##TITLE=1H_SAV-32-sinflet-bat3
 CDCl3, 8 sc, 
 29.10.2020
##JCAMPDX= 6.0         $$ Bruker NMR JCAMP-DX V2.0
##DATA TYPE= NMR FID
##DATA CLASS= NTUPLES
##ORIGIN= UXNMR, Bruker Analytische Messtechnik GmbH
##OWNER= root
$$ XWIN-NMR		Version 3.5
$$ Thu Oct 29 10:02:26 2020 Russian Standard Time (UT+4h)  she@DPX200
##.OBSERVE FREQUENCY= 200.1315066352
##.OBSERVE NUCLEUS= ^1H
##.DELAY= (6, 6)
##.ACQUISITION MODE= SIMULTANEOUS
##.ACQUISITION SCHEME= undefined
##.AVERAGES= 8
##.DIGITISER RES= 18
##SPECTROMETER/DATA SYSTEM= spect
##.PULSE SEQUENCE= zg30
##.SOLVENT NAME= CDCl3
##.SHIFT REFERENCE= (INTERNAL, CDCl3, 0, 15.7039)
##AUDIT TRAIL= $$ (NUMBER, WHEN, WHO, WHERE, WHAT)
$$ ##TITLE= Audit trail, XWIN-NMR		Version 3.5
$$ ##JCAMPDX= 5.01
$$ ##ORIGIN= Bruker BioSpin GmbH
$$ ##OWNER= she
$$ F:/spectra/data/she/nmr/H-F/1/audita.txt
$$ ##AUDIT TRAIL=  $$ (NUMBER, WHEN, WHO, WHERE, WHAT)
(   1,<2020-10-29 10:01:09.96 +0400>,<she>,<DPX200>,
      <created by zg, POWCHK disabled, PULCHK disabled
       configuration hash MD5:
       00 E9 B6 7A A2 85 ED C7 34 08 36 98 17 FE 4E 26
       data hash MD5: 16K
       28 91 C1 C8 36 9A 78 9C 07 4D 86 DE F9 E1 52 E0>)
$$ ##END=
$$ 
$$ hash MD5
$$ 68 E3 1E 78 86 16 67 9E 45 22 E1 74 11 CB BE FA
##$RELAX= 
##$RELAX= 
##$RELAX= 
##$RELAX= 
##$RELAX= 
##$RELAX= 
$$ Bruker specific parameters
$$ --------------------------
##$DU= <F:/spectra>
##$EXPNO= 1
##$NAME= <H-F>
##$PROCNO= 1
##$TYPE= <nmr>
##$USER= <she>
##$AMP= (0..31)
100 100 100 100 100 100 100 100 100 100 100 100 100 100 100 100 100 100 
100 100 100 100 100 100 100 100 100 100 100 100 100 100 
##$AQSEQ= 0
##$AQ_mod= 1
##$AUNM= <au_zg>
##$AUTOPOS= <>
##$BF1= 200.13
##$BF2= 200.13
##$BF3= 200.13
##$BF4= 200.13
##$BF5= 200.13
##$BF6= 200.13
##$BF7= 200.13
##$BF8= 200.13
##$BYTORDA= 1
##$CFDGTYP= 0
##$CFRGTYP= 5
##$CHEMSTR= <none>
##$CNST= (0..31)
1 1 145 1 1 1 1 1 1 1 1 1 1 1 1 1 1 1 1 1 1 1 1 1 1 1 1 1 1 1 1 1 
##$CPDPRG= <>
##$CPDPRG1= <>
##$CPDPRG2= <>
##$CPDPRG3= <>
##$CPDPRG4= <mlev>
##$CPDPRG5= <mlev>
##$CPDPRG6= <mlev>
##$CPDPRG7= <mlev>
##$CPDPRG8= <mlev>
##$CPDPRGB= <>
##$CPDPRGT= <>
##$D= (0..31)
0 1.2 0 0 0 0 0 0 0 0.06 0 0.03 0 0 0 0 0.0002 0 0 0 0 0 0 0 0 0 0 0 0 
0 0 0 
##$DATE= 1603951269
##$DBL= (0..7)
120 120 120 120 120 120 120 120 
##$DBP= (0..7)
150 150 150 150 150 150 150 150 
##$DBP07= 0
##$DBPNAM0= <>
##$DBPNAM1= <>
##$DBPNAM2= <>
##$DBPNAM3= <>
##$DBPNAM4= <>
##$DBPNAM5= <>
##$DBPNAM6= <>
##$DBPNAM7= <>
##$DBPOAL= (0..7)
0.5 0.5 0.5 0.5 0.5 0.5 0.5 0.5 
##$DBPOFFS= (0..7)
0 0 0 0 0 0 0 0 
##$DE= 6
##$DECBNUC= <off>
##$DECIM= 32
##$DECNUC= <off>
##$DECSTAT= 4
##$DIGMOD= 1
##$DIGTYP= 9
##$DL= (0..7)
0 120 120 120 120 120 120 120 
##$DP= (0..7)
150 150 150 150 150 150 150 150 
##$DP07= 0
##$DPNAME0= <>
##$DPNAME1= <>
##$DPNAME2= <>
##$DPNAME3= <>
##$DPNAME4= <>
##$DPNAME5= <>
##$DPNAME6= <>
##$DPNAME7= <>
##$DPOAL= (0..7)
0.5 0.5 0.5 0.5 0.5 0.5 0.5 0.5 
##$DPOFFS= (0..7)
0 0 0 0 0 0 0 0 
##$DQDMODE= 0
##$DR= 18
##$DS= 0
$$ [...]
##$SUBNAM2= <"">
##$SUBNAM3= <"">
##$SUBNAM4= <"">
##$SUBNAM5= <"">
##$SUBNAM6= <"">
##$SUBNAM7= <"">
##$SUBNAM8= <"">
##$SUBNAM9= <"">
##$SW= 16.880792210976
##$SWIBOX= (0..15)
0 0 2 0 0 0 0 0 0 0 0 0 0 0 0 0 
##$SW_h= 3378.37837837838
##$TD= 16384
##$TD0= 1
##$TE= 0
##$TE2= 300
##$TE3= 300
##$TEG= 300
##$TL= (0..7)
0 120 120 120 120 120 120 120 
##$TP= (0..7)
150 150 150 150 150 150 150 150 
##$TP07= 0
##$TPNAME0= <>
##$TPNAME1= <>
##$TPNAME2= <>
##$TPNAME3= <>
##$TPNAME4= <>
##$TPNAME5= <>
##$TPNAME6= <>
##$TPNAME7= <>
##$TPOAL= (0..7)
0.5 0.5 0.5 0.5 0.5 0.5 0.5 0.5 
##$TPOFFS= (0..7)
0 0 0 0 0 0 0 0 
##$TUNHIN= 0
##$TUNHOUT= 0
##$TUNXOUT= 0
##$USERA1= <user>
##$USERA2= <user>
##$USERA3= <user>
##$USERA4= <user>
##$USERA5= <user>
##$V9= 5
##$VALIST= <valist>
##$VCLIST= <CCCCCCCCCCCCCCC>
##$VD= 0
##$VDLIST= <DDDDDDDDDDDDDDD>
##$VPLIST= <PPPPPPPPPPPPPPP>
##$VTLIST= <TTTTTTTTTTTTTTT>
##$WBST= 1024
##$WBSW= 4
##$XGAIN= (0..3)
0 0 0 0 
##$XL= 0
##$YL= 0
##$YMAX_a= 356548
##$YMIN_a= -336541
##$ZGOPTNS= <>
##$ZL1= 120
##$ZL2= 120
##$ZL3= 120
##$ZL4= 120
##$ABSF1= 10
##$ABSF2= 0
##$ABSG= 5
##$ABSL= 3
##$ALPHA= 0
##$AQORDER= 0
##$ASSFAC= 0
##$ASSFACI= 0
##$ASSFACX= 0
##$ASSWID= 0
##$AUNMP= <proc_1d>
##$AZFE= 0.1
##$AZFW= 0.1
##$BCFW= 1
##$BC_mod= 2
##$BYTORDP= 1
##$COROFFS= 0
##$CY= 11.3945322036743
##$DATMOD= 1
##$DC= 2
##$DFILT= <>
##$DTYPP= 0
##$F1P= 15.9154993809931
##$F2P= -4.1035820241983
##$FCOR= 0.5
##$FTSIZE= 0
##$FT_mod= 4
##$GAMMA= 1
##$GB= 0.15
##$INTBC= 1
##$INTSCL= 1
##$ISEN= 128
##$LB= 0.24
##$LEV0= 0
##$LPBIN= 0
##$MAXI= 10000
##$MC2= 0
##$MEAN= 0
##$ME_mod= 0
##$MI= 1.114404
##$NCOEF= 0
##$NC_proc= 0
##$NLEV= 6
##$NOISF1= 3.799351
##$NOISF2= 2.8
##$NSP= 1
##$NTH_PI= 0
##$NZP= 0
##$OFFSET= 15.70392
##$PC= 1
##$PHC0= -10693.78
##$PHC1= 18.80088
##$PH_mod= 1
##$PKNL= yes
##$PPARMOD= 0
##$PSCAL= 0
##$PSIGN= 0
##$REVERSE= no
##$SF= 200.130013532006
##$SI= 16384
##$SIGF1= 3
##$SIGF2= 2
##$SINO= 400
##$SIOLD= 16384
##$SREGLST= <1H.CDCl3>
##$SSB= 0
##$STSI= 0
##$STSR= 0
##$SW_p= 3612.71676300578
##$SYMM= 0
##$S_DEV= 0
##$TDeff= 0
##$TDoff= 0
##$TI= <>
##$TILT= no
##$TM1= 0
##$TM2= 0
##$TOPLEV= 0
##$USERP1= <user>
##$USERP2= <user>
##$USERP3= <user>
##$USERP4= <user>
##$USERP5= <user>
##$WDW= 1
##$XDIM= 8192
##$YMAX_p= 0
##$YMIN_p= 0
$$ End of Bruker specific parameters
$$ ---------------------------------
##NTUPLES= NMR FID
##VAR_NAME=  TIME,          FID/REAL,        FID/IMAG
##SYMBOL=    X,             R,               I
##VAR_TYPE=  INDEPENDENT,   DEPENDENT,       DEPENDENT
##VAR_FORM=  AFFN,          ASDF,            ASDF
##VAR_DIM=   8192,          8192,            8192
##UNITS=     SECONDS,       ARBITRARY UNITS, ARBITRARY UNITS
##FACTOR=    0.000296,      1,               1
##FIRST=     0,             0,               0
##LAST=      2.424536,      0,               0
##MIN=       0,             -336541,         0
##MAX=       2.424536,      356548,          0
$$ Real data points
##PAGE= N=1
##DATA TABLE= (X++(R..R)), XYDATA
$$ [...]
2827B162k134l253L129K680m346j047L893N85m237N81M284j450m265K738L438
2842B758l080k858L350K394l789j838M547P05m396O17M079j388l744J906M078
2857C341l167k863L695J782l891o12L654L13l952N30M496k216l510K845K633k856
2873B22k688L536K197m436r30M363l5m187O92L887j217l925K117L464l449k256
2889b645L564J469l640r88L938J16m300J198L371j867k794K252K445k928k167
2904b976L457J659m499J17M085o38m165J036M332k080l818L380K699l571j942
2919b924L407J944m304n09M188k38m103J663L426k081k786K188L368m131j410
2934b302M224M00m045M00L773n56m059J471M492l447l017L948K080m036j496M002
$$ plain form
2827 2162 28 -3225 -96 2584 -1762 -2809 1084 1669 -2568 -1987 2297 847 -3418 -680 2758
2842 2758 -322 -3180 170 2564 -1225 -3063 1484 2189 -2207 -1590 2489 1101 -2643 -737 3341
2857 3341 174 -2689 1006 2788 -1103 -1715 1939 2252 -1700 -1170 3326 1110 -2400 445 3078 222
2873 222 -2466 1070 3267 -1169 -2099 2264 2229 -1958 -1266 2621 1404 -2521 -404 3060 -389 -2645
2889 -2645 919 2388 -1252 -2240 1698 1814 -2486 -1288 2083 216 -2578 -326 2119 -809 -2976
2904 -2976 481 2140 -2359 -2242 1843 1205 -2960 -1924 2408 328 -3490 -110 2589 -982 -2924
2919 -2924 483 2427 -1877 -2386 1802 1564 -2539 -876 2550 469 -2317 -129 3239 -892 -2302
2934 -2302 1922 2322 -1723 -1323 2450 1894 -2165 -694 3798 351 -2666 1282 3362 -674 -2170 1832
2950A832J137m923P5N092j824l820J954L442k428l366L381K652m332j309M122
2965A685j09l659N81L797j347l973K573L127l740j759L608J127l612j052M374
2980A621o1m757J871L693j959l476K246L380l483k337M056P41l402L2L393l64
2996A194l370R14L333j786l191K939K104k512j444L101J093l829j00L885r52l455
3012b076J799K897j614k977K243K900l319j889L763N21l076n83L300q8l359R70
3028e88L135k070k439K434J860k543j711K998Q87l388P7K852p46k726J085K902
3044B019j591k906K549J945l315r99K895J030l420k43L618p81l493J507L008j759
3060F4k700K433K063k468k078L337O60k826m5L099m27l162J260K832j947k389
$$ plain form
2950 1832 2969 -1954 -1879 3213 1389 -2431 -477 2965 537 -2829 552 3204 -1128 -2437 1685
2965 1685 1576 -2083 -1502 2295 948 -3025 -452 2675 -1065 -2824 784 1911 -1701 -2753 1621
2980 1621 1560 -3197 -1326 2367 408 -3068 -822 2558 -925 -3262 794 1535 -1867 -1835 1558 1194
2996 1194 -2176 -1262 2071 285 -2906 33 2137 -375 -1819 1282 2375 -1454 -1554 2331 1379 -2076
3012 -2076 -277 2620 1006 -1971 272 3172 -147 -2036 1727 2248 -828 -1411 1889 1801 -1558 -588
3028 -588 2547 477 -1962 472 2332 -211 -1922 1076 1963 -1425 -1348 1504 758 -1968 -883 2019
3044 2019 428 -2478 71 2016 -1299 -2298 597 1627 -1793 -2036 1582 801 -2692 -1185 1823 64
3060 64 -2636 -203 1860 -608 -2686 651 1311 -1515 -1560 1539 1112 -2050 -790 2042 95 -2294
3076b294K752J776k883j329L392N95l517J61L505r70k780J706K384j811k637K418
3092D68K143l285j076L494N72l509P1L437j015l275J739K824k309j995K457J626
3108B367l286q73L394K84l663O71L447j612k812J896K397k517k320L158J375l523
3124a617j39K853P1l097M34L323j431k941K042K321k628j662K837J174k947o96
3140b103L214j53l024J208K732j691k228J944J923k485j379K734Q68k693K8K653
3156A548n2l279J365K603j730k168J832K067j959j732K689J018l020j36K665l29
3172A382k713Q13K415r52k562J719J827j829j348K103R75k415q46K665Mk695M18
3189a039K758j012k571J558K188k357j613K340J264k952m04K783j57k367L04K733
$$ plain form
3076 -2294 458 2234 -649 -1978 1414 2009 -1508 -1347 2158 1188 -1592 114 2498 687 -1950 468
3092 468 2611 -674 -1750 1744 2316 -1193 -1122 2315 1300 -1975 -236 2588 279 -1716 741 2367
3108 2367 -919 -1792 1602 1886 -1777 -1106 2341 729 -2083 -187 2210 -307 -2627 531 1906 -1617
3124 -1617 -1756 1097 1168 -1929 -1495 1828 397 -2544 -502 1819 -809 -2471 366 1540 -1407 -2103
3140 -2103 1111 958 -2066 -858 1874 183 -2045 -101 1822 -663 -2042 692 1560 -1133 -1105 1548
3156 1548 1496 -1783 -418 2185 455 -1713 119 2186 227 -1505 1184 2202 -818 -954 1711 1382
3172 1382 -1331 -518 1897 945 -1617 102 1929 100 -1248 855 1830 -585 -1431 1234 1238 -1457 -1039
3189 -1039 1719 707 -1864 -306 1882 -475 -2088 252 1516 -1436 -1840 943 786 -1581 -1277 1456
3205A456j156k552K008J895k135j721K489J231k887m22K860N4k978P85K810j312
3221D25k713J955K220k101j946L034J176l378l01K865K44l143Q47L520k001k646
3237a943K404K036k708j805L287J010l318k74L401q07l095J363L004j948k821
3252b214K692J987l100p60K550P22l159k61L581r14l418J865K903k345k087K163
3268B05K001k898j253L205J5l284N57L085j295k674J813K418k350k184K919J283
3284A563k943o30L198j46k931O55L114j493k584J840K095k172j567K325J575l113
3300a214m27K952j03k688P48K443j067k547K080J989k389j445K730P43k553k97
3316a045K644j96k423M35K787j545j912J491J985j973j685K254J098k898j02K555
$$ plain form
3205 1456 300 -2252 -244 1651 -484 -2205 284 1515 -1372 -1794 1066 1120 -1858 -1073 1737 425
3221 425 -2288 -333 1887 -214 -2160 874 2050 -1328 -1629 1236 1480 -1663 -816 2704 703 -1943
3237 -1943 461 2497 -211 -2016 1271 2281 -1037 -1311 2090 1283 -1812 -449 2555 607 -2214
3252 -2214 478 2465 -635 -1395 1155 1877 -1282 -1543 2038 1124 -2294 -429 2474 129 -1958 205
3268 205 2206 -692 -1945 1260 1275 -2009 -1452 1633 338 -2336 -523 1895 -455 -2639 280 1563
3284 1563 -1380 -2010 1188 1042 -1889 -1234 1880 387 -2197 -357 1738 -434 -2001 324 1899 -1214
3300 -1214 -1641 1311 1208 -1480 -732 1711 644 -1903 177 2166 -223 -1668 1062 1805 -748 -1045
3316 -1045 1599 1403 -1020 -585 2202 657 -1255 236 2221 248 -1437 817 1915 -983 -1085 1470
3332A470J88k671k10K880r84k469J735J958k281j198J895J156k521p90K800L88
3348A346l212M97K559r07k241J368K400k115k024K680J356k846p06K903k9k747
3364a718Q4L168j234k793K501J888k135j694K412J298k959l63L560o38l459J305
3380g77K915j328k832K297K351l055j425L494J26k824k04L145j69l586J416L045
3396B589j893k228J857K086k727j501L217O60l691P51L180j752k372J623K214
3411B013j850k265K964J242l263n87L112rl212K98L605j496l106K208K150k465
3427f61j674K377J550k934q61L292k35k794J113J921j183j993J719J995k204j401
3443a973K671M84k685K06K426k68k429P29K824j911j810J936J552k001j152K192
$$ plain form
3332 1470 1658 -1013 -1223 1657 673 -1796 -61 1897 -384 -1582 313 1469 -1052 -1842 958 1346
3348 1346 -1866 -1369 1190 283 -1958 -590 1810 -305 -2329 351 1707 -1139 -1845 1058 1029 -1718
3364 -1718 -1634 1534 300 -2493 8 1896 -239 -1933 479 1777 -1182 -1545 2015 1377 -2082 -777
3380 -777 2138 810 -2022 275 2626 -429 -1854 1640 1766 -1058 -1262 1883 1714 -1872 -456 2589
3396 2589 696 -1532 325 2411 -316 -1817 1400 2060 -1631 -880 2300 548 -1824 -201 2013
3411 2013 163 -2102 862 2104 -1159 -1746 1366 1357 -1855 -1557 2048 552 -2554 -346 1804 -661
3427 -661 -2335 42 1592 -1342 -2203 1089 854 -1940 -827 1094 -89 -2082 -363 1632 -572 -1973
3443 -1973 698 1182 -1503 -1297 1129 861 -1568 -839 1985 74 -1736 200 1752 -249 -1401 791
3459G91Q87k458k01K759m93k296M76K168q19k031J353J697k002j022K068O02j902
3476d23o26K082K70k698J121J958j378j560J111J591j472j536K449N73k316m92
3492a346K096M88k286k54K839j029k599J830J803k083j227J764J581k555p88K680
3508I14Jk700P43K322j163k071J263K357k053j714K688O02k427j14K591l2k813
3525a606N90L073j723k488K299K055k540j372K556J169l125j23K921m57k824J329
3541b66K542j748k403K351J840k934r47L082K33l225M92L069j083k908J727K316
3557B138k003j746K078J566k908p05K774Q4k938R21K552j379k292J577J902j981
3573c60j604K355J309l114k5K454k69k337L68K632j266k200K109J276j866j285
$$ plain form
3459 791 1678 -780 -981 1778 1285 -1011 -535 1633 814 -1217 136 1833 -169 -1191 877 1479 -423
3476 -423 -1049 1033 1303 -1395 -274 1684 306 -1254 -143 1448 -24 -1560 889 1462 -854 -1346
3492 -1346 750 1238 -1048 -1302 1537 508 -2091 -261 1542 -541 -1768 -4 1577 -978 -1766 914
3508 914 915 -1785 -1042 1280 117 -1954 -691 1666 -387 -2101 587 1189 -1238 -1352 1239 1207 -1606
3525 -1606 -1016 2057 334 -2154 145 2200 -340 -1712 844 2013 -1112 -1235 1686 1229 -1595 -266
3541 -266 2276 528 -1875 476 2316 -618 -1565 1517 1750 -1475 -983 2086 1003 -1905 -178 2138
3557 2138 135 -1611 467 2033 -875 -1580 1194 1278 -1660 -739 1813 434 -1858 -281 1621 -360
3573 -360 -1964 391 1700 -1414 -1439 1015 746 -1591 -1223 1409 143 -2057 52 1328 -538 -1823
3589a823K329R96k899k02K703l35k323Q00K221j027k171J722J721k073r96K003
3605F46P31k185o6K075k31k029P57J767q00j766J274J399j550j122K046N75k082
3622e61J03J857j67k169M17J976p50j883J284J253j420j201J681R74j885p76K335
3639A068J40k327L37J956o15k026R18J785j484j370J815P85k014n48K234L35k476
3656a487K38K470q60k254J493J717j951j413K259J108k210p71K718m7k729P94
3672i25K339r74k225J559K068j991j567K580Q85k792k89K887m11k837J025K929
3688B261j681k328K355J491k462j265K886O69k882k48L233j001k832J699K459
3703B354j825k413K639J201k945m68K777n7k889P15K669j176k235J403J831j822
$$ plain form
3589 -1823 506 1502 -1397 -1599 1104 769 -1554 -754 1467 440 -1731 -9 1712 -361 -1357 646
3605 646 1377 -808 -874 1201 970 -1059 -302 1465 665 -1101 173 1572 22 -1100 946 1521 -561
3622 -561 -458 1399 1232 -937 -520 1456 706 -1177 107 1360 -60 -1261 420 1394 -491 -1267 1068
3639 1068 1208 -1119 -782 1174 559 -1467 -549 1236 -248 -1618 197 982 -1032 -1580 654 989 -1487
3656 -1487 -1249 1221 361 -1893 -400 1317 -634 -2047 212 1320 -890 -1661 1057 1010 -1719 -925
3672 -925 1414 440 -1785 -226 1842 -149 -1716 864 1749 -1043 -1332 1555 1144 -1693 -668 2261
3688 2261 580 -1748 607 2098 -364 -1629 1257 1926 -956 -1204 2029 1028 -1804 -105 2354
3703 2354 529 -1884 755 1956 -989 -1457 1320 1263 -1626 -911 1758 582 -1653 -250 1581 -241
3719b41j615K402P46k511j23K426j97k618J102J882j019k061J510J640j719j286
3735a682K112N53k418L4K158k76k108O22K256j087j738J683J181j699j017K040
3751F14M46j728m6J889k99j958M34K439j542j200J114J268j435r37J541O68j875
3768f07q6J866k3j695K3J822q30j478J064J182r80j373J618O12j483m85J798J43
3786A088j956J76J891o87k068J560J293j453j202J397J065j862r62K375J41j878
3802a082J39J867m56k210J070K044j564j562J991P08j822o88K375K27k513N53
3818i23K458j303k005J798J529j674j641K366R36k442o18K748J31k647P90K248
3834A751j089k243J734J913k329r62K322N92k748J42K674n06k770J373K132k021
$$ plain form
3719 -241 -1856 546 1292 -1219 -1342 1084 887 -1731 -629 1253 234 -1827 -317 1323 -396 -1682
3735 -1682 430 983 -1435 -1401 757 481 -1627 -1005 1251 164 -1574 109 1290 -409 -1426 614
3751 614 1060 -668 -714 1175 876 -1082 -648 1791 249 -951 163 1431 -4 -941 600 1268 -607
3768 -607 -693 1173 1150 -545 -522 1300 470 -1008 56 1238 258 -1115 503 1115 -368 -853 945 1088
3786 1088 -868 -692 1199 512 -1556 4 1297 -156 -1358 39 1104 -758 -1720 655 796 -1082
3802 -1082 -943 924 468 -1742 -672 1372 -192 -1754 237 945 -877 -1565 810 1037 -1476 -923
3818 -923 1535 232 -1773 25 1554 -120 -1761 605 1541 -901 -1519 1229 1360 -1287 -497 1751
3834 1751 662 -1581 153 2066 -263 -1225 1097 1689 -1059 -917 1757 1251 -1519 -146 1986 -35
3850c5j305J741J524k519q79K962m23k184L17K540j048k235J321J808j721j656
3866a792K150J038k253m32J959Jk025M09K217j124j900J646J138j497q33J380
3882H2Q97j938m48K268m17j803P93J761j291j286J260J386j952o62J893K57j612
3899h12j08J636M38k207N15J760p37j234Q61Q06p46j033J189J069j709m53J660
3916H95k3j294J14J345m89j448J087Q81r54q24J115P85j236r03J746L23j880r
3934g69J655k94j416K38J873p67k159J589J091j566n15J383N04j655l29K230o52
3951D41k069J077J455j002j406J284J613k126q16K359P2k509N70K015l85k140
3967a567P20K385j841j379K075J008k054q44K344M47k585L59K493j141j768J414
$$ plain form
3850 -35 -1340 401 1925 -594 -1473 1489 1066 -1118 -801 1739 691 -1544 -223 1585 -136 -1792
3866 -1792 358 1396 -857 -1289 670 671 -1354 -945 1272 148 -1752 -106 1032 -465 -1298 82
3882 82 979 -959 -1407 861 444 -1359 -566 1195 -96 -1382 -122 1264 -688 -1350 543 800 -812
3899 -812 -920 716 1154 -1053 -538 1222 485 -749 112 918 172 -861 328 1397 -312 -765 895
3916 895 872 -422 -308 1037 548 -900 187 1068 114 -710 405 1190 -46 -949 797 1120 -760 -769
3934 -769 886 592 -824 -586 1287 520 -1639 -50 1041 -525 -1040 343 847 -808 -1137 1093 441
3951 441 -1628 -551 904 -98 -1504 -220 1393 -733 -1549 810 882 -1627 -1057 958 573 -1567
3967 -1567 -847 1538 -303 -1682 393 1401 -653 -1497 847 1294 -1291 -932 1561 420 -1348 66
3983F6J700j820j575K292R45k365r9K608p81k254P29K342j069k423J982J630k398
4000d90n97J970P35k516l14K681o85k089J138J937j639j565J595J300j989r65
4016a493K450j11k291O91J918q88j676J218J473j722j218K001P02k086j12J834
4032F90R1k026L65K117j282j295J362J013j304r37J216R62j771l60J965j12j867
4049a173M76J776q87j493J382J316j551p12J295M41j114k78J307qj428K65J439
4066A053l34j447P06Q52m67j163J219P22j590m75J846Q9j613k26J966m02j728
4083i92N45J838j524q62J033J188j615q52J835L21j898J5J869k64j853N01K021
4100A306j370j514J602J139j776r73K225K95k218kK413j030k034J324J942j714
$$ plain form
3983 66 1766 -54 -1629 663 1608 -757 -856 1752 971 -1283 -554 1788 719 -1704 278 1908 -490
4000 -490 -1087 883 1618 -898 -1212 1469 784 -1305 -167 1770 131 -1434 161 1461 -528 -1493
4016 -1493 957 846 -1445 -754 1164 276 -1400 -182 1291 -431 -1649 352 1054 -1032 -1144 690
4032 690 781 -1245 -880 1237 -45 -1340 22 1035 -269 -1206 10 972 -799 -1159 806 694 -1173
4049 -1173 -697 1079 192 -1301 81 1397 -154 -866 429 870 -244 -522 785 777 -651 -386 1053
4066 1053 719 -728 -22 830 363 -800 419 1141 -449 -924 922 1011 -602 -828 1138 736 -992
4083 -992 -447 1391 -133 -995 38 1226 -389 -1241 594 915 -983 -968 901 637 -1216 -715 1306
4100 1306 -64 -1578 24 1163 -613 -1586 639 934 -1284 -1286 1127 97 -1937 -613 1329 -385
4116c85q59J587J072k287n44K392j28k495N80K554q06k379J754J735j991j313
4132a513K058J016k399k50K500j80k330P57K262j552j862J876J332j864j040K256
4148A067M27k553N62K116p76k291J375J915j908j383K194J094k598m47K440k4
4164A210k595M97K302j301j602J327J425j782q45J865N18j957J09J539l8k117
4180a445O42K024j299j509J757R54j536q82J905Lj559m4J509j07j549N76J560
4197A000p94j330J271R21j379n32J349O58j855k23J669k41j171M07J296n68j492
4214a014J033J066r24o86R37N42j123k80J177nj578O01J087l39j198N27J305p66
4232C62j117J019R70j728l60J438J18j562q5J909o37j511Q31J297r33j338J274
$$ plain form
4116 -385 -1244 343 1415 -872 -1416 976 848 -1647 -1067 1487 681 -1698 56 1791 -200 -1513
4132 -1513 545 1561 -838 -1088 1412 1232 -1098 -341 1921 369 -1493 383 1715 -149 -1189 1067
4148 1067 1494 -1059 -497 1619 843 -1448 -73 1842 -66 -1449 745 1839 -759 -1206 1234 1210
4164 1210 -1385 -888 1414 113 -1489 -162 1263 -519 -1364 501 1019 -938 -829 710 672 -1445
4180 -1445 -803 1221 -78 -1587 170 1124 -412 -1294 611 614 -945 -989 520 413 -1136 -560 1000
4197 1000 206 -1124 147 1068 -311 -843 506 1164 -691 -914 755 514 -657 -250 1046 478 -1014
4214 -1014 19 1085 161 -525 412 954 -169 -449 728 723 -855 -254 833 494 -704 -177 1128 362
4232 362 -755 264 1234 -494 -854 584 702 -860 -945 964 327 -1184 -353 944 11 -1327 -53
4249e3Q23j489r11K059K44j879L21J831o39j553R93J253j181j247J719R35j925
4266f99o75K027J19k148P35J914q71j790J213J717j644j255J560J060k216N3K203
4283A303k58j981Q22J590j223j430J458J470k129n72J875K33k061M15J924o89
4299G47j877J216J586j613q62J151J092j801o48J955J00k117M31J665q12j097
4315h84P50J043j078j089J764M9j323l57J473R9j685O58J611j012j403J429L92
4332D37r04n79J265N89j640QJ563k27j374L05J203p19j146J049P07j157o4Q90
4350B06J79n63l96J241kj222K02J007m04o20M16Q45o78p32R34O16j220l58J030
4369D81L60r40k43J278j13j439K95J242l50j365O59J364j181j094J323O07j341
$$ plain form
4249 -53 770 -719 -1630 429 673 -1206 -885 946 307 -1246 -253 1000 -181 -1428 291 1226 -699
4266 -699 -1374 653 772 -1376 -641 1273 402 -1388 -175 1542 -102 -1357 203 1263 -953 -900 1303
4283 1303 1045 -936 -114 1476 253 -1177 281 1751 -378 -950 925 1158 -903 -488 1436 747
4299 747 -1130 86 1672 59 -803 348 1440 -361 -1009 946 1046 -1071 -640 1025 213 -884
4315 -884 -134 909 -169 -1258 506 555 -768 -1125 348 447 -1238 -580 1031 19 -1384 45 437
4332 437 -467 -1046 219 808 -832 -824 739 512 -862 -557 646 -73 -1219 -170 537 -620 -684 206
4350 206 385 -178 -574 667 665 -557 -355 652 248 -372 44 889 211 -521 413 1029 -191 -549 481
4369 481 841 -99 -342 936 823 -616 -321 921 571 -794 -135 1229 48 -1046 277 884 -457
4386d57K9P78L61j235j03J545o99j346J158P41j079q36J378O12j810k53K137n96
4404C25j520O00J616j005j445J293J366j746r06J906N07j860j31J874l26j775
4420a227O58J697j238j138J549P39j478o05J914J01k013M32J995j211j309J144
4436A0J511j652j308K213N47k008j43K174k31k009L48J964q69j985J948R62j573
4453a01p62J409M71j799K12J571m90j662P01J526j090j230J338J014k075k01J848
4470F80n5j463L5J446m25j300Q44J238j180q17J002O87j288k30J256K29j747M04
4488f84J547q36j043Q89R97j057p12J066O31j308k17J288P1j097k11J438m0j435
4506g13N40J143j006m88O23Q88j047l95Q58Q07j791J92J291k57j216l1J596m95
$$ plain form
4386 -457 -428 350 711 -524 -627 918 219 -1127 31 772 -307 -1143 235 847 -963 -1216 921 325
4404 325 -1195 -595 1021 16 -1429 -136 1230 -516 -1422 484 991 -869 -1000 874 548 -1227
4420 -1227 -569 1128 -110 -1248 301 1040 -438 -1043 871 972 -1041 -609 1386 175 -1134 10
4436 10 1521 -131 -1439 774 1321 -687 -830 1344 1113 -896 -548 1416 547 -1438 510 1472 -101
4453 -101 -863 546 1017 -782 -570 1001 511 -1151 -450 1076 -14 -1244 94 1108 -967 -1168 680
4470 680 625 -838 -803 643 218 -1082 -238 1000 -180 -997 5 692 -596 -826 430 659 -1088 -684
4488 -684 863 27 -1016 -127 870 -187 -899 167 798 -510 -727 561 632 -465 -676 762 722 -713
4506 -713 -173 970 -36 -524 99 987 -60 -455 403 1210 -581 -389 902 645 -571 -602 994 499
4524D99j264J046Q14r69q19R81P33j336l75J430N0j828O68J501q10j586J231R34
4542I00j314p32J492N83j730k12J615k49j469N43J540r84j332J301J242j752r15
4559a473K076K37j890m6K131m50j799R06J533j400j421J972Q21j762l64J802j16
4576G57k009M55K149n62k075J347J227j502j120J764R42k065j57K169m77j963
4592a120R07J889j697j131J444J233j822p78J879M74k151L71J892q19j627J015
4608d1J407j165j486J737M63j599k84J473K69j869M39J748q93j372Q97J104j344
4625e16q31J615K92j475J38J240j20j421L37J564p15j280J076O35j174l09J115
4642A71K82r20Q2Q20J54j424O35R20m92j121P89R81j125l67R11N10j110j37J233
$$ plain form
4524 499 -765 281 1095 126 -693 288 1021 -315 -690 740 790 -1038 -370 1131 321 -1265 -34 900
4542 900 -414 -1146 346 929 -801 -1013 602 353 -1116 -573 967 -17 -1349 -48 1194 -558 -1473
4559 -1473 603 840 -1050 -1096 1035 585 -1214 -308 1225 -175 -1596 376 1197 -565 -929 873 757
4576 757 -1252 -797 1352 790 -1285 62 1289 -213 -1333 431 1373 -692 -849 1320 843 -1120
4592 -1120 -213 1676 -21 -1152 292 1525 -297 -1075 804 1278 -873 -502 1390 571 -1056 -41
4608 -41 1366 201 -1285 452 915 -684 -968 505 774 -1095 -656 1092 199 -1173 -276 828 -516
4625 -516 -1347 268 560 -915 -777 463 343 -1078 -741 823 108 -1172 -96 539 -635 -944 171
4642 171 453 -467 -385 435 589 -835 -200 720 228 -893 -104 877 -248 -615 296 806 -304 -441 792
4661G92J15j336L51Q96l28r48P17O67p43o92N35J201j051r99J270L75j152j51
4679d81J556m94j427O29J167p78r25Q54R38j371n52J097M32j335J06J402n69j307
4697a058O17J280j086p94J077R19j614j33J430j05j543J87J414o49j217Q95J385
4714A005j327r04J453N89j421k12J495q1j719O22J648j102j261J467Q37j114r99
4731a024J554L55j688K47J730m04j631O55J419r65j102J098J001j562l80J570
4747H73L78j930K09J768p62j229O31J161j017r71J348N46j392m23J529k39j111
4764f31K78R95n71q92R66P93j188o39J239R2j011q7J371n16r26L14O55l74o64
4783g96P61L75q44j38P62L90r23p2Q59j08r52M75L63J02p10P48P6n21k15P10J41
$$ plain form
4661 792 907 -429 -78 818 490 -458 259 926 183 -509 26 1227 176 -823 447 822 -330 -481
4679 -481 1075 581 -846 -217 950 172 -753 101 1039 -332 -884 213 645 -690 -584 818 249 -1058
4697 -1058 -441 839 -247 -1041 36 955 -659 -792 638 533 -1010 -823 591 -58 -1275 -380 1005
4714 1005 -322 -1226 227 816 -605 -817 678 597 -1122 -500 1148 46 -1215 252 1089 -25 -1024
4731 -1024 530 885 -803 -556 1174 770 -861 -206 1213 248 -854 244 1245 -317 -697 873
4747 873 1251 -679 -470 1298 536 -693 -62 1099 82 -889 459 1005 -387 -810 719 480 -631
4764 -631 -353 642 71 -821 145 938 -250 -889 350 442 -569 -656 715 199 -727 -413 242 -132 -796
4783 -796 -35 340 -504 -642 120 510 -413 -485 374 266 -686 -211 152 254 -456 292 368 -153 -368 342 483
4804D83o96k36R07J44r30K31N37j68n45K06P00l67q95O78O88n85l85N43J98n29
4824b1m83R22J03o49N2O46m45q61N81R82r06n50Q43O60j395j37J200J34j330O8
4844e86J205n14p29M58P88q05p68Q17P76j265k86J381k80q95K51J046n96p76P88
4863A0Q51j285n61J340k1r84K21J318n85j403J185R12j154q88J549L17j390j89
4881g57J625J18j632M93J313o20j303O04J536j351q81J592J15j342J73R59r1j306
4899g55M09J269p97p76J191J91q68m19Q65M42j626L87J576p70j112Q72R06r90
4917eq41J012O89j113n51J098J01q77k74J184j48j118O18Q77q61o03J165J10p66
4936c03l54J071O5j166M5J001j15r32K81R83o57o16P92O00r01l23Q68J25o24n04
$$ plain form
4804 483 -213 -449 458 602 -328 -97 440 272 -273 -67 633 266 -629 49 737 152 -233 310 508 -21
4824 -21 -504 418 521 -128 -76 570 125 -736 -155 827 -79 -629 214 874 -521 -658 542 676 -654 -586
4844 -586 619 105 -624 -166 622 -183 -951 -134 642 -623 -909 472 192 -703 -452 594 -2 -778 10
4863 10 861 -424 -985 355 334 -650 -429 889 304 -1099 86 998 -156 -1044 505 822 -568 -757
4881 -757 868 986 -646 -153 1160 540 -763 -159 1377 26 -855 737 852 -490 -317 642 551 -755
4899 -755 -346 923 126 -650 541 732 -136 -555 310 752 -874 -487 1089 319 -793 79 985 -5
4917 -5 -846 166 855 -258 -809 289 390 -487 -761 423 275 -843 -225 652 -209 -812 353 463 -303
4936 -303 -657 414 479 -687 -642 359 244 -688 -407 576 -81 -697 95 695 -206 -529 339 464 -160 -664
4956f64J287k35r90L98Q01k54p04N26M31l30q96J084K98q78k73R08K04q57k40
4975c84J184k85j192P48Q83o64j026Q10O09j095l60J321J92j488N06R62n52j199
4993a030P22J112j257o65J395L13j362J46Q76R0j529N42J717r98j255J330J023
5010A170j550o33J607K31j922K37J674l46j601Q83J419j183j221J659O31j622
5026e67l36J607Pj562K86J714p80j299J071J263j282r99J456O75j866M2J687k18
5044H99j818P39J574j246j014J263Q08j472m07J773k8j501J91J341o63j385O70
5061b76J283q37r99J126L59j277l71J501p8r88kJ293p68r34P41Q21p51q08J040
5080G5M36j053n04J576o1j242M64O07j81p41J92R97p26o26Q06N02q78j89R58J14
$$ plain form
4956 -664 623 388 -602 -204 597 343 -361 165 596 266 -630 454 752 -126 -399 509 713 -144 -384
4975 -384 800 515 -677 71 954 290 -736 74 683 -412 -772 549 741 -747 -241 721 169 -1030
4993 -1030 -308 804 -453 -1118 277 590 -772 -626 250 340 -1189 -647 1070 72 -1183 147 1170
5010 1170 -380 -1013 594 825 -1097 -860 814 468 -1133 -250 1169 -14 -1235 424 1055 -567
5026 -567 -903 704 711 -851 -565 1149 369 -930 141 1404 122 -877 579 1254 -612 -570 1117 899
5044 899 -919 -180 1394 148 -866 397 1205 -267 -674 1099 1071 -430 -239 1102 439 -946 -276
5061 -276 1007 170 -829 297 656 -621 -992 509 431 -557 -559 734 -34 -968 -227 594 -157 -965 75
5080 75 511 -542 -1046 530 469 -773 -309 298 117 -624 -432 565 -161 -787 19 521 -357 -546 412 526
5100E26p18j75J208o84o12L92N25m72m91K96J034r18l40P78L08j080Q4J332o03
5119C90p85L31R32l12j051N89Q57o71r38J204J17q97P0Q42m64p97J71J201q11
5138b2r10J381K20r51o54J294L42j424n4J445l69j214P42Q34p14q72Q78Q48j263
5157d63k62J320R0j647L07J202m96j059P35J089j078p52J142N71j089j60R92L3
5175D75j784J106J185r56r70J120P88j196l15J102M49j567R7J301n51j005O47
5192g4J054j000n99J218K95j112k75J160r0j457J086Q01p08j022R83M34r23l70
5210e99N57N46j123J67J092l12r13K51Q39m00q84N80O08n38m82O38M36o67k11
5229d15Q65k31r97M48N82l43n99N33N86o94k53P63J1o69K50N29J4q58K52P46n43
$$ plain form
5100 526 -192 -367 841 157 -455 -63 462 -10 -501 -205 829 -89 -429 349 657 -423 -339 993 390
5119 390 -395 -64 868 556 -495 94 951 280 -658 546 663 -234 -164 678 214 -583 -412 789 -22
5138 -22 -932 449 669 -282 -936 358 700 -724 -778 667 298 -916 -174 660 -54 -926 -48 800 -463
5157 -463 -725 595 685 -962 -655 547 51 -1008 -273 816 -262 -1014 128 699 -390 -550 442 475
5175 475 -1309 -203 982 26 -944 176 964 -232 -547 555 1004 -563 -466 835 284 -721 -74
5192 -74 980 -20 -619 599 894 -218 -493 667 577 -880 206 1007 299 -723 260 694 -229 -599
5210 -599 -42 504 -619 -452 640 328 -585 -334 505 105 -779 -199 409 -129 -611 27 463 -204 -415
5229 -415 450 219 -778 -330 252 -91 -690 -157 429 -265 -518 245 256 -413 -163 366 380 -478 -226 520 -23
5250b3l16J49N94m63j94L64J85j67l85M35L92q58P9M74J09l09j20O97l51o61N86
5271B17K71m00l18K82N59p19r8Q52k87q42K15R46m29p30O27L24m57o08R42K01
5291E48r16l1R10r0r56L5Q23l99n58N88O19o99p93J055J96r14J25J284n80q13
5311e66N60O56p13r59J127O46j258j80J039J43j038J86Q84o00p06P11Q60p52n25
5330d85O70L95r14l4J136rj286M78Q27n39p06L15J036r23k27M91K19r31K33P71
5350E17j82p38p9J115m76r33J062K34m30m38M66M13j062J05J011n07o61K95O95
5369D07l44n57L83N95r81p8Q85j80k93m25P95k9p22J43N38j42o37L12O20n28j18
5390c56M17K61p16j45O17rn97N25Q2K87p11K84P22l89p70M91L08p5o19Q01j73
$$ plain form
5250 -23 -339 -190 404 -59 -253 111 296 129 -256 179 571 -287 -208 266 375 66 -54 643 292 -369 217
5271 217 488 88 -230 52 611 -108 -206 646 359 -483 -268 678 249 -481 146 470 13 -595 347 548
5291 548 -368 -399 511 421 -535 -500 323 -76 -634 -46 573 -126 -919 136 332 -582 -457 827 247 -566
5311 -566 -6 650 -63 -1022 105 751 -507 -687 352 495 -543 -357 527 -73 -779 -68 792 40 -485
5330 -485 185 580 -334 -368 768 759 -527 -49 778 239 -467 -152 884 -39 -266 225 444 -487 -254 517
5350 517 335 -403 -482 633 157 -776 286 520 90 -348 118 531 -531 -426 585 78 -583 -288 407
5369 407 63 -494 -111 484 -497 -575 310 130 -163 -588 207 178 -544 -401 137 -5 -642 -330 290 -238 -356
5390 -356 61 322 -394 -539 78 69 -528 -3 79 366 -345 -61 661 272 -498 -7 301 226 -393 408 235
5411B35o98J07J188m82q08N56P14p12o20O58N89j023m26Q16K91q14o2O36R1o82
5431d46N32N14n69p87R38O27j001l81J021R7j252K50Q35j34j177Q53O44n57r37
5450i30J066N42j007n01J583j55j539M56J191o30q39O18P79j001l66J005L54j354
5468g28l4J155l47q61Q21R79j020o91R60M52j042k85J212L16j384K89R85m67r48
5487f38P66J097j182p37R55N67j290q4J011q5r94L74J050p13o43M19O39n76n97
5506f61J016K21r77NR45l93p37L99R87r18q35J010L46o88k90Q56K79j309K59Q61
5526C76l03j006O25R33q65o08R57L75o08m81Q15P3o12j01O84k18p14K06Q88r9
5546C17r10P84N0m14l90P47J44n51k21J009n6j124K85J030o09n79N73O69p92p02
$$ plain form
5411 235 -463 -356 832 350 -458 98 812 100 -520 138 727 -296 -722 94 385 -429 -491 145 236 -446
5431 -446 86 600 31 -756 182 809 -192 -573 448 545 -707 -457 378 244 -933 -80 564 7 -930
5450 -930 136 678 -329 -830 753 598 -941 -485 706 76 -763 -145 634 -367 -733 272 626 -728
5468 -728 -762 393 46 -815 6 985 -35 -726 234 686 -356 -641 571 887 -497 -208 777 310 -638
5487 -638 128 1225 43 -694 261 828 -462 -546 465 380 -614 -240 810 97 -546 -127 512 -64 -661
5506 -661 355 576 -401 -396 549 156 -581 -182 805 -113 -948 62 408 -280 -570 286 565 -744 -485 376
5526 376 73 -933 -308 625 -240 -848 109 484 -124 -605 210 283 -329 -430 254 36 -678 -472 416 317
5546 317 -593 191 241 -173 -563 184 328 -223 -444 565 509 -615 -330 700 91 -488 85 754 -38 -740
5566g40J066K91r87q4R26J03j024K9R87j32q58M94O00p12n82Q41K77j028j11J135
5586D91j28q80L79P32n02p81R79L32j025l70R83J61j134K85J142l26j020N39Q99
5605G56p76p11P29O48j162k06R61p7p04K17J110p76r00J018N99r96m57J072Lq79
5625e31J9J125k23j070M53J046n01q36N69O48o80l36R34J05j223K02R41l92q08
5644e58O89N31m66p71Q95N59j105l16R85o6p46J44Q28n41m33M76M33p87l52Q35
5664B34K11q49j71J051k16p75L71O16p25k90N35L54o21l22Q78m0o00J40L01M1
5684A23n89Q6N44j69l67L33O96r03m2N18K07q22pN29J22l50L7L21K3l88p4N93
5706D21j25n16M26J62m50l7M56j1l76o2N86k42l28o9P64m39n64M74L27l45m82
$$ plain form
5566 -740 326 617 -370 -454 472 575 -449 -420 567 435 -423 71 671 -41 -623 218 495 -533 -644 491
5586 491 363 -517 -138 594 92 -689 290 622 -403 -773 210 371 -763 -478 664 338 -682 -143 756
5605 756 -20 -731 -2 646 -516 -722 239 162 -542 -325 785 9 -891 127 726 -270 -727 345 348 -531
5625 -531 -512 613 390 -680 -227 819 318 -518 51 699 19 -317 617 722 -501 -299 642 250 -558
5644 -558 131 662 196 -575 320 879 -226 -542 443 377 -369 -225 603 62 -371 105 538 -249 -601 234
5664 234 445 -404 -575 476 260 -515 -144 472 -253 -543 -8 346 -275 -597 281 241 -359 -219 82 123
5684 123 -466 -380 164 -5 -372 -39 657 -246 -288 230 437 -385 -392 137 259 -91 -54 267 290 -98 -172 421
5706 421 296 -220 206 368 -82 -119 337 326 -50 -112 474 232 -96 -165 599 160 -404 70 397 52 -430
5727d30Q04J51p63L6P38L4q97L3P26m59m78M79M57q86oP21R7r62K98O51j16j067
5749h39P13M40n22l28O16M68j188o4J117or14j43J162m27n69K62R13r45l49Q02
5769A99J50p29K2P43k9o93J79N56p8q44O41M02p76L7N47L35j127N5J065k14j032
5790e91N78J11m4m42N44L83p24k61R10j13m11j41M88R8p16Q4O39l73l21L70K00
5811B68k88j49K61L80p80JN57q6o37K16M75p4k79K30K45o59j83N28p8l02k21P38
5833A63K83p25K72J08l96o6J32M25J1n79L42K63l06q7N55j96l09PM84l87k33K93
5855E4L39l44l14L28J16k62PM05K43q49jN51n9l91N9O00k54p71N99M56o70j47
5877c05N82K93q01n0Q16m25m57M88K41k21p80R36M51j071M6P66k53o94M8Q57j68
$$ plain form
5727 -430 374 525 -238 -202 536 570 -327 -294 432 -27 -505 -26 431 -455 -461 260 357 -605 -307 344 228 -839
5749 -839 -126 314 -208 -536 80 548 -640 -704 413 407 -507 -650 512 85 -484 -222 691 -254 -603 199
5769 199 349 -380 -358 385 356 -337 -158 398 320 -524 117 519 -257 -220 327 662 -465 -410 655 441 -591
5790 -591 -13 98 54 -388 156 539 -185 -446 464 351 -60 -201 287 385 -331 -247 392 19 -302 68 268
5811 268 -20 -169 92 472 -308 -307 250 164 -473 -257 218 144 -135 95 340 -319 -502 26 -52 -354 -575 163
5833 163 446 -279 -7 101 -295 -361 -229 196 207 -372 -30 233 -73 -160 395 199 -110 -103 381 -6 -239 54
5855 54 393 49 -265 63 179 -83 -76 329 572 -277 -278 273 214 -177 -118 482 228 -543 56 512 -158 -305
5877 -305 277 570 -231 -281 535 110 -347 141 382 161 -619 317 768 -303 -257 509 256 -438 -390 467 299
5898B99p76M39M91o52l14N69M10q07m44R94J74j068M40P21o27n25Q04L90q05j29
5918d16M75K56q20J56P50j07q07K72P45o49m28R06K92q54r4P19J84q05O5P17j94
5939C63r15M13P30n80n32P82J48m51k40P72O9r70K83N89l84m78M75K83l85n22
5959e50Q49l2n04j58Q00m9q86kR32r9q54L31P45n83l69P55j11o14j66O11K19p19
5981d54K82M55p3p79M76M90o13k88O39L14n82j09L77J29o29J36N57p4p34N75N22
6002F17k82n24J39P70j168q2Q81L2p95M80O19o86l90K74O39o02k81M24N67q94
6022b62k31P57J63o31J65M39k85m94L60P27p98m38P58L71r78j02Q32l9p02N1P88
6043D51n61m81N58N25r23l16R21O6n55k16J038j31r20M51O97o20o56O59M34r02
$$ plain form
5898 299 -477 -38 453 -199 -513 56 466 -341 -785 209 383 -685 -245 476 -151 -676 128 518 -287 -416
5918 -416 59 315 -505 -349 401 294 -513 -241 504 -145 -573 333 625 -229 -323 396 580 -225 -160 557 363
5939 363 -552 -139 591 11 -521 261 409 -42 -282 490 559 -411 -128 461 77 -401 74 357 -28 -550
5959 -550 299 267 -237 -395 405 356 -530 -532 400 301 -553 -222 523 -60 -429 326 215 -399 -565 46 265 -454
5981 -454 -172 283 210 -569 -93 397 -216 -504 135 449 -133 -242 135 264 -365 -229 328 254 -480 95 617
6002 617 335 -189 -50 720 -448 -530 351 383 -412 68 687 1 -389 -115 524 -78 -359 65 632 -262
6022 -262 -493 264 427 -204 -39 400 115 -379 -19 708 -90 -528 230 601 -377 -479 353 314 -388 -337 451
6043 451 -110 -591 -33 492 -431 -747 174 240 -315 -531 507 376 -544 -93 604 -16 -672 -13 421 -481
6063d81J50Q86l76p85L08P09q4r54L99P24o43l60P94J98p45k2O97j1p69M06K96
6084C37j35o41N41N41o17o51R09J2n2m06M86q9o64M92N50q40l78R05K70p87l36
6105e53J107k50q21K24P42k64q74O83M48m08l72M48N4k12l30P82j34o49J85M70
6125B76j72m18K25L68m41k38M17J59l22m23P93j94l40K73M26k74n63M11L28l97
6145a06o11Q98J62l22k81L92N6k80j54M41k6n86N64K54m51j80L96K23m34lM63
6166D15m1m08n2L44Q3n47M9M81j0n48M58Mj85k48M44m4l62N2M50m4p62M95K98
6189C22l44l73N26M27q23j73N84R4n43J60O52p23j06M9O23l50n63O26Q8m85n1
6210c83O26l8o92L05N10m04k82K67N93n31n18P54j25k42j34O81j16p14K50N33
$$ plain form
6063 -481 -331 555 179 -606 -298 411 327 -627 -228 496 -147 -507 287 485 -260 -282 415 404 -365 41 337
6084 337 202 -439 102 643 26 -625 284 296 244 -162 324 235 -429 63 613 -227 -605 300 570 -217 -553
6105 -553 554 304 -517 -293 449 185 -689 -6 442 34 -338 110 164 -48 -378 404 270 -379 -194 276
6125 276 104 -314 -89 279 -162 -400 17 176 -146 -569 224 30 -310 -37 389 115 -448 -37 291 -106
6145 -106 -717 181 343 21 -260 132 188 -92 -246 195 169 -417 147 401 -50 -230 166 389 -45 -48 415
6166 415 374 -34 -86 258 341 -206 -157 324 314 -234 224 228 43 -205 239 195 -167 -115 335 291 -471 24 322
6189 322 -22 -395 131 558 -265 -438 146 240 -303 -143 509 -214 -320 -271 352 2 -561 65 153 -332 -383
6210 -383 243 205 -487 -182 328 -76 -358 -91 502 -29 -547 207 82 -160 -294 387 271 -443 -193 340
6230C40l73j94K68L80n38j56N11L17o88q7P87m34j29K8L15j28n82M81R1m95J24
6251a62K11Q2k76L3M85k44m75K91L35l21j87L35J26o73J13N35q5n42J82M73k81
6272d5j80k40O68j40k83K61K74m04k51J18N45n42M4K62l7l49M03J44k23oj71K76
6294A24k97k8J86L98o14n5M01j6m42R0O24j34n94L97L09k62m13L77N28o74k24
6315c19P52j38l52r3M13P9q54M45N56m49l65N09J79o24K10K04M05r21L94M06j65
6336B72n54j94O92l8q16M27N34p02K9M60M9n20N1O23k14n80M85L03n35l35N39
6357b4n5m29JR83m53l56J71M06m09k08K17L62k98l55Q23k14n90K17K88M0l71L77
6379A23L72m89m55M04M55l76n4J61K91q78J55M89j69m99M58L40k44n51O44J90
$$ plain form
6230 340 -33 -227 41 421 -117 -273 238 555 -133 -220 567 133 4 32 347 219 -363 118 209 -286 -162
6251 -162 49 131 -145 -112 373 129 -346 -55 280 -41 -228 107 233 -440 -327 208 123 -419 -237 236 -45
6272 -45 -225 -465 203 63 -220 41 315 -89 -340 -222 323 -219 -175 87 50 -299 104 248 25 19 -152 124
6294 124 -173 -201 -15 383 -231 -286 115 99 -343 -253 371 237 -357 40 349 87 -326 51 579 -95 -319
6315 -319 433 295 -57 -150 263 342 -512 -67 489 40 -325 184 363 -261 -51 153 558 -363 31 437 272
6336 272 -282 -476 216 178 -638 -211 323 -379 -350 110 159 -361 -310 313 99 -481 4 307 -228 -563 -24
6357 -24 -79 -508 -507 476 23 -333 -162 244 -165 -373 -156 206 -92 -447 376 162 -428 -211 77 117 -254 123
6379 123 495 6 -449 -45 410 34 -20 141 432 -446 -291 198 29 -470 -12 328 84 -467 177 367
6399C67n06j08M26J69m22o4P23m02n95L01M47k54n68N94P7l05l52Q93m96l08K00
6420a83N40m09j28k21O97l11m99N20K09l72j68N96j15l11l23P33l81l9K54K39
6440C28l96k03L41P1k70m30Q74jp37J74O49k35n18K83M71j72o78P99k6m46k31
6461c53P19j89m02K63M91k62q75M86L48k76j58L26L08o25j09N39j41k23J92K39
6481B98k73l50M95L11o15m6L47K70o80J50L38K9p42M66M20k78o71M24N00n76j29
6502c12M04J40m86n5O02j47n47K74O69o69p14J059k92k9o0L98k47l22l9O64k69
6523B2o61R20mk51j65L66Ol83j42O08Lo19K16M44k19l67J92M20m27j17M54K5m45
6546a24m9L59m7m18M58J85n28k59O34n7k78j29N71m2o54K07M31l8m80L37P8k24
$$ plain form
6399 367 -139 -247 179 348 -74 -138 585 183 -412 -111 336 82 -486 108 185 -120 -472 421 -75 -383 -183
6420 -183 357 -52 -180 -401 296 -15 -514 6 215 -157 -325 271 156 -155 -478 255 -126 -165 89 328
6440 328 -68 -271 70 141 -129 -559 315 314 -423 -249 400 165 -353 -70 401 229 -449 350 324 -122 -353
6461 -353 366 177 -225 38 529 267 -608 -122 226 -50 -208 118 426 -199 -308 231 90 -133 59 298
6481 298 25 -325 170 481 -134 -180 167 437 -243 -93 245 274 -468 -2 418 140 -531 -107 393 -183 -312
6502 -312 92 232 -254 -309 293 146 -401 -127 542 -127 -841 218 -74 -103 -163 235 -12 -334 -373 291 22
6523 22 -639 281 277 26 -139 227 233 -150 -292 316 319 -300 -84 360 141 -226 -34 386 -41 -158 296 321 -124
6546 -124 -173 186 139 -279 179 364 -164 -423 211 154 -124 -253 318 276 -378 -171 260 222 -258 79 157 -67
6568f7k17K17K70m45k8K25J68k16m5M41l94j57K34J83k70l33M77K15l13l69K35
6589a89M15l36l9K87J7n15M75n3j65l01M35J41k36j3J59P5k27K8K34K9k83m2M21
6612C17m94j1K56L06l47l74O12r7l12j6L92k88r1K36J82j94l83O59R6q17J10K74
6634A6J57n46L21J72P6p55K29P24m83j82L05J08k69m7L67j16l47q3M72j23l95
6655c99M22L92p55q6L60N18o74r1N24p8m23j06N49R7m88M57ql01j23L48J28m61
6677a98J50K62j39j20M2L17j22k23K30J30k65k9K26M8m66J42L58m13o9L40P5k27
6699D9k58L69L39m87J68K6j19m62K25J86N1j18m4M24j36o17K64L42n31J88l2L11
6721A38k65N3K5K2k58nM07l53Q3ML90l51N9J29P5m00Q0L16j19l07PM79j92l07
$$ plain form
6568 -67 -284 -67 203 -242 -270 -45 123 -93 -138 303 -91 -248 -14 169 -101 -434 43 258 -55 -424 -189
6589 -189 226 -110 -149 138 155 -360 115 62 -103 -404 31 172 -64 -77 82 157 -70 -42 192 221 -62 -104 317
6612 317 -177 -188 68 374 27 -347 265 168 -144 -160 232 -56 -147 89 271 77 -306 353 449 -368 -258 16
6634 16 173 -373 -52 120 196 -559 -330 394 -89 -271 34 142 -127 -174 193 77 -270 -353 119 -4 -399
6655 -399 23 415 -340 -426 -66 452 -222 -313 211 133 -290 -396 153 250 -238 219 211 -90 -213 135 263 -198
6677 -198 -48 214 75 -45 -3 314 192 -31 199 329 64 35 261 309 -157 -15 343 -70 -139 201 276 49
6699 49 -209 160 499 12 180 206 87 -375 -150 36 87 -31 -75 349 213 -404 -140 202 -329 -141 -173 138
6721 138 -127 -74 -49 -27 -285 -290 117 -236 -153 -149 241 -110 -51 78 153 -247 -167 149 30 -277 -270 209 17 -290
6745b90J88K93j34j85J46L47k72k63K76J83n86L68L01m17o8J48J46j79l63M68
6765A07K07r2l00L87q6n52O7N93k80m71N92J14l17j39J17K36l63j8L46ro63N18
6787fK76j32l80k3O67m11l99M01K59l91j73M88r8m98L96J77j70l29L43N4j86n
6809a40L43k89j02j69O55p4m21P0N07j57o49M32J62k33j20N49l63j67j21N49l19
6830e7r7K70j9l4m7N6J88l11l56O52P7m61p8M23j54J06j2K9m4j28N7K24k60k12
6854a88L66q2m73K10L47j53k81J36M78k35m15L35M1p5o9L07p8k27m4L41j57j25
6876d1j81L22j02l95N93Om30j64O27l5n26K14K02r6k14L32O5k22k78M33M76q12
6898b26j15O04l2m93J86K52j81n12L65O08l82l16M90r6k32j13K67M5l76J24L79
$$ plain form
6745 -290 -102 191 57 -128 18 365 93 -170 106 289 -297 71 372 -45 -113 35 181 2 -361 107
6765 107 314 222 -78 309 223 -329 -262 331 51 -420 172 286 -31 -170 -53 183 -180 -198 148 139 -524 -6
6787 -6 270 138 -242 -265 402 -9 -408 -7 252 -139 -312 176 78 -420 -24 153 -17 -346 -3 51 -135 -140
6809 -140 203 -86 -188 -357 298 224 -197 -127 380 223 -426 6 168 -65 -185 364 1 -166 -287 262 -57
6830 -57 -154 116 97 63 16 72 260 -51 -407 245 322 -139 -217 206 52 158 146 175 131 3 60 284 24 -188
6854 -188 178 96 -377 -167 180 27 -254 -118 360 125 -290 45 86 11 -58 249 171 -56 -100 241 84 -41
6876 -41 -222 100 -2 -397 196 202 -228 -392 235 200 -326 -112 90 -6 -220 112 177 -45 -323 110 586 -226
6898 -226 -341 263 231 -262 -76 176 -5 -517 -152 456 74 -242 248 152 -80 -193 74 119 -257 -133 246
6919B46l17k25L34Q8l43P8L35R4k35j1K34j19l77J65O12p59k66M27K08j88k90
6940c09N33j68l28J04O27m71k25J93L67l91j57K17J53k08l20N90l73k56O5N19
6960A62K0p48M75K71k60k13M15n7k89K34K01R5p02M31J32j42k84K32N33n96r0
6981a80M59L2l72pM58l2o93J18P02j70n91N8N73l31l28L87K40l21l20P16j53m99
7003b54K71M85m38j63K98K14o67j35P62j60k48n53Q51j77m77L41M30m63Q4m3O
7024c6l39J96J42Oj20j15K13P3m09K29L41j11l53M42N3m07O0J80J96k24l04N54
7046B67l47q2R8K26m03l0L60L01m85k83N98lm13N0O21k04l52p1M82l10j80P3Q9
7069Bp2j85N69l18J18k77L84j10m49M58L66m58m23J053m94j52k10J65R6n3j43
$$ plain form
6919 246 -71 -296 38 126 -217 -139 196 290 55 44 278 159 -218 -53 559 -200 -466 -39 169 -19 -309
6940 -309 224 56 -272 -168 459 -12 -237 -44 323 -68 -225 -8 145 -63 -383 207 -166 -422 -357 162
6960 162 182 -566 -91 180 -80 -293 122 65 -224 10 211 306 -396 35 167 25 -259 -27 506 -90 -180
6981 -180 279 311 -61 -68 390 358 -335 -217 485 315 -276 -218 355 24 -304 83 323 2 -318 398 245 -254
7003 -254 17 502 64 -99 199 413 -254 -389 373 213 -35 -588 263 86 -391 -50 380 -83 1 -42 -36
7024 -36 -375 -179 -37 -31 -151 -266 -53 20 -389 -160 181 70 -283 159 212 -195 -135 45 241 17 -287 267
7046 267 -80 -162 -64 162 -241 -271 89 390 -95 -378 220 217 -196 -146 475 271 -81 -152 330 20 -160 -87 2
7069 2 -70 -255 314 -4 114 -163 221 111 -338 120 486 28 -395 658 164 12 -198 -33 63 10 -133
7090a33N31l92l24K79%J28j37L4J89l16qJ76Rl57K37K28m61qM03N7l45N7R4K88
7114B29o85L90L55l95j29K4L77l7n31N16P5l75L2J60K50l15k65M62P3j26j5J88
7136B58l37j58J78K51j57k38L18K39m48J05L17l75j98J02L94k09j22M56R7m94
7156b1p1L61q7j77j36K80K44q26N08n3k27J78K01K5l3m72L38j17j32L09j68K83
7178B07o11J75M72j93k88K29rO1j78K28J63l53j54K11p2J62j30K71M0j85O3qk82
7201a81J49J59Q2l22m3J61N1l1J04k1o8j26L58M6k45m46M87K18n30L4M10l17j81
7224b52K18L40l87O0J00L18m26j63K89Q6k84k12L91j27o2k0K83L6l72K93L4m17
7246b74J60N16k15n38K58K38Q2o35L54K42q6n11M54J0l01K4O67l34o00M43K54
$$ plain form
7090 -133 398 6 -318 -39 -39 89 -48 -14 175 -141 -149 27 36 -321 -84 144 -317 -325 78 135 -210 -153 -59 229
7114 229 -456 -66 289 -106 -235 -211 166 129 -402 114 189 -186 -154 6 256 -59 -324 138 211 85 70 258
7136 258 -79 -237 -59 192 35 -203 115 354 -94 11 328 -47 -245 -143 251 42 -80 376 473 -21
7156 -21 -92 269 182 5 -131 149 393 -433 75 22 -205 -27 174 199 166 -306 32 -85 -217 92 -76 207
7178 207 -404 -229 243 50 -238 -9 -18 43 -135 93 256 -97 -251 -40 -112 50 -80 191 231 46 109 101 -181
7201 -181 -32 127 209 -113 -156 5 56 25 129 108 40 -86 272 318 73 -373 114 332 -198 -164 246 -71 -252
7224 -252 -34 306 -81 -21 79 397 -29 -192 97 183 -101 -313 78 -49 -111 -131 152 188 -184 109 143 -274
7246 -274 -114 402 187 -351 -93 145 227 -408 -54 188 102 -409 45 55 -246 -222 445 111 -489 -46 208
7267B08q2m08M16K44m99j28O62j14j11m77N07j31m45L69L82j92n41M66Q7o4j28
7288B1R6K46m46J7L2L16k09j5J41k75J4r0K01o8k05L71O9l72O9Q6R3j48n4J76
7312F6L6k58J30J76k68l08M12K45m39n0J73J43n57L07M52m15j17K09J68J24l37
7333a08L89j40k74j69K29l6j64K23J71j70j71K12L20l15l16M85P2l54j37N45R
7354C01n67M6M05r1l36M39rj69L3K69n6r9l01K34J95l25N7L10j69k32J37J87k07
7377E2k40J8L25k14k54M76m7k97R9M43j06o39N64j18k99j12O12k51j89NL51k76
7399i7r5nL68k65k12L67J59n11K84P6p7j38j39O68j07n90J61M13k65m35N56k1
7421I5j09r9L56j61m19Q3P57n46l39O33l0K5m26L47J50k42m68O09j55l25k3N66
$$ plain form
7267 208 126 -282 134 378 -121 -249 413 299 188 -289 218 87 -358 11 393 201 -340 126 213 149 21
7288 21 117 363 -83 -66 -34 282 73 58 199 -76 -62 -152 49 -19 -224 147 216 -156 -87 -1 92 -56 -110 66
7312 66 102 -156 -26 150 -118 -426 -14 231 -208 -258 -85 58 -499 -192 260 -155 -272 -63 105 229 -108
7333 -108 281 141 -133 -302 -73 -109 -273 -50 121 -49 -220 -8 312 -3 -319 166 238 -116 -253 292 301
7354 301 -266 -220 185 94 -242 197 188 19 52 321 265 166 -135 99 294 -31 26 336 167 -65 72 259 52
7377 52 -188 -170 155 -59 -313 163 116 -181 -82 361 255 -384 180 62 -237 -349 263 12 -177 -172 179 -97
7399 -97 -192 -197 171 -94 -306 61 220 -291 -7 69 -8 -146 -285 383 276 -314 -153 260 -5 -440 116 95
7421 95 -14 -113 243 82 -337 -254 503 -43 -382 251 221 246 -180 167 317 75 -393 216 61 -264 -287 279
7443B79r2l05J84J61j2m42L77J22j67m50N42j67j77j18M70j45m33K36K76k37q9
7464a87N44l38k52R3K98m3m27O9L03O0l64L39N0m28K0M56l10j15J67L48k39j15
7486g1O0K29m65O9L43nl91j60L73K06m11m8L15M40n50q8M53k03l90M12K11m59
7508a30M2M08m1n32M04L2J13n30K63J88k22l64L91K19m41K1K04J20k44Q5L12k47
7530E1q1J16J75k30k38%L75k68J29K73l28j49L0L62l8n11J81M57n18j74N13p5
7552E2j32k78K65J35l61K9N54m07l25J96L96j32k29L75k6n67K29L89q2j81k7Q3
7574d4m6j97N01j58k20J66K11rl32R9K74L3o28L35L77o81K14J26L29m68j36K08
7596d6K05j34n3K4J27k80N0L7p8o8L18p6j93J54o6L48n69J27M42k95j78J43M20
$$ plain form
7443 279 187 -118 66 227 215 -227 150 272 105 -345 197 30 -147 -265 205 60 -373 -137 139 -98 -187
7464 -187 357 19 -233 -140 158 115 -312 -243 60 120 -244 95 145 -283 -263 193 -117 -232 -65 283 44 -71
7486 -71 -11 218 -247 -178 165 160 -231 -391 -18 188 -223 -271 44 484 -66 -154 299 96 -294 118 329 -130
7508 -130 -88 320 279 -253 151 183 296 -234 29 217 -5 -369 22 241 -200 -179 25 145 -99 -14 298 51
7530 51 -30 86 261 31 -207 -207 168 -100 29 302 -26 -175 -145 217 179 -332 -151 306 -212 -386 127 52
7552 52 -80 -358 -93 42 -319 -290 264 -143 -468 -272 124 -8 -237 138 112 -455 -226 163 81 -100 -127 -44
7574 -44 -90 -287 214 56 -164 2 213 204 -128 -29 245 278 -350 -15 362 -319 -105 21 350 -118 -254 -46
7596 -46 159 25 -28 -4 123 -157 -107 -70 -148 -216 102 26 -167 -13 -79 269 -300 -173 269 -26 -204 -61 359
7619C59m74P2j79M72n59O0Q6M71n18J43K20j56j68Q2L21m14k6M3L00l88K66J79
7641A92k09k4J61J13n4m58L81p2J59l50J86P6r6m0J73J0l55J80R5o2k45K94J25
7664A80j55l44M57K28n55o7L88M8m11L43J87j66j52J52j15j29k0K07J20l48j0
7685a62J52q2L22l02J23j97j7Q2M58k19m39N76j29l94j86M49K28m65R8K46q4j36
7707g8J08r8J8q8K49J72m51R6L14k03m60M27M0j54J07j00K69k03l47L89J45j86
7729c4j95K31J73n57L89m3J33m07J25M51k82k2J21K9n7m0J36l35J87j99M14k75
7751e7q3K22P6l7l54M18j24l72n5L46m7J0p2M82n18j07K20Q5l2l83L51J20j00
7774a1N3Nq1l99K80L76j53n25R2L96k91n9J76K54k20r7M28L9m26%L93k20k57K42
$$ plain form
7619 359 -115 -43 -222 250 -309 -249 -163 308 -210 -67 153 -3 -171 -89 232 -182 -208 -165 135 -253 13 192
7641 192 -17 -41 120 233 179 -279 102 30 189 -161 25 101 5 -35 138 148 -207 -27 68 6 -239 55 180
7664 180 25 -319 138 366 -189 -256 132 180 -231 112 299 133 -19 133 18 -111 -131 76 196 -152 -162
7685 -162 -10 -92 230 -72 51 -146 -163 -81 377 158 -281 295 166 -228 -414 35 263 -202 -104 142 58 -78
7707 -78 30 -68 -50 -138 111 283 -168 -72 242 39 -421 6 46 -108 -1 -101 168 -35 -382 7 152 -34
7729 -34 -229 2 175 -382 7 -36 97 -310 -185 266 -16 -38 83 112 55 15 151 -184 3 -196 218 -57
7751 -57 -140 82 158 121 -233 185 61 -311 -366 -20 -67 -57 -129 353 -165 -272 -52 33 1 -382 -31 89 -11
7774 -11 42 47 -34 -433 -153 223 70 -455 -363 33 -258 -317 -141 113 -107 -204 224 263 -163 -163 230 10 -247 -5
7798eL69l86k23P29l27j6k47K89R4k59J34%M5k46J93N6j41l69M44P3n26K59K35
7821A75n2j85J9J13J09m08Q4L21j45k69K93J49m33nM92m3l82J81K83n22J68n6
7843a13J79j44Rj29J65k5k86L63l8k59J60K93r2l31L63P0m43J39J67Lk72J82J36
7866I7P4m73K54L33k74k47N43l09L3k83L34K84m06K5Q8O4j70R1M1J06j75j14K28
7889A44k31q7K06J69k11J21Q5m9l28J96K86m35J34J43K41o92L1M60j27m5P7J90
7911B78k36j95j40J83Q7k54K78J55m72J21J15J45k31J16L20k57j78o1K92k87j45
7932c66N39j38m7N1K62j2o72K58L92l60l78M80J42k14N5O1K98m91J23K06J89n48
7954a70K37K16l29nK89J03l59N0J32K92n87K56k6o7l04J98K77k09l86L01K18l66
$$ plain form
7798 -5 364 -22 -245 484 157 141 -106 183 277 18 152 152 197 -49 144 200 59 -310 134 207 -319 -60 175
7821 175 123 -62 -43 70 179 -229 -145 176 31 -238 55 204 -229 -234 258 215 -167 14 297 -225 -57 -113
7843 -113 66 -78 -69 -198 -33 -58 -344 19 -19 -278 -118 175 83 -248 115 185 -258 -119 48 51 -221 -39 97
7866 97 171 -302 -48 285 11 -236 307 -2 31 -252 82 366 -40 -15 73 137 -33 58 99 205 30 -84 144
7889 144 -87 -174 32 201 -10 111 196 147 -181 15 301 -134 0 143 384 -308 -277 183 56 11 88 278
7911 278 42 -153 -293 -110 -23 -277 1 156 -316 -195 -80 65 -166 -50 270 13 -165 -226 66 -221 -366
7932 -366 173 35 -12 39 301 289 -383 -125 267 -93 -471 9 151 -63 -8 53 351 -140 -17 189 378 -170
7954 -170 67 283 -46 -51 238 341 -18 32 164 456 -131 125 99 32 -272 -74 203 -6 -392 -91 127 -239
7976b39J5K58l2l2P9K93j56j05j19K77k87k85L37J01l75j28M47J14p29M74R1j7
7998a8m87K80K30k21Q9J93kk44J71o6K28k87j27L44rl21j06O20k66l24L52K32
8020B61m44K10K03k03j10Q7K87m11o3L30N2j46o3L20o1k18ML0n6j72J30J32R8
8043A97k46j56M67l20r2K07p6jj23M61j58k20J33p7K1k33K92k2m02J39N63k67
8065H7m91M22m3k0r5K27J17j78k59J92n3J67P1j58L30n71N2K03J09m96K89N4K75
8088B31l08J82N4j78j93L78q2l64L26Q1J45m49K67J74j53l55J52L07j63j83J88
8109E7K53m64J55J76j5l67J98k2J6Q7O8K61m04n6Q2K5k00j6L30j99k31J47L25
8132B06m95Q8M34l03k06j0J72J50j40k11M89k19n1q2K91k57oj0mN5j31L84o4k81
$$ plain form
7976 -239 -224 34 2 -30 49 342 186 81 -38 239 -48 -333 4 105 -270 -398 49 163 -566 -92 -1 -18
7998 -18 -505 -225 5 -216 -127 66 64 -180 -9 -75 153 -134 -261 83 74 -247 -353 267 1 -323 29 261
8020 261 -183 27 230 27 -83 4 291 -120 -183 147 199 53 -10 310 249 31 35 65 9 -163 -33 99 197
8043 197 -49 -205 262 -58 -150 57 -19 -20 -143 318 160 -60 73 -4 17 -216 76 54 -348 -209 354 87
8065 87 -404 18 -25 -45 -140 87 204 26 -233 -41 -94 73 144 -14 316 -255 -203 0 109 -387 -98 -44 231
8088 231 -77 105 159 -19 -212 166 84 -280 46 127 272 -177 90 264 111 -244 -92 215 52 -131 57
8109 57 310 -154 1 177 162 -205 -7 -29 -13 74 142 403 -1 -57 25 50 -150 -166 164 -35 -266 -119 206
8132 206 -289 -201 233 -70 -276 -286 -114 36 -104 -315 174 -45 -96 -178 113 -144 -150 -160 -164 -109 -240 144 80 -201
8156b01J01J47n0m0R8J11j18k09L68k9k21R2j12J44k28KP8j9J7J26q1P6k98P1
8180a75R0p9J92j04K53k57R8K20R2n47K24
$$ plain form
8156 -201 -100 47 -3 -43 55 166 48 -161 207 178 -43 49 -63 81 -147 -145 -67 -86 -69 57 -24 52 -246 -175
8180 -175 -85 -164 28 -76 177 -80 18 238 330 -217 7
8191G
$$ Imaginary data points
##PAGE= N=2
##DATA TABLE= (X++(I..I)), XYDATA
0@%%%%%%%%qJ6j6J6j6K4l5M3n6P2q8J04j20J44j75K07k40K79l23L72m31M97n66
31c00O45p34Q31r40J057j187J330j486J656j843K050k274K518k785L076l395L742
48A961m123M542n002N510o073O700p401Q189r083J0110j1300J2698j4370J6408
62H766j8956K2244k6663L2942m2592N9373r6352L08913j08420m75796N67847k33009
74a703m7662P7853j53434K90667j29605k29472L40400j19508j07511P8163O17
85a195P2739j29982j3516K03975j54752p1096J64814k1738j10595L6388P2812
96D7854j1602q7127K2653J26414q5666j20104J55621J4287j24270K0952O4517
107B3529M6450j21097l0211J84528j10686r6663J17154J914q280p6125L6706J30589
$$ plain form
0 0 0 0 0 0 0 0 0 0 -8 8 -8 8 -8 16 -19 24 -32 40 -48 56 -64 80 -95 112 -128 151 -172 200 -231 266 -300
31 -300 345 -389 442 -498 559 -628 702 -784 872 -971 1079 -1195 1323 -1462 1614 -1781 1961
48 1961 -2162 2380 -2622 2888 -3185 3515 -3886 4303 -4780 5330 -5970 6728 -7642 8766
62 8766 -10190 12054 -14609 18333 -24259 35114 -61238 247675 139255 -336541 231306 -1703
74 -1703 -49365 28488 -124946 165721 36116 -193356 147044 27536 -79975 -1812 -1195
85 -1195 71544 -58438 -71954 132021 -22731 -93827 70987 49249 -61346 -24958 47854
96 47854 36252 -50875 -28222 98192 12526 -107578 48043 62330 -61940 -40988 23529
107 23529 69979 -51118 -81329 103199 -7487 -104150 13004 14918 6638 -69487 -32781 97808
119I7808j59836p783J32066o1909k1646k5632P2277L7835j58363J04997P4813
130H4627j29304L8395Q283K5357m217r6742J28826L136j22517Q8723o588j7474
142E05M024n9256J09207k4764j06238J22399j2674p0653M2250j4514L1007k1085
154B08n2011J05205k0262q5163P8707O247m5079R483p086N1544j6386q3112R5024
167C7319J7850j13529N6407L5452l4521L363m2823P0415J3748j28527R3835M6059
179E5048j10007L5996J2715J3795m21p6747J00971J3262j21345P0129L4584m0863
191a2883j0856J774P2755n1899o0085R8480j0223n7769J5373L6639J6460q3945
203d6179K1387Q8797p8913k6350O1377P669l3219m5783O7818L2088j02506L5647
$$ plain form
119 97808 -62028 -69811 62255 346 -21300 -46932 25345 63180 -95183 9814 84627
130 84627 -44677 -6282 2001 27358 23141 -73601 55225 58361 -64156 24567 17979 505
142 505 4529 -54727 54480 29716 -76522 45877 33203 -37450 4800 -9714 21293 208
154 208 -51803 53402 33140 -52023 26684 32931 -12148 -2665 -9751 41793 25407 -57705 37319
167 37319 55169 -58360 -1953 33499 -1022 2341 -40482 29933 43681 -84846 8989 55048
179 55048 -54959 -18963 -6248 7547 7126 -69621 31350 44612 -76733 -6604 27980 -12883
191 -12883 -23739 -21965 50790 -1109 -61194 37286 27063 -30706 -15333 21306 37766 -46179
203 -46179 -24792 64005 -14908 -41258 20119 27788 -5431 -51214 16604 48692 -53814 -18167
215a8167P4554n5232l5841K5259M1069k6392n6543P0643M3574r0460L682P3312
227D9458l3778m4024K0552M3245n227o9659M4016O6099r5177o149P1838l1895
239I299k0283j1281L8361K5548r6660M6584O2625r1068J6344K7909n447Q598n7125
252d6596O2926K8474j07014N9714L3213n9767K4311p679K9772M894p1678P0361
264B0931J2529q1068M9489J2560k4613J2910k4140L5809M752o0661M9090J3928
276B1516n3060K7241N692p774J2938k8693K4556J6962m7129K6958J7176k5336
288h953J3243q287R523J0892l0560K4783P897k4555J4270j0254J0509R064k9051
301a1479K8755L597k8277J1773p079J2586n089k6355M6033j0397l8951L3602n420
$$ plain form
215 -18167 56387 1155 -34686 -9427 31642 5250 -51293 19350 62924 -27536 -23854 49458
227 49458 15680 -28344 -7792 35453 30226 -39433 4583 70682 -24495 -30644 41194 9299
239 9299 -10984 -22265 16096 41644 -55016 -8432 54193 -36875 -20531 7378 1931 10529 -46596
252 -46596 16330 44804 -62210 -2496 30717 -29050 -4739 -12418 17354 22248 -49430 20931
264 20931 33460 -47608 1881 14441 -10172 2738 -21402 14407 19159 -41502 7588 21516
276 21516 -31544 -4303 1389 -6385 6553 -22140 2416 19378 -27751 -793 16383 -8953
288 -8953 4290 -3997 5526 16418 -14142 10641 18538 -6017 8253 -2001 8508 17572 -11479
301 -11479 17276 20873 -7404 4369 -2710 9876 4787 -21568 24465 14068 -24883 8719 3299
314C299o713j1j3419M1128k1129l5590N2948q878k9962J5513M969J5254k9990
327a2581j0248O0383l5168l5118N0602p191k4035j953J0611L1923m2276j3705
339b8756O2889l2861l7259L3382J0931p872l0143K0378M8234o4703j1398O8646
351C1468l1295k6066K1704J5687P243m8911J7861O0005o3273j4251O1200j7535
363A3837k3224l508K6673K1098o4475J7587O4420o2919j7736M8175o462j3954
375d88j8597K8145K9831o6390Q529N8241m2548k0283K6410J4058p514l6946L4839
388G287L2317o2404N853M4641k2156j8328O597K8113n981m3724L0393K3348l9471
401a3515m060K2496J2033k3633j9628M5714n861m6479K7394J5373j7061p877J177
$$ plain form
314 3299 -3414 -3425 -16844 24284 3155 -32435 20513 11635 -18327 -2814 2155 17409 -12581
327 -12581 -22829 37554 2386 -32732 17870 10679 -13356 -15309 -4698 27225 -15051 -28756
339 -28756 34133 1272 -35987 -2605 8326 454 -29689 -9311 38923 -25780 -37178 31468
351 31468 173 -25893 -4189 11498 18741 -30170 -12309 47696 -15577 -29828 31372 13837
363 13837 -9387 -12895 13778 34876 -29599 -12012 52408 -10511 -28247 19928 13466 -488
375 -488 -19085 9060 38891 -27499 -18970 39271 -3277 -23560 2850 16908 9394 -27552 7287
388 7287 39604 -22800 -16947 27694 5538 -12790 -6193 21920 15939 -27785 2608 25956 -13515
401 -13515 -17575 4921 16954 -6679 -26307 19407 13546 -32933 -5539 9834 -7227 -15104 -13927
414a3927L2058j7234l3024M3436j403l3073J5834N891J0052j2315j8447M6120
426B3968j2916m1163L8266M593j7940J702j032K7352k1248l0593M7126m255l2669
439a8809J8108Q696O055k2526j3152N0446k0730l8735M3558M461k4174l745Q854
452a693L0334l2233k1258N7689j8543l9276K8284J1858k295k6792N130N2910m8826
465d711k9528O4777j4534l5203R939K0441J2440n1983P689O4679m9927l1687M7722
478A0114P103k7443k2722M0210K8311o7060N353N9886l2493l6564K7606L3669
490B5970k4212l7743M5827K4783o0209k017N2545r894m3881J2533N1458k4598
502A0562n5830M8519L6813o1825j0857N2951M994m5854j0287O2259q042p0160
$$ plain form
414 -13927 18131 897 -32127 11309 9906 -23167 -7333 -1442 8610 -3705 -22152 23968
426 23968 11052 -30111 8155 12748 -5192 -3490 -4522 22830 1582 -29011 18115 13860 -18809
439 -18809 -701 7995 14050 -8476 -21628 28818 8088 -30647 12911 17372 -6802 -10547 -1693
452 -1693 28641 -3592 -24850 32839 14296 -24980 3304 15162 12867 -13925 -8795 44115 -4711
465 -4711 -34239 30538 16004 -19199 -9260 11181 23621 -28362 -20673 44006 -5921 -37608 10114
478 10114 17217 -10226 -32948 7262 35573 -31487 -26134 33752 1259 -35305 -7699 25970
490 25970 1758 -35985 9842 34625 -25584 -27601 24944 15050 -28831 -16298 35160 10562
502 10562 -45268 3251 40064 -21761 -32618 20333 25327 -20527 -30814 31445 23403 -46757
514d6757M3381M3307m9194j5489L0244K7760l5373l6023O9425P7p0378L7207L4948
527C3135k7452k3501J3203M6202m0458m0815O9617r46n7446J8171L2083m209m1601
540b4017P731N7560l9014m2621N2097J3136m0314q118L4858J4812m7972k296N3031
553B8873k2786l6720L0025K0805k1258k1892K4321K5389m1561j0535M6459j2792
565H328l3128J6610K3791p538l1160J6049L4789l8442k0516M1681J529k5003j286
578a4296K1849J0733l6598j508M1539j8581k3709K2567J3266j0367k1203J5940
590c68K4962l2768o902L4082p834j8634K509J9802N93l1648J3568K6885k6651
603b404j2372K1109J2230j8556j7790L0766P958l9197O914K9090q915k5175P974
$$ plain form
514 -46757 -3376 39931 -9263 -24752 5492 33252 -2121 -38144 31281 31358 -39020 -1813 33135
527 33135 5683 -17818 -4615 41587 1129 -39686 29931 28985 -28461 -10290 21793 17584 -24017
540 -24017 -16286 41274 2260 -40361 11736 24872 -15442 -23560 11298 26110 -21862 -24158 28873
553 28873 6087 -30633 -608 20197 -1061 -22953 1368 26757 -14804 -25339 21120 8328
565 8328 -24800 -8190 15601 8063 -23097 -7048 27741 -10701 -31217 10464 11993 -13010 -14296
578 -14296 7553 18286 -18312 -19820 21719 3138 -20571 1996 15262 4895 -16308 -368
590 -368 24594 -8174 -15076 19006 11172 -7462 -4953 14849 15442 -16206 -2638 24247 -2404
603 -2404 -14776 6333 18563 7 -17783 12983 20941 -18256 -11342 17748 8833 -16342 -8368
616h368L1116j7123k9847K8384J8538l0667j0751K8498P223k9718l153L2912l412
629A3632l6234J5227L1408k8368j9868K9003J1920k5719j4673L5003P232m7403
641b8840J3547L7232k2349k1617J5671K7589k0554l4972M1558J6209m5357N138
653a6745L2379n47l2624J816M4880k4980l4965L9630J3374k8996q685K5770J4741
666B5048m0543l453M5652j8708l1392K5653K1142k1050k3407K5561K1580l7473
678a1390q951M2688p357l5426J6703K4235j4083k3026J4669K7512k7892k1302
690b3620L8731L023l1581O416K1071k647k7453P111L2685k5108j8349K8800J104
703A0183j8626n800J8302R402l0212N613K6595j9002j1210J1313J0920o324j9611
$$ plain form
616 -8368 22748 5625 -24222 4162 22700 -7967 -18718 9780 17003 -12715 -15868 17044 13632
629 13632 -22602 -7375 24033 -4335 -24203 4800 16720 -8999 -23672 11331 18563 -28840
641 -28840 -15293 21939 -410 -22027 -6356 21233 679 -34293 7265 23474 -21883 -16745
653 -16745 15634 15087 -17537 -15721 29159 4179 -30786 8844 22218 -6778 -15463 10307 25048
666 25048 -15495 -18948 26704 7996 -23396 2257 23399 2349 -21058 4503 26083 -11390
678 -11390 -20341 22347 14990 -20436 -3733 20502 6419 -16607 -1938 25574 -2318 -23620
690 -23620 15111 18134 -13447 -7031 14040 11393 -16060 -8949 23736 -1372 -19721 9079 10183
703 10183 -8443 -14243 4059 13461 -16751 -11138 15457 -3545 -14755 -3442 7478 1154 -18457
716a8457J9144J2229k7903O238J6217o255n342l601J4037n5k2066J4992J0524
729I702j5458K603N663K370l283j1544J2525N302j6095P142P831n626j415l859
743d142P830L394j4675P906R296j0080p25K582N245o04j3391J0707Q906j7544
757e295K796J0416k151m609o446J2839K131k1184J1893J1641j4379j791L117Q886
771G864n022j8796K2009O592k8294J0333J4028q747p922R3J8544q646k2220K4474
785D290P359k2953K642J3069K887j6016m361K5512p301k4106J7605J4083j7367
798d657r539J8019R728k2657n033K5016m724k2436J1129J9105j1682j6121J4044
811A92J4656k0262j0294K4822L104k1259L335J8555l701k1411Q452K3011j8814
$$ plain form
716 -18457 687 12916 -14987 -8749 7468 1213 -4129 -7730 6307 6252 -15814 -822 9702
729 9702 -5756 -3153 2510 4880 1597 -9947 2578 7880 -8215 -1073 6758 1132 -283 -4142
743 -4142 3688 7082 -7593 313 9609 -471 -1196 1386 6631 6027 -7364 3343 12249 -5295
757 -5295 -2499 7917 5766 1157 -5289 7550 9681 -11503 390 12031 -2348 -4139 -1022 7864
771 7864 2842 -15954 6055 12647 -15647 -5314 8714 -33 -7955 -7862 10682 2036 -20184 4290
785 4290 11649 -11304 -8662 4407 7294 -8722 -13083 12429 5128 -18978 -1373 12710 -4657
798 -4657 -14196 3823 13551 -9106 -14139 10877 6153 -16283 -5154 13951 2269 -13852 192
811 192 14848 -5414 -15708 9114 12218 -9041 -5706 12849 9148 -12263 -3811 19200 386
824C86j3170K2676K580j6022l693J4792O824k4219L261K4706j6119j2534J4097
837C565O664p809j3461J2657J2342k3129J89K0359o878j1485K253J1116k491j7312
851a3420J1700J4190j6256m630J1477K259r771n935J4735K205j7044O085J0667
864F262p126o075K124R966k686j5925J2448R476j6799P31J0427N31n583q023J3928
879C676M015k0402Q583J4074j0594m319L196R313k975j6737J4377J1931j9868
892e730n42J5394q34j2635k336J8430l573k0605J2750J4593j4717r248J3119J0477
906A4543j7989j0207K4574J164k4561P838J9733q802j9711R944K1868j9791j6266
919a7663K5937O161k2502l045K0700L691k8167L607L0475j7894k0842K2317J1748
$$ plain form
824 386 -12784 9892 12472 -3550 -7243 7549 14373 -9846 -6585 18121 2002 -10532 3565
837 3565 10229 2420 -11041 1616 13958 -9171 -8982 11377 4499 -6986 -4733 6383 3892 -13420
851 -13420 -1720 12470 -3786 -8416 3061 5320 -4451 -10386 4349 6554 -10490 -4405 6262
864 6262 -864 -6939 -4815 5151 2465 -13460 -1012 8464 -8335 -7604 2823 3354 -2229 -10252 3676
879 3676 7691 -12711 -4128 9946 -648 -4967 -1771 7542 4567 -12170 2207 14138 -5730
892 -5730 -6272 9122 8288 -4347 -6683 11747 8174 -12431 319 14912 195 -9053 4066 14543
906 14543 -3446 -13653 10921 12085 -12476 -4638 15095 6293 -13418 -3474 18394 -1397 -17663
919 -17663 8274 14435 -8067 -11112 9588 13279 -14888 -11281 19194 1300 -19542 2775 14523
932A4523j9424j2927K2943J0398l2580K512L1899j3754k2906J4278J9984j5215
944b69k2804K5600J8173l3748o030L2787l634k6962O219K8147r322k9909J9741
957b011K3440k8423j1141K7810N165k3244m281K6765n05l2886J3733K8329k3439
970f88j5592K2562J0390k0987j2112K8713O043l4573Q331K8475j5621j9629J4582
983a06J8658j6268j9862K2768J3833k7436l965K6962l041k4213N584K1525j0660
996C779j9188J5782J5957k0030j0747K0981L700k1420P08K0454m247j9670P195
1009f746J9407j1843j7956J6479J4201k0321q183K0547L758j8747j498J8896m65
1022G529k0377N665J8571r932j4226J2071J1092j1898j0416J4686Q040j7931k088
$$ plain form
932 14523 -4901 -17828 5115 15513 -17067 -14555 17344 3590 -19316 -5038 14946 -269
944 -269 -23073 2527 20700 -13048 -19078 13709 10075 -16887 -10668 17479 8157 -21752 -2011
957 -2011 21429 -6994 -18135 9675 14840 -8404 -12685 14080 13575 -19311 -5578 22751 -688
970 -688 -16280 6282 16672 -4315 -16427 12286 18329 -16244 -7913 20562 4941 -14688 -106
983 -106 18552 2284 -17578 5190 19023 -8413 -12378 14584 11543 -12670 -7086 14439 3779
996 3779 -15409 373 16330 -3700 -14447 6534 10234 -11186 -10478 9976 5729 -13941 -6746
1009 -6746 12661 818 -17138 -659 13542 -6779 -14962 5585 9343 -9404 -10902 7994 7529
1022 7529 -12848 -7183 11388 1456 -12770 -699 10393 -1505 -11921 2765 10805 -7126 -9214
1035i214J8745l258j5966O504J3211o836j3054R019J4893j5136j1748K0336N088
1048A2584j8827p77J6596J562k0673J810K4260j0899j8363J5768J0982j3523j0881
1061a0381J2209J2659j9034q029K4724k101k1668P227J6422q684j6436J1024J7154
1074A5086j8530j2556K4794K745k3690K838J8139k426j9826M362K5809j4569k2890
1087b0714K3444J1171k2462n392J9426P114k4151k318K8364r106k3575J5740J6216
1100A3757j5476j4169J8538J1647k3116m766K4624j906k2490O442K2447j2103
1112C429j9718J8118J3990j9724r037K0719O594k3575j448K5841o197k2591J2346
1125a253J7226j4192j3785J4946J2583j9127q636K2925M49k1718O965J6061q523
$$ plain form
1035 -9214 9531 6273 -9693 -3189 10022 3186 -9868 -849 14044 -1092 -12840 7496 12584
1048 12584 -6243 -7020 9576 11138 -9535 -7725 16535 5636 -12727 3041 14023 500 -10381
1061 -10381 1828 14487 -4547 -12576 12148 10047 -11621 -4394 12028 3344 -13092 -2068 15086
1074 15086 -3444 -16000 8794 11539 -12151 -9313 8826 6400 -13426 -9064 16745 2176 -20714
1087 -20714 2730 13901 -8561 -13953 5473 12587 -11564 -13882 14482 5376 -18199 -2459 13757
1100 13757 -1719 -15888 2650 14297 -8819 -13585 11039 9133 -13357 -6915 15532 3429
1112 3429 -16289 1829 15819 -3905 -12942 7777 14371 -9204 -10652 15189 8992 -13599 -1253
1125 -1253 15973 1781 -12004 2942 15525 -3602 -12238 10687 11136 -10582 -3617 12444 3921
1138C921j3648P648J5106j3540j2882K1173K944j9438L031J2141m19j4282J118
1151g127J9509j0766j5644J6797N213j2242l606Q768O951j4374l593J8354o161
1164B079j1983Q103N875m299p515M740J0303j0102o340J2560l21r020J676P114
1178B870N55q492J049J0109n448p778P703M816n316l897M589N551p611l502R248
1193D446M47p498N72O834k8q378J916Q790m664o193M733N432n026o641P522N750
1209H014j0555j582R493m40q533L19R797k198j1927P284Q558r847l567O987M036
1224E839p464o796J2339K805j5274N019J0798o786q012M012R955p594j0467J4734
1238C108M418j5192J190J0551j068j0535J196J3792n286j3490J1668P784j2814
$$ plain form
1138 3921 -9727 -2079 13027 -513 -13395 7778 10722 -8716 -5685 6456 6037 -8245 -7127
1151 -7127 12382 1616 -14028 2769 7982 -4260 -7866 902 7853 -6521 -10114 8240 2079
1164 2079 -9904 -1801 4074 -225 -7740 -3000 7303 -2799 -9139 3421 3100 -5920 -4244 2870
1178 2870 3425 -5067 -4018 6091 643 -7135 568 5384 68 -3829 760 6311 -1300 -4802 4446
1193 4446 4893 -2605 -2033 4801 4773 -3605 -1689 7101 2437 -3756 977 6409 1383 -5258 2264 8014
1209 8014 -2541 -4123 5370 4930 -3603 -3284 6513 4315 -7612 -328 8230 -1617 -5184 1803 5839
1224 5839 -1625 -8421 3918 6723 -8551 -3532 7266 480 -7532 -3520 6435 -1159 -11626 3108
1238 3108 7526 -7666 -6476 4075 3007 -7528 -6332 7460 2174 -11316 352 8136 -4678
1251d678l246J0829K815j0632k429J4400j900j5289Q794J0810j1166m990Q242
1264A560N844q311p464J4446K608j6281M921J1052o102p137L911R858p129r787
1278h011J2720L357j1810P13Q782j49r578Q00J1008m762r189P266N942p275n537
1293e723P960L516r110p64P864m70p070M62Q173l653p655N196N079n103l668M879
1309h7L976o633l796P790J407p448J068O741j951n839J230N783j154o855M408
1324a360O323o742l428N607K727m467m749P936L796j1487L048Q297m160m908J292
1339b275Q040k513j1022R243P537j2190j038R038Q25q228j984J1714j010j3741
1353g604P100J0360q874p506Q623O617r903o278J2841L666j5719J191J4724n319
$$ plain form
1251 -4678 -7924 2905 5720 -4912 -7341 7059 5159 -10130 -1336 9474 -1692 -6682 1560
1264 1560 7404 -907 -8371 6075 8683 -7598 -2677 8375 2273 -4864 -953 8905 1776 -8011
1278 -8011 4709 8066 -3744 -3031 5751 5602 -3976 -3176 7832 3070 -6119 1147 7089 -186 -5723
1293 -5723 2237 5753 -3357 -4121 3743 3273 -3797 -3335 4838 1185 -6470 -1274 3805 -1298 -4966 -87
1309 -87 3889 -2744 -6540 1250 2657 -4791 -3723 3018 1067 -4772 -3542 2241 1087 -5768 -1360
1324 -1360 4963 -1779 -5207 400 3127 -1340 -6089 1847 5643 -5844 -2796 5501 1341 -3567 -2275
1339 -2275 5765 3252 -7770 1473 9010 -3180 -4218 4820 5645 -2583 -4567 7147 6137 -7604
1353 -7604 -504 9856 982 -6524 2099 8716 -1187 -7465 5376 9042 -6677 -5486 9238 3919
1367C919j2219P938R957r941r616J2246P245j4621k970J5542j557j5464M290J3952
1381H701p177j2786J0552J1234j3798r216J6367M490j7874J068J6651l732j5202
1394a0722O064J4233q793j4263J4185R928j6761l779J6601K89j5682J784J6126
1407I210n653j5275J0968J2031j3527p499J4309N009j4851k904J6532m41j7321
1420i412N971J5626r551j2331J1039J0225j2782p815J5114M049j5979K27J4777
1433I158l841j2808N807J1346p516j0789J0650Q003j3619l823J4091p1j3213J981
1447d644J1739l256j2828O101J2690j0887q403J2153M010j0679l845J0239M503
1460F893j3671n01J5021n828j1496P214P669n623p784O831Q684j0591n642J3056
$$ plain form
1367 3919 -8300 -362 9595 -346 -9962 2284 9529 -5092 -8062 7480 5923 -9541 -5251 8701
1381 8701 1524 -11262 -710 10524 -3274 -12490 3877 8367 -9507 -8439 8212 4480 -10722
1394 -10722 -4658 9575 782 -13481 704 10632 -6129 -9908 6693 6982 -8700 -6916 9210
1407 9210 3557 -11718 -750 11281 -2246 -9745 4564 9573 -5278 -8182 8350 7909 -9412
1420 -9412 -3441 12185 2634 -9697 1342 11567 -1215 -9030 6084 10133 -5846 -5619 9158
1433 9158 5317 -7491 -1684 9662 2146 -8643 2007 10010 -3609 -7432 6659 6588 -6625 -4644
1447 -4644 7095 3839 -8989 -2888 9802 -1085 -9488 2665 6675 -4004 -7849 2390 6893
1460 6893 -6778 -7279 7742 1914 -9582 -2368 5301 -322 -8106 -1275 7409 -3182 -8824 4232
1474D232j95j0766K372R069j584j0248M046J1641q558r312J1415N238j0639l233
1488f522J0642M014j3638k82J4239l649j2553N935J1115o782j0693R902Q575j2509
1502b206m397J1900K666j1785j548J3940l241j3803Q129J0294r599p606R660O931
1516I335j2734n520J6479L6j6474M856J3315o684j2295P268J3181j1494j1210
1529a1941J5633N691j6353j349J4024K08j4887K076J6894q616j3473J2663P133
1542G703j1562n694J1788N873j5974n50J8048o726j3853R371R420p998j0466J1374
1556G54J1010j7611l884J7922j916j4576L645J3074l893j3650P932J2645j2420
1569i68q131J3684M249j3316j034J3005r16j3646M199J2733q155r566J0219O609
$$ plain form
1474 4232 4037 -6729 -4357 4712 3128 -7120 -3074 8567 9 -9303 2112 7350 -3289 -6522
1488 -6522 4120 8134 -5504 -5786 8453 4804 -7749 -1814 9301 2519 -8174 1728 10303 -2206
1502 -2206 -6603 5297 7963 -3822 -5370 8570 5329 -8474 -345 9949 350 -7256 2404 9335
1516 9335 -3399 -8919 7560 7596 -8878 -4022 9293 2609 -9686 -2418 10763 -731 -11941
1529 -11941 3692 9383 -6970 -8319 5705 5913 -8974 -6898 9996 1380 -12093 570 7703
1542 7703 -3859 -9553 2235 8108 -7866 -8416 9632 2906 -10947 -1576 7844 -154 -10620 754
1556 754 11764 -5847 -9731 8191 6275 -8301 -4656 8418 4525 -9125 -1193 11452 -968
1569 -968 -9099 4585 8834 -4482 -5516 7489 6573 -7073 -2874 9859 1704 -7862 2357 8966
1583H966j0893m791J2315J995j3206J360J1953m202j0237M732J0627p547j0214
1596i142J1550M764j1305r96Q333J810r598j330J2090m203r388P044M853n417
1610i35m888M662O213p994l831J0734j240q631K966N958j461p303L171Q282o694
1625i91n125P376K391n876k721O350K979p964m11R005k863o817L367N088j972
1640A816n971L664O827p077l861P997P90n844n30N334J553p642R32Q743n187o117
1656d573O005L749m753l994N681L995q228k085R203j241q263K825O859l181p500
1671e501M954O431p085m662P795K789q300j559R110q95r180L575P246m907n732
1686e921M831O331p550m845R650J164q922J075P996j800q067K737Q518n333p352
$$ plain form
1583 8966 -1927 -6718 5597 7592 -5614 -4254 7699 3497 -6740 -2008 8619 1072 -9142
1596 -9142 2408 7172 -4133 -5129 3204 5014 -4584 -5914 6176 1973 -7415 -371 4482 -935
1610 -935 -5823 -1161 5052 -2942 -6773 3961 2721 -5910 -2944 3014 1553 -5750 -2579 5703 -991
1625 -991 -6116 1260 3651 -2225 -4946 1404 4383 -3581 -3992 5013 2150 -4667 -1300 3788 1816
1640 1816 -4155 -491 6336 -741 -4602 3395 4185 -1659 -2189 3145 4698 -2944 -2012 6731 1544 -4573
1656 -4573 1432 5181 428 -3566 2115 6110 -2118 -4203 5000 3759 -4504 -1679 5180 1999 -5501
1671 -5501 -547 5884 -1201 -5863 1932 4721 -3579 -5138 3972 3077 -6103 -2528 4718 -189 -5921
1686 -5921 -1090 5241 -2309 -7154 2496 3660 -5262 -4187 3809 2009 -6058 -3321 5197 -136 -7488
1701g488Q477M272q219k339Q273P27q148Q69Q622k791p982N265O460o600l956
1716d558O550K966o297k579P957P05r197K941P356m209n069L999N249n211m748
1731d145P098J414o229k73N446J10o266J400O517l923n313M625L214m182k732
1746c239M369K711o045q48N085K6m987Q63M541j650m619K567L539k781l576L850
1762a94K889n083j357M747J97l603j090M478M32n220J622N300k978l765K654L797
1778B826l184l606M694K616n212j504N852L49n715J151N553j981m987K201N742
1793D795l444n719N762M423p382j465O815O0o201q8P570j847p627M337O112n841
1809B60m550O527L555p417k245Q037P40r205J407Q777m198p695N949O142p275
$$ plain form
1701 -7488 989 5261 -2958 -5297 2976 3703 -4445 -3576 5046 2255 -5727 -462 5998 -602 -4558
1716 -4558 1992 4958 -1339 -3918 4039 4744 -4453 -1512 5844 1635 -3434 565 5814 603 -4145
1731 -4145 2953 4367 -1862 -2135 3311 3421 -2845 -1445 5072 1149 -4164 461 3675 -507 -3239
1746 -3239 1130 3841 -2204 -3052 2033 2059 -2928 -2065 2476 826 -3793 -1226 2313 -468 -4044 -194
1762 -194 2695 -2388 -3745 1002 1199 -2404 -3494 984 1416 -3804 -2182 3118 140 -3625 -971 2826
1778 2826 -358 -3964 730 3346 -1866 -3370 2482 2831 -2884 -1733 3820 1839 -3148 -947 4795
1793 4795 1351 -4368 1394 5817 -1565 -3030 3785 3845 -2356 -2444 5126 3279 -4348 -11 6101 260
1809 260 -4290 2237 5792 -1625 -3870 4167 4907 -4298 -2891 5886 1688 -6007 -58 6084 -1191
1824a191m554P780L276q926j692R780j205r431L218Q421n025p572O738O263q551
1839b671m427J0028J277r584K71R465k086r268M935Q131o964o111P617N048q461
1854b800l934J0479J079j0668K628R459m614p706N174P586o737o044Q713M080
1868F695r771j165Q860k83q874K457Q727m374p842O357O001p481m188Q197K144
1883E460q086j001Q691j297q413K905P921m787o497N629N672p393m651Q802J703
1898D658q425lP434q08p282J040Q649m662p207O590L924n407l499N470L879q027
1914c676j740R478k508p195L981N429l537o224M650O574p449l906Q636J781q285
1929c991p22Q532r0r385K728R006n128o840N892N897o084n044Q000L169q991l59
$$ plain form
1824 -1191 -5745 2035 5311 -3615 -5307 4473 3268 -6163 -2945 5476 451 -7121 -383 5880 -2671
1839 -2671 -7098 2930 4207 -5377 -5106 4359 2273 -6995 -2060 6071 -893 -7004 613 5661 -2800
1854 -2800 -6734 3745 4824 -5844 -3216 6243 1629 -6077 -903 6683 -54 -6098 2615 6695
1868 6695 -3076 -4241 4619 4336 -4538 -2081 6646 2272 -5570 787 6788 -693 -4881 3316 5460
1883 5460 -2626 -3627 5064 3767 -4646 -1741 6180 1393 -5104 525 6197 -1196 -5847 2955 4658
1898 4658 -3767 -3770 3664 2856 -4426 -3386 5263 601 -6606 -16 3908 -1499 -4998 472 4351 -3676
1914 -3676 -5416 4062 1554 -5641 -1660 3769 232 -5992 -1342 5232 -2217 -6123 2513 4294 -3991
1929 -3991 -4713 3819 3729 -5656 -2928 6078 950 -5890 2 5899 -185 -5229 2771 5940 -3051 -3410
1945c410Q592j891p400K265P756l521q184P393N940r710k291Q673P25q239o07
1960c909J0166j771j1329N923Q804p936n542O745N582q294n075J0790J497j1833
1974f182K181R611l533q043M062Q253o940o993R290L636r734q01R033k79r786
1989f225K101J0413n545q749Q275N833q668m642R521L438j1085l95J1262k612
2003B922r129L884Q161m442q331P149O781r489k874R043O52q094P1R085j823r207
2019e641N580P232p872m035P146L277p468k779R640j10r690L151P788l985o689
2034d455M111O840o247n769Q198L013q774l91P113n6p110P11P858l240p489N602
2050h5M649o599k167N256K425o015j958Q047j254p733L665N299l797m669L927
$$ plain form
1945 -3410 5182 3291 -4109 -1844 5912 2391 -5793 1600 7540 -2170 -4461 4212 4937 -3302 -3909
1960 -3909 6257 4486 -6843 -920 7884 -52 -5594 1151 6733 -1561 -6636 4154 5651 -6182
1974 -6182 -4001 5610 2077 -5966 -1904 6349 -591 -7584 1706 5342 -4392 -5193 3840 3561 -6225
1989 -6225 -4124 6289 744 -8005 270 6103 -2565 -7207 2314 5752 -5333 -5728 5534 2922
2003 2922 -6207 -2323 5838 1396 -6935 214 6995 -2494 -5368 3675 4327 -3767 -3696 5389 3566 -5641
2019 -5641 -61 7171 -701 -4736 2410 5687 -1781 -4560 5080 4970 -4720 -1569 6219 2234 -4455
2034 -4455 -344 6496 249 -5520 2678 5691 -3083 -3474 3639 3583 -3527 -2816 5042 1802 -5687 -85
2050 -85 4564 -2035 -4202 1054 3479 -2536 -4494 3553 2299 -5434 -1769 3530 -267 -4936 -1009
2065a009M939n367m066O438K619o761q58O606K50p015J579O382l024n069L832
2080e24M084l918l849N285L090o842k37O016q87m869R31N646j817o072M356M980
2096E373n935k550N519J368m892k014O322Q53p665K274O546l516n055L557M450
2111D635m215m582O105K693o761q65O407o30o351J661N866k950n473M263M679
2126D482n862l372O602J092n871m11O121n07p080K519O262m437m766N205L310
2141C287n110k766O122J370o605M11O583j899n735K575N309l703m530N272L381
2156C962n649k108O457J63n803J219M962j614m903K574M705l706l962N587J815
2171C699m826o95L997J186n198J48N967k324n250M139K984l677k372L574K066
$$ plain form
2065 -1009 3930 -1437 -5503 935 3554 -3207 -4065 2541 2791 -4224 -2645 3737 713 -4356 -524
2080 -524 3560 -358 -4207 1078 4168 -2674 -2911 3105 2218 -2651 -1720 3926 2109 -3963 393 5373
2096 5373 -562 -3112 2407 3775 -1117 -3131 3191 4044 -3621 -1347 5199 1683 -3372 185 4635
2111 4635 420 -4162 1943 4636 -2125 -2990 3417 2787 -3564 -1903 3963 1013 -4460 -197 4482
2126 4482 -1380 -4752 1850 2942 -2929 -3340 2781 2274 -4806 -2287 3975 -462 -5228 -23 3287
2141 3287 -1823 -4589 1533 2903 -3702 -3291 3292 1393 -4342 -1767 3542 -161 -4691 581 3962
2156 3962 -1687 -3795 2662 2825 -2978 -1759 3203 1589 -3314 -740 3965 259 -3703 1884 3699
2171 3699 -1127 -1822 2175 3361 -1837 -1689 4278 1954 -3296 843 3827 150 -2222 1352 3418
2186C418m347j334M588M67n045P26M642j910m112K674K931k246l224K900K653
2201B781m619j223N078q87l275N1L378K8m270J442M101l329k826L489J859l192
2217a414j574L557J310m047o03M389k92m494J751L605k057l077J989L563k849
2232b43k900M188J731m802R7M502o72m200R10M712j955m212L498L066l490k840
2248b610M281K041m799q77N190p32m645J148M709k196m325L262L804m414l176
2263c339N167J957n510p69N520q88n119J359N194k598m801L902L711n121k665
2278d000N413J134n238n13N423l63n974K236N468m125m158N030K359m348k691
2293d347N646J569o158j01O434j946n439L213M483l915l342M228L190m908k627
$$ plain form
2186 3418 -929 -2263 2325 2792 -2253 -1527 3115 1205 -2907 -233 2698 452 -2772 128 2781
2201 2781 -1838 -3061 2017 1130 -2145 -2094 1284 1312 -2958 -1516 2585 -744 -3570 -81 1778 -1414
2217 -1414 -2988 569 1879 -2168 -2771 1618 1326 -3168 -1417 2188 131 -2946 -957 2606 -243
2232 -243 -3143 1045 2776 -2026 -1929 2573 1901 -2299 -1389 3323 1368 -2844 654 3720 230 -2610
2248 -2610 1671 3712 -1087 -1964 3226 2494 -2151 -1003 3706 1510 -2815 447 4251 -163 -3339
2263 -3339 1828 3785 -1725 -2494 3026 2138 -2981 -1622 3572 974 -3827 75 3786 -1335 -4000
2278 -4000 1413 2547 -2691 -3204 2219 1856 -4118 -1882 3586 -539 -4697 333 2692 -1656 -4347
2293 -4347 1299 2868 -3290 -3391 3043 1097 -4342 -1129 3354 -561 -3903 325 3515 -1393 -4020
2308d020O668N30o457J516N188k317m100K205M976l524m804N891K488o029j29
2323a918M884M7n390L73O210k115n939M185M354m776l122N054J849n018j271N409
2339B816N06o182J270N324k323m862K658M324l834l525N053K277n935m22M884
2354B029k62m806O29N294j922n427L831M026m464k959M696K532n781j545O709
2369B580n21o070J812M923j686n084K896N175m835l347N155K268n481j225O215
2384B775k1o594K412N582l277m142L588L643m355l402O096J755o708N17O014j233
2400B650n481J174O551l077o287N807L752o504k004N964J051n216j088O331n09
2415C114o901K902N418m352l776M201L150m794l165O973Q45p484J682N919k816
$$ plain form
2308 -4020 2648 3178 -3279 -1763 3425 1108 -2992 -787 4189 665 -4139 1752 4240 -1789 -1918
2323 -1918 2966 3013 -2377 -2004 4206 2091 -3848 337 4691 -85 -3207 1847 3696 -1322 -2593 2816
2339 2816 3322 -2860 -1590 3734 1411 -3451 -793 3531 -303 -3828 1225 3502 -2433 -2855 2029
2354 2029 1767 -3039 -2410 2884 962 -4465 -634 3392 -1072 -4031 665 3197 -2584 -4129 2580
2369 2580 2059 -4011 -2199 2724 1038 -4046 -1150 4025 -810 -4157 998 3266 -2215 -3440 2775
2384 2775 2754 -3840 -1428 4154 877 -3265 323 3966 -389 -3791 2305 4060 -2648 -2131 3883 2650
2400 2650 -2831 -1657 4894 1817 -4470 1337 5089 -1415 -3419 2545 3596 -1620 -2708 3623 3114
2415 3114 -3787 -885 4533 181 -3595 606 3756 -1038 -4203 2770 3615 -3869 -2187 3732 916
2430I16n336L084N422m774m724O205K901o526j180O331M87o951P80O755k264o094
2446d968L825M541l887m129N063L467o427j206O504o14n302J262N241k288n372
2461d290M539M295n797k168N619J080n295q06O341n03o629K535N988l936l952
2476b979L398M373m826l806O392J511o467K78N226p45m956J260N347k876m997
2491c867M852K769n276j244M615O19n018r5N908j522o033L997L875m372l197M030
2507D1L318m872k928O253O24o145J303M900j136n003K002M705l350l680M227K363
2523B622m395j493M800R07n360Q60M933k231l651K478L681l444l148M685K265
2538C509n339n73N240j99m733L88N269j675n441L455M517m702k582M507K092m484
$$ plain form
2430 916 -4420 -1336 4086 -688 -5412 793 3694 -2832 -4012 2319 2806 -4145 -3365 3390 1126 -4968
2446 -4968 -1143 3398 -489 -4618 445 3912 -2515 -3721 2783 2169 -3133 -1871 3370 1082 -4290
2461 -4290 249 4544 -1253 -3421 2198 3278 -2017 -2823 3518 3015 -3614 -1079 4909 973 -2979
2476 -2979 419 4792 -34 -3840 2552 4063 -2404 -2126 3100 2355 -2601 -1341 4006 1130 -3867
2491 -3867 985 3754 -1522 -2766 1849 2468 -2550 -2645 3263 1741 -4292 -295 3580 -792 -3989 41
2507 41 3359 -1513 -4441 1812 2436 -3709 -2406 2494 1358 -3645 -1643 3062 -288 -3968 259 2622
2523 2622 -1773 -3266 1534 2441 -2919 -2059 2874 643 -3008 -530 3151 -293 -3441 1244 3509
2538 3509 -1830 -2403 2837 2638 -2095 -1707 3562 1887 -3554 -99 4418 -284 -2866 1641 3733 -751
2554g51j540M909J24n126J320M122j947l482K578L478l831k815M684J299m913
2569a891m6L957j29m616J182M823k662m551L895L034l932k192L721J966m796j079
2585c316N446n80m893J692M056k221l565K933L026l527k569M578J082m577O0M173
2601A798n99m000J613L914k349l260L066K807l780j790M231J157m812K39M359
2616B594r35l936J439M434k711l467L343K469l743j193L561O59l621l56M346p77
2632B106m304K153K748k226k372K169K507l311j666L943P94m285L42L697j147
2647A148l482J705L030k408k855K838K162l215j346L443P47l895l09L996q41l524
2663b806J499L467k402k799K845K461l674j329L769N12l642L28L398n48l854J746
$$ plain form
2554 -751 -2291 2618 2742 -2384 -1064 3058 1111 -2371 207 3685 -146 -2961 1723 3022 -1891
2569 -1891 -1937 2020 1891 -2725 -1543 3280 618 -3933 -38 2996 -936 -3128 593 2559 -2237 -3316
2585 -3316 2130 1550 -3343 -1651 2405 184 -3381 -448 2578 -949 -3518 1060 2142 -2435 -2375 1798
2601 1798 1199 -2801 -1188 2726 377 -2883 183 2990 -790 -2580 1651 2808 -2004 -1765 2594
2616 2594 1659 -2277 -838 3596 885 -2582 761 3230 -513 -1706 1855 2514 -1107 -1463 2883 2106
2632 2106 -2198 -45 2703 477 -1895 274 2781 -530 -2196 1747 2541 -1744 -1402 2295 1148
2647 1148 -2334 -629 2401 -7 -2862 -24 2138 -1077 -2423 1020 1767 -2128 -2437 1559 718 -2806
2663 -2806 -1307 2160 -242 -3041 -196 2265 -1409 -2738 1031 1543 -2099 -1771 1627 1079 -2775 -1029
2679a029L424k389k836L213K397l889r87L201N77l575L65L627o07l357J583L169
2695B887k449k543K787K232l293j477L679P50l830O8L894j042l652J955K738k376
2711C28k379K507K267l196j720L942L29l901M43L567q27l870J560L465k678k652
2727b815L180J775l287j328L496P19m035K19L686j116l330J686L506k985k458
2742c087L187J766l324j088L489P22l731K72L679j203l293J248L834k449k922
2757b900L396J901l474j071L397R50m142O29L864j409l329J924L018k200l153
2772b599L615K120l819q93L369L30l574K3M524j573l842K380K741k269k705K932
2788G60K104l751j394M375l14m053J023L780j396l734K258L033l105k639L982
$$ plain form
2679 -1029 2395 6 -2830 383 2780 -1109 -2096 1105 1682 -1893 -1528 2099 1492 -1865 -282 2887
2695 2887 438 -2105 682 2914 -379 -1856 1823 2573 -1257 -1189 2705 1663 -1989 -34 2704 328
2711 328 -2051 456 2723 -473 -2193 1749 2078 -1823 -1380 2187 1360 -2510 -950 2515 -163 -2815
2727 -2815 365 2140 -1147 -2475 1021 1740 -2295 -2076 1610 494 -2836 -1150 2356 -629 -3087
2742 -3087 100 1866 -1458 -2546 943 1665 -2066 -1794 1885 682 -2611 -1363 2471 22 -2900
2757 -2900 496 2397 -1077 -2148 1249 2199 -1943 -1314 2550 1141 -2188 -264 2754 554 -2599
2772 -2599 1016 3136 -683 -1576 1793 2123 -1451 -1428 3096 1523 -2319 61 2802 533 -2172 760
2788 760 2864 -887 -2281 2094 1780 -2273 -1250 2530 1134 -2600 -342 2691 -414 -3053 929
2803I29J191l890n68M051k91m070R32M281k006m078L233K907m027j792L451J869
2819B122m221n76M622o05m427J790L804j985l435K446L065l517j753L992Q86m128
2835a920j39M359m66m418J837M064k875k984K974K477l053k263M044J360m660
2850a663L00L997q13l806J347M012k392l636L496K168l826p54L328K86l774qM171
2867B433j119m160K371K931k465k461K759K342m014j437M364K34m163N70L989
2882B174j245l720J487L781k801l247L904J777l453j191L567P43m139K85M176
2897B098j454l687K573K680k402k812L203K271m216n88M300l42l935O95M001j052
2913A333m231K760L378l550k364L832J596l474j458M647j45m521J538L531j950
$$ plain form
2803 929 2120 -1770 -2338 1713 1422 -2648 -1716 2565 559 -3519 -286 2621 -1406 -3198 253 2122
2819 2122 -2099 -2675 1947 1342 -3085 -1295 2509 524 -2911 -465 2600 -917 -2670 1322 2208 -1920
2835 -1920 -2059 2300 1834 -2584 -747 3317 442 -2542 432 2909 -144 -2407 1637 2997 -1663
2850 -1663 -1363 2634 1821 -1985 -638 3374 982 -2654 842 3010 -816 -1570 1758 2044 -1730 -1738 2433
2867 2433 1314 -2846 -475 2456 -9 -2470 289 2631 -1383 -2820 1544 1778 -2385 -1815 2174
2882 2174 929 -2791 -1304 2477 -324 -3571 333 2110 -1343 -2534 1033 1776 -2363 -2078 2098
2897 2098 644 -3043 -470 2210 -192 -3004 199 2470 -1746 -2334 1966 1624 -2311 -1616 2385 1333
2913 1333 -2898 -138 3240 -310 -2674 1158 2754 -720 -2178 2469 2324 -2197 -659 2872 922
2928I22l186K370L007l030k596M423N09l986K84L243j02l928Q68M372k477l916
2944c223L774K273l535j927L930J113m568n25M881r33m367K080L278k258l010
2959c017K636K757l554j706M167L69m036O07L347n87l843J761L607l275k107L471
2975E97J519l483j240M390L06m767J104M217j692l425K022L444k718k954L611
2990I31J836l937n93L429N18l566L57L533j552l255K585K518k914j837L217J315
3006B585l446j010M406p89l712J380L037j701k561J864K639l109j994L516Q65
3021A970l339l77L247k10l053M15L213j696k797K210K087k193j928K717J265l286
3037a755k24L402n03k859Q17K609j290k835K207K236k763j450L176P74k808n96
$$ plain form
2928 922 -2264 106 3113 83 -2513 1910 2419 -1567 -1283 1960 1858 -2070 -1202 3170 693 -3223
2944 -3223 551 2824 -711 -2638 1292 2405 -2163 -2688 2193 1260 -3107 -1027 2251 -7 -3017
2959 -3017 -381 2376 -1178 -2884 1283 1652 -2384 -1777 1570 983 -2860 -1099 2508 -767 -2874 597
2975 597 2116 -1367 -2607 1783 2089 -2678 -1574 2643 951 -2474 -452 2992 274 -2680 931
2990 931 2767 -1170 -1763 1666 2184 -1382 -1025 2508 956 -2299 286 2804 -110 -1947 1270 2585
3006 2585 -861 -1871 2535 1746 -1966 -586 2451 750 -1811 53 2692 -417 -2411 1105 1970
3021 1970 -1369 -1746 1501 1291 -1762 -1347 1866 170 -2627 -417 1670 -523 -2451 266 1531 -1755
3037 -1755 -1979 1423 920 -1939 -1122 1487 197 -2638 -431 1805 -958 -2408 768 1542 -1266 -1862
3053a862L155J97l639Q56L345j564k573K083K087k190j937L130R45l021m46L345
3069A911p5l220L24L486j706k982K536K544l145j281K909J235l627m20L886o18
3085A757l450J203L069j696k942K231K373k836j830L163O76l057k22L280p81l383
3101b445J324L205k009k669K553J987l269j293L290P40l387l7L654j110l212J633
3117a045K790j973k517K638K123l502o50L176M33l519M76L285p39l269J690K722
3133B119k266j932K687J595l152n75K935L28l357R32K695r86k543J559K310k371
3149b2j612K597J289k888n62L060j29k917P66K589j049k628J568K022j807j555
3165a278J975J017k431p52K990l06k565K30K814j284k577J805K151k286j565K379
$$ plain form
3053 -1862 1293 1490 -2149 -1293 2052 488 -2085 -2 2085 -105 -2042 1088 2033 -988 -1434 1911
3069 1911 1836 -1384 -1060 2426 720 -2262 274 2818 -327 -1608 1301 2536 -1091 -1511 2375 1757
3085 1757 -1693 -490 2579 883 -2059 172 2545 -291 -2121 1042 1718 -1339 -1561 1719 938 -2445
3101 -2445 -1121 2084 75 -2594 -41 1946 -1323 -2616 674 1414 -1973 -2010 1644 534 -2678 -1045
3117 -1045 1745 -228 -2745 -107 2016 -1486 -2136 1040 1473 -2046 -1570 1715 976 -2293 -603 2119
3133 2119 -147 -2079 608 2203 -949 -1524 1411 1739 -1618 -686 2009 1023 -1520 39 2349 -22
3149 -22 -1634 963 2252 -636 -1198 1862 1733 -1184 -418 2171 1122 -1506 62 2084 277 -1278
3165 -1278 697 1714 -717 -1469 1521 1215 -1350 -1120 1694 410 -2167 -362 1789 -497 -2062 317
3181C17J382k695q74K611k39k303M96K659j023k265R26K445j824j659K162J514
3197A630k675r05K776N75l165L23L004q20k511J122K488j763j912K482J284k613
3213f80j067L185L72l346M64L051j153k658J846K424k222k059K506J323k670r76
3229a660L553k30k784M78K879j420k596K014K179k580j960K892J267l028r60L604
3245A648k88l220P42L219j665k799K192K257l062j619L438Q72l214m23L228l73
3261I33l434J373L252k350k280K502J942k723j547L339L60l239N97L080j090k767
3277b052J405K585k056k297K716J762l003j017L565R1l281K98L468j207k570J611
3293A8K506k472j844K510J301k554p33K991j50k626J90K801j045k327J495J983
$$ plain form
3181 317 1699 -996 -1870 741 502 -1801 -1305 1354 331 -1934 -1008 1437 -387 -2046 116 1630
3197 1630 -1045 -1950 826 1401 -1764 -1441 1563 743 -1768 -646 1842 79 -1833 649 1933 -680
3213 -680 -1747 1438 1810 -1536 -1072 1979 826 -1832 14 2438 216 -1843 663 1986 -684 -1660
3229 -1660 1893 1663 -1121 -643 2236 816 -1780 234 2413 -167 -2127 765 2032 -996 -1956 1648
3245 1648 1360 -1860 -1118 2101 436 -2363 -171 2086 -976 -2595 843 1715 -1499 -1922 1306 933
3261 933 -2501 -1128 2124 -226 -2506 -4 1938 -785 -2332 1007 1367 -1872 -1275 1805 715 -2052
3277 -2052 -647 1938 -118 -2415 301 2063 -940 -1957 1608 1699 -1582 -1284 2184 977 -1593 18
3293 18 2524 52 -1792 718 2019 -535 -1268 1723 1573 -1053 -863 1938 893 -1434 61 2044
3309B044j988j582K387R86k665m39K537K06k888J64L050j139k587J483K257j839
3325a3k012K131J613k932n16K608K33k451J74K088n26k506J652J860j967j336
3341a900K010J062k038j366K743O93l041K98K995j094k230J211K338j529k444
3356b292K615J620k939o46K723L85k960M72K810n82l084J565K834k346j939K538
3372G74J581l020j054L490J4l322R69K777j198k713J612K679k636k166L535Q74
3388B196l159m54L069q7l561R43L481k064k834K419J998k475j525K672J237l426
3404a570k95L521j336k727J597K464j699k516K706J822l318r35L365K00k898j20
3420a739L501o53l649J926K628k440j673K226J562k518j269L125N98l121O41K711
$$ plain form
3309 2044 56 -1526 861 1847 -818 -1257 1280 1486 -1402 -1238 1812 673 -1914 -431 1826 -13
3325 -13 -2025 106 1719 -1213 -1729 879 1112 -1339 -1165 923 397 -2109 -457 1403 -564 -1900
3341 -1900 110 1172 -866 -2232 511 1204 -1837 -1539 1456 362 -1868 -657 1681 152 -2292
3356 -2292 323 1943 -996 -1642 1081 1466 -1494 -1022 1788 1206 -1878 -313 2521 175 -1764 774
3372 774 2355 -665 -1719 1771 1785 -1537 -568 2209 1011 -1702 -90 2589 -47 -2213 1322 2196
3388 2196 -963 -1417 1652 1565 -1996 -1053 2428 364 -2470 -51 1947 -528 -2053 619 1856 -1570
3404 -1570 -1865 1656 320 -2407 -810 1654 -45 -2561 145 1967 -1351 -2286 1079 1279 -1619 -1739
3420 -1739 1762 1109 -2540 -614 2014 -426 -2099 127 1689 -829 -2098 1027 1625 -1496 -855 1856
3436A856j594j660J034K464j907k231L119N42k561L36K070l0k485M87K707j371
3452G76k370K181J490j934j354K155J192k898l15K606j48k612L90K327r11k153
3468a578J210K111j465j947J979P21j702o30J890M48k470M47K378j176j864J171
3484d77J851j695j798K418J223k963m42K711L8k395J24K506l66k797J487K070
3500A495j766j381J662J398k068r98K565P05l183O90K274o67k162J003K428j708
3516B87k118K719J152k754m86K540Qk361K51K765q62l136K117K266k361j645K487
3533H69J203k674r46L232n40k763P19K719r48k702J591K661k890j415K894M06
3549A416k707k44K905m25l204J749K292j825k078K225J515k451j332K769P88l245
$$ plain form
3436 1856 262 -1398 -364 2100 193 -2038 1081 1623 -938 -602 1468 1438 -1047 -560 2147 776
3452 776 -1594 587 2077 143 -1211 944 2136 -762 -1077 1529 1381 -1231 -841 1486 575 -1578
3468 -1578 -368 1743 278 -1669 310 1031 -671 -1301 589 1037 -1433 -986 1392 216 -1648 -477
3484 -477 1374 -321 -2119 299 1522 -1441 -1883 828 866 -1529 -1405 1101 735 -2062 -575 1495
3500 1495 -271 -1652 10 1408 -660 -1658 907 1612 -1571 -881 1393 726 -1436 -433 1995 287
3516 287 -1831 888 2040 -714 -1200 1340 1348 -1013 -762 2003 1141 -1995 122 2388 27 -1618 869
3533 869 2072 -602 -1548 1684 1144 -1619 -900 1819 871 -1831 -240 2421 -469 -1884 1010 1416
3549 1416 -1291 -1535 1370 945 -2259 -510 1782 -43 -2121 104 1619 -832 -2164 605 1393 -1852
3565a852N11K955j371k511J614K110j841j857K426J195k379n82K754j98k607N99
3581a034K467r10k389J803J751j968j200K268P74k160n40K764k15k671O99K343
3597A782j262j715J368J506j502j654K362O86k351j47K321j01k282M75K267j226
3613E27j562R37J453j337j304J477J010j700q14K047K30k154K66J789o63j705
3629a503R00J761j455j528J705J261j933o74J997M15k381L60K286p46j938O73
3645h00K120j404j778J950J361k162p44K329K77k332n1K500m72k393J080K234
3661A715j412j861K138J424k633p67K524N50k774K74K708j057k378J457K109j796
3677B21j836K355J153k555p37K655M61l046N29K992j673k450K100J891k312j668
$$ plain form
3565 -1852 -1341 1614 243 -2268 -654 1456 -385 -2242 184 1379 -1000 -1582 1172 974 -1633 -1034
3581 -1034 1433 523 -1866 -63 1688 -280 -1480 788 1562 -598 -1138 1626 1411 -1260 -561 1782
3597 1782 520 -1195 173 1679 177 -1477 885 1571 -780 -927 1394 1293 -989 -514 1753 527
3613 527 -1035 -98 1355 18 -1286 191 1201 -499 -1313 734 964 -1190 -924 865 202 -1503
3629 -1503 -603 1158 -297 -1825 -120 1141 -792 -1466 531 946 -1435 -1075 1211 465 -1473 -800
3645 -800 1320 -84 -1862 88 1449 -713 -1457 872 1149 -1183 -1234 1266 794 -1599 -519 1715
3661 1715 303 -1558 580 2004 -629 -1396 1128 1678 -1096 -822 1886 829 -1549 -92 2017 221
3677 221 -1615 740 1893 -662 -1399 1256 1717 -1329 -800 2192 519 -1931 169 2060 -252 -1920
3693a920K649Q17k983r3K959l06l011J038K722j701k319K050J889k473j260K772
3709H30N07k877O1K437l09k544J058K273j567j725K222R57k277p20K454K87k712
3726a645N28K601r81k118J232K213j938j361K179O90k205n44K511j35k008L97
3742e84J999p64j800J089J671j797q61J742O08j721m06K146m05j825P31J656q57
3759F22j770J221J591j593j188J676O38j553m26J629K85k002M7J610k31j936R78
3776d02J474j074j269J589P67j681n75J760J3j657q7J960l21k107J019J787j387
3793a91j549J681J258j768q40J994L56j994K41J735k90j859P02K181j329j691
3809a363J676J086k116n50K388O5k338L40K593q90k379J539J927j929j181J647
$$ plain form
3693 -1920 729 1546 -1437 -1530 1429 1123 -1888 -850 1872 171 -2148 -98 1791 -682 -1942 830
3709 830 1337 -1540 -1479 958 649 -1895 -837 1436 -131 -1856 366 1323 -954 -1674 780 1067 -1645
3726 -1645 -1117 1484 503 -1615 -383 1830 -108 -1469 710 1400 -805 -1349 1162 1027 -981 -584
3742 -584 1415 651 -1149 -60 1611 -186 -1047 695 1303 -418 -824 1322 917 -908 -177 1479 622
3759 622 -1148 73 1664 71 -1117 559 1197 -356 -782 847 1132 -870 -823 787 556 -1380 -402
3776 -402 1072 -2 -1271 318 1085 -596 -1171 589 602 -1055 -1142 818 497 -1610 -591 1196 -191
3793 -191 -1740 -59 1199 -569 -1409 585 941 -1053 -812 923 633 -1226 -524 1657 328 -1363
3809 -1363 313 1399 -717 -1267 1121 1186 -1152 -812 1781 891 -1488 51 1978 49 -1132 515
3825E15J288k354q60L013r5k617L86K411o17k438J408J890k148j248K117P78k238
3842h09m63K142J44k579N51K831j680j901J903J489k078j313K205P37k752K89
3858a284K765j134j985Q85K284j531k038K197J241k304m86K052l7k036L33K257
3874A179q75k150J527J407j549n46J221O92j489p97K555m22j858R55J458j182
3890A26j069J036J518j465j275J892O75j849j94J219N72j971mK124q66j497R82
3907d6J238q60j123Q84J136j574m51J602k46j264K39J057j80j218N17J594j619
3924c14p72J214O81j058r93J587M97j764k84K131n75j523K98J784p75j881J450
3941b97J301j640p52J555N86j478m23J809R0k081O61K006j459j274J056J744j619
$$ plain form
3825 515 1803 -551 -1411 1602 1507 -1110 -724 1687 1070 -1368 40 1930 -218 -1466 651 1429 -809
3842 -809 -1272 870 1014 -1565 -1014 1817 137 -1764 139 1628 -450 -1763 442 1179 -1573 -1284
3858 -1284 1481 347 -1638 -753 1531 0 -2038 159 1400 -904 -1390 662 625 -1411 -1078 1179
3874 1179 304 -1846 -319 1088 -461 -1007 214 906 -583 -1380 1175 753 -1105 -150 1308 126
3890 126 -943 93 1611 146 -1129 763 1438 -411 -605 614 1186 -785 -789 1335 469 -1028 -46
3907 -46 1192 332 -791 93 1229 -345 -796 806 560 -704 -465 592 412 -806 -289 1305 -314
3924 -314 -1086 128 809 -249 -1242 345 842 -922 -1206 925 350 -1173 -875 909 134 -1747 -297
3941 -297 1004 -636 -1388 167 753 -725 -1148 661 751 -1330 -669 1337 -122 -1396 -340 1404 -215
3958b15j094K441K35k167j45K245k26k058M51K719j801j931J904J452k104o50
3974i44J860N34k159k29K546p26k276J669J294j431j405J658J590k713q52K735
3990A151k33k280R18K093j329k225J781K011k320j414K509P77k331l83K499o23
4006F01k294Q96K101j315j591J643J431k165j009K464K87k380K42J986n89j888
4022a580R10K060j701j334J610J104j964k26K004R2j915J66J969p57j340R15J294
4039A307j486r61J717Q89j848n47K178k90j591L36J655n27j562O10J445j135j043
4056h53J299P75j639m08J710O6j589J38J469m96j265N52J323j141j052J147R78
4073A014j340q72J730J68j656J63J544k48j591K78J864r42j444P52J611j221q72
$$ plain form
3958 -215 -1309 1132 1367 -800 -945 1300 1074 -984 -533 2186 385 -1546 358 1810 -294 -944
3974 -944 916 1450 -709 -938 1608 882 -1394 275 1569 138 -1267 391 1981 -732 -1584 1151
3990 1151 918 -1362 -444 1649 320 -1905 -124 1887 -433 -1847 662 1439 -892 -1275 1224 601
4006 601 -1693 -797 1304 -11 -1602 41 1472 -693 -1702 762 1049 -1331 -1089 897 308 -1580
4022 -1580 -670 1390 -311 -1645 -35 1069 -895 -1121 883 975 -940 -774 1195 438 -902 13 1307
4039 1307 -179 -1140 577 1466 -382 -929 1249 959 -632 -296 1359 832 -730 -120 1325 190 -853
4056 -853 446 1221 -418 -826 884 950 -639 -501 968 472 -793 -241 1082 -59 -1111 36 1014
4073 1014 -326 -1198 532 700 -956 -793 751 503 -1088 -810 1054 112 -1332 -580 1031 -190 -1062
4090a062J375M57j746l07J844j28j873P83J885j064j368J070J641j956r98K060
4106F13R08k625OK419l19k749J531J622r92j623J770J238k394o32K574J35k545
4123a063M49K255q00k371J482J923j418j856K033J065k285o39K347J08k394M85
4139f79K325j276j841J604J581k013j427K512N07k641K14K331p61k135J057K012
4155A370j411j783J529J607k287n84K362J88k511M05K076p37j916J308J699j600
4171b85j196J896O95j893l71J974Q6k060M67J936p91j623J096J372j392j092J870
4188F89L83j659k17J552n9j628P78J279q61j239J425P69j003p94J211N59j482
4205b97k84J263M5j208L49R82m94j083R00Q09q12r71J157L69j032n81J368K30
$$ plain form
4090 -1062 313 770 -976 -1283 561 433 -1440 -657 1228 164 -1204 -134 1507 -449 -1447 613
4106 613 1521 -1104 -1098 1321 1002 -1747 -216 1406 414 -1209 561 1799 -595 -1227 1347 1482 -1063
4123 -1063 -614 1641 841 -1530 -48 1875 457 -1399 634 1699 -586 -1225 1122 1230 -1164 -679
4139 -679 1646 370 -1471 133 1714 -299 -1726 786 1293 -1348 -1134 1197 436 -1699 -642 1370
4155 1370 -41 -1824 -295 1312 -975 -1559 803 991 -1520 -1115 961 224 -1692 -384 1315 -285
4171 -285 -1481 415 1110 -783 -1154 820 906 -1154 -687 1249 458 -1165 -69 1303 -89 -1181 689
4188 689 1072 -587 -804 748 689 -939 -161 1118 257 -982 443 1212 209 -585 626 1185 -297
4205 -297 -581 682 727 -481 -132 850 356 -727 173 982 170 -801 356 725 -307 -888 480 710
4223G10j561M7J578l41j384M89J238q21j161Q84J017j323l79J201N40j452m18
4240a136J895k79j630L45J683r58j000J057R55j140j118J697Q21k322L55J585
4256H10l62j567N45J817j090j229J404R85j617l99J573L78j876j64K272o50k045
4273a215J014J974j671j103J508R15j880o35K481k82k083M60K082q41j911J257
4289G0J849k295q31K064j12j824J12K185n73j984Q70J757j330j290J665O70j805
4306h02p19K331K51k145P9J792p03j223O82J383j165j370J945N02j657j82J658
4323F57j70j208R3J561p59j285J137Q29q39r76J365O34j717j65J814q5j722P44
4341i2Q05j82j250O83J099j246l16P87M81j047L1O95M33j216P2J219p64m04J69
$$ plain form
4223 710 -851 -804 774 433 -951 -462 776 -45 -1206 -322 695 -628 -1007 194 734 -718 -1136
4240 -1136 759 480 -1150 -805 878 -80 -1080 -23 932 -208 -1326 371 1192 -1130 -775 810
4256 810 448 -1119 -574 1243 153 -1076 328 1313 -304 -703 870 1248 -628 -792 1480 830 -1215
4273 -1215 -201 1773 102 -1001 507 1422 -458 -1093 1388 1106 -977 -517 1565 724 -1187 70
4289 70 1919 -376 -1207 857 745 -1079 -967 1218 645 -1339 -469 1288 -42 -1332 333 1003 -802
4306 -802 -1521 810 1061 -1084 -1005 787 84 -1139 -457 926 -239 -1609 336 838 -819 -1001 657
4323 657 487 -721 -628 933 174 -1111 26 855 16 -960 405 1039 -678 -843 971 886 -836 -92
4341 -92 713 531 -719 -36 1063 -183 -499 288 769 -278 -247 448 881 -335 -263 956 192 -212 -43
4360d3Q26m34r20N28R56j105m98J105Qn64k83Q32J84j482K82J308o26j140P28
4379c38Q77m02j170J052P47j120n42J129J43j321p0J622r2j548N76J288j212p64
4397a145J328M54j172l60J443K50j836N26J614p64j190N53J766j376j097J760
4413G54N40k022nJ642n0j684K65K191j366j441J632R63j763m75J859K77k242Q5
4431h40K301p51j733J112J463j147j778J806Q82k079k47J889J02j899Q6K002q85
4448B84j620J379J308j622q84J762K66j606l01J635l0j797O49J319q78j212J227
4465a21J109j714l46J537K12j631NJ672n09j343O62J452j113j067J587O75j501
$$ plain form
4360 -43 783 349 -571 -43 913 -192 -690 415 423 -141 -424 408 592 -890 -608 700 74 -1066 -338
4379 -338 539 137 -1033 19 766 -354 -896 233 376 -945 -1015 607 515 -1033 -457 831 -381 -1145
4397 -1145 183 637 -535 -895 548 798 -1038 -512 1102 338 -852 -299 1467 91 -1006 754
4413 754 1294 -728 -733 909 859 -825 -560 1631 265 -1176 456 1419 -344 -819 1040 1317 -925 -840
4431 -840 1461 710 -1023 89 1552 405 -1373 433 1315 -764 -1011 878 980 -919 -833 1169 284
4448 284 -1336 43 1351 -271 -1155 607 873 -733 -1034 601 571 -1226 -577 742 -136 -1348 -121
4465 -121 988 -726 -1072 465 677 -954 -949 723 214 -1129 -467 985 -128 -1195 392 1067 -434
$$ [...]
8191B22
##END NTUPLES=NMR FID
##END=
