##TITLE=1H_SAV-32-singlet-bat26
 CDCl3, 8 sc, 
 27.11.2020
##JCAMPDX= 6.0         $$ Bruker NMR JCAMP-DX V2.0
##DATA TYPE= NMR FID
##DATA CLASS= NTUPLES
##ORIGIN= UXNMR, Bruker Analytische Messtechnik GmbH
##OWNER= root
$$ XWIN-NMR		Version 3.5
$$ Fri Nov 27 10:11:56 2020 Russian Standard Time (UT+4h)  she@DPX200
##.OBSERVE FREQUENCY= 200.1315066352
##.OBSERVE NUCLEUS= ^1H
##.DELAY= (6, 6)
##.ACQUISITION MODE= SIMULTANEOUS
##.ACQUISITION SCHEME= undefined
##.AVERAGES= 8
##.DIGITISER RES= 18
##SPECTROMETER/DATA SYSTEM= spect
##.PULSE SEQUENCE= zg30
##.SOLVENT NAME= CDCl3
##.SHIFT REFERENCE= (INTERNAL, CDCl3, 0, 15.7039)
##AUDIT TRAIL= $$ (NUMBER, WHEN, WHO, WHERE, WHAT)
$$ ##TITLE= Audit trail, XWIN-NMR		Version 3.5
$$ ##JCAMPDX= 5.01
$$ ##ORIGIN= Bruker BioSpin GmbH
$$ ##OWNER= she
$$ F:/spectra/data/she/nmr/H-F/1/audita.txt
$$ ##AUDIT TRAIL=  $$ (NUMBER, WHEN, WHO, WHERE, WHAT)
(   1,<2020-11-27 10:10:38.46 +0400>,<she>,<DPX200>,
      <created by zg, POWCHK disabled, PULCHK disabled
       configuration hash MD5:
       00 E9 B6 7A A2 85 ED C7 34 08 36 98 17 FE 4E 26
       data hash MD5: 16K
       44 C8 0D CE 06 72 7B A2 A3 85 74 A9 B4 B3 E0 CD>)
$$ ##END=
$$ 
$$ hash MD5
$$ 22 F8 69 D7 62 98 15 A8 97 4C CE 73 F0 E7 DB 46
##$RELAX= 
##$RELAX= 
##$RELAX= 
##$RELAX= 
##$RELAX= 
##$RELAX= 
$$ Bruker specific parameters
$$ --------------------------
##$DU= <F:/spectra>
##$EXPNO= 1
##$NAME= <H-F>
##$PROCNO= 1
##$TYPE= <nmr>
##$USER= <she>
##$AMP= (0..31)
100 100 100 100 100 100 100 100 100 100 100 100 100 100 100 100 100 100 
100 100 100 100 100 100 100 100 100 100 100 100 100 100 
##$AQSEQ= 0
##$AQ_mod= 1
##$AUNM= <au_zg>
##$AUTOPOS= <>
##$BF1= 200.13
##$BF2= 200.13
##$BF3= 200.13
##$BF4= 200.13
##$BF5= 200.13
##$BF6= 200.13
##$BF7= 200.13
##$BF8= 200.13
##$BYTORDA= 1
##$CFDGTYP= 0
##$CFRGTYP= 5
##$CHEMSTR= <none>
##$CNST= (0..31)
1 1 145 1 1 1 1 1 1 1 1 1 1 1 1 1 1 1 1 1 1 1 1 1 1 1 1 1 1 1 1 1 
##$CPDPRG= <>
##$CPDPRG1= <>
##$CPDPRG2= <>
##$CPDPRG3= <>
##$CPDPRG4= <mlev>
##$CPDPRG5= <mlev>
##$CPDPRG6= <mlev>
##$CPDPRG7= <mlev>
##$CPDPRG8= <mlev>
##$CPDPRGB= <>
##$CPDPRGT= <>
##$D= (0..31)
0 1.2 0 0 0 0 0 0 0 0.06 0 0.03 0 0 0 0 0.0002 0 0 0 0 0 0 0 0 0 0 0 0 
0 0 0 
##$DATE= 1606457437
##$DBL= (0..7)
120 120 120 120 120 120 120 120 
##$DBP= (0..7)
150 150 150 150 150 150 150 150 
##$DBP07= 0
##$DBPNAM0= <>
##$DBPNAM1= <>
##$DBPNAM2= <>
##$DBPNAM3= <>
##$DBPNAM4= <>
##$DBPNAM5= <>
##$DBPNAM6= <>
##$DBPNAM7= <>
##$DBPOAL= (0..7)
0.5 0.5 0.5 0.5 0.5 0.5 0.5 0.5 
##$DBPOFFS= (0..7)
0 0 0 0 0 0 0 0 
##$DE= 6
##$DECBNUC= <off>
##$DECIM= 32
##$DECNUC= <off>
##$DECSTAT= 4
##$DIGMOD= 1
##$DIGTYP= 9
##$DL= (0..7)
0 120 120 120 120 120 120 120 
##$DP= (0..7)
150 150 150 150 150 150 150 150 
##$DP07= 0
##$DPNAME0= <>
##$DPNAME1= <>
##$DPNAME2= <>
##$DPNAME3= <>
##$DPNAME4= <>
##$DPNAME5= <>
##$DPNAME6= <>
##$DPNAME7= <>
##$DPOAL= (0..7)
0.5 0.5 0.5 0.5 0.5 0.5 0.5 0.5 
##$DPOFFS= (0..7)
0 0 0 0 0 0 0 0 
##$DQDMODE= 0
##$DR= 18
##$DS= 0
$$ [...]
##$SUBNAM2= <"">
##$SUBNAM3= <"">
##$SUBNAM4= <"">
##$SUBNAM5= <"">
##$SUBNAM6= <"">
##$SUBNAM7= <"">
##$SUBNAM8= <"">
##$SUBNAM9= <"">
##$SW= 16.9725356469052
##$SWIBOX= (0..15)
0 0 2 0 0 0 0 0 0 0 0 0 0 0 0 0 
##$SW_h= 3396.73913043478
##$TD= 16384
##$TD0= 1
##$TE= 0
##$TE2= 300
##$TE3= 300
##$TEG= 300
##$TL= (0..7)
0 120 120 120 120 120 120 120 
##$TP= (0..7)
150 150 150 150 150 150 150 150 
##$TP07= 0
##$TPNAME0= <>
##$TPNAME1= <>
##$TPNAME2= <>
##$TPNAME3= <>
##$TPNAME4= <>
##$TPNAME5= <>
##$TPNAME6= <>
##$TPNAME7= <>
##$TPOAL= (0..7)
0.5 0.5 0.5 0.5 0.5 0.5 0.5 0.5 
##$TPOFFS= (0..7)
0 0 0 0 0 0 0 0 
##$TUNHIN= 0
##$TUNHOUT= 0
##$TUNXOUT= 0
##$USERA1= <user>
##$USERA2= <user>
##$USERA3= <user>
##$USERA4= <user>
##$USERA5= <user>
##$V9= 5
##$VALIST= <valist>
##$VCLIST= <CCCCCCCCCCCCCCC>
##$VD= 0
##$VDLIST= <DDDDDDDDDDDDDDD>
##$VPLIST= <PPPPPPPPPPPPPPP>
##$VTLIST= <TTTTTTTTTTTTTTT>
##$WBST= 1024
##$WBSW= 4
##$XGAIN= (0..3)
0 0 0 0 
##$XL= 0
##$YL= 0
##$YMAX_a= 403619
##$YMIN_a= -338300
##$ZGOPTNS= <>
##$ZL1= 120
##$ZL2= 120
##$ZL3= 120
##$ZL4= 120
##$ABSF1= 10
##$ABSF2= 0
##$ABSG= 5
##$ABSL= 3
##$ALPHA= 0
##$AQORDER= 0
##$ASSFAC= 0
##$ASSFACI= 0
##$ASSFACX= 0
##$ASSWID= 0
##$AUNMP= <proc_1d>
##$AZFE= 0.1
##$AZFW= 0.1
##$BCFW= 1
##$BC_mod= 2
##$BYTORDP= 1
##$COROFFS= 0
##$CY= 11.3945322036743
##$DATMOD= 1
##$DC= 2
##$DFILT= <>
##$DTYPP= 0
##$F1P= 15.9154993809931
##$F2P= -4.1035820241983
##$FCOR= 0.5
##$FTSIZE= 0
##$FT_mod= 4
##$GAMMA= 1
##$GB= 0.15
##$INTBC= 1
##$INTSCL= 1
##$ISEN= 128
##$LB= 0.24
##$LEV0= 0
##$LPBIN= 0
##$MAXI= 10000
##$MC2= 0
##$MEAN= 0
##$ME_mod= 0
##$MI= 1.114404
##$NCOEF= 0
##$NC_proc= 0
##$NLEV= 6
##$NOISF1= 3.799351
##$NOISF2= 2.8
##$NSP= 1
##$NTH_PI= 0
##$NZP= 0
##$OFFSET= 15.70392
##$PC= 1
##$PHC0= -10694.49
##$PHC1= 16.40088
##$PH_mod= 1
##$PKNL= yes
##$PPARMOD= 0
##$PSCAL= 0
##$PSIGN= 0
##$REVERSE= no
##$SF= 200.130013532006
##$SI= 16384
##$SIGF1= 3
##$SIGF2= 2
##$SINO= 400
##$SIOLD= 16384
##$SREGLST= <1H.CDCl3>
##$SSB= 0
##$STSI= 0
##$STSR= 0
##$SW_p= 3612.71676300578
##$SYMM= 0
##$S_DEV= 0
##$TDeff= 0
##$TDoff= 0
##$TI= <>
##$TILT= no
##$TM1= 0
##$TM2= 0
##$TOPLEV= 0
##$USERP1= <user>
##$USERP2= <user>
##$USERP3= <user>
##$USERP4= <user>
##$USERP5= <user>
##$WDW= 1
##$XDIM= 8192
##$YMAX_p= 0
##$YMIN_p= 0
$$ End of Bruker specific parameters
$$ ---------------------------------
##NTUPLES= NMR FID
##VAR_NAME=  TIME,          FID/REAL,        FID/IMAG
##SYMBOL=    X,             R,               I
##VAR_TYPE=  INDEPENDENT,   DEPENDENT,       DEPENDENT
##VAR_FORM=  AFFN,          ASDF,            ASDF
##VAR_DIM=   8192,          8192,            8192
##UNITS=     SECONDS,       ARBITRARY UNITS, ARBITRARY UNITS
##FACTOR=    0.0002944,     1,               1
##FIRST=     0,             0,               0
##LAST=      2.4114304,     0,               0
##MIN=       0,             -338300,         0
##MAX=       2.4114304,     403619,          0
$$ Real data points
##PAGE= N=1
##DATA TABLE= (X++(R..R)), XYDATA
$$ [...]
2146e93M49r47P39Q60j340l2M37K77N91j352j27O56K78k23j077N60J263n75r15
2165a071M39M41K95n51q00O70J304p76q52R67L81K57m63r75R36L41l14k36K0J117
2185A130k73j499J040O7K68j25p53M43Q00q16K53j24l8L81r5o8q06J026J74j599
2205f14O91k50o9Q77j834J444m6p70J087p47J81R91j265q2O64o78J74k17o13J335
2225B59l22j282R75K95k88K94j069J52J485r84o17M61K42P68r50n90J645o05l36
2244d67L31r01J069L15j138M61K63L66J70r29K39P95Jj86q89P33J041q55k83N3
2264A89J85P23j097k53J041Q2jq76k69J532k26j026q0L31O52j7j544M99J534q87
2284D92p36n1J94Q53p11j235P25R76n40l55l96O19Q72p92r54M74N12K35j085n87
$$ y = [-593, -144, -1091, -352, 508, -832, -864, -427, -150, 441, -911, -1038, -382, -104, -327, -1404, -844, 419, -156, -1071, -632, -191, 104, -447, -1247, -577, 727, -49, -901, 66, 447, 704, 241, -734, 202, 543, 229, -7, 13, 1130, 857, -642, 398, 465, 733, 608, -145, 298, 1098, 282, 535, 411, 373, 754, 659, 591, -215, 811, 985, -614, 77, -173, -242, 635, -1199, 245, 199, -571, 516, -231, -50, 941, -324, -406, 258, -420, -246, -463, -1076, 259, -63, -1345, -370, -75, -363, -69, -1138, -986, 499, -485, -1102, -641, -399, 369, -581, -1171, 474, -131, -467, -136, -1037, 32, 347, -791, -330, -67, 299, 469, -460, -221, 574, 575, 389, -500, 233, 1274, 419, 136, 189, 374, 1097, 0, -253, 788, 870, 869, -7, -276, 1256, 1030, 4, -76, 255, 907, 890, -654, -155, 1379, 492, -244, -295, -101, 752, 41, -1194, -469, 507, -33, -388, -784, -165, 707, -85, -1039, -565, -53, 182, -903, -1490]
2304a490J268N52j043n21M74Q58J41j032n58J453L11q32o62M34N27Q07j373o54
2322a340J695J97l24o88l24J623J50j643N24M29N03k9j669J196J034j103L4l13
2340d8P02K81m34p68K51J104j99r72M02M25K69k14j230N19Q69j1j075J44J122
2359A137p28p36K37n44Q69L84j886J147l42J214p63j703J608M78q40K91p57J147
2377B13J60j781N09P99j55k65k44m74J454l32k29k55K18K01O25q37P1M70jn49
2397d02K19p4N14M00j626R85P55q81L33j34k19J181k49p22kN75q5J88q94R41J48
2418I51n78j2L31O94o60l6r20J321l92j231J179m45j16l59j43J035L16k42j91
2437E02p99m66J729j793L88J223m10N1j275P31N48r78M69K75p37Q20k2j275M12
$$ y = [-1490, -222, 330, -713, -1234, -760, 98, 239, -793, -1351, 102, 413, -419, -1081, -647, -120, 687, -686, -1340, 355, 552, 228, -460, -784, 839, 989, -654, -130, 299, 802, 773, -896, 300, 1334, 231, 265, -48, 654, 935, 501, -267, -16, 1088, 889, -83, 319, 744, 1013, 799, -431, 88, 957, 946, -129, 15, 1137, 409, -327, -90, -634, 235, 619, -1267, -120, -462, 752, -11, -1714, -106, 372, -468, -177, -934, 213, 373, -1408, -899, -100, -255, -520, -764, -1238, 216, -116, -345, -600, -382, -181, 444, -393, -322, 148, 147, -402, -183, -257, 257, 657, -969, 16, 771, -110, 223, 89, -130, 1051, 802, 80, 78, 653, 568, 756, -138, 803, 951, 373, 361, 692, 1386, 726, 690, -230, 1091, 699, -532, 647, 202, 86, -273, -416, 619, 935, 693, 502, -297, -763, 966, -827, -439, 784, 374, 425, -850, -119, 429, -549, -80, 195, -542, 278, 256, -1019, -607]
2456f07Q41j097J431j094p92J925j113n30P16N42J28l30r25J408K58j048P8m83
2474f92R66Q09j757L47N63J68L30r99n15J713j85j160K90K65J084o44r80N98N97
2493G98j46l2q75L17J344j225o05O32N80J59r30m62Q96L49o60n65J84Q43j75p15
2513b88o83J038M72q08j87k97R12P25j518l12R11O8J0j037J63J158k62q71J8K17
2533e71Q98m02j189L81J196j88p48k03Q44M64r53m63J074J93k87j94o60R87L97
2552E76p35N1l91R05M76j278J81N97K44J36r67L35O65j78n43m6J88P97n26o63
2572a76N75J27J03n29j97N02M12p37m55N68l6L79p20l8O52k00n70jJ14Q88o31
2593C0q08N42M82l53q7m16L24P3j15o3l88P15J86n71J88r8J40q9m70M86J61L6
$$ y = [-607, 234, -863, 568, -526, -1318, 607, -506, -1036, -320, 222, 350, 20, -905, 503, 761, -287, -209, -692, 274, 1083, -674, -327, 236, 404, 734, -265, -780, 933, 748, -412, -122, 143, 1227, 583, -397, 201, 798, 652, 620, -255, 62, 1406, 181, -424, 208, 788, 947, 17, -445, 451, 800, 140, -425, -241, 602, 427, -288, -971, 67, 539, -269, -456, -753, 159, 884, -634, -946, -35, 33, 43, -994, -831, 327, 65, -806, -788, -571, 327, -75, -1264, -883, 313, 125, -623, -826, 18, 482, -471, -934, 140, 333, 46, -148, -808, 179, 576, -159, -108, -499, 406, 882, -396, -215, 382, 626, 762, -205, 130, 795, 617, 74, 28, 216, 1013, 487, -176, 399, 526, 629, 100, -97, 405, 817, 80, -375, 193, 157, 536, -184, -222, 430, 230, -340, -341, -227, 661, 30, -778, -236, 246, -107, -194, -610, -286, -213, -328, -391, -779, -64, 122, -449, -261, -359, -219, -308, -778, -292, -131, -95]
2615i5p6n84R43n6p66L78K9M91p9l90K27L37m4j02k99j60Q96m10n13R1O46J3k22
2638B55k09J64O23p73n2M57M1N64j092m81J290l50j49l12J29P88k99j265J029
2657C58k23M76k52j093M64O90n14j35J1J12M13l77p13N69M90j89q49L16K75K41
2677G0m40m41M08L01K31r49N1R73l94m40j02L69O47j35j065O49O85k27o04j10
2697e23P28M16n77p72K01P95K53n27l82P60M03o92k72K25M32N66r31k89J166j20
2717H60m09m40k44J141o0j032L27O1O08m4j416O36P04k79l91j56k1J221p25j194
2737h53R08M78j68n21p42P59P38j037k78L33N47j04o75j05P11M12p03k95l34P86
2757a43N15j249J64O29m5O8n09j65J185k23o35m5J07P42l01r16P70L14L21o65
$$ y = [-95, -171, -755, 188, 132, -634, -256, -227, 264, 185, -205, 22, 359, 315, 213, -86, -246, 650, 240, -273, -182, 464, 477, 255, 46, 210, 833, 60, 8, 465, 506, 1070, -22, -503, 787, 437, 288, -24, 105, 893, 594, -671, 358, 135, 611, 359, -734, -270, 420, -94, -229, -218, -106, 307, -70, -783, -214, 276, 87, -762, -446, -171, 70, -370, -811, -403, -102, 129, -820, -769, 204, -190, -630, -732, -363, 284, 149, -916, -267, 418, 191, -413, -523, 205, 621, 44, -728, -527, 268, 521, -6, -388, 372, 775, 83, -189, 36, 468, 1034, 103, -186, 980, 860, 451, 11, -233, 908, 848, -184, 143, 204, 812, 768, -648, -12, 692, 413, 22, -134, -155, 1066, 341, -853, 55, 533, 365, -156, -898, -139, 599, -438, -716, -383, 164, 60, -615, -720, -9, 403, -300, -595, -929, -143, 372, -877, -713, -84, -129, -61, -570, -735, 450, 227, -408, -453, -346, 396, 95, -821, -51, 263, 584, -81]
2777h1k70P57j56j6n69M55M22j62l99j79N90J89l07n20O72K77l59k19j29M94M63
2798I53p20j92J9N05Pl38l14M80J57n20l47O66J3k49j74m5L99J0o13J74k3K61
2820A09o03J58k10N49j15k23L12o06J225j351L92n46J475o08j055J210M5n31P6
2839b97n98O52k79L55j15l27Q57K19q13r4N70K49j86l76q8M34R0l68l15J048M5
2860F63m88k45K71O36k99p41O66j97N08m73m63K75P01j21p89R9M37K93o01m65
2880c33M06R11q15m41k8L89Q19j067r13J478l56l74o51l25J432R9p02j54J95N46
2900A16j77q41M3J036k70n70J43P3R48l43j055L36O51J57l99p37Q11M00k77p34
2920f89K99K64N17o86k51M74M82J14r18R2R04m6o02l44N28O98k76p27j5O85L43
$$ y = [-81, -351, 406, 250, 234, -335, 120, 542, 380, -19, -198, 392, 581, 274, -246, 426, 703, 344, 125, -4, 490, 953, 233, 41, 60, 565, 572, 234, -80, 400, 557, 37, -310, 356, 369, 120, -54, -99, 300, 310, -303, -129, -152, 109, -494, -336, -546, 3, -112, -335, -23, -629, 596, -755, -363, -909, 566, -42, -1097, 113, 158, -373, -297, -895, -243, -522, -167, -282, -609, 248, 467, -346, -440, 130, 379, 193, -183, -271, 163, 253, -115, -430, 618, 663, 175, -70, 201, 837, 538, -203, 463, 266, 774, 301, -162, 113, 814, 693, -96, 3, 440, 733, 132, -333, 73, 984, 169, -272, -300, 89, 908, -159, -1072, 406, 50, -324, -975, -1300, 132, 231, -471, -625, -430, 116, -61, -902, -859, 177, -93, -663, -520, -447, 501, 158, -897, -561, 90, 247, -152, -889, -78, 322, 45, -689, -390, -126, 391, -295, -546, -72, 410, 524, -394, -302, 602, 556, -46, -390, 138, 836, 560, -167, -182, 503, 846]
2941H46n32o89R57K84m55k65j40O60K35p84m10N79L89k40p47J23P10q2o94MJ57
2962i4L81k47n26L85K96M2n04l72O04K11k69l20l52Q52P5q64N8N05L00m31o03
2983h73K93P59m58j13NJ26L97o8o78J58P03k29l61j1K94O55n43o89O09M42j14
3004C04l09l11M02N70m31l81L94O6J14m33q1O25K48n85P3L7K98k99l52J63N56
3025F68k10m58J24L16l3o0p66N38O05o40j47j64R0O91q24k57M43K15j3n43K32
3046a93L01J7o10k46M74J32o3m63J61M44q1k23l06K59P26m69l05K74J65O1m56
3067d01j97N68L75k50l49n2M75j32o67L25O32j31J35p50L88R90n22m95K38k3L33
3088D90p0o78N82M31m02k00l03O09M63p59m87L90N23K58r18j36Q73Q2p16j34K42
$$ y = [846, 314, -375, 582, 866, 411, 146, 6, 666, 901, 117, -293, 286, 675, 435, -312, -189, 521, 439, -255, -251, -94, 287, 40, -486, -101, 195, 237, -267, -639, -35, 176, -93, -413, -765, 87, 162, -702, -644, -139, 161, -270, -873, -580, 179, -279, -392, -387, -261, 136, 68, -610, -452, 251, 22, -339, -350, -56, 599, 56, -633, -24, 418, 304, -5, -316, 86, 656, 225, -156, 238, 304, 418, -15, -96, 529, 777, 192, 265, 302, 600, 301, -51, 112, 668, 458, 0, 124, 440, 407, 347, -419, 119, 724, 84, -63, -227, -137, 554, -270, -527, -84, 131, 118, -425, -193, 108, 125, -485, -731, -257, -125, -188, -651, -490, -46, -127, -350, -656, -397, 329, -140, -445, -171, -6, 55, -401, -598, -30, 345, 95, -254, -306, 169, 37, -630, -305, 327, 196, 331, -419, -31, 959, 437, -58, 180, 157, 490, 420, -258, 324, 755, 353, 153, -150, 459, 922, 163, -324, 66, 589, 847, -71, -207, 666, 748, 32, -102, 140]
3109A40K97l24m02N5M43J74o17l33K14P86k28o90j78Q08n3l69n31O11M43l39m17
3130e10r2M69L15m65l44K59M77r9q43K73O42K13m31o25N34P05j42p83J37N78J12
3151C80o67k26M72M77q4m48P4M74L0m45k10O54L97m26l79k30O92J78p89J2N13
3172D49K49l00n77M80N70l62n94P2J41K36M9o78M9N56J54q80j02O47p7R0p69K52
3194c45N81n23k06j93N47N79q74J12R3o8J10l94J22L85p9k35k27J50M65p2j85
3215b57k07K73K35l38q6J56L29J15o15J77L67p9p2O7n7M34m36rJ1K87J14m06L53
3238C56O4K66m96j70K69J5J41o12K27L52k7l87j9P8M33k2n80J62K88j05k26l20
3260c13K83K49o03K88O4PK78p00M7L23K64k98k9j72N90p7p52J64K66j2j25k68
$$ y = [140, 437, 113, -289, -234, 209, 383, -234, -567, -353, 433, 205, -485, -663, 145, 92, -277, -808, -197, 246, -93, -510, -602, -133, 182, -283, -627, -368, 109, 10, -833, -560, 82, 295, -136, -761, -227, 478, 336, -447, -310, 268, 380, -287, -513, -41, 436, 352, -96, -22, 452, 482, 37, -173, 481, 878, 452, 73, -157, 535, 713, -76, -64, 449, 698, 398, -179, 301, 871, 509, -85, -13, 128, 364, 413, -265, -216, 340, 494, -386, -488, 159, 82, 172, -597, -345, 236, -287, -493, -686, -139, 440, -434, -322, -229, -297, -187, -581, -459, -74, -153, -388, -615, -465, 0, -72, -257, -464, -191, 44, -294, -380, -224, 105, 220, -395, -218, 149, 70, -2, 65, 8, 442, 6, -3, 8, 295, 409, 3, 356, 420, 686, 190, 20, 289, 304, 445, -167, 60, 412, 385, -2, -21, 57, 490, 468, -112, 50, 338, 233, 7, -313, -30, 219, -384, -96, -32, -25, 253, -447, -400, -77, 187, -111, -140, -312, 278, 201, -551, -387, -121, -133, -258, -526]
3282e26k33Q87j65n27m9J20R01m32n43K43L34M8m32l9M66K49k17n60O28J13J70
3303D36l53n12O18L71n77k98L99L62J51q41K77P66j56n65r4K79M74j1q94L39J032
3324A203p87m79m75O06M01m8p16O25j08J021j981M10Q4J051n3j264L31J89N46
3343E56j071J88R73n79j24n1n47M20M41j143R47n33J384o24m50l7O75m62Kp20
3363g55K43O30l57k43O9N55l1l92m13Q36L98k35o55O9P00p6l23k95L62K14Jm24
3385a22J80J140r20K49l46m53J177j151K92k70N65K52q29R40j275J215r02j00
3403c58L21J57j03o2J24k76P01m28j02K5M17l0q65K23m9Q00n28m82J05L96Rk74
3425b79l78L03L72m51O2J89K73m08j50K18J50K27n33l51N27O29n16K9m34M99m2
$$ y = [-526, -759, 128, -37, -564, -613, -493, 408, -24, -567, -324, 10, 58, -374, -413, 53, 302, 85, -475, 153, 266, 436, 83, -429, 189, 560, -17, -315, 84, 446, 597, -244, 33, 799, 643, 78, -16, 263, 737, 726, -168, 171, 1203, 416, -63, -538, 68, 469, 421, -295, 330, 222, 1243, -738, -328, -244, 807, 754, -510, -179, 10, 556, -515, -327, 646, 67, -57, -108, -655, -235, 206, -937, 10, -523, 861, 237, -213, -250, 425, -37, -35, -755, -512, 118, -239, -482, -413, 142, 111, -281, -694, 142, 540, 305, -350, -281, 419, 343, 20, -275, 87, 301, 302, -122, 58, 1198, 278, 527, 181, -272, 905, -246, 46, -224, 341, 593, -236, 704, -571, 644, -258, -358, -37, 120, 17, -45, 79, -197, 504, 76, -26, -1, 416, 386, -479, -256, -305, 495, -33, -515, -410, -14, -5, -279, -657, -354, 18, -433, -371, -182, 91, -317, -467, -249, -99, 128, -405, -756, -229, 400, -116, -87, -521, -22, -64]
3446f4j88J50J73L43m13l67L31O74k71m74J83J70K45l90j65L10L54l81j89nQ9
3467A15K89n48N1M10K5p9k79J1M46j72m45J37K4P46k34q76L35K98J62n25j73K47
3489c5J71M8p58K20P29m97l40L50q4M63n86k64N08k7J45k31m95O04L66n48k53
3510e14M3R17k15q51O1M22M38n12m46K87P10j44n20k43N98O82n60p15N52M68m09
3531D9l67K11L21k03L27j46l0L9J05l59K76K6O79j059l77K39M78M86j121J10P31
3552D15Q1k68k25l80P17q1o30R8N49Q7l59j52L95K17l67m07j86P33Q6l79m33K83
3574b06J78q2k44N1L29j3q6n30M91J07j97k70k55P60r7l74j3J41K46J69m57O0
3596b92J0j91M79k10K69M48n16o61K35P72k25j2K14N1j09j97K64j32O00l46q37
$$ y = [-64, -252, -102, 71, 414, 1, -366, -35, 639, 368, -106, 77, 247, 492, 102, -63, 247, 601, 220, 31, 26, 115, 404, -144, -93, 317, 342, 263, -16, -5, 441, 269, -176, -39, -15, 731, 497, -379, -44, 254, 416, -109, -282, -35, 136, 184, -574, -354, 375, -122, -462, -112, -196, 267, -319, -583, -75, -102, 43, -188, -683, -79, 287, -261, -514, -471, 446, 231, -620, -559, -137, 301, -211, -657, -370, 340, 196, -324, -567, 31, 713, 153, -562, -10, 458, 49, -318, -107, 214, 11, 338, 192, 162, 201, 306, -53, 223, 249, 928, -131, -508, -269, 209, 695, -426, -316, 415, 496, 228, 3, -377, 340, 259, -371, -273, 276, 363, 4, -148, 247, 464, 97, -310, -496, 237, 323, -56, -489, -206, -28, -110, -354, -303, 26, 13, -73, -603, -112, -5, -202, -472, -727, 33, -64, -438, -451, -310, -64, 105, -352, -292, -282, -473, 6, -204, 65, 513, -3, -664, -429, 343, 118, 106, 320, 371, 262, 65, 329, 197, 797, 451, -386]
3617c86N44K94O68j257L83O2J41n40J38M98q61J539j051k75Q99m71J35l88k04
3636a32O5J44M74k6j201J331q55m30N09M20k83l47O73j37j94L9l25L1L09l07K3
3657b19j48R1J54J23n35L40K67k68m8J27P6L7l56o3M25J27j38j89K1N92k3l78
3679A5k75M97J26q6l81J43L17j66q8r6L13K28m67p2J7K57j5k30j40M14J14l52
3701G3j30J15K07j29k49l68Q28m45k87k15N54J91K19P2j760R10N44m67M1q6J04
3722b78J55J11m58L19Q31j164p9m1N64j3l36M1K44L5M5j78j56P46k31l61j81R9
3744b86O41n42j73J92L65k59p7n4L16L86n26j60M15N13l09n98j64P54K96j91o57
3765a18P7N63j42m25K11J07J57j24l72J86M89l86k48p6L15K71k57m45P8L75j31
$$ y = [-386, 158, 452, 1120, -137, 246, 308, 449, -91, 47, 545, -316, 1223, 172, -103, 796, 325, 460, 72, -132, -67, 77, 551, 525, -676, 655, -200, -630, -121, 299, 16, -331, 342, 205, 11, 50, -275, -244, 65, -242, -219, -367, -276, -122, 1, -534, -194, 73, -195, -243, -116, -40, -3, -359, -422, 3, 130, -8, -197, -176, 416, 393, 15, -260, 237, 363, 277, -104, 39, 356, 190, 102, 6, 319, 547, 80, 8, 25, 282, 267, 37, -103, 311, 425, 73, -57, 58, 265, 136, -113, -481, 347, -98, -385, -600, -46, 145, 364, 436, -1324, -414, 130, -337, -296, -382, -278, -123, -12, -470, -151, 680, -484, -563, -604, -40, -53, -389, -348, -104, -69, -24, -202, -358, 388, 157, -204, -385, -286, 355, -187, -360, -168, 197, -62, -139, -193, 123, 509, -17, -177, 238, 751, 442, -156, -320, 434, 730, 539, -118, -41, 522, 380, -45, 166, 273, 430, 306, -66, 120, 609, 223, -25, -101, 214, 485, 228, -217, -139, 236, 105]
3786A05k71j66M41J34l70k24K66M20j74m22k02L46M05k67m00J66J49l26L7J68
3806a85P1L57n37k58L42J3K31n60J01M54q4k47P3J21L36l82l53M31L24j95r1j0
3828d8K32K0n2l31J19L35L5l09N7K66l6k19o6J44J96J19o08L13J30j05k15J52
3850A29J74J47l58n1l2L65l0j19m32K46J83N5l82o4N74k44k71k89L74J47p19J92
3872d05K02L63j91l98J7N23nk29k12J11K71j64j79o7L05J64j93m62L68K81j6l02
3894b18k8L02J32j56n47N50M44m25j32J9L21M58n99l96L28M82l58k55o8M71j32
3915A93j83j43L76L62l98l01N6M43k95j27L1L44k42P7m20K54N35j00l37m15M70
3936A80J40l20m82K78K85k71l90J68L50K18%o57K15L04R1m92r2L14M76k81m65
$$ y = [105, -166, -332, 109, 243, -127, -351, -85, 335, 161, -261, -463, -117, 288, 21, -379, -213, -64, -390, -353, -185, -114, 243, -294, -552, -210, -197, 34, -526, -425, 29, -55, -302, -229, -108, 228, -154, -507, -76, 248, 53, -38, -48, 184, 204, 152, -179, -60, 275, 310, 1, 58, 324, 288, 69, 3, 147, 343, 462, -146, 167, 297, 192, -23, 129, 303, 450, 92, 41, 9, 374, 344, 225, -207, 39, 222, 277, -105, -169, 405, 161, -110, -399, -25, 122, -597, -405, -203, 160, -31, -429, -412, 111, 106, -123, -335, -224, 47, -117, -296, -363, -58, 106, -87, -549, -181, 100, 84, -218, -246, 56, 188, 32, -515, 35, 479, 54, -78, -59, 262, 720, 121, -275, 53, 535, 177, -78, -146, 325, 193, 10, -133, 243, 605, 207, -94, -38, 405, 110, -17, 14, 358, 116, 193, -227, 27, 562, 462, 125, -290, 180, 320, 0, -482, -204, 81, -190, -580, -412, -62, 156, 156, -501, -286, 18, 109, -383, -475, -161, 315, 34, -431]
3957d31K22K35J03n17j90M24L35k72j87l9P98k31o50k3O02M85n58m61L74J88L10
3978E17m81j52L40L88l79l55n2N00J5n79J66M50k37j58q2K35M09l08j98K30m4
3999B25k9q6k14K50L23l22j52j35L96r5l11j5K68p6K15m45k31K18M46k44j41K43
4021H8m8J06o28J35N37L1n98N6P8M51l08k31Q2K98k96j45m1K89J59J03m32Q3K83
4044E2j01j32K44Q3k3l4j99J22K02p5k86P4J48K08l13j49K50M25m48m7J2M28j48
4067B93K9o22M21N4m3j56q9L64J23m70L94N9k17n1k76K45M16l99k96J25K57j29
4089C2m24J68K92K39p3m16k45N28K7n07q7R4N11l43k73M2K94J92l64k9K77J40
4111G5m5n21K88J0j14K25n21M38K73k40j53lL91N3k18k92J50O56k18o39J91K40
$$ y = [-431, -209, 26, 129, -388, -578, -154, 181, -91, -278, -317, 481, 250, -400, -423, 179, 664, 106, -355, 19, 207, 517, 36, -116, 224, 612, 233, -122, -174, 326, 341, -238, -72, 378, 141, -17, -99, 136, 545, 237, 39, 269, 225, 196, 110, -104, 146, 469, 147, -5, -140, 256, 161, -150, -165, 103, 27, 242, -203, -434, -216, 230, -14, -155, 88, 40, 146, -482, -347, 190, 221, -377, -321, -243, 208, -100, -331, -249, 49, -247, -392, -433, -144, 15, 118, -314, -231, 52, -49, -181, 63, 146, 123, 89, -110, 12, 214, 139, -147, -73, 75, 283, -30, -179, 71, 496, 48, 1, 13, 441, 293, 322, -300, 121, 175, 132, -24, -113, 251, 374, -96, 298, 357, 140, 89, -187, 58, 474, 75, -221, -96, 161, 32, -392, -224, 68, 307, 234, -182, -427, 101, 128, -379, -466, -372, 139, -204, -477, -435, -141, 51, -313, -342, -65, 75, 30, -491, -203, -193, -307, -82, -603, -165, 108, -132, -285, -288, 103, 156, -62, -354, -204, 452, 234, -405, -214, 26]
4133B6J25k70j12K41O53l83m32K16L37J56p12J04K96J83N4p72L45L84k40k13k18
4154b32J82N31k08p18M53M28k18j68l87M90j88J03m3m3O88o31j75o22O40K70j09
4175D3n91N07J14M10n85M4K40m72k59M8J15N98Oo37K71j07L45k22k23J41L70Q9
4197B45k72k59K81N83k31o79K09O05m42%k71R69l13l03j17J15l6J58O3j53K76
4218D28q1K34q19K9N19n4m84J14L05k83R9nL20j85l34j46K05J78Q4l58L19l85
4240c00K59J45n37J62O02n31J53j10N70rq10Ol63L95O47q76L33J13j19j03o42
4261a015J191j37k41q3m20P03K15n34N97mk65l4K24p37J236M36j439N3N20R83
4281A249q41j126L75Q10J1O63j009M12J74j011P17m84M87k66r13N72N73K64m93
$$ y = [26, 151, -119, -231, 10, 663, 280, -152, 64, 401, 557, -155, -51, 245, 428, 482, -290, 55, 439, 199, -14, -232, -50, 481, 273, -445, 8, 436, 218, 50, -337, 153, -35, 68, 25, -18, 670, 39, -136, -758, -118, 152, 43, -548, -41, 73, 483, -102, -58, 182, -290, -549, -501, -386, 212, 218, -419, -148, -255, 90, -132, -355, -214, 156, 245, -27, -286, -5, 578, 347, -332, -123, 482, 40, 40, -231, 738, 425, 122, 5, 120, 84, 242, 305, 152, 428, 347, 581, -238, -209, 310, 256, -228, -114, 191, -92, 7, 2, 322, 137, -197, -343, -138, 40, 124, -234, 85, -300, -41, 104, -433, -271, 331, -200, -47, -157, 413, 404, -406, -400, -763, -368, 279, -597, -264, -151, -270, -373, -1015, 176, 39, -202, -285, -705, -2, 213, -321, 276, 272, 7, -27, 197, -540, 696, 1132, -307, -254, 266, 1249, 408, -718, -343, 467, 478, 1141, 132, 544, 718, -293, 424, -60, 427, 161, -752, -180, 393, 657, 164]
4300A64k4K97M55j205O21K04m77p51J115n3k97n12J34k84K59L51m0j53m2P5O45
4321D82m14q31N16K57l24J44J5L27J58n31p4J15J65R6j93j65o5K18J29k55K03
4342b7K48j09l58KL44O3m3l32K56N3M16q45Q5N0L09R5n1j12K05o8j00Q7N4K44
4366D66k98j18K39J57O9m44l25P61k11l29k86K80K79L18p71L07L32l97J77m19
4386b13j47N95k19k07J22N5K7p9l39J91J95p0l7j82q1O44m53k49L13L2P5l84J70
4409b41K24J24m71M8QL13n1n9K89m90M57j24k45J78k5J11j87r4M46K44m19p0J83
4432A49K52k38j72N4%J32q1q3J22M59l88l23J32J54J59m13m5M26L66l89l65M91
4454C99k29J71l11J87O3j57j27j82J32J17k04j33K46nj11k62K57K22q4J59m85
$$ y = [164, 140, 437, 892, -313, 308, 512, 35, -716, 399, 346, 49, -463, -329, -613, -354, -3, -43, -196, -238, -163, 482, 68, -763, -247, 10, -314, -170, -155, 172, 330, -201, -275, -160, 5, 101, -92, -257, -322, -104, 25, -230, -27, 221, 112, -246, -244, 100, 163, 120, -212, 44, 97, 513, -332, -247, -197, 112, 207, 156, 44, 249, 181, 81, 168, 222, 466, 168, 50, 289, 446, 515, 71, -254, 507, 296, -33, -319, -39, 240, 558, -213, 94, 426, 29, 206, -213, -360, 235, 16, -191, -69, -14, 13, -66, -405, -214, -19, -89, -126, -308, -389, 255, -198, -447, -134, -102, -27, -411, -241, -17, 107, -364, -316, -308, 5, -46, -105, 184, -306, 151, 27, -218, -40, -65, 46, -141, -235, 211, 455, 36, -34, 149, 401, 163, -9, 45, 45, 177, 96, 13, 135, 594, 206, -117, 15, 169, 328, -85, -130, 296, 662, 273, -92, 399, 170, 341, 30, 217, 280, 123, -4, -186, -54, 63, -141, -274, -28, -33, -144, -406, -149, 73, -11, 148, -337]
4475c37K12L6J44j34O0j29p2k3O8k75L60J06l04K02J45m3q4k16K63J07o2k41M
4498b13L20q3J16n10L19K07q7k88K56K69j98l1j60J76J87kl86j59P16kn28J79
4520I8j14M59m06j36M3K71J91l42k29L64K6r6k63p8M70N4m37o5Q3J33K45n18M6
4543b01L55m5j15m64K79J35mk09J37K67J33n81k75J39N21O1n55J66L89j83Ol56
4565d00K65N07l68j60L8L01PJ78k87%j34L83l73k73Q33m63K24n81K94L44n10L71
4587A96l56N37l47rj10J99J94r8l05J78nL53n42qJ10O4J65l54J17K2J72k20r5
4610a42L15J45j99j86k05L04j32q0J8J12J31M4l74o7L26P1k12k31L10L94l91l37
4632c86K58L2K40p3l93N02k05k12n6K88J12J09l54N4k83M02k99J16L63J24j60
$$ y = [-337, -125, -89, 55, -79, -19, -148, -220, -243, -175, -450, -90, 16, -288, -86, 59, 16, -68, -284, -21, 86, 24, -217, -213, 107, 24, 140, -370, -51, 156, 69, -219, 37, 306, 108, 77, -83, 93, 280, 278, -108, -267, 449, 447, -81, 98, -16, 443, 37, -99, -56, 215, 406, 64, -165, 199, 225, 129, -134, -212, 258, 312, -125, -190, -107, 26, 271, -247, -201, 154, 109, -6, -470, -191, -56, -60, -269, -132, 135, 268, -313, -588, -449, 72, 133, -422, -256, 133, -50, -44, -400, -135, 372, 4, -156, -118, 183, 190, 368, 81, 81, -53, 330, -43, -316, 517, 54, 278, -303, -9, 335, -175, 196, -160, 377, 30, 21, -89, 110, 304, 206, -99, 79, 74, 427, -115, -123, -13, 51, 216, -138, -21, 1, 173, -47, -142, 173, 318, 119, -67, -272, 32, -100, -180, -162, -50, 81, 125, -249, -316, 10, 81, -131, -362, -52, 342, -49, -386, -128, -96, 144, 71, -322, 180, -25, -237, -293, -5, 107, 216, -138, -84, -367, 35, -264, -148, 215, 339, 179]
4653A79k32L09k43J87p2j79Q9K34j97k55K75L0K68l15q4M09j66j35P9l84M41N4
4675B92j17j44K08j36k82J61N6K32k77l8j95L08Pj29N0J68m2o0j23lK00Nm09m6
4699c14L59L5j70m04P3M61k80P1j66J68K65r2l43L26n4M9j74k04K56J23k6l29
4721c70L08J59j19j87p4M34K13n00j0J09M46m3n22kM45q1j91j35O6N11j19n08
4743a70K95L43k00k51K5j05K71j5l12R5J40K06p2n01L61J33J20o66Q4L68J49m63
4765a65K3k7P8J97k76m02O48Q2m52l95L96M73m39J03j02K61N6k92j49Q0K03j31
4787b30j02K15K04nL6m93L82J37n7k10j23M18K10k63l18J15N95j20o17O14n7j74
4809A57j74K44j07J94k09q7Rq2J04r6r7L82J3j31m42K03K97J34j33k46N5P6k76
$$ y = [179, -53, 256, 13, 200, 128, -51, 38, 272, 75, -180, 95, 125, 393, 78, -6, 403, 237, 102, 181, -203, 238, 292, 175, 31, 239, 103, -179, -18, 38, 270, -7, -45, -240, 68, 75, -54, -4, 164, 122, 62, -61, -64, 136, 141, -268, -314, 45, 80, -90, -494, -421, 40, -240, -169, -335, -167, 98, 6, -337, -11, -65, -16, -190, -394, -138, -15, -41, -370, -62, 97, -22, -209, -283, 151, 364, -136, -146, -37, 409, 366, -156, -158, 287, 206, 15, -120, -54, 457, 338, -170, 125, 468, 268, 17, 42, -63, 208, 193, -119, -24, 116, 322, 250, -251, 110, 243, 363, -303, -219, 149, 298, -165, -142, -169, -91, 106, -170, -572, 76, 158, -294, -689, -293, 180, -259, -156, -258, 3, 59, -233, -382, -302, -99, -230, -332, -117, 87, 82, 118, -375, 7, 144, 87, -123, -246, 172, 382, 119, -199, -84, 511, 391, -226, 388, 331, 157, -17, 227, 120, 314, 105, 18, 27, -55, 49, -47, -144, 238, 251, 120, -322, -119, 178, 312, 179, -67, -12, 64, -212]
4832b12K35P0j00Q4k06K45l5N6J8n27L25M8k9j66j7K64J42j81j35R7R1r1k11k7
4856b62J01J51p8k19J07L8M15l22j32NmK21J51j40q4J60l74Q9K42J64k27j87L19
4879A34Q2k61j21O9J99n0j89L4L47l71k30K68J00M83o90K61M6L0Q8on17L84K15
4902C05j65l83J09O63n46p7k37L39K03K7q39L79M44j89j25J5o4J85p0O8L8k24
4924a44jj98J00K25j78J32l87K71J41K00k46J49L8k6j62k63K4L58Q5l54Q7K07
4946E8N4j52j16J1K97j8k07pO8J85k77M6J95K42J0l40mJ92J80k40n27L67M79j97
4970B99k53k8Q1K96j87k33J32L37k59k61J21r8J49q5k06K0K50J97o94J69L89j07
4992B9j3j63k22N09l35j45P8J89j2j45j07M78q6j95m3J5J68J74o40J31J66j53
$$ y = [-212, 23, 93, -7, 77, -129, 116, 81, 137, 155, -372, -47, 1, -28, -194, -211, 53, 195, 14, -121, -24, 67, -24, -235, -262, -161, -10, -88, -307, -200, -162, 253, -69, -201, -196, -200, 21, 172, 32, -52, 108, -266, -177, 65, 229, 2, -185, 134, 216, -45, -166, -97, 102, 52, -137, -103, 244, -127, -357, -89, 11, 494, -196, 65, 111, 141, 229, 223, -294, 90, 305, 140, -243, -134, 529, -17, -94, -331, 8, 211, 238, -601, -222, 222, 33, -92, -77, -141, 44, -26, 42, 80, -144, -145, -343, -243, -18, -196, -64, -451, -180, -39, 161, -85, 64, 102, 76, -86, -349, -325, 33, 118, -236, -149, 58, 112, -40, -156, -145, 152, 134, -73, -80, -12, 173, -104, -58, 137, 379, 389, 49, 45, 237, 417, 177, -350, 17, 496, 299, 46, 18, 99, 395, 208, -25, 107, 444, 185, -76, 45, -53, 96, 11, -195, -175, 75, 272, -422, -253, 136, 29, 16, -147, -369, 140, -195, -340, -262, -73, -85, -230, -337, 141, 55, -140, -183, -168, 0, 174, -466, -335, -169, -322]
5014c22n59L40P72l49q1k3l30P86j62J45o27L03j53L07l61j19O35k4O6m80L92
5035A56j87J93k26l0J00K39M5m31q8M70j49J9K3L0P1k07q5J96K48j65k67k7J30
5058E8j45l2N1r8M44k38k43J55K59k6l76o6M41k87p7Q5j12L45l53P8L4J23n0q9
5082a19k06P9L28j39o5j53o9M59m1j44J39j96J40j76N9J22k38M63n73K30J94J0
5104A04l18L90l95Q15o96m4M33m5j20m6K47M8l73j8N6q9K07j79N7N15k54k21K82
5127C56n23N94l37Q5l12J29Q9j63n7J23j97N19n21K2j10K75K6J91m02L83N42n47
5149A65j06j54J26K07l53k44L25k92M96j87l7M10k55J8l70J55M03o4j61k34K21
5170F9pl51P3O84p03J60K63m95N05o5J93q59N77N21q86O73l99P65n58L67l60K22
$$ y = [-322, -881, -541, 231, -118, -199, -222, -552, 234, 72, 217, -410, -107, -260, 47, -314, -433, 202, 178, 244, -236, 156, -31, 162, -64, -94, 6, 245, 290, -141, -229, 241, 92, 111, 134, 164, 235, 28, -57, 139, 387, 222, -45, -72, 58, -87, -119, -68, -166, 278, 40, -203, -48, 211, 185, -191, -257, 184, -103, -180, -95, -207, 138, -215, -137, -103, 20, -30, -119, -325, -246, 82, -57, -122, -275, -344, 115, 74, -70, 69, -127, 13, -163, -104, 18, -220, 243, -330, -100, 94, 104, -214, 176, -219, 596, -100, -144, 289, 244, 124, 78, 325, 373, 0, -18, 38, -51, 156, -23, 34, 549, 295, 74, 356, -167, 427, 90, 175, -137, -8, 81, -82, -139, -16, -213, 306, -215, -193, -303, -28, -2, 189, -213, 170, 712, 165, 59, -95, 31, 238, -115, -359, -34, -326, 170, -17, -54, 356, 101, 119, -251, -96, 307, 243, 82, -152, 69, 62, -289, -216, 468, -235, -75, 188, -307, 198, 133, 326, -533, 44, 565, -321, 352, -47, 718, 160, 527, 167, 389]
5192C89L58L94j023K5M10m09R3J56n40Q13r19q6N5J80J72k69n5L50K86j05k65
5213A0KO52o96J54k67mJ83j96l79O59l73O67l96k65k94M22k46K1K38qj81k80P82
5236B05j60K85p8n63J12J54m16M19P6J99l06M81m78n46N65K75k97qn4K76M47o41
5258e3O88m69n43J21L63k23O3K5J18j82J75J86j60oJ6k15J51Nl0J5L3K45l69J41
5282I5J98k84n2lk0r0q6K76j48k43K22J96l8o2k97K12L8R1j39m8j02J73K8j02
5306a85k17O24n4m48J29J8L32l38P0m1K34l81J23n8N8J73O3k01L66j11j19J09
5328A46l69K88Q9j24J01k02M01j16j61r4r8L73k73k5J70J35m6Q4k13O5p1Q4j28
5351A6r5K60j12j77j86J93K72k14Nq9L83k24J84k12K03J21m7l99L2J34k24M7j18
$$ y = [389, 747, 1141, 118, 143, 553, 144, 237, 393, -147, 666, -253, -339, -284, -104, 68, -201, -256, 94, 380, 275, 10, 12, 664, -32, 122, -145, -149, 34, -162, -541, 118, -255, 412, 16, -249, -543, -121, -367, -346, -108, -116, -297, -577, 205, 45, 330, 252, -311, -199, -45, -461, -42, 34, 233, -73, 408, -70, -616, -51, 224, -73, -81, -135, 141, 588, -53, 635, 166, -377, -256, 107, -116, -53, -28, 90, -92, 83, 269, 109, 103, 119, -96, 55, 60, 30, 45, 78, 323, -46, 95, 293, 9, -43, -46, -66, -156, -242, 34, -114, -357, -135, 61, 23, -39, -336, -124, -86, 5, -134, -182, -284, -111, -83, -185, -402, 222, 168, -280, -151, -133, 199, -139, -69, -110, 124, -257, -134, -192, -134, 39, 102, -99, 267, 156, 37, 146, -223, 65, 154, 30, 131, -71, 330, 214, 53, -41, -139, 234, -39, -64, 106, 241, 195, 279, 66, 131, 60, 144, 16, -79, 181, 69, -108, -294, -101, 171, -43, -38, -127, 256, 32, 216, 4, 207, 328, 281, -118, -86, 48, -176, -129, -247]
5374b47K46j74K64k42j57L05Mk57j36N26k27L3P5j95K62l65L62p49N88J1j25m01
5396e99R45J97J77q69k4J067j88j394N33p23Q91l84P58J59j065K1M47M44n08M61
5416C46J49l31k05j63M07j1m37J79N71k37k67j57P19m37j05R2R1p20M35k05K86
5437@j61Q65q19j309J357J17O5j280J086N96l06k03j4K06m23l03P62q88M5Q19
5457B12J24q28Q82p42o68J002J04k69L05l21n1K24J16m00P35l60j55k6J42J41
5477A67o84M67j24J91l2J43k0K85o19M59K32l11k31k04M67m54j46J048m23k4l30
5498a43N8L20M2j66k30j46P4P0J57n16K76R7K72m08k46P46m38N58n88L26m88M71
5520I8o4l34N20l90k80p3L65L47j18m02P1K56L54p67R6J46J84n38N96k79m3M11
$$ y = [-247, -1, -175, 89, -153, -310, -5, -1, -258, -394, 132, -95, -62, 13, -182, 80, -285, 77, -672, -84, -73, -198, -599, 346, 543, 720, -149, -173, 894, 706, -688, -155, -878, 13, -371, 387, 546, -519, -498, -51, 393, -115, 346, 495, 164, -41, -204, 203, 192, -245, -66, 505, 268, 1, -156, 563, 126, 21, 113, 204, -516, -81, -286, 0, -161, 704, -115, -1424, -67, 50, 115, -1165, -79, 517, 211, 8, -6, 200, -223, -526, 236, -652, -607, 212, 336, -492, 390, -352, -1020, -18, 86, -183, 122, -199, -250, -26, 90, -310, 425, 65, -90, -116, 26, 167, -517, -50, -174, 17, -15, 128, 108, 393, -226, 233, 465, 154, -77, -281, 186, -268, -414, 634, 211, 187, -143, -85, 235, 277, 111, -119, -265, -191, -121, 36, -480, -204, -107, 165, -243, -489, 257, -181, 377, -211, 115, -373, 98, 34, -300, 220, -170, -450, -523, -158, 189, 71, -331, -260, -4, 350, -417, -321, -175, 9, -529, 67, -212, -255, 156]
5542A56j95m57R98k97J82P0o02M69%p48R72l83j51m82L28N38l22J87q23J257m89
5563B08l16K05J93j57N92P5j298l0P88L53r26j46J748j955N34q1n0M27N83r51
5583b04R5J75k24P48l65J80K46o08l81M59k80L80O7p23j20O03k78J6N8K40j64
5604h0L14J68k58M9m39L78M0K1j39n18Q95k07l86L5J16J99k14J70n45L44J11j77
5626a23L17r9m48P85j43J1n63O91l21K45k61k32L38k46N97q00q78Q55K82J0l23
5647c06P87l98L53M5l04k4O0k76R5k11j6l26M26O14l61N20q87P1J83k74N38k07
5669A02k41k69P19q46K17N04q31N60q4j19M82n06O4J55K23n43L71K50K6n51K67
5690e0O9j67O95p62K08J95j10m99Q56n67K69P97o82N23r46P41j045J078o76k08
$$ y = [156, -39, -496, 502, 205, 387, 457, -145, 324, 324, -424, 548, 165, 14, -468, -140, 398, 76, 263, -560, 697, 208, -108, 97, 290, 133, 725, 800, -498, -528, 260, 613, -313, -459, 1289, -666, -132, -213, -263, 164, 747, -204, -109, 66, -158, 590, 225, 405, 651, 43, -338, 121, -159, 221, 288, -435, -555, 48, -230, -214, -156, 84, -80, 234, 402, 144, 193, -246, 132, 172, 193, 54, -464, 431, 224, -162, -127, -11, 188, -26, 144, -401, -57, 54, -123, 194, 95, -353, 432, 289, 300, -263, 428, 107, 352, 91, -141, 197, -49, 548, -252, -1130, -275, 7, 17, -306, 481, 83, 436, 481, 177, 153, 213, -63, 32, -179, -195, -521, -95, 519, 158, 678, -209, -138, 45, -229, 309, 102, -139, -408, 311, -535, -318, 186, -645, -85, -169, -288, 194, -312, -248, -93, 130, -413, -42, 208, 234, -317, -50, 19, -148, 547, -215, -7, 188, 78, -421, 435, -132, 137, 934, 252, 775, -171, 570, -475, 603, -73, -281]
5710b81M31p03J49J54M74j085N94m53J270l06K16o90J201l63r07K94j25J69Q90
5729I29j110Q7O20j51P6Jr2o91p1J43L28j95M17l14j70L80k23J8j55p5J088p60
5751H0j78K46o14J21P22m59j67K65J94n67k72L88M67q1n57J429k86l68J3q53P94
5772C17j45L39r91l52P59L24m66K27j63L94n34O98r0K47m17L24k47p53J099j30
5792D40m14k14N00k07k2OL66m07j4o35J44P19o68K79j91N23J87L05q90Q5M64K97
5814F53p19M67n45M53m14L13k72m51N03j96K62q5r5J62q0K09R3j06M86j301P69
5835A06k98j30j11M16J5J59k77k34O44l15K8L25j9r1k95k46L78n46K12QR29o77
5857a9m8j43K62j23J15L26m82J87L74k9m30L43l45J11J72k41J58l36L17k40K77
$$ y = [-281, 150, -553, -404, -250, 224, -861, -267, -720, 550, 244, 460, -230, 971, 608, -299, -5, -130, 39, 929, -181, -94, 526, 375, 451, 452, 360, -331, -402, -259, 69, -126, 291, -23, -193, 187, -36, -18, -173, -248, 840, 80, -98, 148, -466, -345, 377, -82, -249, 16, 210, -357, -629, -241, 226, 145, -412, 1017, 731, 363, 376, -477, 317, 172, 511, -480, -832, -73, 251, -215, 12, -151, 243, -291, 407, 317, 564, 147, 471, 224, -529, 570, 440, 26, -188, 312, 105, 83, 89, 455, 48, 34, -601, -457, 262, -406, -127, -318, 205, 392, 697, -193, -108, 356, 653, -66, 401, -144, 309, -105, 208, -64, -515, -12, -208, 54, -31, -126, 36, -44, 165, 258, 152, 638, -663, 106, -192, -322, -433, -17, -2, 157, -120, -354, 290, -25, 3, 328, 309, 218, -77, -323, 55, -491, -279, -271, 658, -19, -67, -210, 52, -71, 44, 370, -112, 75, 449, 420, -10, 333, -12, 99, 271, 30, 188, -148, 169, -71, 206]
5878B06l59M74n67j3M20J97K28J7m7m97k80P25J59j090M70J22N9K07k45j26k31
5899a71M13n02N71m56J78o8l32j84L41m82O86k79N73r56L56L01qk98P19K69o14
5920E7K31q69L82l02P14p37L89P49p77j3L83l80M65l6q9r5nK77k60N3j30K1J28
5943A56M6k83j96J49N6n8r4L10J60J56l39m78N45j16N1l03O49l13q6L8k45R9N36
5966D40n97J03K53m5n6j6j75J3kJ04N4j36K24K01p43J77j13K38K37k69K97Lj81
5989A1L2K1l37M16j87j03K11k22N6J00Q4Jj17RM0O5j22Q8J02p2K17Q2m51O7J45
6014A36j76J41n9JK16J84m57j15K56lk0m35M00PK33n03K24K90l09rj63J34J22
6037I5L4j15r6K03k52J11K70k27j10L5J03m16M72k82K54k86M48k75K0j59J37J34
$$ y = [206, -153, 321, -246, -259, 161, 358, 586, 603, 556, 59, -221, 504, 663, -427, 43, 165, 224, 431, 186, 60, -171, 242, -260, 311, -145, 33, -35, -367, -551, -210, -692, -6, -285, 288, -668, -312, -11, -19, -317, 402, 671, 57, 288, -581, -199, -501, 213, -524, -135, 614, -163, -176, 207, -173, 292, 256, 167, 72, 67, 344, 84, 137, 7, 28, 156, 202, -81, -277, -128, -72, -130, -224, 86, 246, 402, 63, -415, 130, 14, 65, -238, 411, 98, 12, 50, -195, -96, 440, -157, -54, 199, 154, 98, 82, -93, -80, -82, 22, 76, -60, 164, 365, -378, -201, -314, -76, 161, -108, 189, 192, 11, 43, 64, -273, 143, -44, -147, 64, -158, -102, -2, 82, 83, -34, -25, 15, 80, -42, 46, 148, 76, 293, 375, -76, -9, 136, -40, 101, 42, 43, 259, 443, -14, -129, 127, 124, 104, -331, 69, 76, 309, -194, 30, 320, 11, 2, -161, -27, 95, 129, 14, -82, 121, -131, -20, 250, 23, -87, -52, 51, -365, 107, -175, 79, -207, 241, -34, -14, -173, -36, 98]
6059I8l6j89J87k75J06J30k52l0J18J30J46k50K68M4k45j74K94K76l68J58k78
6080a42L15j95J2K17k24K31k06J05j20K68j46J95n11J12K04k33R2KK4n0J07j84
6102a27l7L73k67J90j74k15M68l11o0J09QK24j67l3r3Q7q8J75Po3r0N1k6l2Rj53
6128b35L09q4J00j97m5L22j3l32k74K31j2K69j44J11p4J91q9Kj47m9L41k75j62
6151b56K67Q8o8P9l80M41j30J10l89L12p1o6J19J9K52k56R4j84M6L6j09M2Jl2
6175c5J15j86n9R9n1P7r9J2K19L08l51l4O0j10M6l27K94n8J86j60k13QK31M5p2
6200e5j29L05o7j24%k1J27j97jo2R8M24k98j12K82j88p7P9j42k26L67L01k88M5
6224D1m7L65J14n36k00K47k81K40j09M34j06J50j57p57Q50J67p72L65J41m34K68
$$ y = [98, 62, -127, 60, -215, -109, 21, -231, -261, -143, -13, 133, -117, 151, 195, -50, -224, 70, 346, -22, 136, -142, 173, -22, -10, 207, -17, 214, 8, 113, -7, 261, 115, 310, -201, -89, 115, -118, -26, -24, 0, -50, 57, -127, -164, 209, -58, 132, -42, -257, 211, -100, -160, -51, -43, 181, 14, -19, -112, -25, -113, 62, 69, 6, -84, -33, -59, -91, -82, -235, 74, -10, 90, -107, -152, 170, 157, -175, -449, -218, -230, 39, -105, 6, -68, 123, 34, 36, -111, -160, 181, -94, -256, 11, 99, 31, 110, -270, 171, 41, 151, -238, 74, 3, -63, 56, 75, 327, 71, 165, -19, 27, 63, -46, -4, -3, -35, 80, -106, -165, -66, -117, -40, -139, -127, 92, 400, 49, 15, 75, -35, 11, -316, -22, -80, 106, -54, -267, -259, -28, 17, -55, -184, 121, 54, -70, -70, -91, 36, -161, -162, -224, -126, 298, 0, -112, 170, -18, -95, -16, -158, -384, -17, 284, -4, 41, -6, 359, 473, -63, -263, -16, -297, -57, -166, 268, 162, 312, 155, -602, 248, 415, -357, 8, 149, -285, -17]
6245a7M80j85m7K25m70l3mJ69j79J45k26L59j72j72M4j38J91n4j97N18j44l99
6267c06K33J54L7Rn35J11K00N9Q8k42j91J99l9j7J85J09J23k95j03K77l84N23
6289A95k61n48O26M44q81K96k73R9K78k25l66L76N92l86L8m28M91J71k09l3l43
6310c47M99k18O97p49m53J62K78K81L46p69J97L06k3l03q42P89Q6R3m3l98J065
6331F54o08j80K43L3j8J23K08m99K87O3M52o51Q1qJ19k22K54J36k59O43j295J52
6353b92O21o97M9M93l78j41l82Q38o25M20P3k5r6J81J41l67O42r04M70l1Nm57
6375d62R06Q6p72L96k02m0j35J78J01m9L17j48k45L1J88M1j70l50K40K48j05p4
6397b0K9M6p2Q6mj33N1M0j32R8J72p3J6o3j56K33j11o2j44K40L0j99k78L11L21
$$ y = [-17, 463, 278, 231, 456, -14, -47, -51, 118, -61, 84, -142, 217, 45, -127, -83, -221, -30, -84, -281, 237, 93, -306, -73, 81, 118, 127, -408, -297, -97, -38, 50, -192, -383, -184, -223, -240, -55, 54, 177, -118, -221, 56, -328, 195, -66, -614, 12, 456, -425, -129, -402, -303, -25, -250, -616, -240, 352, -34, 4, -424, 67, 238, 29, -4, -347, 152, -66, 631, -118, -571, -409, -131, 150, 496, -273, -76, 230, 207, -96, -938, -149, -63, 30, -13, -411, 654, 46, -134, 109, 142, 124, 247, 455, -44, 243, 306, 758, 107, 188, 180, 299, 77, 331, 467, 208, 851, -444, -292, 329, -368, -319, 174, -204, -345, -727, 111, -514, -94, -21, -46, -142, 39, 180, -187, 455, -449, 21, -10, -5, -462, 444, 530, -242, 154, -48, -88, -223, -45, 56, 7, 324, 176, -69, -38, 150, 191, 21, -329, -89, 159, 54, -20, 9, 55, -17, 69, 65, -68, -17, 23, -109, -11, 161, 88, 104, 41, -115, 118, 7, -55, -199, 41, 71, -128, -406, -95, 226]
6422B26k73k75J74L61k72m6R1M1J12l51K62r5M2n0o9j22N39k17k90j7oJ68q2K
6446a47K09N0L5j99k35M49r2J2j32r3J26Nm9M6O2k16K19o9j31K02j19o8R8L3l0
6471c4L53j08j47l13L44M6k48M59l02m6o9j01P9n2j23j3L48q2n2M6j57J49n7r4
6495a74K34k5m3k3l0j33Q8J85m90M54r8j09J09O9k69j45K32r2L23L0k48K9q9K29
6519A4L5k5j18N5R7l03K06N5r3J79N5k16K44j9O3k71q9K88o4J6l89K23K8k9J07
6544D9p9J17p3QM0J25j16O5l93J58L13p3j56J7j91J98M1k2kJ46o1n35L95j59k9
6569b17K89r4k0J07J12k02kk16J98j60l9R4J06l2J87k59R7p8J6j01R0Q3k68K57
6593e2k15J94K65J27m65K92k34K20j92J68k13L31m5k17K40k63L18l69M1N08l08
$$ y = [226, -47, -322, -148, 213, -59, -105, -14, 27, 139, -212, 50, -45, -3, -53, -122, -244, 295, 78, -212, -229, -235, -67, -149, -147, 62, 112, 147, -52, -287, 162, 70, 82, -50, -143, -17, -12, -61, -15, 47, -169, 50, -19, -150, 52, -67, -135, -37, -4, -34, 319, 211, 64, -249, 95, 141, -107, 352, 50, 4, -65, -166, -87, -139, -262, -275, 73, -9, -61, -15, -172, -23, -80, -174, 60, 35, -8, -31, -61, -194, -106, 79, -411, 43, -55, -164, -55, 14, -255, -400, -168, -260, 63, 93, -155, -126, -215, 14, 49, 24, -94, -39, 58, -245, -39, 16, -77, 102, 157, -59, 185, 166, 229, -42, -131, 157, 93, 109, -280, -57, -29, -58, 49, -30, 87, 14, 22, 62, 187, 71, 136, -257, -99, 214, 141, -15, 2, -189, 9, 50, 28, 26, 172, 111, -424, -29, -188, -217, 72, -22, -42, 65, 177, -25, -27, -243, -45, -205, -244, -150, -44, -76, 111, -148, -51, -129, -113, -214, -124, -41, -309, -52, -267, -73, 192, 319, -146, 146, -88, 132, -60, 108, -105, 226, 181, -36, 204, -59, 259, -110, -69, 439, 131]
6614A31j50k44L59K29k52N4OQ6J6j91k03M87k05l3ok10J45J88l23j61R2K92J5
6637A22j06r3L06j81j40l6m7K7J51p7j36L21k7o4j18N8j46LO1O6l6j0m9J29L3
6662A1J98k96j8l6L40m78L67j95Q3j21K15J17k43J39k65L25P7j96K8N4p1L0k9
6685C6J7K07k91M5J15L5k12K9L3j21MO4K26L1j11K6k6R6j90j14R1j56J30J49j50
6710c7j2Q2p0k22K21k15L62Q5j57OR7j1j59N1J32j45R7p3R0j57NK2mp3J54l04
6736b35P8K51o7k34L45l91K79l1J31l55L80k80J23p5K09M1k10j23K96m3J88r1
6758A86o6k3NJ07l08R6J27K2n0J48p6O0k40l33L72M8Q0j58j64J27K07k09k06L83
6782A35j78K24l85L66k06j2J3j95K66o9J9j08PJ34J01n4j31j7k6M7n3M9N5N0Q1
$$ y = [131, -19, -263, 96, 325, 73, 127, 133, 219, 235, 44, -159, 328, 123, 90, 84, -126, 19, 207, -116, -277, -185, 107, 122, 16, -77, 229, 48, -92, -128, -175, -148, 3, -74, -210, 111, 84, 20, -98, -40, -186, -183, -122, -56, -92, -102, -151, -22, 11, 209, -87, -105, -141, 199, -279, 88, -107, -24, -145, 70, 187, -56, 83, -182, 143, 220, 24, 52, 106, 35, 65, 36, 53, 260, -31, 14, 129, 164, -48, -19, 14, -107, -103, -39, 187, 218, 107, 133, 107, 203, 13, -101, -10, -166, -36, 113, -37, -49, 33, -37, -259, -38, -253, 109, 194, 37, 43, 140, 129, -30, 21, 153, 8, 105, 32, 122, -35, -30, -8, -12, -85, 69, -235, -157, 94, 27, -207, 138, -253, 26, -5, 126, -229, 151, -129, -6, -81, 128, 169, -41, -164, 132, 89, 277, 186, 120, 97, 102, 209, -99, -3, 124, 146, 96, 244, 168, 228, -12, -345, 27, 75, 155, -3, -167, -40, 167, -42, -248, 135, -43, 181, -204, 162, -44, -56, -43, -238, 28, -41, -22, -130, -123, 11, 112, 58, -73, -90, -116, -69, -122, -73, -18, 32, 113]
6807A13k02o7L77l60J47N1O2q7l9r9J26j90M10k24N6K95m80K11l35n5M14l1j56
6830f3n3J86j47K65l29K13k5P8L3j21K18m23O7L2J56rj7o2P1J57K0k94J18j49
6854g8Q9K65n23M1M02J18l26j57J24n0J74j15o2K63j46k2j37J95qJ28r2j7k5K
6878D3r9p3o2L62l02r2L7P3K57j47j68K0K34L7j81j5m1j51K0J67K79j07j20L9
6902A0P0l1j76J99j04J13L1r2J39k56J69l5j02J90k28m1J72J65J04l99j6j57L30
6925E5Q3j49K36k99J75Pp7j46J09R7L5k14J01j80J17K04l75O5J57P0n25L05N9
6948i0J25J9m1Q9l08m1K55p9J83r8k50K65L2l36K41J4k1K20l54O7L1O1Pr4J5J13
6974B5M9j11j18R9J58j40L39j27m9N13j011J231p91J03j81J56k61L64J45ll10
$$ y = [113, -89, -156, 221, -139, 8, 59, 121, 34, -5, -104, 22, -168, 242, 18, 74, 369, -111, 100, -235, -290, 124, 93, -63, -116, 70, -77, 188, -141, 72, 47, 125, 158, 37, 255, -168, -101, -69, 87, 78, 61, -1, 70, 227, 247, -47, 71, -78, 11, 276, -247, -206, 196, 314, -12, -169, -45, -95, 79, -36, -98, 165, 19, -3, -140, 55, 47, 175, 83, 66, 41, 43, -56, -129, -191, 171, -131, -223, -186, -113, 144, -3, -171, -151, 83, 120, -61, -76, -117, -268, -248, -81, 198, 91, -29, 10, 80, 49, -127, 72, -32, 81, 112, 20, 159, -97, 72, 37, -65, 125, -103, -144, 28, 193, 297, -102, -118, -275, 55, 138, -11, 225, -74, 101, 108, 31, -115, -6, 91, 126, -88, 13, -167, -50, 154, -221, -156, 1, 71, -454, -149, -90, 35, 54, 13, 102, -206, -247, 8, -71, 112, 14, -236, 29, 61, -275, -34, -20, -41, 179, -175, -108, -77, -16, -9, -103, -88, 25, 74, -37, -155, -56, 102, -38, 301, 174, 125, 638, -373, 858, 67, 170, -11, 145, -116, 248, 393, 390, 80]
6995H0K08j15P2j82l16L16j36K47j29j15J80r5j20K13j54K10l03J4J53O1l6k61
7017b08m0R9K66k09R3o6J31l26J47nj48J85OJ11l47M28k76M7K2J2K5J30j03k07
7041b33k6M75l16J16J19l8j67jJ17m0J01l99J30J5K27jj06j90K42K52j74p9r1
7064f7J72j57J85k19O6N6L1m3nJ0p5J2j38K37K67l83R8j12K43r7j30K71j60O3
7088A25k44N9K12n7J85m19M6J68K06k13J12l85K76k26K05J43p4j70o3J79k59K42
7110D8k25K61k08R7K12k39q0L29k85J80j99J83j7N1J0l09K14kJ44n8j95J27j63
7133a24J51j16O1Q9mM7n1L80l61l3jN4Nj9k55L54k7k25L21k80l7J08J03j5m5j41
7159f1j1K12j00J75k88k41J37J55L48l06j76K52k95Q1J04k53K83J94k48PJ7J46
$$ y = [80, 288, 173, 245, 63, -253, 63, -73, 174, 45, -70, 110, 15, -105, 108, -46, 164, -139, -125, 28, 89, 53, -208, -248, -149, 117, -92, 1, -65, 66, -260, -113, -118, -266, -81, -75, 36, -311, 117, -159, -112, -90, -78, -53, 77, -26, -233, -259, 216, -100, 16, 135, 97, -70, -71, 46, 6, 107, -292, -162, -147, 80, 79, -27, -217, 25, 277, 103, 24, -67, 105, -52, 133, -86, -20, 36, 67, 24, 19, 29, -46, -34, -172, 65, 332, -51, 47, -65, 178, 81, -49, 222, 62, 125, -119, -60, 152, 95, 280, -139, -93, 75, 281, 68, 180, -205, 71, -155, 50, 193, 119, -51, -114, 65, -194, 48, -177, 84, -124, -27, 185, -54, -134, 195, -90, 90, -109, 74, 57, 108, 118, -191, 23, 21, 165, 107, -88, 39, -124, 27, -89, -28, 61, 57, 104, 53, 433, 72, 39, 38, 92, 97, 78, -177, 177, 150, -75, 246, -34, -71, 37, 140, 125, 80, -61, -72, 140, 40, 215, -73, -314, -177, -22, 326, 20, -156, 96, -199, -118, -14, -267, 16, 210, -38, -31, -14, 132]
7181A32n3l09q8K68L17l24j23J95l23J63J16j07K44l9k65P6M7M8K7O5q3M60k4
7204D20m22r3o0J46L23m16N3J84j32J27p6J4j57K21k18j67M79k17k53J07O7p4
7226a44L56l45K5K00j80K06l61L44l07J78P6r5J99j39P8k58K97j12O4m27O99o68
7248c14M84k2l42ml43R17n35J61O8k03K96p4k50K65k21j87l0L90q0J3k22L24L1
7271A22Lk62J67j03NK52j22O1j94q9J20K15J9l09j17L1K21J75j03Oq2J00l40K31
7295Gk29N1K28j42j9K96l14J97J20J24l10O5j8k30K58o2o2QL0O0k21K40j27j37
7319a87L83m23M95j51l96K48K46n33K74P9nk80J94K02j18K19o49L86K3j85J05
7340g3j88M56k59J5k24K52K82l91J41L89l94j75R2J05j07Q2l4j48M67m20J0N8
$$ y = [132, 79, -230, -318, -50, 267, -57, -180, 15, -308, -145, -29, -136, 108, 69, -196, -120, -73, -25, 2, 67, -16, 444, 420, -2, -95, -155, -9, 314, -102, -49, 135, 3, 130, 54, 68, -89, 132, -86, -253, 226, 9, -244, -137, -70, -144, 212, -133, -108, 92, -88, 118, -243, 101, -206, -28, 48, -47, 152, 13, 91, -167, 130, 18, 82, -345, 354, -314, 170, 148, -194, -198, -541, 376, -159, 2, 70, -133, 163, 89, -161, 104, -117, -304, -334, 56, -24, -11, -233, 91, 122, 125, -137, 30, -73, -68, 184, 62, 123, -71, -160, -40, 175, 194, -115, -232, -201, 20, 195, 92, 98, 16, 116, -224, 7, -222, -171, 57, -85, -104, 192, -122, 75, 195, 319, 9, 74, 56, -174, 84, 22, -40, -32, -2, 58, -163, 77, -50, -187, 196, -227, 268, 117, -279, -31, 215, -318, -44, 35, 30, -250, -56, 146, 28, 247, -402, -16, 7, -178, -73, -261, 195, -64, -49, -273, -21, 261, -130, 11, 400, 6, -169, -77, 28, -79, 3, -31, -179, 288, -132, -122, -64]
7362f4K29j68L2j13L11l34J75j74K73m7j67J50j36K5L0p5J64J26k02j3J76j97
7384Aj47K34l10j69L33k95k38O92m1J3LJ35m04L95p08P27J98J1o10k7M38l53j14
7407b36Q6K76o2k06Q5N2N0N7k07l1MJ23k42R9K44k56J59m66M57j05P2K44k30L97
7431C64n04K73J11j66J17MK05J94q36M80k91m09M42K08m51L94k64Q66o67K89n5
7452C04N1m09N91j088J582L44j256M01l62P48j164P00j179Q78J67j194J580j025
7470c31M70k63J84m62N08j16o4M83K9o51M49j21K21k08k30k85Q6M93L06l69l35
7491b06N14m62j74O39j221N80lQ9N86k69n27Q21k44%k78N06K86k49o26J031j210
7512d17m8q7N23N36q12J22O37j12r98R61q73J47O22l39L71o30L1J029p73Q34m40
$$ y = [-64, 165, -3, 29, -84, 227, -107, 68, -106, 167, 120, -47, 103, -33, -8, 22, -53, 111, 237, 35, 22, 198, 1, -146, 88, -222, -391, -58, -353, -591, 101, 60, 73, 76, 211, -193, 202, -506, 221, 419, 430, -180, -207, 231, -122, -236, -150, 126, 64, -142, -57, -5, 45, 102, -105, -136, -132, -9, -251, -152, 92, -164, -5, -471, -14, -119, -47, 197, -33, 364, -140, 133, 244, 78, 195, 199, 404, 598, -238, 242, -49, -458, -16, 192, -259, 135, -129, 737, 70, 359, 304, 355, -54, 537, -551, 1031, 1375, 119, 520, 158, 906, -258, 442, -737, 141, 308, -886, 694, -331, 139, -124, 60, -402, 106, -10, -74, 409, 438, -213, 236, 115, 336, 128, -102, -387, -301, 192, 498, 129, -206, 308, -154, -328, 311, -910, -330, -333, -244, 342, 73, -454, 367, 123, 123, -155, 351, 637, 388, -238, 793, -417, -465, -552, -29, 507, -305, -183, 454, 342, -656, 305, -568, -421, 201, -138, 233, -397, -366, 663, -110, 724, 284]
7533B84Q68r69l74P6n4J32Q83r39O15J4M18n16k56J45n91p3j52N82K28j17J33
7554C37n34j65K60O9j89Q45n37l86M25J88l24q02N23M15k38m31Q79k91l68J67
7574a57P0J00m70K79J74L46m44Q22m76r5j44L43J50nn31J58J81kJ92l65o8m63
7596d05L58l36M11K10L7J96p56K02k9m77L69L35L73l55K51k08p55Q67j01m28K93
7617E2L28j98k37O9J87m7J57J57k83k75R6J02k29M22n18J16M80n04l22R86r34
7638c95O28m92O51l20l73P91j79N11q46r5j82J216p06k93N8K42K70l3o92K99N28
7659E88k82p75N50J09k71K74k40k64M35J07K49l2p04O69k65k43J1j35K71kM3M18
7681E11n44M4m81L06N0J07P16L12j275Q18n5r68L44N24l24M26p78M02n41K74M4
$$ y = [284, 1152, 183, -191, -115, -169, -37, 846, -93, 522, 536, 954, 438, 182, 327, -264, -337, -489, 93, 321, 204, 337, -197, -362, -102, -33, -222, 623, 86, -300, 125, 313, -11, -813, -290, 125, -113, -544, 335, 44, -324, -157, -87, 13, -457, -178, -4, 342, -102, 720, 244, 149, 5, 348, 498, 493, -38, 120, 301, 299, 491, 126, 58, -405, -47, -383, 28, 238, 275, 471, -285, -83, -112, -589, -220, 115, 488, 133, 384, 176, -579, 288, 187, -241, 52, 380, 182, -55, 14, 201, 154, 311, 468, 185, -90, 6, 108, -121, 301, -217, -101, 379, -125, -447, 539, -395, 233, -259, 392, 72, -301, 490, 311, 822, -24, -119, -301, 915, 209, -84, -26, 216, 486, 453, -239, 60, 588, 306, -469, 81, 190, -81, 193, -47, -311, 124, 231, 480, 448, -256, 413, 148, -95, -84, -219, 52, 50, 93, 511, -33, 11, -470, -164, -114, -7, 709, 1021, -254, 564, 509, -459, -115, 409, 85, 511, -267, 135, -406, -132, -88]
7702h8q3M8J9K4L68k87k17J72K82rj84j14m9o4N4K27M3Kj9r5P3j38J03k03J99
7727F4k24M59j33J59l67P1j13Mn5K31o3l8L9L3ll9J73j79o4%j4K32R8l54J51m33
7753c65N12q5j25L92j87p4p0m8J14N3q9j58K78j14J46m50O72l29k30j29L42M43
7775D99m57j14Q2K5l6j37L2K14J03l60J88l1mjk75Q6J17K8K6j89K03q7L33k46
7799aM1q2P5p7J37j80o3K11J50l72J69J81k58L39k25J04j64P3J45j53K34l46Q0
7822A8J7q9L47k19p0J34j18l8k32Q1p8J82K57l87L27M3j87Lj79L11j98j82L8K13
7846fJ25j14J32j48j62L88n12J44J75Q3k17R0m4l58K54J42k3j31M38m60J17J06
7868A9q7L2l88M92j6J70j29n7J49k66J84Qj77j10M13l56J54P8m2j43L23k61K2
$$ y = [-88, -171, -123, -104, -80, 288, 1, -216, -44, 238, 229, 45, -69, -118, -182, -128, 99, 142, 144, 125, 30, 103, -35, 68, -135, 64, -160, 299, 166, 325, -42, 29, -84, -80, -135, 96, 33, -5, 34, 67, 64, 25, 198, 19, -45, -45, -59, 173, 271, -83, 68, -365, 147, 62, -63, 329, 142, 68, -2, -50, 64, 117, 28, -130, 148, 34, 180, -270, 402, 73, -157, -286, 56, 499, 42, -72, 10, 35, -1, -138, -106, 108, 211, -149, 39, 8, 4, 3, -272, -186, -69, -41, -15, -204, -1, -88, 245, -1, 40, -42, 33, -44, 93, -87, -150, 61, 211, -161, 8, 189, -69, 270, 45, 149, -15, 58, 203, 50, 284, -62, 18, 35, -54, 293, 74, 4, 138, 20, -18, -250, -169, -247, -65, 192, -195, 132, 175, -12, -9, -188, 123, -75, -257, -219, -6, 119, 5, 137, -11, -173, 215, -297, -153, 22, 105, -112, -22, -66, -424, -170, -28, -51, -182, 256, -204, -87, 19, -68, -36, -424, 68, 52, 222, 93, 36, 185, -81, 103, 111, -66, -176, 237, -119, 35, 113, 71, -72, 251, -10, 12]
7891A2l1l8K40j14j24J58j04j24J28P7M0l72k8L78J4l5j35J22k06l4J42PN8J90
7915B21j78l37K01J7J77m13K64J18q6j43J39J24j1j55J76l29k8L40J31k06o9J85
7937A38j56L3j36L0J90p0K9m6K18k03m8Oq1j00J39Lk13M02j15o7J1J03j34L0j63
7962b00J34l7J89J73j63q9j83J80L07j28l13J52j40L0R4J74L0k25J32k5j76K47
7984A63l11J37K4j5r9L21k92k72J05J4J65lnK75M3j45m6r1K4Lk37N6K5L73k39
8009b7j80J75J66j17O4j51J72J51k78O3J07j83J50J43m90K20P8Q6j14J53j47k4
8031A7Q0l04L03k65O2Q4J92j60Q6k39J56NL8N9j06j59J72J04Qo3J26j44R5k73
8055a26J35j7k50M10k41o6J88k2n7J6l8J20J40j56M56p71Q7O43n73M9j6N2MM2
$$ y = [12, -19, -57, 183, 69, -55, 103, -1, -125, 3, 80, 120, -252, -280, 98, 112, 77, -58, 64, -142, -176, -34, -27, 31, 221, 43, -294, -93, -76, 101, -312, -48, 70, -16, -159, -20, 104, 93, -62, 114, -215, -243, 97, 228, 22, -47, 138, -18, 15, -121, -91, 99, 29, 58, 12, 230, 27, -21, -15, -96, -196, -57, -54, -267, 135, 20, -47, -36, 67, -67, -37, -200, -66, -103, 86, 259, 96, 7, -176, 4, 311, 183, -130, 22, -118, -88, 6, 180, 210, -15, 117, 92, -84, 163, -148, -11, 13, -2, -101, 220, -72, -344, -239, -225, -60, -63, -68, 207, 250, 105, 59, -32, -8, -5, -242, -186, -161, 212, -27, -207, -32, 134, 17, 81, -70, 102, 253, -25, 38, 145, -38, 112, 255, -235, -15, 63, 149, 35, 188, 41, 17, 97, -207, 96, -169, -107, -23, 169, 9, 95, -144, 12, 17, 55, 114, 8, -151, 21, 125, 133, 70, 196, 52, 147, -126, 9, -8, -258, 152, -89, -155, 33, 11, -46, -30, -68, 52, 192, 36, 492, -279, -192, 451, -122, -73, -89, -37, -33, 9]
8079Im2L0JM9r8m1J37l9N5m3kj00j9J38r5j77K59k3pk20J70J0j0J85k34K35j94
8106f6j15L5J72j74J51k90N45k34n1J0k62J98J45j02q4O6K87p9N8j27j89J53p1
8129b4K87q8m8p5R3j20K7Kj75j9J23L17m66M31k83K5j48O7N3O8L4j25J7k6M7j26
8155a32J49j29P2j11O0PK05Q5j14j44J96J2k26L01j10j55oK2j09Q8k6m9J05L3
8179B4mk90K93P5L9R9m30K10L8O7k17N
$$ y = [9, -33, -3, -2, 47, -51, -92, 45, 6, 61, 18, 16, -84, -103, 35, -60, -237, 22, -1, -8, -228, -58, -48, -58, 127, -107, 128, -66, -181, -146, 26, -148, 3, -287, 258, 24, -27, -17, -279, -81, 64, -38, -122, -56, 231, 152, 210, 83, -106, 47, -24, 263, 175, 127, 52, 145, 25, 52, 54, -121, -140, -17, 300, -166, 265, -18, 7, -141, -74, -21, 47, 81, -44, -27, -53, -6, -132, 17, -112, -40, -151, -91, -84, 121, 206, 92, -52, 144, 156, -70, 231, 121, -34, -40, -18, -127, -39, -65, -114, -9, 24, 20, -270, 23, 98, 137, 236, -194, 16, 54, 121, -96, -91]
8191i1
$$ Imaginary data points
##PAGE= N=2
##DATA TABLE= (X++(I..I)), XYDATA
0@%%%%%%%%qJ6j6J6k4L2m0N6p2Q8j04J20j44J76k08K40k80L28l83M45n11N88o73
31c58P66q70R84j112J254j409J579j764J968k190K432k700K991l306L652m030
47b113M442m894N390n938O540p207P950q780R716j0778J1994j3403J5061j7039
61i059J9450k2462K6344l1554L8934n0229O9751j12288L51492j66819m51860O73021
73C34721n13674J03171K83357m46880L25421P1921l11343K57867j54876M7673
83b642J09865k39712J61857N2120j74109J25832k8210j5376Q1020q7103k0442
94c6900Q4549p8039k8831Q3644k0159J3801L284p0600R9944n3854q5060J24579
106C6358m8720K3034K0628j19452J50079l8910j08702J26360p1088N4083Q689
$$ y = [0, 0, 0, 0, 0, 0, 0, 0, 0, -8, 8, -8, 8, -16, 16, -24, 32, -40, 48, -56, 64, -80, 96, -112, 128, -152, 176, -207, 238, -273, 315, -358, 408, -462, 522, -590, 664, -745, 834, -930, 1038, -1152, 1280, -1420, 1571, -1735, 1917, -2113, 2329, -2565, 2825, -3113, 3427, -3780, 4170, -4610, 5106, -5672, 6322, -7081, 7980, -9059, 10391, -12071, 14273, -17281, 21653, -28576, 41175, -71113, 280379, 113560, -338300, 334721, -178953, -75782, 207575, -239305, 86116, 158037, -153306, 104561, -50315, -2642, 107223, -132489, 29368, 81488, -92621, 33211, 5001, -10375, 70645, -16458, -36900, 47649, -30390, -59221, 24423, 4264, 18065, 21349, -49251, 50693, -3161, -88221, 36358, -12362, 10672, 31300, -88152, 61927, 23017, -85685, 40675, -30413, 23670, 32359]
117C2359j50423J73571k7435q8651J04712r1029Q1308N050j45866J49953l4556
128H993l9497Q1663j12947R5864J2495j31134J20192l2679j9070O3275j00915
139e3760Q4944Q672j06067J05562l5787k5864P2390r3389N3254M9493j13725O7437
151A3160K3576o4020N2492m1959P90P8111q9286O178P5048p2242K2609Q82m7717
164d2378J01851n8513o3855J21266o6047j1920N9776r8467R0957P027j30905J25214
176C4006j7933n0213Q7303j01641N2399N2772j41364R4766J2556o2678Q5453q6080
188d0654K3258P5089j12967N5827K0949m9772N6645o6351K1216N9890p8186M6270
200A1214N102l3612M4955o6376K0755N7121o9705L2346J8550k7937K9945m4910
$$ y = [32359, -118064, 55507, 28072, -60579, 44133, -46896, 34412, 39462, -106404, 43549, 8993, -30504, 51159, -61788, 34076, 46571, -84563, 35629, 2950, -16120, 47155, -53760, 31184, 39856, -66211, 39351, 3564, -22300, 50090, -43299, 9955, 59448, -54277, 13160, 36736, -27284, 25208, -16751, -15961, 62150, -27136, -20958, 54090, -18152, 4457, 5339, -42378, 59473, 960, -62895, 58371, -7676, -19596, 40180, -58287, 32670, 39697, -91208, 34006, 16073, -34140, 53163, -48478, 3921, 56693, -84671, 10095, 22651, -40027, 45426, -40654, -17396, 57693, -55274, 553, 21502, -28270, 28375, -37976, -16760, 43130, -35056, 11214, 16316, -17296, 27659, -38717, -17962, 39159, -30546, 1800, 20350, -7587, 22358, -22552]
212b2552P555N3882n1194l6K4356j4234K4107l0574j5124O8252l1223m0217L6381
225I379j6641J8505M370n3914O6608Q191o4519L9031k1180J3151L3848q2769N4834
238H894K7626p0250N6670l3857k58O5818r7449L7915L9260q3154O9618k3199k4334
251b6700Q0740q6435K0169N5419r1597N2366K526l8930P4745o8484k404Q1737
263E3152q1448J5486L1702n0227N9143l3816m9558R0359k7614k7314M0190m0249
275b0194L6802m86p5969P1922J0731m5295M8369m1124Q073M9064q0619K9751M3478
288C4503n0186L0876k1921q229M8034n4779K2974K9479n2004L9944k1415k1927
300b4651O0919n0468N191M9004n1225J1621J855j2953L8834m0482K024M0250l8997
$$ y = [-22552, -14997, 38885, -12309, -12345, 12011, -2223, 21884, -8690, -23814, 44438, 13215, -27002, 9379, -7262, 11243, 15613, -38301, 28307, 36498, -28021, 11010, -10170, 2981, 36829, -45940, 8894, 36520, -33730, 22940, -10917, -11175, 54643, -42806, -4891, 34369, -48785, 20833, -2366, -26700, 54040, -32395, -12226, 43193, -48404, 3962, 6488, -32442, 42303, -26181, -28585, 53152, -28296, -12810, 18892, -31335, 27808, -6008, -55566, 34793, 7179, -20135, 20055, -20194, 16608, 16122, -59847, 12075, 22806, -22489, 25880, -15244, -7171, 41893, -38726, -8975, 34503, -15683, 15193, -6728, -14957, 33077, -21702, 1272, 30751, -21253, 18691, -2724, -24651, 36268, -14200, -9009, 39995, -11230, 391, 2246, -10707, 28127, -12355, -10331, 29919, -9078]
313i078R030n366j5152N4041l0684k7967M5780j7821p844k32j6865M2241p699
326A2384l3196K5542m724L194j127l0282L8169M561l9327K3975j950J195J4490
339A2904l3375K3426J1989l6722K1675o721L24K4200m0814K6746K0945n1655L2813
352E735k882k2164M2043m1507P453M9165n7971J5761K1280l4116L6585k6784j4602
365b2004N8271m4994k963L2467l6498L6698j3240m1170O7922k8109l2431M8172
377B2121l3909J8810J8706n6830M9058M432m7136L4788j8846R033K6907n3509
389b6375L4377J6385m8230L2672j4385m018M0169m8236R449K9680m0952J8892
401e72P40j0390L1208l1493n82K4966l1730J5524M648j4311L0598k6325r882L6203
$$ y = [-9078, -48, -5414, -20566, 33475, 2791, -25176, 20604, 2783, -5061, -5293, -22158, 20083, 12384, -20812, 4730, 6, 3200, 2073, -28209, 9960, 14521, -24806, -831, -2781, -1586, 12904, -20471, 2955, 14944, -21778, -103, -6824, -6500, 17700, -23114, 3632, 24577, -27078, 5735, 2853, -19311, 22732, -18775, -11322, 37843, -20128, -4367, 16913, -17203, 19382, -7402, -22004, 36267, -8727, -11690, 20777, -15721, 20977, 7737, -33433, 34489, 6380, -26051, 22121, -11788, 7022, 25728, -31102, 17956, 22388, -24748, 10040, -8806, 227, 27134, -26375, 8002, 24387, -23843, 8829, -5556, -9574, 30595, -17641, -8192, 21488, -19464, -572, 168, -10222, 20986, -10507, -11089, 13877, -17853, -2329, 2319, -11992, 18606, -7719, -17601, 18602]
415A8602k8308P4J6674j7562K2557j7001k1175M0553j3431p905J3904j8249K7041
428A5774j3147l8051M5422k304j3022K1258k8351K2086J0238n0046K8125J2294
440A0276j4737J8658k6005J3535K2475l9751J7978Q450j8771K3913k5002l062
452a2043L3515k9741R828J8968k6338J3967r235j2600K6196k1740M176K5741k2636
465a942Q962p110j5239L4061k5773j3491L7521j7694J893J247k0219L5440j0079
478G577k8612K3791p232O219J348k6366L5435L253l1351J6705r123L570J4874
491A0088k9815J6839J9337k4695Q162l195n156J7351j9230N140J6520j9892J3385
504D839j130j5999K3161j7045m652K9706k7190L329J8867k1048J4673r479j0723
$$ y = [18602, -9706, -9632, 7042, -10520, 12037, -4964, -26139, 14414, 983, -6922, 6982, -11267, 15774, 2627, -35424, 9998, 7694, -5328, 15930, -12421, 9665, 19903, -30143, -2018, 10276, -4461, 14197, -11808, 1727, 24202, -15549, 2429, 10879, -7892, 16021, -8981, -12043, 21472, -8269, 1559, 20527, -5811, 8156, -1079, -13679, 12517, -9223, -5047, 20694, -1942, 7020, -90, -15329, 18732, -7041, -20532, 16989, -705, 1188, 2435, -17784, 17656, 7577, -21035, 2756, -4476, 1743, 3091, -23275, 12160, 15413, -15938, 767, -8356, -4786, 10088, -19727, -2888, 16449, -8246, -84, -3279, -8435, 8916, -10314, -5174, 11346, -8546, 4839, 3709, -12290, 10871, -6174, -10826, 18880, -8310, -4981, 13886, -7162, 7511, -1968, -12691]
517a2691L2465k2529n719K0084j6306J9121j0280k2075L7509j5154j6885J8717
529F257j4104J8500J928k8543K6604k40j7287R166j2437J4299Q213k4594J8294
542F056L097j4421J2445j5004J741J8044k3663N749J5188j5513R632j906n893
555d448J2272j7931J512J2814j4051J2377j554n596J9428k3781k761K0824k0260
568a1155P665L168r370K4630j7276r843K4513j6894K149K063j6272K8733q446
581C665k0701L0859r604p153J1933k4114J7310J0994l0169K1317N294j2727J6402
594A3306k1631M801K2288l0914J0847J1172j8788K2393j4577q280L0498k4527
606c412p71J5648k1581J4339j483j2344K4114j3046m426J2958j5963N680n80q119
$$ y = [-12691, 19774, -2755, -8474, 11610, -4696, 14425, 4145, -17930, 19579, 4425, -12460, 6257, -7847, 10653, 12581, -15962, 10642, 10402, -6885, 2281, -10156, 4143, 12356, -12238, 6056, 9153, -5268, 7177, -7827, -6086, 11958, -11705, -5956, 9232, -6281, 3351, 1445, -4448, 7824, -10107, -8595, 4219, -9832, 2545, 991, -4605, 14823, -8958, -11719, 9105, -11155, -3490, -322, -9692, 14938, -2338, -12181, 12332, -4562, -2413, -350, -16622, 12111, 3665, -17036, 13823, 4219, -2934, 8999, -15115, 2195, 13189, -16980, 4337, 9631, -3096, 13306, -8325, -3524, 18764, -12150, -1303, 9869, -8919, 13474, -1103, -9383, 21115, -3412, -4183, 11465, -10116, 4223, 2740, -9604, 14510, 1464, -2962, 9996, -5967, -287, -867, -8986]
620h986J9496j0525q866J7409q387l601L523p786J2573k18j6219R741M882l591
634e55Q94r202J0424P099j9530N000M539j513J0550j6406K817J8000j8209J202
648d890M453m485J3620j2162k741J2457j1263O804k360n529J5970j3059P80R604
662G199j5929J0953J691o392J1005j2957N232R314j7764R274K51l353J5710j9982
676e748o45K1667j8656k95P806r146J7717p137j9088K1241l273r094Q591j2388
690h448J3950Q081k6927J4634N961j4431J5652j4796k100K3132k4369M052J5487
703I878j8134J4022k879j4446J6860j3321l28J5840j4768J0747K280j2645J3022
716F128j4764l747K1375j4223J596Q308r232J1838q401j1237J8308n876l304K948
$$ y = [-8986, 10510, -15, -8881, 8528, 141, -3460, 63, -7723, 4850, 4632, -11587, -1846, 3036, -555, 339, -8863, 1561, 8660, -10870, -5870, -1331, -2844, 7706, -8700, -5883, 12117, -6092, -4890, -437, -4922, 8698, -3464, -6205, 6252, -5011, 1793, -567, -6096, 9874, -3185, -2405, 7199, -8730, 2223, 3914, -2478, 8527, -4430, 802, 10116, -7648, 1626, 1877, -1476, 14234, -5748, -6393, 15274, -3382, -3677, 4129, -5017, 12700, 5563, -13525, 7716, 4443, -4651, 3940, -8448, 5502, 13583, -13344, 1290, 7251, -7180, 8472, -6324, -8424, 14708, -9661, -5609, 9878, -8256, 5766, 2887, -11559, 5301, -8020, -8348, 7492, -7276, 3471, 5751, -6894, 6128, -8636, -12383, 8992, -5231, -3635, 4673, -4559, 7279, -1122, -12359, 5949, 73, -3231, -283]
730b83r310J6962j055j5898J6604j985o673N011j5377J0677J2097j5942Q417M827
744H072o866L913j1146J569J1109q548L816L054m290N380p379l55Q407q204J575
759A07L760o112M321k123j85O873p250j31K515n239M710n246N60J3633j2439j011
775c257Q879j1801P481j391j0785J8522n670j0568J1251p231N820J109j4936J8418
789E841k990j2854J3680r813M443J0729k0675J0946R074j7290R260j404l390J2000
803G557j1917L19J0357r787L677N81n375J1294o714m926J1221q015k37O569o993
818b389N343j56n374Q920o084l132P589o875N654K63r688J4693l590j1572R955
833C557m378K248L828j2958J0206N700j1289L286j794L967M130j3463M311O691
$$ y = [-283, -9593, 7369, 6314, -9584, 7020, 5035, -1638, 3373, -12004, -1327, 10770, -5172, 3245, 8072, 1206, 5119, -6027, -4458, 6651, -1897, 1919, 4973, 683, 6063, -1316, -1671, 6736, -1468, 107, 3867, -2245, 2076, -47, -232, 6641, -609, -740, 1775, -3464, 1246, -4000, -3440, 10193, -2246, -3257, 5622, -6179, 1302, -89, -10874, 7648, 1978, -8590, 2661, -4570, 1250, 2359, -12577, 5841, 2851, -10003, 3677, -6136, -1693, 9036, -11639, -693, 8381, -8909, 351, -1053, -4443, 7557, -4360, -4041, 6316, -3471, 206, 787, -4588, 6706, -8, -4934, 6287, -1728, -1965, 4604, -2389, 2954, 2798, -2576, 6344, 260, -2872, 4717, -2158, 3496, 3759, -5929, 8764, 5174, -6398, 3557, -821, 1427, 5255, -7703, 2503, 8203, -3086, 200, -1594, 2373, 6503, -6960, -2649, 4042]
847D042n418K231l949K473P621r302l939N299L10l30j536J473K037j408L48m329
863d377J573N554o654K553L649q426O563J974p149O859l870j645Q306j1621K169
878d542J0112q179O013l381p286J7445j1213q734J7252q147L203L523j7206J5786
892D646L468j6710J2675k351j390R082j6527N028J1609j3995O750N40p675J4654
906I804r244o538J5164j0871J69P813j3404Q312M538j0117J0790m866o307J0223
920E466j0051P99O248p249J1166l501j0351J1790n052l372N001p623Q227K791
934D289j1363O008K658j347Q25o669L615L391o058J455K018K528K774o483r74
949c333M104k083j648J338K117J231j435r69k39J612R41l211J593K047m591K087
$$ y = [4042, -1376, 855, -3094, -621, 7000, -2302, -6241, -942, -632, -962, -2498, -1025, 1012, -396, -48, -4377, -2804, 2750, -3904, -1351, 2298, -6128, 435, 2409, -4740, 2119, -1751, -3396, 4910, -6711, -4542, 5570, -2609, 3404, 23, -7263, 10182, -1031, -9765, 7487, -660, 2543, 6066, -11140, 4646, 8114, -8596, 4079, 1728, 338, 9420, -7107, -2079, 9530, -4465, 2285, 2825, -4850, 9804, 560, -5978, 9186, -1685, -1516, 6297, -7107, 1205, 5743, -4374, 6416, 1550, -4757, 5466, -4585, -3786, 2462, -4787, 6379, 2878, -7473, 4317, -735, -4107, 894, -6729, 1498, 4289, -7074, -1066, 1592, 245, 1070, -5599, -1984, 1407, -4651, -3196, -1178, 1350, 4124, -2359, -3333, 771, -1312, -2960, -1622, 495, 1726, 291, -678, -917, 695, 1636, -1575, 18, 2065, -2526, -439]
965d39K589k486M273j354k987M117o501O34O815n725M061M64m837Q428q791l427
981e166J3067r671P38N479r450R521k92j1720J2592k270o180O519p654N507M309
996E329j1899Q573J265o736P045q496O05J1461j2321K039P779q917N324j699o060
1011f708J0504m106l937N894m440L209n18m662O558k503k753O085n084j74N309
1026B674n183J787J507m466M850Q03m170J692R58J567j548l549M481J112k283
1041B32O31l311M421L826p875J166M353k036q4m496K907N110l304M66l071K171
1057A106M370r908L055N938n436N330m813l183Q574o670Q30L896o581N743k004
1072B47n187P279m180K572M606r801K451L542n649M090p53k690Q298l960o384
$$ y = [-439, 2150, -336, 3937, 2583, -404, 3713, -2788, -2154, 4661, -1064, 2997, 3461, -1376, 7052, -1739, -5166, 7901, -1770, -1032, 4447, -5003, 4518, 4226, -7494, 5098, 2828, -3352, 3167, -4487, 1020, 5329, -6570, 2003, 3268, -3468, 3577, -4919, -4314, 7147, -5174, -3135, 4644, -4273, 1051, -648, -6708, 3796, -310, -4247, 1647, -2793, 416, -102, -4764, 1794, -709, -3462, 2623, -2461, -2635, 2674, -2509, -722, 785, -3681, 1169, 1972, -2198, -506, 452, 2019, 471, -3078, 1403, 2515, 232, 863, -2448, 1973, 5799, -2076, -910, 3443, 1407, 1323, -3173, -266, 4844, 1540, 2006, -1065, 1106, 5476, -4432, -1377, 4561, -875, 4455, -358, -3541, 5033, -1637, -807, 3089, -3492, 2251, 247, -4940, 2339, -1841, 731, 5337, -4464, -2013, 1529, -4120, -30, -783, -3473, 4825, 865, -5519]
1087e519M971o32O74J284o747O378K937q925M951l34J8P948j2133N50R173r092
1103d498L678N16k527J0664p485l985N741n215M116k85m025P554l220j654L734
1118C109n471L969J328m489K523j587O79L392k743J84J469L42j212k873q43K465
1134B42K634k506r45K370Ko83m255J328N165k902j232J19J210K759n097j65K820
1151H64j620J361l803M19O219m977r9K576l814L469k435j614N058l244J853K62
1167D75l616M234l062l14M302n214K990J874m302L948k251p72L928m808J189K735
1183A336k019L088k844q42N046m874p66L535k227K909k67m831N932K29o054L552
1199I03M30j101K863n013K001M955n355J153M25k592N299n326k372Q787n299R4
$$ y = [-5519, -548, -1180, -506, 778, -5969, 409, 3346, -5579, -628, -962, -944, 7004, -5129, -4579, 4594, -4498, -820, -304, -2831, 7833, 348, -3637, 2104, -3111, 1005, 720, -3305, 4249, 1029, -625, 3109, -2362, 1607, 2935, -1554, 969, -618, 61, 3453, 710, 894, 2363, 2705, 1493, -1380, -2223, 242, 2876, 370, -575, 1795, 1797, 1114, -3141, -1813, 3352, 450, -782, -663, 547, 3306, -1791, -1956, 864, -756, 605, -3198, -2779, 3440, -1537, -1636, 940, -2874, 595, -1840, -3454, 1604, -1640, 213, 475, -3141, 1093, -1969, -2283, 2019, -3195, -205, 1669, -2633, 1315, -936, -1708, 2220, -2588, -1399, 1336, -683, 2405, -439, -1281, 3765, -1109, -1875, 1660, -567, 2342, 2075, -2756, 3176, 3405, -2649, 903, 1333, 232, 3095, -1918, 83, 5038, -317, 836, 1261, -1331, 3968, -1358, -3730, 5057, -242, -148]
1215a48L987o993M992k43o521O342j450q37L885n262K571J095m278M527l633r29
1231b895M840m554J578J807l239M461j939l741K466k40J014j229p19M324o87j903
1247f56j389o71L998j131l970K771K938j039j568l83J573J598k279j933J632J483
1263I74M41j362n39L745j199k983J476k022K676K095n187L633P29k760L533m049
1279g99O1L976l906J747j274j475O415m307r42K028l165M968l278m291O971j391
1295A338j318j05l457N968r18m648L310p68J401k08n307L757K755l068N74n72
1311a266K02K053k343k356L637N75j471M83j562J730J425k912J353l45o73L103
1327A633l996O24L289k500K740j500l210M790j754j044J159j414N097k499l852
$$ y = [-148, 3839, -3154, 1838, 1595, -4926, 1416, -34, -871, 3014, -2248, 323, 1418, -2860, 1667, -1966, -2895, 1945, -2609, -1031, 776, -2463, 1998, 59, -3682, -1216, -1456, -442, -1671, -2390, 1934, 1247, -656, -2045, -2716, 1282, 151, -3819, -1048, 1890, 851, -717, -1100, 473, 2071, -208, -2141, -509, 974, 1415, 53, -486, 3259, 2060, -923, 553, -1469, 1207, 3302, -1885, 1748, 2477, -283, 3250, -799, -738, 3238, -668, 1079, -195, -1670, 4745, 438, -504, 1524, -1641, 3327, 49, -4242, 2729, 1338, 20, -85, -3542, 2426, 1508, -3140, 170, -598, 803, 595, -4712, -955, 1800, -1268, -694, -1266, -1064, 989, -1354, -3710, -73, 502, -969, -486, -2048, -318, 1107, -1805, -452, -797, -1470, 1633, -2363, -1739, 1550, -950, 1790, 290, -2920, 1870, 116, -928, 231, -1183, 3914, 1415, -2437]
1342b437M525k258J848k3m910O422l94m417K762j416J680J748m407J647J288j076
1358E82N25k143J499K825l513k9J196r94R04n39j587J957K9k210J125J61j06M19
1376A01n76O2p06K81J249j696K28J347j544J250q12j271L001j520j408J045n74
1393a543K243j624j365L459j874k38J165k530L426K76m548L547O63j986K225k855
1409a559J276K953m171M55K245j227J896k003q16M345l043j057K079k139K666
1424A900j98k978K933j26j310J642k342J267J010k250J633j567N1L161k948j98
1440c20J992j873J034j058k212L440L85k406J153q43J350M65l833J518J724r91
1456d75N91k540R69M106m094q50K701j644J424j168k616M530L51k600J003n17
$$ y = [-2437, 2088, -170, 1678, 1655, -3255, 3167, 2773, -1644, 1118, -298, 1382, 3130, -1277, 370, 1658, 582, 1107, -1036, 463, 3288, -225, -254, 942, -52, 852, 313, -1274, 683, 712, -1498, -373, -212, -318, 101, -475, -413, -1119, -838, 411, -1285, -1057, 290, -1254, -4, -816, -2087, 914, -606, -2014, -969, -1543, 700, -924, -2289, 1170, -704, -942, 223, -2307, 1119, 1395, -3153, 394, 1057, -929, 1296, -1559, -283, 2670, -1501, -1046, 1199, -28, 1868, -135, -951, 3394, 351, -706, 1373, -766, 1900, 1702, -1276, 1657, 1531, 221, 1863, -479, 788, 1798, -452, 1181, -386, -335, 2826, -122, -320, 1672, -201, 833, -225, -2437, 1003, 1388, -1018, 135, -708, 642, 1107, -2726, -1208, 516, -475, 116, -2424, -1455, 2651, -1443, -2293, 408, -1236, 188, -980, -3596, 934, 1285, -1315, -312, -829]
1472h29R25k02k133R81J470J14K33j836N84R66P28j919l38J819N1j01j037r87
1490a511K787K205m207J054n82Q2K274k890p58M844j742j561M0k17K295p48l693
1507b328K512J807j353Q10k481J438L250n132L58K248k124K598j592k511M934
1522B434j547k256K148k797J781J109l022J700N00p14J938l101K96K883k987O33
1538a002L01j417L427j391k275J985n29O08L14k589K749R69k239P11j203J912
1554C31J524m097J418J991j395J232j912J7K784j818q67J525Q8J87m51n58R25
1571I24L12j008J33M20j67N47l83o54J585q79q29Q71j460R82J178j477R8Q59n91
1590D61l22J22n70q8J530j475q53K314j169L78M2k399L061j003k632L038j726
$$ y = [-829, 96, -106, -2239, -1258, 212, 326, 559, -1277, -693, 273, 1001, -918, -1256, 563, 614, 513, -524, -1511, 1276, 3481, -726, 328, -254, -172, 2102, -788, -1546, 3298, 1556, -5, 35, -182, 2113, 1365, -2328, 184, 1991, 638, 1448, -1033, 405, 3655, -1477, -1119, 1129, -995, 1603, 11, -2500, 2434, 887, -1369, 779, -2018, -237, 872, -2150, -450, 50, -664, 1274, -1827, -1531, 1352, -1635, -1002, -701, -2118, 1309, -82, -2357, -372, -901, -293, 21, -2568, 181, 1150, -1089, -378, -1581, 331, 1855, -2242, -824, 1167, -228, 1004, -908, -891, 1893, 75, -792, 733, 821, 1008, 557, -1, 924, 1236, 228, 361, 781, 614, 1161, 778, 124, 1709, 830, 1, 872, -588, 394, 1572, 95, 193, 1052, 461, 139, 261, -309, -397, 1133, -342, -1195, 1119, -50, 328, 370, -2029, 1032, 29, -2603, 435, -1291]
1607a291J262J190m539L850R45m272K901j548j11L227m070J264K587k389R63j085
1623a116m93K570j784m75J459l20O85nk059J730Q94k238J016K48m74K319j692
1640B65q73K093j311N58k67j892L305m47j594J770k396K207J064m101K193P10
1656A284j088J716l163J162L071k761o37L83J70J710k371o74K057K57m58j556
1672h98k98J639M83j607r63K081L17j367n8o97P05J802k969K49J919r37P76j172
1690i95j470L192m42j786Q84n70J324J070l543R80K486j680K76n28r83M093j451
1707H57l406L267j27o47Q39k833J997K817l126M85O45o47K285k737j528L679j087
1724G33K23J37k220L326l9l590K127l19j36J379k523J317J474j546N59j408m93
$$ y = [-1291, -29, 1161, -3378, 472, 1417, -2855, 46, -1502, -1613, 1614, -2456, -1192, 1395, -994, -31, -1116, -1609, 961, -823, -1298, 161, -159, 526, 521, -1538, 192, 1086, -1152, -136, 112, -362, 1957, 265, -608, 1485, 174, 732, 465, -1427, 1878, 1431, -163, 1607, -789, 1418, 2482, -1619, 574, 1284, 196, 1912, -1251, -89, 2982, 221, -416, -33, 137, 1847, -524, -1198, 859, 1116, 658, -898, -1196, 443, 926, -681, -1644, 437, 754, -613, -671, -1368, -663, 1139, -1830, -1581, 338, -599, 177, -995, -2465, 727, 285, -1501, -617, -1187, 137, 1207, -2336, -1356, 1130, -550, -274, -802, -1785, 2308, 857, -2549, 718, 591, -56, 783, -2050, -53, 2764, -362, 123, 768, 121, 2406, -331, -1859, 1820, 733, 956, 1093, -1127, 2199, 2160, -1430, 697, 378, 242, 1621, -902, 415, 1889, 343, 902, -506, -999]
1741i99K769k049m46Q76l43J509q50k187J997O89j615l20k23Q87J022j613n09
1758a405J754o4q93p37j92J960l94j850J128N03L30j00j642R67J245j629J19J09
1776g91K72J187j094j42Q04m4m51k88O31p1M68L16r35P71Q1l10L12j360J359L57
1796A072j441J152L41j357K100j988o91K837j431l80N33p47J350k75j991J672
1812G56O1p16L79j392J332J011k343K58J357j085N94n37j311K831r55k154K209
1829B95o84k5O36k076J354J077j750J031j029M14J656k270M17P93p49J372r33
1846d71j467K356m26r27L96k86R85Q28j992N2J392Mm4j136J23K106j000j155P30
1865F8K41J176p49j885J607J309j299o76J65J021N72q52j223J331J044j558n99
$$ y = [-999, 1770, -279, -725, 151, -192, 1317, 467, -1720, 277, 966, -649, -969, -1192, -305, 717, -896, -1405, 349, 285, -608, -1345, -1537, 423, 29, -1821, -693, -190, 140, 40, -1602, -635, 610, -1019, -900, -791, -519, 668, -426, -568, 236, 192, -259, -547, 84, 13, 481, 797, -138, 633, 714, 404, 716, -644, 715, 1072, -369, 783, 1124, -233, 1867, -121, -812, 2025, 594, 214, 747, 0, 1350, 1075, -916, 756, 817, 101, 480, -912, 420, 1431, -912, -654, 703, -382, 212, -325, -1636, 1195, 240, -1914, 295, -389, -414, 222, -1854, -500, 577, -1173, -142, -1171, -757, 899, -1371, -954, -161, -910, 462, -471, -1938, 418, -8, -935, -539, -825, 160, 988, -1004, -952, 440, 444, 400, -736, -613, 1493, 493, -662, 68, 309, 1485, 736, -1149, 458, 1767, 468, -208, -43, 978, 1550, 698, -525, 806, 1850, 292, -307]
1882c07M78M90Q54j226p04R97j04K48r40r39K178o2j914R35m22R98R28k804J37
1901a179K000j204O0p35j70K349p66k274J132O0R96o0k786J677K128k313M48l04
1919i41K57K244k888o84K640r01L33k83j067K497n89j777R22RL80O52j648N57
1937b87J262o32J44r14Q1J876r69r78P88M13l6r3q06O19J239q92r32j5P65O52
1957A285j291l78O72L54K67j423K89J124J54j319p17J076Q82j455L61K37J79M91
1975G88j447o0J092m08l32P0n84J564r37q44Q7j35J234o82n94Q58M26m41q3m94
1995i22N53M61p43N17o68L86P59p41L23P23m40o7l32K55L48L6r77J023J32R9m25
2016C00m02L91O43j103L63M08K6L85j015M32Q91r41L6m66K10J331r26q40P16J47
$$ y = [-307, 171, 661, 1515, 289, -415, 582, 478, 726, -214, -1153, 1025, 963, -951, -16, -438, 560, 1488, -1316, -1179, 821, -383, -323, -1058, -1228, 1121, 355, -1919, -787, -727, 269, 209, -2577, -900, 1228, -1085, -637, -941, -684, 1560, -1328, -2012, 628, -273, 60, -223, -1290, 1207, 618, -1159, -237, -228, 152, 804, -844, -287, 975, 343, 487, -427, -346, 1530, 561, -417, 371, 784, 748, 655, -151, 468, 1707, 815, -117, -132, 633, 1285, -6, -384, 288, 642, 909, -514, -225, 899, 1053, -266, -983, 93, 975, -480, -119, 118, 297, 788, -659, -719, 373, -35, -367, -297, -881, 683, -254, -1098, -1011, -1146, 88, -594, -1188, -330, 96, -345, -428, -922, -369, 92, -651, -134, -802, -416, 343, -398, -75, 648, 208, 141, -191, 64, 412, 448, -529, 494, 626, 725, 300, -102, 289, 932, -171, 192, 600, 626, 1011, -4, 428, 1319, 378, 414, -52, 158, 1489, 563, -277, 439, 586]
2036E86Qn61m35Q13L56p74m60O97K42k72o07j53O10J26k22o42j66J308k73r50
2056g69LL09O36m41q64M95N89O4q43p68J850k07q27rj67J011L87j752L84J587
2076F68o42k73n45M19J340q64j116P21R09N3n89r34J107R14r62m85M58K45R82
2095A406j183q61J050P36m31o59J72M02O27o33j416Q92J181q13n29j2R26N05j156
2114B04r24Q94L26N2j014m34J722M4j327j80K51O42L44k067J29K218o02p38k56
2133g16K7P06K62j827Q42O04J66k57j512Q75J346j240K08l25M26R69j309l79J038
2152i6J78K84o75j35R32K90r37m27M37R57k52q93P09L57l9m35l17J24J273o02
2172G33j291J000N74l39l97o79J032M60o67m68P5O71P70j860O41N23o04Rl09M2
$$ y = [586, 594, 33, -402, 411, 767, -7, -467, 230, 472, 200, -407, -560, 50, 176, -46, -688, -854, 454, 181, -769, -766, -457, 179, -262, -1126, -631, -42, 22, -821, -1589, 261, 54, -773, -782, -949, 62, 449, -1303, -919, 668, 26, -247, -792, -373, 967, 103, -1013, -292, 617, 670, 81, -853, 254, 1168, 206, -279, 179, 424, 1406, 223, -638, 412, 1148, 717, 58, 230, 632, 1259, 626, -790, 102, 1283, 470, -59, -71, 855, 1360, 204, -720, 174, 500, 552, -462, -896, 826, 870, -457, -637, -386, 256, 600, -1467, -1338, 880, 278, -460, -716, -689, 17, 279, -1548, -706, -102, 64, -193, -1705, -830, 516, -724, -516, -841, -415, 554, -755, -1134, -96, 82, 366, -309, -444, 488, 778, -159, -586, -149, 808, 556, -337, 372, 729, 690, 255, -62, 62, 1335, 733, -558, 442, 1016, 677, 280, -399, 633, 1093, 426, -42, 33, 704, 1474, -386, 255, 778, 174, 183, -126, -84]
2192h4Q78r16k87J37R7M79r22L59m33J037j08j406O66L98o95J049j540J036R38
2211F83k072O01O56p93J518j571j93J891j100J98m06n05J719j44j588M95R32n92
2229b71K53k32q1J191p22p09O34L27K60k32j319J826M0j202N13r6N7J220j496
2248c9j13J123l75O4p16j29J263o44l27j76L88R87j010n01N62J68J57p49p58J579
2268G54j79o44k60k05J293k27j518K16Q20N5k87j127M72J567p35j338O01O19K33
2287A10m06r53P30J085n35p42l34P10Q28r56m58P05P20n56o54l31J171P65j189
2306b90n09Q81K81J72p42n72J601L37j064o09Q09L80L53j098n38J669N03j906
2324c42L13J43R25M88j981K75J261j29j64j515R52J419j348p68L07M09M21m31
$$ y = [-84, 794, -122, -409, -272, -175, 304, -618, -259, -692, 345, 237, -1169, -503, -105, -800, 249, -1291, -255, 683, -1389, -788, -132, -925, 593, -978, -1171, 720, -380, -182, -588, -1093, 626, 482, -1106, -611, 321, -271, -18, -250, -331, 860, 138, -571, 63, 390, 650, 418, -901, 925, 965, -237, 276, 180, 237, 1457, -39, -152, 971, 596, 660, -56, -185, 1078, 434, 107, -69, 319, 1306, 296, -205, 357, 525, 682, -67, -825, 754, 575, -69, -329, -534, 759, 532, -986, -770, 50, 105, -182, -1309, -837, 730, -5, -1343, -742, -123, 110, -296, -1249, -519, 566, 31, -711, -1045, -335, 493, -463, -921, -216, 504, -52, -706, -1037, 134, 899, -290, -799, 82, 363, 535, -207, -779, 822, 1159, 95, -514, 295, 675, 1028, -70, -608, 1061, 1564, -342, -29, 114, 1039, 1527, -454, -179, 1082, 953, 789, -726, 226, 1645, 297, -471, -164, 245, 666, 235]
2342B35j061Q39O36L7j396k65J443l93Q0r04M38R08q46l71M19K33Q0l77q43M13
2362f95K02O09k115J659O30l79K0j031N89R26j42j440J052r8J457k208M12J370
2380H18j024J96n56K48J126p05n05M82M69K36j51m40p86L65P42K00j189L81M48
2399C55K3m8m72J237o82m42O86p26J369m89j534J200m51j22P76l44o48R79n40
2418A27n90J279n75n06j4K28K60N75k424J218R4N35m1j354J119R98j295L89l83
2437c60k03M52m8j574K047j130L90j62j274J892L11p90J188p54m40O34j187J39
2455h69J666J29m92r78j18J584K30j352J63J091o73R69j946J318P23j188J60j75
2473B42L42J000j394q49J476k58k7l95j37P89k45r61J47Q85J69k25j319M27R87
$$ y = [235, -826, 13, 649, 686, -710, -975, 468, 75, 155, -749, -311, 597, -249, -620, -201, 32, 112, -265, -1108, -695, -493, 116, -1999, -340, 290, -89, -69, -1100, -511, 415, 273, -1167, -115, -213, 1244, -964, -552, 818, -206, -10, -566, -318, 808, 103, -402, 80, 549, 785, 634, 194, -592, -227, 515, 715, -474, -93, 355, 378, 330, -142, 1095, 413, -29, 657, -69, 1300, 811, -723, 477, 26, -96, 680, 336, -312, 667, 127, -463, 816, 241, -265, -279, -51, 209, 784, -1640, -422, -328, 207, 166, -1188, -69, 929, -366, 23, -360, -563, -111, -159, -1733, 314, -816, -426, -588, -1862, 30, 341, -449, 739, -15, -455, 179, -1008, -869, 797, 926, 434, -544, -662, 922, 1152, -200, -37, 1054, 381, 1350, -596, 722, 1445, 257, 417, 242, 584, 1584, 190, -659, 817, 559, 532, 137, 0, 789, 544, -417, -270, 615, 784, 559, -760, -333, 654]
2492F54m12l43o6J46Q05q08j251J204M45l04k33q55O44P55n91p82K39J148k00
2511A95q24o29J005P35r98k43M2P05N75j465l37J518r7l53m57mJ231l56r74L11
2531d20N15M75l40r22L69J252k22q87P1N46K45l99r09J072N43l34l44n67O67O33
2551A044j195j05N89M9M66j049L2R08k86K41j207J18J617p30p68J73K86M41n88
2570C6o37O58O25q83l32P3J16M65m58p12O35N14m9o83q8R53l92n36K10J28J99
2591a58J31r29M97M93k48j14l3J06K97p87O64l29N28L68q19p0M55M97n58q1L33
2612B43L12j19j36k15L55K20q62J65L61K20o0k29J27L14j79k67j57N0O26j68q00
2633a99O88J76n99K18n36O02N25r93n70R38o4o9l36k54R44n2j103K67Q2M98J42
$$ y = [654, 242, -101, -167, -21, 784, -24, -1275, -71, 374, 70, -163, -1018, -374, 381, -210, -992, -753, 395, 195, -629, -1258, -253, 482, -516, -759, -717, -12, 563, -902, -1239, 279, 182, -171, -628, -632, 599, 243, -731, -420, 95, 570, 230, -692, -323, 929, 707, -180, -109, 437, 682, 283, -626, 446, 989, 655, 311, -256, 411, 1044, -151, -256, 333, 382, 848, -201, -169, 739, 453, 694, -513, -395, 1222, 492, -276, -103, 183, 624, 36, -601, 57, 682, -201, -533, -460, -344, 121, -337, -1049, -414, 100, 51, -632, -720, 233, -159, -695, -485, -357, -158, -27, -956, -459, 34, -214, -328, -361, -255, 42, -745, -81, -410, 118, 486, -333, -403, 52, 549, -9, -90, 243, 555, 436, 300, 85, 440, 660, -202, -37, 324, 544, 484, 255, 382, 696, 517, 250, 93, 143, 769, 601, -199, 489, 665, 66, 284, -252, 350, 875, -118, -688, 250, 186, 117, -219, -473, 471, 419, -684, -417, -335, 163, 305]
2654C05j238O61N76p19K66n11O9R81r11j70M32k8L05o82k39P05N38l56n86K54
2674c48O21R9l93p32R17J23j20p80J52R63J43j190L03O99J87M0j266O08R60o04
2694C82m68o7N25O17m43o53L94O74l19m89l80O52N79o25m34m5N29K35q89l64R00
2715C11L82n77j22k55M27L88r39j80P83J36j85j062j30J291k38o97k45N07O71
2734B66j16j285N83R15n30k01o01O56R41j091m36O25L92K3o45m94J060M95p32
2753a75o37M84N74M78j056nJ166n63k8j72m03J179j68r37L39L09K43m51k57M42
2773C62M72l95l66j15N73M12q04k37N95L03k52n62J29N22j26m78k84K10L93l11
2793D1k08k41M76N16o80l55N37j21n3l37KK61J4k38l72N20L42q30J18K91J24P0
$$ y = [305, -933, -272, 304, -415, -149, -660, -591, 390, -521, -691, -259, -287, 18, -664, -903, -198, 340, -16, -602, -348, 273, 372, -21, -753, 164, 287, 167, -613, -461, 502, 645, -545, -242, 457, 644, 684, -582, 26, 986, 382, -86, -153, 372, 989, 546, -107, 287, 961, 642, 153, -227, 425, 1004, 379, -55, -100, 429, 664, -225, -589, 311, 693, 116, -6, -261, 166, 554, -385, -565, 218, 354, 169, -893, -1023, 268, 30, -667, -912, -405, 266, 150, -1135, -552, 363, -167, -368, -969, -313, 628, -463, -899, -274, 118, 141, -504, -998, 62, 557, -175, -812, -328, 246, 724, -332, -337, 829, 266, 238, 66, -337, 842, 674, -263, 76, 385, 628, 177, -80, 362, 834, 439, 73, -42, 531, 943, 139, -98, 497, 800, 548, -14, 115, 637, 511, 33, -251, -41, 352, 41, -167, -408, 68, 584, -96, -451, 86, -35, -88, -425, -423, -162, -148, -386, -758, -238, 104, -726, -608, -317, -193, -123]
2815a23m62P0R8J02m8j81%R53q30O09j106J202P66j119M02l09J189j352j25R3
2835a71P97p8q3q57O77M37n71k43J40L04M92q97J63K26L58j59j82m8K88j74m11
2856Hl8M51K49n41j94L58J27k00p45P63P8Jn19l6K72M83m45m66j42O74j29k15
2878b06p18Q47M80p06m95O80J21J90p29m77Q07N12K4j247L41J244L8j232Q5K74
2898a67O0K07r38K01J248k42j024N22K14O21o47p53P74O14j36n11l15L05P76n49
2918B60l91M73K16L89j031l42R26J39k0r04K99P42P7n99l07K27R00r88m39N06
2938A33M20M6o44k80M16N44p89k44r6Q52k2p34m13Q28M19n92m55J7Q38o7j001
2959h24O46q1K76l8o16O9O75k10l10k77M56M60n57k66K97O84k57n44j64Q68j16
$$ y = [-123, -585, -515, -417, -315, -363, -544, -544, 409, -421, 188, -918, 284, 1050, -69, 333, 24, 1213, -139, -264, -171, 626, 548, 465, -392, 285, 722, 151, -92, 48, 352, 844, -53, 110, 336, 694, 535, 353, 305, 593, 419, 8, -30, 421, 670, 129, -65, 293, 420, 220, -525, 238, 316, 317, -202, -238, 34, 517, 72, -394, -536, 138, 9, -206, -924, -77, 403, -303, -798, -118, 3, 193, -536, -1013, -206, 306, 330, -917, -576, 668, 706, -526, -441, -167, -107, 100, -838, -637, 611, 369, -655, -133, 81, 702, 55, -698, 76, 690, 554, 43, -272, 33, 809, 260, -131, 342, 558, 947, -84, -426, 500, 639, 619, -285, 14, 756, 833, 234, -73, 154, 1054, 66, -373, 133, 553, 599, -45, -325, 91, 635, -154, -398, -494, 358, 336, -398, -811, 17, 436, -156, -611, -594, 244, 177, -824, -178, -259, 17, -21, -637, -568, 107, -103, -413, -690, -234, 226, -331, -597, -300, 384, 127, -417, -581, 287, 171]
2980A71J9p90M79O48j69n84R0L89R4R0o40N05M10o6p08j8M27K84q3n69K8R62p13
3003B56k7j76K21J78l44k89P59l79l4j39n4M98r0n17j0M08J18l5n71k05O33k55
3025e4m33J88p8K14j7o80O46N50p98P8j01K16K14l72j69O48k63K9ll19P0L93n18
3048e59j4O83j4l57k60L26N59j77l25m8J68M62j74o45P15K3j38j32j49M77M41
3069H62n92k41J58L48K4j023P01M58k14k67k57M7O46m21m76N8M03N38m26n37K87
3090G6M18o69J57m01L99O17p96l70M10L04k03n50j56J033k13m49k21M16K01j42
3110a39n89K21Q10k70l72k24L75M49n09o50L81O69M1l31m67O57N09o55n40Q9O88
3131A43K99m94l96N41N43m18p29K72O99J66l63o54P71M75o42m19M57K93K01o99
$$ y = [171, 190, -600, -121, 527, 358, -226, -136, 253, 347, 437, -203, 302, 712, 646, -62, -80, 347, 631, 548, -21, 7, 969, 256, 229, 53, 274, 452, 108, -181, 578, 199, 165, 26, -28, 470, 380, -137, -147, 261, 379, 344, -227, -432, 201, -54, -487, -299, -377, -163, -180, -860, -214, 336, -462, -384, -485, -269, -55, -427, -596, 52, -211, -182, -185, -504, -434, -41, -559, -573, 110, 96, -261, -521, -195, 364, 187, -138, -186, -18, 444, 270, -375, 340, 363, 225, 93, -56, 421, 862, 270, 29, 187, 535, 559, -464, 237, 695, 481, 214, -43, 4, 650, 229, -247, -189, 214, 752, 326, -211, 76, 494, -175, -18, -419, -20, 597, -199, -569, -159, 145, -58, -608, -764, 269, 56, -393, -614, -198, 3, -139, -728, -507, 303, 33, -339, -563, -188, 261, -248, -898, -517, 152, 193, -138, -605, 52, 561, -94, -634, -545, 143, 442, -52, -448, 93, 636, 218, -511, -239, 460, 626, 263, -391, 380, 855, 213, -206, 251, 544, 745, 46]
3151D6KK68L82k41n67K42N32l5r45J10L85L58k73p01M50J41J56n23QL42J92k81
3173D8n72K02M01M9o26K06K79r6j97J7k56M48L27r28K31K28M57l39r53P66P40
3194D32o04j33j47M34M23n09l12K93M26l43n2k90K50K10j98J49N5M31l69j18p3
3215d5N31Q0o26L31J29M1nl85K01L74m28k1K00J15R6k56l34K82P7l66j90L90N7
3238B48J45o70R7L00K16j16m10rK92j0n84J49J65K75J7o97J70J25J66m07K16J24
3260a98K31m88j84M96N5k00n8k38O96rl70n7l2M00K01p72k1O40K22m13j51J60
3282i0N15q6o67L97K32n6j26n84M71O90n61n32K48N98J38m30m19Q01O4l22q5n24
3304c28P25K63p67k84O80O8O7p65J92R13k82p33J60K47J19k2q65M60R10j130J54
$$ y = [46, 48, 316, 698, 457, -110, 132, 664, 629, -316, -206, 179, 537, 264, -437, 13, 154, 310, -213, -205, 137, 329, 48, -524, -322, 79, 128, -498, -292, -13, -109, -306, -289, -545, -97, 230, -698, -467, -239, 218, -121, -1074, -308, 432, -172, -305, -452, -18, 405, -104, -416, -123, 303, -40, -92, -382, -132, 78, -120, 29, 84, 515, 146, 28, -45, 486, 566, -60, 271, 400, 441, 436, 51, 252, 626, 198, 177, 377, 492, 588, 332, -2, 280, 357, -9, -199, 191, 248, 393, -277, -180, 120, 336, 220, -190, -199, 93, 83, -501, -352, -187, 88, 105, -592, -422, -297, -131, -538, -322, -198, 33, -455, -639, -143, -88, -288, -346, -584, 112, 103, -267, -324, -356, 44, 245, -527, -548, 92, 314, -99, -250, -90, 425, 339, -328, 69, 301, 245, 119, -465, 6, 696, 135, -397, -149, 449, 587, 157, -262, 539, 603, 281, 196, -328, 397, 660, -107, -391, 289, 357, 424, -341, -149, 764, 482, -251, -91, 156, 275, 253, -612, -152, 758, -372, -218]
3325b18m83N07P13q03m97M21L49l84J89l35M20K75o6k41M80p31J189j412N75n28
3345e80O67J65l22MK24K86j055R01n63R41N65j315r60J851p01m46j68O54O69j095
3365b78K30j62Q52j14l60n47N41M32j60m68jN45K34j064K35L09k29J00k95m16
3385f16Q34R11j236k55O81L58r87l01L35J8M29P9j010M12O38o85RJ98M60r05K65
3406c68O5n8J50pNk32L96%p13R8N83R4k31k73N51R8j25m51K0K58K15j63m35K66
3430b57N66m69p4J62K16K08l54k13M53K16k96j65k0L74L4l64RK94K27k65l14K35
3452B03K64K66o92N6K18K51n15l73O59Kl15k34K47K19J85n77j89L31L24m71l22
3473d63J33L32J39m33j14L21L55j94n30m7M74k73l45K49L74J38n17j46L65M93
$$ y = [-218, -701, -194, 519, -284, -781, -360, -11, -395, -206, -541, -121, 154, 88, -153, 327, -404, 785, -627, -52, -580, 87, 252, -70, -66, 158, 444, -611, 290, -273, 668, 1233, -82, -1042, 809, 108, -338, -506, 148, 817, -278, -48, -210, 642, 528, 168, -379, 162, 594, 434, -34, -35, 510, 744, -320, -85, 224, -5, 95, -200, -616, 218, 1129, -107, -362, 319, 677, -310, -611, -276, -258, 171, 250, -760, -348, 290, -395, -386, -188, 272, -633, -368, -303, -361, -211, -218, -213, -445, -49, -49, -762, -664, -81, 13, -218, -491, 60, 158, 33, -418, -398, -140, 75, -88, -523, -257, 309, -160, -234, -72, 144, 352, -2, -215, 238, 454, 158, -7, -27, 347, 381, 17, 26, 320, 547, 282, -32, 203, 467, 733, 41, 97, 315, 566, 51, -322, 337, 339, 24, -210, 37, 256, 441, -136, -325, 6, 330, -141, -463, -330, 2, 141, -292, -406, -85, 270, 76, -454, -501, -27, -300, -645, -396, -22, 116, -401, -547, -182, 311]
3493C11j51o74J80K6K87l7o42L14Q56m85l31p5M91L68l42m08M79K57k17l47j67
3514c07Q88J80n89l74L12K51R5m18k73P51M90o61q12L89O55k96n81M27N42J0p09
3535c0q41J295r9K98p08k13L58L79l45j179J116L13l02m16l54Q65L5m19n1R1L41
3556A34k75m52J13O58k33j72k55J57N25k05m87K20J69M03m56m52M26M52m97k01
3576d28n9O03R2k69n00R52j45N5k17j66L58O0l98j40J84K74Q6n85M91J38k37O4
3598B13o6J00K64l64l22L30N19j20j13n02K11L81k86l75j1M46M4m09n93P46N04
3619E97r73L49m08K27L85q45j92O08N19q1j039P9Q3M00J0p8O07j09r96M10R32
3640D85o03p7m71M45J031p3m61j188M75K32K68k60k31N45J86m64o5K84J37q2n03
$$ y = [311, 160, -514, -334, -308, -21, -58, -700, -386, 470, -15, -346, -421, 70, 438, 96, -312, 167, 424, 207, -140, -307, 581, 761, 172, -202, 110, 361, 456, 38, -235, 516, 1006, 345, -467, -78, 577, 281, -300, 127, 669, 679, -30, -871, 424, 325, 623, -85, -298, 60, 439, 94, -1085, 31, 344, 42, -374, -728, 137, 172, -247, -298, -207, 134, -141, -593, -480, 178, -55, -227, -482, -325, 200, -5, -492, -272, -103, 300, -156, -608, -182, 270, -227, -428, -487, 116, 208, -61, -561, 391, 246, 301, 84, -82, 276, 336, -62, -202, -18, 256, 342, -243, 248, 386, 149, 213, 147, 247, 511, 147, -175, 155, 674, 554, 441, -61, 150, 531, 245, -130, -141, 305, 349, -60, -653, 93, 597, -376, -27, -435, -208, 177, -668, -860, -252, 267, 186, -853, -774, -691, -291, -281, -359, 248, 139, -857, -447, 485, -118, -195, -666, -221, 810, 737, 276, -912, -437, -205, 63, -197, -428, 117, 303, -161, -226, 58, 195, 113, -390]
3661c90J20O63k81K0j21j25M98l75l5M98K6q5l27J44J42k15j67m9M33J83m87j72
3683a02Q4M09p1k98k79K81K16k61j40j08M47J05o30N5K31P4k71j54j53P29l22
3704a58j86j0K50k33P2p48J348j80N04o76J87j53M13q44p45L39J025n96K14K23
3724D6m00J356j062K19m72M84j19j80k91M47K69k52k54N65J27j66p89L52L93M61
3744G34n02k70K73L95m03n39L55K40K53l01n52L75P45m78m19r6M93L02n60k84
3764b39J87M93l31k56j73M63J28m54k44M69L09l31n24l4M75K99n73m22O22J63
3784B7o7l77Q5K92J11l16k05J55O15m58k30rK62J52l32k01M61K66k93%j41M34
3806B31K3j53k25J15L55n7n60J34L08K14n34K12J35J98K4n92K44K88j05j14k43
$$ y = [-390, -270, 393, 112, 132, 11, -114, 384, 9, -26, 472, 498, 413, 86, 230, 372, 157, -10, -59, 374, 557, 70, -102, -18, 391, 320, 22, -257, 24, 240, -21, -161, -269, 178, 283, -347, -292, -61, 13, -258, -412, -565, 164, -158, -344, -354, -104, -337, -265, -1013, 335, 155, 659, -17, 170, 17, 430, -414, -1159, -820, 205, -391, -177, 46, -354, 1002, -60, 159, -313, 171, 52, -128, -419, 28, 297, 45, -209, 356, 483, 317, -472, -120, 273, 734, 232, -38, 235, 630, 227, -312, 43, 283, 536, 235, -317, 58, 803, 325, -94, -190, 303, 605, 45, -239, -52, 441, 110, -146, -319, 144, 272, -182, -426, 43, 352, 21, -503, -537, -62, 237, -336, -758, -136, 27, -40, -417, -332, -40, 71, -245, -450, -295, 320, -138, -368, -377, -115, 37, -295, -496, -35, 231, -62, -62, -203, 231, 254, 101, -124, -9, 346, 289, -271, -137, 171, 385, -149, 63, 198, 396, 420, -172, 72, 360, 255, 141, -102]
3827a02L25M8K8m99M75J58j95m9j04K2J02j35m04M80k49L01l67k28Q17p0o05K26
3849b5k57K55k7j84p4P2J54k02QJ10K55m42Qo2M96Jn95j8L65L71k85l45K43J23
3873e5n6k65J83M05j05l36K51k96O66l06k88K12L71k4n33J41J05O52o39l09K33
3894GM39J40o28n6O81j32l81j06J96P4K84o50n5O00j1m77J71k12N71k92m55K65
3916b7J23K65l48k89K36P0K73j89p22O37K91o45K2J93J27n5m38k0K88N34o13l81
3938f68M21N03l02k92j44K90K50J42q46M40L52j88k58K9J24L04K7n92M28j86L55
3959A89n04O5P27K34p57k5J30N54k33k89j64M05L15p21k12M39K75O6m37nJ89K55
3981D96n30j15K13L21j74k00j97K96K42j63l35J86K92Jl94k32L19K47j86m43L11
$$ y = [-102, 223, 271, 299, -200, 275, 433, 238, 189, 85, 107, 209, 74, -330, 150, -99, 202, -165, -393, 424, 354, -251, -25, -282, -27, -54, -238, -312, -240, -86, -288, -280, -170, 85, -357, -349, -411, 85, 86, -509, -527, -162, 209, -76, -421, -178, -55, -111, -376, -193, 212, 107, -229, 22, -274, 392, 86, -202, 10, 381, 357, -176, -35, 70, 722, 83, -226, 7, 446, 586, -42, -98, 583, 451, 70, -36, 160, 234, 518, -132, -187, 413, 402, -75, 96, -116, 455, 163, -292, -27, 96, 361, 13, -276, -40, 30, 303, 114, -608, 29, 320, -325, -303, -110, 17, -38, -476, -496, -208, 326, -287, -668, -247, 256, -46, -338, -482, -192, 58, 200, -646, -206, 146, -42, -300, -271, -147, 157, 184, -408, 20, -166, 189, -315, -250, 477, 711, -46, -71, 59, 613, 380, 91, -73, 332, 647, -74, -286, 153, 428, 494, 57, 52, 241, 496, -34, -149, 64, 385, 211, 11, -186, 110, 352, 189, -146, 40, 332, 333, -61, -293, 26, 273, 87, -356, -45]
4002d5j4j56j42Q5J65M1k29n6L47j42K52o88J64L35K70n24j25K84J68J22m76K17
4024a47K75k09L3j28K07L04k55J6j10K91k82j57K0K41L35l24JJ3J69j27R5p2r7
4047I2K9l06K6K98J25m13K96p6J95J93o05J64K02q1O5l81j0M92n2m31Q4P8L61
4070C45l54l09L45L5J00l17j73L93L8m05o9J48L91n44Q1l0L93j89k1k27L77k6
4092a8k81P0k47K70J08j34k29N49O7m4k97k70R09k53o6k57K23J43J38m25L0K49
4114B35p9l28R8M13J09l52k34K26K17P3m46j48M85K86j99m41R5L56l2m66p5P36
4136E29M5p57r2L06K29l83j4m60K62N77j87l27j8L73J45l36k70L05J34k52k78
4157d69Q9L94n4l88J18J37O84j330L80L05L44J13q76m00P95N25r45l1Q02M88j126
$$ y = [-45, -59, -215, -357, -272, -107, -66, -295, -351, -4, -146, 106, -582, -418, -83, 187, -337, -462, -178, -10, 112, -364, -147, 128, -81, -48, -176, 31, 335, 80, 96, -14, 277, -5, -162, -142, 99, 434, 110, 111, 124, 293, 166, 261, 189, 92, 121, -185, -159, 139, 264, -149, 147, 71, 266, 459, -146, 18, 220, 139, 204, -177, -187, 305, 253, -178, -94, -16, 345, -9, -318, 27, 62, 162, -155, -328, 65, 103, -302, -371, -223, 168, -376, -295, -325, 68, -121, -142, -369, 8, -18, -299, -229, -476, -206, -98, -232, -461, 88, 155, 111, -186, -456, 453, 200, 134, -123, 100, 243, 381, -44, -14, 235, 156, -172, -74, 339, 448, 96, -138, 88, 305, 378, -68, -216, 269, 555, 356, -85, 10, 366, 334, -132, -207, 529, 574, -183, -275, 31, 260, -123, -137, -597, -335, 242, 55, -272, -290, 83, 228, -108, -378, -73, 61, -191, -469, -380, 14, -40, -428, -310, -173, 511, -819, -439, -134, 210, 323, -553, -953, -158, 367, -578, -609, 193, 681, -445]
4178d45N4r0M76J78j41j54J89L10k70k43J54L87j34n6k66R9K99j00n12J89L50
4199B74J2j53m80L70N99l10j33l55L96K81n07Q3k20M83J17q70k5N02M56o37l57
4220d74J82K46J01n73L69r7l5L35m10J42N50l81j67O0k0j25n8R6j06l8J04k32
4242e31O63J9l03k67K41OK34M18j238J65P36k9n00K04L33k66j37m0L73o2N81n56
4264D4l08J00L21l27j69L83K55N03n15J43L53o36K91m4jJ09lr45J108k95p1L75
4286F71J1l27m22R88j059M9J039m79o87Q34o33P03m22o74N54J09q3m16J6K69P13
4307G54k40p16m13N22J113j831L75k43R57o53l50P86%k08m66K54N28N48o46m75
4327d04J36N10o4n19L01j33M68l72o2P3O35n18k62P6L95K66p04P8K38K43n28L
$$ y = [-445, -391, -481, -5, 173, 32, -122, 67, 377, 107, -136, 18, 405, 271, 215, -51, 48, 347, 247, -265, -76, 274, 286, 133, -347, 23, 622, 312, 179, -176, 220, 501, -6, 77, -143, 340, 457, -413, -438, 64, 520, -117, -474, -292, -46, 55, -518, -149, -246, -281, 54, -356, -214, 336, -45, -212, -152, -172, -297, -355, -259, -365, -403, -299, -531, 132, 151, -152, -419, -178, -172, 62, 480, -758, -593, 143, 114, -386, -182, 151, -115, -252, -292, 81, 19, 600, 44, -264, -164, 157, -170, -339, 44, 299, 802, 287, 430, 783, 147, 438, 394, 393, 502, 499, -446, 662, 367, 296, 671, 682, 355, -67, 921, -138, -89, 950, 471, -216, 618, -15, 688, 266, -408, 146, 255, 172, -244, -228, 41, 754, 514, -202, -615, -93, 1020, -811, -436, -679, 278, -375, -725, 61, 61, -147, -613, -359, 169, 717, 71, -404, -268, 242, 178, -341, -40, -173, 295, -77, -139, -66, 569, 51, -211, -135, 260, 526, -178, -100, 138, 381, -147, -144]
4349a44K46O1K87k57l91M03R2J11p32K65N50j94m07l8L06K95l87m87L49M46j28
4370B46k93l36L31J94l59l2R5L04J24o35Q0K41K63k93l30K13L52j22j96l27L92
4391h8oL5l85K49M05l25k38J04Q4L09k61l07L88PM4j68j3L3N42l91j41K17%L51
4415D45n95K54L44j58k36q2L25j58K5r4n5j51M10j73kL1J29ml19J9L78J58l07
4438A84k71K01J56k28k78J97K18r6l19K52j05J35j9J59l99P3K6k14N1M9J18l1
4460a41l39L43N7k62p8K79J00J03k48k90M95K7m42K25m9K00k39J01j41L91L13
4481D05l41j04lK91Q3l47j45L39K95m08j3J35l5K57l78j74L26R3j32j27K85J35
4503D37m49l9k8L34o1N5o9n3K17r0l46j77L67L2j85j69K84Q2k15j99o3K30J73
$$ y = [-144, 102, 163, 450, 193, -198, 205, 297, 408, -324, -59, 491, 297, -110, -148, 158, 453, 66, -421, -72, 374, 246, -47, -383, -52, 142, -217, -249, -154, 150, 274, -361, -281, -40, 223, -70, -400, -187, 165, 43, -153, -480, -88, -94, -59, -444, -195, 210, -115, -353, -249, -165, 144, -117, -424, -36, -29, 15, -153, -166, -133, 409, 18, -123, 94, 94, 445, -150, 104, 448, 290, 54, -28, 297, 139, 164, 70, 15, -136, 274, 101, 99, 130, 259, 255, -64, -45, 333, 491, 184, -87, 114, 270, 42, -236, -39, 179, 83, -236, 16, -89, 46, 27, 186, -213, -140, -114, -328, -277, -228, -110, -141, -480, -137, -80, -342, -420, -141, -41, 62, -186, -476, 19, 46, -396, -171, -220, -20, -259, -158, -299, 92, 405, 64, -40, -43, 248, 331, -16, -161, 178, 473, 65, 52, 187, 152, 409, 31, -143, 183, 276, 144, 17, 302, 437, -12, -51, -79, 255, 194, 249, 180, 127, 344, 254, -92, -269, 98, 130, -55, -224, 60, 142, -73, -272, -335, -105, 68]
4526F8l52j5K14K24k5n62J75J17L76n85j11N41o9j69n2J1L33r9k04k5J62J11j27
4549f3l28K96M29k04m9n78O71Ok88p1J25M55j81j78k02L45J0p2k28j55O61n02
4571a01R1J77j47L13k22k05K69M33n95J79n13K03K92p73L17L80R3j71p9J62K61
4592C64k3m27r7R3L39o7m99J29M4K07j10l05P4K83m0l44J7J07J95M8l16L87j95
4615a36J75k75j31L33O9j64j89J27O8J55k2k72M63M6k79J4K55Q5k42k6l35M54
4637A73M4k72rj71k2K40K06l72L50M5l67P5j8K75j41j71q7M71K3k36J74K1j5k94
4661g8j68O48l40l06L35K2o5J74n02J57m4M51k46j40K6m8L03j58k79J3N33m84
4683a96j98J29K43q1j93L3M3J73j41j45K46L9L7j96l8J44J47j80N2o6M90k48j43
$$ y = [68, -284, -299, -85, 139, 114, -448, -273, -156, 220, -365, -476, 65, -4, -173, -225, -214, 119, 20, -184, -209, -47, 64, -63, -391, -95, 334, 130, 81, -497, 174, 180, -108, -179, -54, 401, 220, 42, -160, 185, 195, 123, -105, -260, 401, -101, -10, 167, 20, 333, 111, -94, 175, 608, 13, 192, -321, -118, 174, -599, -282, 98, 191, 20, -59, 103, 364, 341, -86, -183, -90, 249, 182, -317, -188, -144, 63, -47, -352, -278, 5, -35, -379, -362, -255, -60, -12, -328, 59, -136, 39, -236, -367, -34, 35, -129, -318, -191, -123, 32, 10, -262, 201, 247, -32, -18, 237, 322, 80, 54, -281, 173, 217, -55, -64, -235, -257, -17, 189, -183, 167, 212, -155, -80, -98, 177, 36, -135, -222, 249, 272, 36, 210, 231, 216, -78, -246, 402, 62, -244, 91, 113, 48, 222, -280, -123, -167, 284, 38, -102, -76, -124, 179, 21, -258, -245, 288, -196, -394, -265, -22, -103, -296, -263, -220, -47, -188, -333, -87, -48, -11, -207, -245, -101, 46, -134, -82, -148, 342, 94, -49]
4706d9k18M15K76j05n14M36K75l67k1k25J67L05j78j28j54N00k1m49n1K26J91
4727C11j12j76K85l9Nn67PK91J73k30l27M52K72mm22j04J49K38k30k70J96K97
4749A95k19k17k79O94j8j16l43j17M57j05j07J41J5K91k10j98k2L73k25k08j39
4770c57M46k2l39J30j32M65k80l2N2M38k22j91l81M85K13J9k32PN96n93j29J46
4792H7m6L44j0k90k1jJ54j36q2PL81r5k19j03L40k4r2Kl44L13l26M0K23K96n16
4817a18K13j48J56J94l59k93K64N6r1r3pJ87R6j12j98M3P4O8o4j19J46O2l23K20
4841a46k04K28J23k99L85Oj51k68J00K19k6J53j38LQ4J37j76l41M37k1j34j52
4863a81L27n5p5K4k4J13L25l15j1j20K69L0l56j33M37Q5k84m7j37L21k84K60p1
$$ y = [-49, -267, 148, 424, 319, -195, 241, 516, 149, 128, -97, 70, 375, 197, 69, -85, 415, 394, -55, -106, 120, 311, 199, 23, 308, 269, 274, -293, -286, 5, 178, -52, -379, 73, 345, 341, -81, -185, -36, 202, -28, -298, -102, 195, -24, -241, -520, 174, 156, 40, -303, -420, 37, -68, -175, -34, -19, 272, 62, -136, -158, 215, -10, -218, -357, 89, 67, -272, -142, -274, 191, -89, -121, -69, 369, 147, -44, -425, 60, 273, 292, 60, 67, 663, 70, -59, 87, 41, 385, 375, 85, 64, 63, 217, 81, -1, 6, 387, 292, 73, -30, 310, 286, 194, 196, -148, 165, -161, -121, 102, 398, -118, 95, -53, 103, 297, -62, -355, -91, -35, -126, -219, -226, -39, 57, -55, -253, -210, -136, -68, -132, -251, -105, -43, -366, -146, -350, -122, 1, -298, 87, 93, -58, -326, -226, -7, -33, 120, -18, -15, 69, 206, 30, -311, 126, 105, -29, -181, 146, 91, 16, 40, 16, 129, 454, 139, 128, 8, 277, 307, -49, -182, 255, 340, 56, 9, -128, 193, -91, 169, 98]
4886I8J13m2k84K98O9j64q3k3k45L82j35lm00O20j48l09J61J66ok51Kk34N62R7
4910B41l21j02J2m2J9j78j1Q7M79l47Q7j63P30n85n0K17l3J14j93l35M94J01l12
4933i1n5j65N07q5j32j32K29L07o1l36q2M72k63k1j48J60K41j45k67j9K60n7k4
4956I3j67L47J75j77l58P3K93K2l35J23j95K87j67j57l36M51K61k94j80k12L93
4977f0J29k28k6L51l51m0n0K12k8Q9p6j32K25J47j84m08L38P0J83k77j55L92j
5000A20q1m39K21K49J89m35L26K28K58k61n25L89m36K67n72N99j57m28L47K21
5020H0L98l04J41l43k6K94j19m19K70k09J94J76p9r1L55m18J72k75M59p1j30j92
5042a37K68K04l15R4n09L08L17l80j88L13J62j84l45j3N11k5k57k77L88J70O2
$$ y = [98, 211, 169, -115, 183, 252, 88, 5, -18, -263, 119, -16, -19, -419, 201, 53, -256, -95, 71, 65, -186, -184, -418, 144, 241, -80, -182, -170, -212, -193, -371, -382, -295, 184, -163, -76, -239, 491, -94, -144, 73, 40, 154, -39, -374, 120, 221, -91, -146, -311, 196, 111, -21, -153, 76, 383, 322, -14, -96, 376, 113, 92, -56, 104, 345, 200, -67, -86, 174, 117, 93, -74, 273, 448, 271, -87, -14, 279, 301, -34, 89, -106, 181, 14, -143, -479, -28, 233, -61, -241, -453, -60, 69, -159, -185, 166, -185, -225, -275, -63, -91, -2, -78, -210, 15, 162, -22, -430, -92, -22, 161, -116, -271, 121, 120, 39, -400, -179, 70, 259, -176, 150, 378, 636, 375, -150, 239, -197, 70, -502, 97, -60, -488, -141, 80, 478, 174, 315, -28, -54, 240, 121, -298, -28, -237, -43, 133, 54, -37, 318, -100, 72, -203, 256, 185, 55, -137, 131, 335, 20, 114, -395, -87, 230, -150, -338, -25, 137, -47, -392, -405, 106, 81, -176, -453, -65, 105, 167]
5063A67m96L99J17N3l62j64L73l22J36J75j53N5j18kJ4J71m5J91k83O7K23N9k80
5086b5k18N10joj96N2K23q6l99J28L62ln74L02j18L57n13J19r5M73K50n34j77
5109a69j4M74l23K57j05K39r7j70k54M17k43k2l9n9K95m5j02k52J14K92k76j64
5131b46K56j74J07k04n9J64N16m91j87k6M99l74o8K63K29k46l85K28L38N0q6m14
5153c10r5O27k83j6l12K86K82J81l92n4L92J02k46j4j45K03j0m30J18J98J14l39
5175a43M5K81P3m13M82m45K70M16n43r0m12P50o0j37n86O39p6p21O36j63l12N81
5197G2j159J087J59r8m32M25K69n35K11m12k23J041l54r9M0n04M26O18m41o4J30
5218A57m51K8K97n01M71L62r28K36N50m8n24K51p5P8J16L83j11Q6j62p49Q90j13
$$ y = [167, -329, 70, 187, 240, -122, -286, 87, -235, -99, 76, -77, -22, -140, -142, -128, 43, -2, 189, -94, -27, 196, 255, -25, -243, 267, 266, 260, 64, 116, 339, 253, -146, -18, 344, 341, -233, 69, -49, 308, -205, -86, -181, 292, 542, 8, -169, -183, 291, -32, 225, 120, 359, 262, 92, -162, 255, 12, -10, -49, -108, 187, 142, 40, -212, -98, 194, -82, -246, 10, -164, -57, -261, -320, -156, 360, -131, -318, -344, 155, -219, -287, -24, 205, -41, -426, -198, 140, 190, 104, -310, -405, 222, -61, -77, -389, -103, 179, 360, -32, -86, 306, 408, 162, 148, 3, 206, 196, -234, -116, 82, 196, -143, -98, 183, 256, -157, 325, -120, 150, 566, 23, -67, -479, 271, 211, 74, -512, 127, 51, -670, -34, -197, -509, 72, -1087, 0, 159, 61, -371, 54, 323, -212, -1, -413, -636, 405, 51, -48, -8, -512, -86, 532, 91, 27, 157, -294, -266, 31, -470, 1, 363, -565, -329, 221, 173, -351, -100, -175, -97, 19, 402, 291, 377, 215, -534, 356, 243]
5240B43j63N46q15p0M69k02n9K57J71L57n64m99p3O19L53r13N59n10L97m84K88
5261i3L22K6k11J41m38M37J91m27P3l8L12m57q5J78rM9j71%L03j07o2R2L4k3r9
5286f2k59J30m9K03N7k01j04L82k90J16j23O6K28l18K49M3p2R1K4n2l3J31j58
$$ y = [243, 80, 626, -189, -259, 210, 8, -51, 206, 377, 734, 170, -329, -402, 217, 570, -343, 216, -294, 103, -381, -93, 229, 255, 44, 185, -253, 184, 375, -52, 21, -17, 295, -162, -247, -69, -78, -29, -200, -200, 103, -4, -66, 26, 60, 37, -62, -321, -191, -240, -37, 20, -181, -285, 97, -193, -77, -200, -134, 94, -224, 25, 68, -4, 87, 111, 59, 26, 157, -1]
$$ [...]
8191a02
##END NTUPLES=NMR FID
##END=
