##TITLE=1H_SAV-32-singlet-bat24
 CDCl3, 8 sc, 
 25.11.2020
##JCAMPDX= 6.0         $$ Bruker NMR JCAMP-DX V2.0
##DATA TYPE= NMR FID
##DATA CLASS= NTUPLES
##ORIGIN= UXNMR, Bruker Analytische Messtechnik GmbH
##OWNER= root
$$ XWIN-NMR		Version 3.5
$$ Wed Nov 25 11:53:06 2020 Russian Standard Time (UT+4h)  she@DPX200
##.OBSERVE FREQUENCY= 200.1315066352
##.OBSERVE NUCLEUS= ^1H
##.DELAY= (6, 6)
##.ACQUISITION MODE= SIMULTANEOUS
##.ACQUISITION SCHEME= undefined
##.AVERAGES= 8
##.DIGITISER RES= 18
##SPECTROMETER/DATA SYSTEM= spect
##.PULSE SEQUENCE= zg30
##.SOLVENT NAME= CDCl3
##.SHIFT REFERENCE= (INTERNAL, CDCl3, 0, 15.7039)
##AUDIT TRAIL= $$ (NUMBER, WHEN, WHO, WHERE, WHAT)
$$ ##TITLE= Audit trail, XWIN-NMR		Version 3.5
$$ ##JCAMPDX= 5.01
$$ ##ORIGIN= Bruker BioSpin GmbH
$$ ##OWNER= she
$$ F:/spectra/data/she/nmr/H-F/1/audita.txt
$$ ##AUDIT TRAIL=  $$ (NUMBER, WHEN, WHO, WHERE, WHAT)
(   1,<2020-11-25 11:51:54.28 +0400>,<she>,<DPX200>,
      <created by zg, POWCHK disabled, PULCHK disabled
       configuration hash MD5:
       00 E9 B6 7A A2 85 ED C7 34 08 36 98 17 FE 4E 26
       data hash MD5: 16K
       39 29 05 FA 86 DE 8C D4 26 D8 9A 63 49 EE 09 20>)
$$ ##END=
$$ 
$$ hash MD5
$$ D8 C1 10 49 D9 65 10 52 CD 91 83 90 26 32 01 0A
##$RELAX= 
##$RELAX= 
##$RELAX= 
##$RELAX= 
##$RELAX= 
##$RELAX= 
$$ Bruker specific parameters
$$ --------------------------
##$DU= <F:/spectra>
##$EXPNO= 1
##$NAME= <H-F>
##$PROCNO= 1
##$TYPE= <nmr>
##$USER= <she>
##$AMP= (0..31)
100 100 100 100 100 100 100 100 100 100 100 100 100 100 100 100 100 100 
100 100 100 100 100 100 100 100 100 100 100 100 100 100 
##$AQSEQ= 0
##$AQ_mod= 1
##$AUNM= <au_zg>
##$AUTOPOS= <>
##$BF1= 200.13
##$BF2= 200.13
##$BF3= 200.13
##$BF4= 200.13
##$BF5= 200.13
##$BF6= 200.13
##$BF7= 200.13
##$BF8= 200.13
##$BYTORDA= 1
##$CFDGTYP= 0
##$CFRGTYP= 5
##$CHEMSTR= <none>
##$CNST= (0..31)
1 1 145 1 1 1 1 1 1 1 1 1 1 1 1 1 1 1 1 1 1 1 1 1 1 1 1 1 1 1 1 1 
##$CPDPRG= <>
##$CPDPRG1= <>
##$CPDPRG2= <>
##$CPDPRG3= <>
##$CPDPRG4= <mlev>
##$CPDPRG5= <mlev>
##$CPDPRG6= <mlev>
##$CPDPRG7= <mlev>
##$CPDPRG8= <mlev>
##$CPDPRGB= <>
##$CPDPRGT= <>
##$D= (0..31)
0 1.2 0 0 0 0 0 0 0 0.06 0 0.03 0 0 0 0 0.0002 0 0 0 0 0 0 0 0 0 0 0 0 
0 0 0 
##$DATE= 1606290713
##$DBL= (0..7)
120 120 120 120 120 120 120 120 
##$DBP= (0..7)
150 150 150 150 150 150 150 150 
##$DBP07= 0
##$DBPNAM0= <>
##$DBPNAM1= <>
##$DBPNAM2= <>
##$DBPNAM3= <>
##$DBPNAM4= <>
##$DBPNAM5= <>
##$DBPNAM6= <>
##$DBPNAM7= <>
##$DBPOAL= (0..7)
0.5 0.5 0.5 0.5 0.5 0.5 0.5 0.5 
##$DBPOFFS= (0..7)
0 0 0 0 0 0 0 0 
##$DE= 6
##$DECBNUC= <off>
##$DECIM= 32
##$DECNUC= <off>
##$DECSTAT= 4
##$DIGMOD= 1
##$DIGTYP= 9
##$DL= (0..7)
0 120 120 120 120 120 120 120 
##$DP= (0..7)
150 150 150 150 150 150 150 150 
##$DP07= 0
##$DPNAME0= <>
##$DPNAME1= <>
##$DPNAME2= <>
##$DPNAME3= <>
##$DPNAME4= <>
##$DPNAME5= <>
##$DPNAME6= <>
##$DPNAME7= <>
##$DPOAL= (0..7)
0.5 0.5 0.5 0.5 0.5 0.5 0.5 0.5 
##$DPOFFS= (0..7)
0 0 0 0 0 0 0 0 
##$DQDMODE= 0
##$DR= 18
##$DS= 0
$$ [...]
##$SUBNAM2= <"">
##$SUBNAM3= <"">
##$SUBNAM4= <"">
##$SUBNAM5= <"">
##$SUBNAM6= <"">
##$SUBNAM7= <"">
##$SUBNAM8= <"">
##$SUBNAM9= <"">
##$SW= 16.9725356469052
##$SWIBOX= (0..15)
0 0 2 0 0 0 0 0 0 0 0 0 0 0 0 0 
##$SW_h= 3396.73913043478
##$TD= 16384
##$TD0= 1
##$TE= 0
##$TE2= 300
##$TE3= 300
##$TEG= 300
##$TL= (0..7)
0 120 120 120 120 120 120 120 
##$TP= (0..7)
150 150 150 150 150 150 150 150 
##$TP07= 0
##$TPNAME0= <>
##$TPNAME1= <>
##$TPNAME2= <>
##$TPNAME3= <>
##$TPNAME4= <>
##$TPNAME5= <>
##$TPNAME6= <>
##$TPNAME7= <>
##$TPOAL= (0..7)
0.5 0.5 0.5 0.5 0.5 0.5 0.5 0.5 
##$TPOFFS= (0..7)
0 0 0 0 0 0 0 0 
##$TUNHIN= 0
##$TUNHOUT= 0
##$TUNXOUT= 0
##$USERA1= <user>
##$USERA2= <user>
##$USERA3= <user>
##$USERA4= <user>
##$USERA5= <user>
##$V9= 5
##$VALIST= <valist>
##$VCLIST= <CCCCCCCCCCCCCCC>
##$VD= 0
##$VDLIST= <DDDDDDDDDDDDDDD>
##$VPLIST= <PPPPPPPPPPPPPPP>
##$VTLIST= <TTTTTTTTTTTTTTT>
##$WBST= 1024
##$WBSW= 4
##$XGAIN= (0..3)
0 0 0 0 
##$XL= 0
##$YL= 0
##$YMAX_a= 382660
##$YMIN_a= -339972
##$ZGOPTNS= <>
##$ZL1= 120
##$ZL2= 120
##$ZL3= 120
##$ZL4= 120
##$ABSF1= 10
##$ABSF2= 0
##$ABSG= 5
##$ABSL= 3
##$ALPHA= 0
##$AQORDER= 0
##$ASSFAC= 0
##$ASSFACI= 0
##$ASSFACX= 0
##$ASSWID= 0
##$AUNMP= <proc_1d>
##$AZFE= 0.1
##$AZFW= 0.1
##$BCFW= 1
##$BC_mod= 2
##$BYTORDP= 1
##$COROFFS= 0
##$CY= 11.3945322036743
##$DATMOD= 1
##$DC= 2
##$DFILT= <>
##$DTYPP= 0
##$F1P= 15.9154993809931
##$F2P= -4.1035820241983
##$FCOR= 0.5
##$FTSIZE= 0
##$FT_mod= 4
##$GAMMA= 1
##$GB= 0.15
##$INTBC= 1
##$INTSCL= 1
##$ISEN= 128
##$LB= 0.24
##$LEV0= 0
##$LPBIN= 0
##$MAXI= 10000
##$MC2= 0
##$MEAN= 0
##$ME_mod= 0
##$MI= 1.114404
##$NCOEF= 0
##$NC_proc= 0
##$NLEV= 6
##$NOISF1= 3.799351
##$NOISF2= 2.8
##$NSP= 1
##$NTH_PI= 0
##$NZP= 0
##$OFFSET= 15.70392
##$PC= 1
##$PHC0= -11054.99
##$PHC1= 18.60089
##$PH_mod= 1
##$PKNL= yes
##$PPARMOD= 0
##$PSCAL= 0
##$PSIGN= 0
##$REVERSE= no
##$SF= 200.130013532006
##$SI= 16384
##$SIGF1= 3
##$SIGF2= 2
##$SINO= 400
##$SIOLD= 16384
##$SREGLST= <1H.CDCl3>
##$SSB= 0
##$STSI= 0
##$STSR= 0
##$SW_p= 3612.71676300578
##$SYMM= 0
##$S_DEV= 0
##$TDeff= 0
##$TDoff= 0
##$TI= <>
##$TILT= no
##$TM1= 0
##$TM2= 0
##$TOPLEV= 0
##$USERP1= <user>
##$USERP2= <user>
##$USERP3= <user>
##$USERP4= <user>
##$USERP5= <user>
##$WDW= 1
##$XDIM= 8192
##$YMAX_p= 0
##$YMIN_p= 0
$$ End of Bruker specific parameters
$$ ---------------------------------
##NTUPLES= NMR FID
##VAR_NAME=  TIME,          FID/REAL,        FID/IMAG
##SYMBOL=    X,             R,               I
##VAR_TYPE=  INDEPENDENT,   DEPENDENT,       DEPENDENT
##VAR_FORM=  AFFN,          ASDF,            ASDF
##VAR_DIM=   8192,          8192,            8192
##UNITS=     SECONDS,       ARBITRARY UNITS, ARBITRARY UNITS
##FACTOR=    0.0002944,     1,               1
##FIRST=     0,             0,               0
##LAST=      2.4114304,     0,               0
##MIN=       0,             -339972,         0
##MAX=       2.4114304,     382660,          0
$$ Real data points
##PAGE= N=1
##DATA TABLE= (X++(R..R)), XYDATA
0 0 0 0 0 0 0 0 0 0 0 0 0 -8 8 -8 8 -14 16 -19 24 -32 36 -41 52 -62 72 -86 100 -116 134 -156 180 -204 234
33 234 -266 300 -340 386 -433 487 -543 606 -676 749 -833 923 -1021 1127 -1245 1372 -1512
50 -1512 1667 -1834 2020 -2225 2454 -2707 2990 -3313 3682 -4106 4598 -5184 5886 -6750 7837
65 7837 -9249 11147 -13783 17443 -37326 382660 -98001 -145668 245950 -162072 87403
76 87403 -9202 -185089 199687 -12864 -122621 129871 -26934 -632 -1165 -21166 87973
87 87973 -39912 -47020 103910 -2111 -53961 44078 53944 -17098 -19614 16612 50106 -5979
99 -5979 -51551 78336 51479 -82949 26863 50687 -16503 -34151 -20687 96652 -8642
110 -8642 -94964 89053 34351 -52097 -17683 -3730 75450 -49296 -84911 92476 -5382 -67860
122 -67860 -1421 18394 38047 -78425 -15004 87849 -80945 -37353 47335 -19328 -1503
133 -1503 -48820 10759 50492 -101893 -7932 65337 -41774 -11523 -6066 22911 16927 -95606
145 -95606 27034 63552 -84435 4367 53289 -10343 -3963 -31799 36897 41068 -89055 16538
157 16538 78841 -51065 -16000 34609 19472 14314 -49053 27730 82599 -69325 -14752 92717
169 92717 -25457 -26826 22369 7427 35993 -38473 -11084 97549 -40317 -43291 77180 -9509
181 -9509 -16902 1466 -4330 54809 -47254 -32793 90893 -32611 -45949 41673 4830 -2236
193 -2236 -38011 2606 54926 -59441 -32546 45372 -8421 -24957 -19024 32946 16901 -72710
205 -72710 7717 34920 -45394 -22847 8819 26766 -20323 -57404 41562 14553 -65040 3652
217 3652 31115 5054 -25428 -23241 42883 -3742 -63830 23032 37741 -32461 -11699 31803
229 31803 18440 -18144 -19789 34945 17639 -52374 11119 55628 -16485 -15442 19000 31733
241 31733 5527 -47305 32522 51861 -47224 5148 38052 -1953 -3437 -24023 39950 25575
253 25575 -63072 42929 46899 -43853 7357 6822 16207 -187 -61671 48842 37574 -72933
265 -72933 19022 34042 -19593 -5230 -22699 26843 10032 -67426 24962 32543 -55580 598
277 598 24251 -6379 -13873 -31542 23548 18781 -66055 2000 46647 -35123 -29475 10631 14772
290 14772 -5531 -38984 17237 30853 -46089 -8851 33651 -6676 -18863 -7742 25592 1250
302 1250 -48943 22018 41170 -26172 -10581 22405 23487 -16745 -33683 42691 23104 -40057
314 -40057 15600 30549 -1665 -10773 -4401 39507 3203 -37656 37969 29297 -33141 -3177 26661
327 26661 16955 -22074 -13823 49436 5467 -38295 21269 23451 -12254 -19001 -1138 29006 -15020
340 -15020 -32350 34290 12327 -31457 -2943 16293 6856 -32899 -15259 43398 -18386 -44757
352 -44757 27099 7653 -26061 -15293 -104 26813 -23119 -35852 41419 -3911 -48428 11364
364 11364 11693 -5196 -15630 -11491 37503 -14810 -47069 38145 11620 -34716 6510 8663 10736
377 10736 -12766 -28164 44333 9518 -46434 30280 28516 -20321 -5259 6795 25055 -7602
389 -7602 -30506 39231 20765 -33715 11382 26206 1115 -11299 -2036 33906 2898 -29216
401 -29216 24181 26658 -20553 -13467 20711 19647 -24305 -12745 39186 4039 -29632 7821 19192
414 19192 -3585 -25635 -1188 32016 -16387 -26085 28564 6296 -25833 -9016 10867 7976
426 7976 -32164 -11919 34768 -16206 -34003 12992 11380 -10946 -22640 4970 27364 -26756
438 -26756 -26294 24708 -2001 -26381 -4341 15859 4810 -29123 1484 31964 -22105 -21000 25702
451 25702 8734 -13946 -14028 13470 25997 -27768 -11687 43262 -3159 -20504 12990 12571 8439
464 8439 -19587 1013 41071 -21663 -16490 44233 -435 -12564 7256 10250 21023 -25494 -9121
477 -9121 48710 -11945 -26524 24894 11230 -6137 -15078 5579 28143 -19410 -14684 31891 -1157
490 -1157 -24292 3201 12540 -4978 -21439 2326 24324 -13819 -28525 15673 15214 -26125 -17028
503 -17028 18757 8707 -26408 -12048 21149 -4923 -27059 4032 15324 -9338 -21790 7131
515 7131 17634 -25021 -17240 21805 1537 -20319 -7684 19893 11326 -30828 1659 30979 -16285
528 -16285 -16362 12072 11087 -1306 -18499 14096 23749 -25285 -2346 30194 -381 -11193 1519
541 1519 21428 5578 -28421 15083 31529 -18173 -6475 21413 10604 -6951 -13951 19768
553 19768 17212 -26307 4355 27539 -7471 -11871 3823 15854 -1116 -25462 15863 24230 -26778
566 -26778 -7862 20993 -2775 -16826 -9649 14102 7325 -29956 1263 26747 -20212 -19563 12181
579 12181 2409 -11385 -17261 6525 18705 -27766 -14136 26831 -12021 -21996 5100 7170 1280
592 1280 -20261 -77 25209 -22260 -18728 21758 3533 -13106 -7571 16891 12693 -26058 432
605 432 25574 -8124 -14109 7115 18196 -4433 -17740 19707 15630 -14584 168 17153 10730
618 10730 -14426 -5856 28581 -583 -21098 15605 20273 -5586 -12360 10259 19642 -11851 -13186
631 -13186 20465 11377 -17827 -1422 19369 -1420 -14643 2885 15188 -3346 -22251 11784
643 11784 19074 -24075 -9270 15608 99 -12207 -14936 15501 11143 -30250 1839 17119 -15741
656 -15741 -13022 -2920 11604 -5205 -25568 18785 8290 -30457 592 10978 -2121 -12101
668 -12101 -9483 23881 -1121 -30032 11394 13382 -13924 -8054 5896 14381 -6207 -15950 17917
681 17917 9255 -21426 4451 20822 -4216 -10463 7258 16209 -2213 -15841 14451 22283 -15219
694 -15219 -8156 20830 8078 -10960 -4337 18042 7815 -18204 5444 21561 -5827 -9057 11094
707 11094 12120 -10843 -12492 16105 8759 -16611 -2337 15648 3632 -19191 -6076 21925 -4486
720 -4486 -21429 10545 9618 -12290 -12053 3036 10920 -14680 -12703 19878 -2366 -21950 1937
733 1937 6390 -4544 -16078 -2665 20518 -10818 -21549 15671 5591 -16880 -6449 7638
745 7638 8252 -14477 -9041 19648 -2709 -18895 7760 11767 -6003 -10742 7112 17313 -10713
758 -10713 -11927 21268 7654 -16673 1824 15300 3250 -10805 164 20717 -1052 -16324
770 -16324 14640 15038 -9569 -2807 10731 11764 -8297 -9868 21931 5796 -18805 9424 14610
783 14610 -4734 -9083 529 15598 -5607 -16687 16720 9853 -16467 -4489 10363 3446 -15084
796 -15084 -5741 17549 -2975 -19470 3547 9605 -10673 -15367 6808 9413 -13947 -8469 11088
809 11088 1278 -16476 -6964 12520 -905 -19320 2523 15376 -9326 -15351 6357 9739 -10002
822 -10002 -12013 10947 10164 -15065 -5675 16866 -1193 -13015 5080 11176 -912 -10885 5218
835 5218 18225 -10308 -12028 18523 6660 -11081 -370 13070 10610 -11754 -3359 20572 -2166
848 -2166 -12817 11193 12228 -2753 -6661 7938 12362 -12849 -6704 19415 3288 -13017 2176
861 2176 13312 287 -15704 1791 16487 -7223 -13423 8674 7648 -8770 -9836 6966 7392
874 7392 -15352 -6220 15163 -5526 -16413 3850 7512 -6923 -14448 3294 13288 -13899 -14209
887 -14209 13083 2557 -14933 -5413 7465 3124 -13530 -4361 14189 -4269 -14330 7123 8507
900 8507 -9071 -7923 10073 8887 -12075 -5995 15410 3151 -13244 1808 16007 2098 -12660
913 -12660 4348 14836 -6148 -8343 11908 10498 -4882 -4270 12410 7079 -13145 1717 16420
926 16420 -1563 -8857 4804 12754 -892 -13770 8616 15174 -11805 -6501 12913 4062 -8208
939 -8208 -4442 10126 3041 -15567 1531 13075 -7259 -10051 5409 6815 -9514 -12309 8432
952 8432 7350 -15550 -5060 12624 -2914 -13863 -3116 9182 -2030 -14829 3759 11164 -11539
965 -11539 -10205 7153 2653 -9605 -8400 10107 5497 -16231 11 13964 -6115 -9672 4088
978 4088 9298 -2112 -12143 8183 12742 -12881 -4439 14550 2468 -7349 -524 11504 4990
991 4990 -12112 3124 16652 -5432 -7593 10928 8867 -4172 -5639 9926 9223 -11839 -2444
1004 -2444 16213 962 -10049 4326 12243 -2358 -10837 6499 10966 -8009 -7719 8546 6781
1017 6781 -10156 -7161 10777 542 -13501 1445 8504 -3955 -10750 1070 9573 -9340 -13260
1030 -13260 9795 5230 -12744 -6327 7537 1570 -13634 -6306 11351 -2162 -13886 3639 8122
1043 8122 -8406 -8272 4671 5190 -7680 -8662 11099 5474 -14704 40 11571 -2685 -8861 615
1057 615 12720 -972 -13496 9232 11091 -8917 -1885 8268 6334 -3980 -4928 13506 3864
1070 3864 -13268 6546 12188 -4549 -5497 6730 12313 -4202 -10031 12029 8486 -11531 -1298
1083 -1298 11540 3207 -6720 -2117 9343 95 -12221 3894 10988 -8149 -7238 8860 3132 -10222
1097 -10222 -6075 8535 3596 -13279 -3175 11828 -3424 -13468 612 7470 -5495 -10968 3607
1110 3607 5986 -9604 -7749 7491 1815 -12147 -2832 9768 -2879 -11402 2020 8772 -3825
1123 -3825 -11046 3949 10822 -8834 -8656 10890 4651 -8688 -1710 8338 3495 -8712 707 13661
1137 13661 -3096 -8570 9279 6681 -4988 -3448 7714 10680 -7213 -5023 14642 2237 -10171
1150 -10171 3356 10173 2099 -7474 2575 12599 -5394 -8568 10260 5388 -7658 -2350 8216
1163 8216 3947 -9436 -2903 11446 -1482 -11849 4307 8603 -6474 -8112 3229 6061 -7243
1176 -7243 -9406 8483 3231 -12611 -1993 7211 -2691 -9738 -2429 8070 -3218 -12539 6226
1189 6226 7141 -10198 -6334 5417 3252 -9157 -4527 10034 672 -10763 1043 8893 -2608
1202 -2608 -9777 4223 9706 -6140 -6194 7738 5748 -6432 -4154 10226 4657 -9330 2050 11148
1216 11148 -1423 -6591 5244 9706 -2545 -6603 8833 9210 -7194 -3301 11063 4140 -7738
1229 -7738 -204 10493 2161 -8669 2067 10213 -4798 -7181 7458 5175 -5426 -4815 6036
1242 6036 4846 -10698 -3379 11554 -1447 -10408 1724 6731 -2711 -11116 1374 8096 -8752
1255 -8752 -7645 7188 1688 -8382 -3493 4513 495 -11721 -1699 9778 -4954 -9678 5333
1268 5333 5038 -6813 -7790 4386 7527 -9348 -5689 10189 1053 -8722 308 6732 501 -7036
1282 -7036 1829 9998 -4400 -6343 8863 5715 -6708 -2081 9606 4953 -7835 -263 11568
1295 11568 717 -7857 4053 9854 -734 -6230 5581 7888 -4254 -4316 8103 4705 -7449
1308 -7449 -510 9646 99 -8568 2489 8615 -3675 -8377 5032 7717 -5942 -7393 6044
1321 6044 4109 -9251 -4501 7640 1225 -8206 -936 5972 -4309 -9969 3239 5908 -7976 -5549
1335 -5549 4656 2931 -7647 -7044 7967 1824 -11629 -124 7717 -1882 -7455 -433 7911 -3628
1349 -3628 -8582 6690 5123 -7488 -2065 6815 2722 -5817 -670 9777 1794 -8855 3967 10304
1363 10304 -3621 -5218 6253 5917 -2851 -4260 8160 7260 -7394 108 10316 425 -5979 2781
1377 2781 7856 915 -6996 4613 8578 -6261 -4998 9263 3552 -6273 -2063 7397 2253 -8246
1391 -8246 29 8460 -2153 -7672 2781 6216 -6435 -7679 4564 3627 -7280 -4670 6414 1873
1405 1873 -9951 -2276 6825 -3810 -9369 1720 5598 -5114 -7758 4127 4685 -8191 -6134 6859
1419 6859 1664 -8643 -1847 6722 56 -8060 629 7646 -3237 -7039 5340 5783 -5087 -3756
1433 -3756 6574 4593 -7103 -1776 10407 1256 -7222 3575 8696 -604 -6115 3789 9664 -3097
1447 -3097 -5228 8555 5154 -6109 419 6837 2682 -4695 166 9928 -372 -8973 5720 6655
1461 6655 -5375 -3821 5561 5214 -4791 -6579 7106 3445 -9793 -222 7618 -2432 -6193 913
1475 913 4728 -3910 -8020 3607 4737 -8605 -4645 6756 496 -8373 -3146 5431 68 -9431
1489 -9431 -362 7514 -3390 -8411 3102 4265 -5353 -4892 4010 2678 -6958 -2044 7710 -174 -8089
1504 -8089 1997 8260 -2615 -6676 5445 7161 -4405 -4924 6511 6072 -5517 -2173 8247 3287
1518 3287 -5748 1194 6741 956 -5078 3571 8392 -4099 -4574 7161 4778 -5966 -2287 8049
1532 8049 3934 -6865 -446 8226 -731 -6709 1598 6005 -1759 -6103 3547 5488 -6734 -4474
1546 -4474 6546 444 -7266 -1174 5518 -17 -8591 -1152 7431 -4795 -8879 4146 3977 -5569
1560 -5569 -5320 2756 3466 -7706 -4936 6994 -1110 -8655 1335 5245 -3132 -6092 1759 5752 -4472
1575 -4472 -6456 6408 4748 -7114 -2142 6782 1007 -5659 -16 7827 1042 -6843 3620 7673
1589 7673 -3979 -3874 6217 5291 -3848 -2177 7658 3797 -5754 248 8693 381 -6031 3403 7508
1604 7508 -2589 -4328 5053 5458 -4025 -3837 6918 3803 -7062 -1176 6686 -614 -6231 -19 6274
1619 6274 -1768 -7348 3391 4815 -6489 -4863 4678 2185 -7451 -3386 5967 -633 -8973 -302
1633 -302 5690 -3373 -7346 1678 4930 -4405 -6804 3663 3404 -7291 -3199 5911 -208 -5993 -532
1648 -532 4885 -803 -7738 2506 7518 -5165 -5016 6201 3754 -4356 -3826 5993 4793 -6735 -392
1663 -392 9193 -532 -4823 3631 5408 -1006 -3324 4281 6409 -4153 -2480 8509 2729 -5935 314
1678 314 7496 1508 -5678 994 8141 -1141 -6791 4052 6003 -4516 -3154 5134 2417 -5127 -2201
1693 -2201 5632 435 -7457 638 6746 -3629 -7086 2941 4211 -5220 -5718 3381 3667 -6217 -4972
1708 -4972 4912 333 -7648 -1287 4656 -2067 -6122 1113 4685 -4565 -6362 4758 3589 -7204
1722 -7204 -2979 6095 1218 -6180 -1807 6671 278 -6964 1787 6524 -2348 -4031 3149 4647 -2878
1737 -2878 -3384 6911 3321 -5655 944 7109 492 -5166 1386 7883 -1012 -5362 5409 6774 -3752
1752 -3752 -2551 5227 3850 -4056 -1990 6575 2028 -5785 1368 6881 -2655 -5034 3717 4340 -3303
1767 -3303 -4746 3664 4150 -6867 -3818 6441 -193 -6682 -546 4143 -898 -7327 -138 5411 -5056
1782 -5056 -6646 4391 1845 -6413 -3406 3908 924 -6505 -1855 5557 -1048 -7479 975 5353 -3863
1797 -3863 -5474 3471 3611 -4205 -3897 4794 3486 -6577 -1403 7234 -182 -5050 2350 5844 -684
1812 -684 -4856 3164 6260 -3486 -2994 7182 3783 -4573 72 6494 1323 -5016 986 7468 -26
1827 -26 -4903 4180 6231 -2903 -3591 4279 3715 -4101 -2682 6076 1926 -6214 363 5849 -1858 -5303
1843 -5303 2109 5020 -3610 -6057 4098 3330 -6447 -3709 4321 1482 -5964 -2829 4680 -1119 -7352
1858 -7352 803 3886 -3737 -5209 2182 2781 -5018 -4551 5204 1870 -7402 -1632 5842 -468 -6432
1873 -6432 -200 5576 -1405 -6112 2621 5891 -3843 -3585 5185 2752 -4282 -704 5162 1882 -4303
1888 -4303 1193 6426 -923 -5004 4539 6319 -2736 -3236 5098 4397 -2984 -2913 5642 3150 -5029 1586
1904 1586 5980 -392 -3706 2801 4275 -2380 -3270 4452 5031 -5050 -2776 6706 1051 -6167 -370
1919 -370 4574 53 -6076 -544 5375 -3016 -5872 2690 1782 -4579 -3307 2890 1906 -5969 -2432 5373
1935 5373 -1850 -7533 380 4493 -3120 -6149 2220 4071 -4237 -4664 3871 2523 -5014 -2507 4761
1950 4761 426 -5255 368 5262 -1245 -4632 3387 5213 -3108 -3545 4536 4087 -4211 -1798 6707
1965 6707 2722 -4426 335 6129 646 -4101 2251 6375 -1611 -3545 4996 3702 -3818 -1233 5274
1980 5274 2544 -4509 -155 6372 481 -5286 1239 5322 -2101 -4653 3215 4056 -3918 -3606 4147
1995 4147 2081 -5880 -2057 4897 -879 -6246 316 3604 -2878 -5504 1663 3657 -4508 -4900 3953
2010 3953 1983 -6456 -2328 3905 -250 -5985 -802 4618 -1677 -5867 1880 4317 -3472 -4206 3775
2025 3775 3041 -4120 -2631 4572 1611 -5212 254 5828 -372 -4335 2869 5236 -2443 -3557 4400
2040 4400 4467 -3497 -1806 5851 2961 -3735 -413 6001 550 -3809 1156 5950 -735 -3212 3342
2055 3342 4267 -3347 -2209 5244 3028 -4987 -947 5968 -356 -5380 161 5055 -1338 -5165 2416
2070 2416 4509 -3721 -3864 3351 1070 -4736 -1586 3786 -277 -5700 -657 4267 -2678 -6186 1870
2085 1870 3769 -4342 -4920 2618 2168 -4989 -4340 3988 1410 -5761 -692 4546 -1191 -4327 1247 3466
2101 3466 -2518 -3954 3429 3808 -4653 -2344 5950 1588 -4521 495 5606 1447 -4230 744 6038
2116 6038 -574 -3966 3919 4237 -2729 -851 4563 2597 -3213 -624 5869 906 -5060 2059 5800
2131 5800 -1811 -3924 2692 4421 -2124 -4006 4097 3507 -4737 -1750 4188 -260 -4325 -471 3795
2146 3795 -1151 -5247 1689 3733 -3963 -4065 3179 1857 -5255 -3536 4142 798 -6222 -1277 4047
2161 4047 -1445 -5197 553 3536 -2647 -4370 2062 2345 -4538 -2639 4417 921 -5047 -564 4525
2176 4525 22 -4951 1306 5225 -1943 -4144 3271 3687 -2604 -2132 4315 3196 -3543 -503 5965
2191 5965 792 -4140 1708 5222 -841 -3196 3596 4696 -1871 -2308 4582 3596 -4018 -860 5501
2206 5501 816 -3873 666 4559 11 -4725 1709 5039 -3037 -3502 4010 1980 -4100 -2418 2990
2221 2990 1364 -5189 -1253 4716 -1325 -5194 1482 2771 -3490 -3925 1931 2364 -4251 -4085 3465 879
2237 879 -5727 -1355 3478 -875 -4534 -349 3195 -1885 -4772 1980 2980 -3847 -2851 4192 1521
2252 1521 -3895 -1014 4445 494 -4468 670 5062 -630 -4026 3113 4764 -1519 -2417 3588 2998
2267 2998 -2697 -678 5024 1099 -3780 1276 5064 -693 -3354 2859 4922 -1967 -2998 4067 3530
2282 3530 -3481 -2059 4323 1874 -3899 -687 4353 -391 -3909 1882 3380 -2602 -3052 2237 2182 -4505
2298 -4505 -3294 3977 644 -5292 -1195 3819 -594 -5244 -696 3429 -2006 -5248 1409 2588 -3960
2313 -3960 -2769 2798 531 -3839 -1111 3337 -261 -5116 118 4393 -2675 -4350 2666 3446 -2078
2328 -2078 -2875 2931 3648 -3454 -1587 4479 923 -3294 1087 4019 -315 -2843 2351 4538 -1771
2343 -1771 -2554 4552 3687 -3425 -1173 4882 1649 -3506 265 5146 749 -3626 1621 4438 -1775
2358 -1775 -2684 2944 2586 -2953 -1931 3621 1383 -4348 -505 4275 -584 -4599 709 3729 -2382
2373 -2382 -4696 1472 2166 -3440 -3280 2306 1421 -4253 -1949 3379 -646 -4771 -246 3060 -2149 -4265
2389 -4265 1771 2804 -3188 -3522 2784 1946 -4109 -2011 3789 205 -4589 -209 3748 -441 -3618
2404 -3618 1269 3952 -2015 -2867 3583 2360 -2803 -777 4030 1730 -2936 77 4819 229 -3579
2419 -3579 2423 4500 -1437 -2008 3143 2927 -2116 -1730 3694 2233 -3262 -42 4943 84 -3399 1297
2435 1297 3133 -1176 -3345 1852 3216 -3342 -2668 3621 1093 -3912 -1032 3452 -116 -4310 -302
2450 -302 3326 -1776 -4813 1125 2367 -2989 -3041 2013 1412 -3974 -2128 2326 -363 -4697 -705 3002
2466 3002 -1667 -4172 1383 2810 -2665 -3254 2670 2618 -3462 -1995 3032 1151 -3572 -397 3565 -101
2482 -101 -2995 1955 3732 -1369 -2237 3056 2779 -2744 -1563 4717 1910 -3499 361 4621 849 -3145
2498 -3145 1305 4206 -579 -2668 2486 3479 -1949 -1644 3545 1498 -2912 227 3540 282 -3443
2513 -3443 277 3974 -1269 -4092 2092 2808 -2554 -3103 2100 2052 -3411 -2634 3022 7 -4569 -686
2529 -686 2529 -2010 -3584 919 2243 -2744 -3533 2364 1791 -4304 -2563 3067 240 -4053 -869 3374
2545 3374 -373 -3624 286 2977 -1720 -2985 2206 2108 -2263 -1655 3073 1391 -3235 -55 4113 550
2561 550 -3201 1356 4396 -1057 -2845 2722 3173 -1880 -1579 3154 2470 -2160 -370 3882 699 -2568
2577 -2568 1177 3662 -588 -2754 1838 3196 -2062 -2482 3135 2179 -3118 -1386 3511 638 -3588
2592 -3588 -450 2891 -784 -3499 1075 2565 -2412 -2866 1774 1436 -3781 -1935 2366 91 -4035
2607 -4035 -932 2724 -877 -4040 713 2620 -2293 -2962 1846 1492 -3000 -2415 2391 1246 -3591 -1039
2623 -1039 3365 -535 -3317 1130 3022 -1364 -2778 2001 2847 -2036 -1738 3292 1771 -2888 -34
2638 -34 3769 881 -2669 807 4003 -181 -2955 2193 3467 -1408 -1440 3026 2261 -2114 -621 3369
2654 3369 820 -2644 385 3425 -623 -2988 1664 3106 -1777 -2475 2662 2036 -3145 -2005 2679
2669 2679 510 -3300 -1180 2997 -611 -3586 763 1940 -2266 -2805 1384 1568 -3010 -2229 2407 483
2685 483 -3993 -921 2930 -455 -3711 359 2780 -1334 -3357 1035 2306 -2788 -2167 2586 827
2700 827 -2761 -88 2779 259 -2940 627 3672 -943 -3282 2357 3258 -1725 -1768 2743 2771 -2104
2716 -2104 -980 3543 1423 -2211 793 3513 -283 -1956 2014 2844 -1179 -1360 2898 2487 -2560 -1319
2732 -1319 3156 876 -2827 -337 3190 137 -3176 589 2848 -1248 -2459 1411 1502 -2504 -1683 2241
2748 2241 168 -3466 -881 2736 -930 -3576 102 2783 -1775 -3643 1049 1922 -2617 -2548 1701 1270
2764 1270 -3405 -1824 2038 -489 -2778 642 2955 -1572 -2495 2068 1466 -1602 -2099 2297 1573 -2542
2780 -2542 -945 3133 916 -2675 319 3100 -136 -2210 1553 3081 -719 -1305 2587 2577 -1875 -719
2796 -719 3266 1040 -2553 174 3422 -59 -2372 1111 3165 -997 -2380 2300 2142 -1668 -1296 2419
2812 2419 1144 -2484 -606 3059 -154 -3216 812 1910 -1476 -2452 1034 1653 -2477 -2288 1789 966
2828 966 -3347 -994 2144 -249 -3192 -620 1846 -1065 -3132 695 2337 -2275 -2574 1794 1099 -2554
2844 -2554 -1262 2306 441 -2971 84 2870 -982 -2565 1141 2257 -1412 -1972 2132 2270 -1950
2859 -1950 -1185 2940 1115 -2155 -52 3187 355 -1875 1202 2873 -576 -1442 2236 2330 -1662 -688
2875 -688 3328 1415 -2160 42 3295 559 -2450 584 2752 -895 -2084 1314 1887 -1462 -1705 1813
2891 1813 1243 -2538 -610 2389 -145 -2896 316 2152 -1493 -2971 757 1756 -2227 -2694 1573 1112
2907 1112 -2988 -1526 1493 486 -2871 -553 1848 -913 -2617 801 1496 -1707 -1782 1804 1424 -2331
2923 -2331 -1257 2680 667 -2870 -471 2621 77 -2053 559 2717 -424 -1776 1891 1983 -1572
2938 -1572 -444 2718 1094 -1960 555 3191 181 -1874 1132 3206 -630 -1936 2119 2443 -1438
2953 -1438 -1404 1931 1504 -1818 -522 2442 474 -2229 529 2112 -949 -2053 1188 1962 -1679 -1860
2969 -1860 1986 1216 -2493 -1481 2253 120 -2961 -793 1875 -636 -2896 257 1527 -1957 -2264
2984 -2264 1238 848 -2475 -1498 1661 111 -3143 -655 2052 -797 -2599 299 2278 -1242 -2166 1376
3000 1376 1646 -2177 -1438 2334 1119 -1884 -157 2221 363 -2250 838 2625 -669 -1557 1951 2129
3016 2129 -1171 -1188 2607 1701 -1981 -273 2947 669 -1788 903 3030 -203 -1465 1485 2346 -1078
3032 -1078 -1503 1865 1480 -2009 -502 2358 441 -2250 -273 2254 -579 -2392 800 1861 -1607
3047 -1607 -2144 939 1337 -2219 -1727 1622 348 -2904 -1042 1612 -590 -2662 365 1713 -1108 -2118
3063 -2118 947 1244 -2198 -1608 1824 370 -2509 -835 2071 80 -2218 422 2056 -775 -1871
3078 -1871 1518 1790 -1094 -1494 1575 1214 -1966 -262 2592 268 -1998 1263 3122 -502 -1752 1462
3094 1462 2679 -893 -1280 2396 2222 -1467 -869 2162 1037 -1728 68 2286 157 -1856 982 1815
3110 1815 -1174 -1418 1743 1335 -1893 -1223 2085 435 -2514 -428 2162 -392 -2393 -12 1824 -838
3126 -838 -2247 838 935 -1992 -1482 1523 112 -2610 -856 1787 -462 -2775 76 2114 -1051 -2715
3142 -2715 878 1293 -1699 -1621 1517 1118 -2085 -859 1719 454 -1927 334 1942 -1452 -2125 1102
3158 1102 1951 -1222 -1535 2299 1634 -1570 -496 2580 711 -1842 39 2438 330 -1366 1011 2183
3174 2183 -497 -887 1819 1439 -1134 -573 2102 827 -1816 -33 2336 143 -2022 635 2020 -722
3190 -722 -2007 902 1355 -1740 -1656 1516 565 -2052 -673 1856 -314 -2360 60 1733 -1189 -2329
3206 -2329 597 1044 -1753 -2008 1071 804 -2369 -1165 1557 4 -2446 47 1684 -937 -2016 738
3222 738 1660 -1132 -1557 1593 1169 -1763 -637 2075 543 -1703 171 2279 172 -1938 1102 2193
3238 2193 -863 -1132 1584 1805 -1198 -977 2188 1431 -1486 100 2344 523 -1719 957 2094 -492
3254 -492 -1138 1262 1672 -1324 -758 1911 693 -1867 -46 1785 18 -1901 260 1913 -586 -2252
3270 -2252 483 1630 -1609 -1458 974 331 -1988 -1184 1527 -72 -2379 -346 1466 -843 -2238 661
3286 661 1347 -1800 -1815 1172 854 -2197 -1285 1617 113 -1757 -315 1587 -168 -1753 287 1610
3302 1610 -1068 -1211 1566 1392 -1466 -889 2180 868 -1781 -38 2211 288 -1411 1121 2264 -260
3318 -260 -1097 1214 1844 -602 -835 1865 1131 -1596 38 2094 318 -1546 654 2363 -661 -1709
3334 -1709 1167 2022 -1016 -1178 1472 1077 -1464 -813 1540 262 -1775 20 1446 -1009 -1834 707
3350 707 1030 -1615 -1604 1116 944 -2247 -1108 1851 145 -2224 -550 1286 -362 -2193 157 1486
3366 1486 -933 -1750 803 960 -1675 -946 1429 397 -1845 12 1948 -103 -1833 559 1720 -522
3382 -522 -1506 1202 1623 -900 -860 1899 1083 -1333 -66 1975 510 -1309 645 2056 -116 -1312
3398 -1312 1440 1913 -911 -869 1625 1322 -1377 -508 1922 502 -1582 -23 1879 -370 -1552 648
3414 648 1572 -915 -1206 1089 948 -1704 -548 1578 -90 -2058 -429 1420 -412 -2126 379 1295
3430 1295 -1140 -1639 1176 971 -1826 -1326 869 114 -1870 -850 1459 -298 -2141 205 1115 -459
3446 -459 -1242 926 1295 -1166 -985 1247 757 -1683 4 1770 393 -1420 251 1608 -370 -1335
3462 -1335 1000 1645 -549 -615 1327 1180 -483 532 2149 622 -1166 325 2602 -212 -896 1214
3478 1214 1637 -753 -912 888 1033 -1066 -987 1415 557 -2025 -418 1264 29 -1862 494 1147 -1108
3495 -1108 -797 703 741 -1287 -879 1957 -220 -1420 -289 1722 -299 -2337 -208 1612 -1452 -1118
3511 -1118 1055 617 -573 -411 919 776 -1879 378 1164 -533 -2034 349 1772 -505 -1824 22
3527 22 2004 -996 -855 1983 1390 -1158 -532 1479 706 -1197 204 1668 -126 -993 1166 1551 -841
3544 -841 -514 1490 1457 -1219 -416 1890 837 -1667 17 2024 68 -1260 479 1446 -489 -1200 943
3561 943 1111 -1276 -712 1459 397 -1750 -275 1605 -450 -1987 123 1379 -825 -2025 215 1100
3577 1100 -1642 -1667 559 401 -1721 -659 1266 -97 -1820 -60 1099 -549 -1775 677 935 -1372
3593 -1372 -1444 1058 689 -1609 -852 1457 370 -1475 -191 1340 -246 -1043 936 1392 -670 -1050 1311
3610 1311 1169 -959 -344 1623 910 -1302 197 1870 171 -1407 681 2038 -258 -781 1060 1507
3626 1507 -859 -552 1778 647 -1234 -272 1546 233 -1464 468 1577 -349 -1601 862 1128 -1480
3642 -1480 -1012 1020 669 -1621 -538 1447 -149 -1870 -211 1159 -718 -2001 500 938 -1375 -1350
3658 -1350 969 493 -1595 -530 859 -44 -1840 -93 1294 -533 -1522 276 1124 -1238 -1347 1048
3674 1048 1172 -1136 -945 1300 650 -1383 -209 1505 86 -998 483 1798 -464 -896 1205 1299
3690 1299 -791 -442 1627 912 -1271 -71 1866 370 -1212 284 1799 -373 -857 1054 1292 -601
3706 -601 -577 1224 816 -1350 -329 1162 -1 -1713 190 1390 -487 -1606 764 1084 -1339 -1561
3722 -1561 1005 752 -1474 -841 784 90 -1588 -244 1008 -640 -1439 762 721 -1280 -1607 736 534
3739 534 -1639 -1069 1462 400 -1738 -440 1348 7 -1363 409 1006 -822 -867 980 935 -982 -457
3756 -457 1567 698 -1088 139 1581 250 -1365 571 1838 -424 -872 1100 1567 -684 -626 1404
3772 1404 1073 -743 -131 1608 489 -1095 419 1678 -406 -1068 982 1218 -1059 -835 1311 807
3788 807 -950 -788 1401 306 -1146 -58 1001 -266 -1194 135 1079 -972 -1471 842 485 -1449
3804 -1449 -877 828 294 -1874 -767 984 -439 -1902 108 1109 -717 -1507 140 862 -1234 -818
3820 -818 1321 215 -1419 -99 1309 -215 -1269 704 1586 -439 -973 832 1296 -743 -599 1147
3836 1147 809 -1105 -96 1620 434 -1011 261 1454 -53 -659 955 1383 -352 -440 1058 1041 -829
3853 -829 53 1246 280 -856 -191 1764 -173 -1326 824 1419 -1172 -977 967 989 -1115 -885 411
3870 411 526 -1588 -98 1240 -376 -1623 -129 667 -1002 -768 599 577 -1366 -1142 1225 -8 -1798
3887 -1798 -385 966 -300 -2069 131 1402 -639 -1562 693 1140 -1055 -872 913 486 -1187 -24
3903 -24 1322 383 -1247 324 1565 -317 -990 642 1172 -427 -791 971 1183 -720 -154 1422 486
3920 486 -741 99 1432 97 -938 589 932 -615 -512 1222 946 -918 -437 1484 668 -1312 -234
3937 -234 1476 95 -1586 278 883 -531 -1317 377 281 -1310 -767 1142 50 -1528 253 1452
3953 1452 315 -1662 -70 1204 -1086 -1192 279 696 -1248 -1374 550 361 -1531 -652 1027 -505
3969 -505 -999 181 481 -373 -1616 356 1680 26 -973 1885 258 -602 -517 1198 810 -1186 220
3986 220 1211 106 -888 517 1333 -344 -565 1154 754 -651 -221 1109 430 -852 22 1626 -290
4003 -290 -898 469 1307 -332 -708 734 1101 -513 -473 1025 514 -1084 -573 1143 -41 -1227 39
4020 39 1261 -436 -1205 390 740 -1231 -1279 576 357 -1363 -628 730 99 -1230 -87 892 -681
4037 -681 -1313 279 758 -880 -946 726 420 -1008 -795 1214 218 -1361 -225 1253 -66 -912 668
4054 668 1446 -533 -972 795 1122 -910 -582 1416 691 -651 87 1362 173 -758 307 1317 -284
4071 -284 -485 913 1052 -453 -425 1166 509 -917 -26 1225 -49 -1006 263 1176 -202 -884 376
4088 376 706 -1029 -723 725 530 -986 -399 767 -190 -1261 -26 932 -778 -1357 591 853 -1021
4105 -1021 -1124 577 629 -1076 -973 954 -175 -1201 -389 890 -86 -849 -256 1013 -992 -1520 854
4122 854 707 -784 -396 969 367 -1249 -349 1054 166 -868 245 1246 -154 -573 607 1081 -691
4139 -691 -408 1112 838 -881 6 1587 228 -981 364 1650 -235 -909 869 1186 -515 -776 780
4156 780 909 -896 -267 925 7 -579 187 962 -593 -905 578 888 -874 -962 787 456 -1204 -791
4174 -791 884 -83 -1334 -431 873 -475 -1166 122 868 -593 -1154 351 430 -1089 -660 640 -31
4191 -31 -1380 -373 1065 -93 -1306 163 994 -521 -1062 498 999 -907 -506 1095 563 -765 94
4208 94 1161 132 -879 534 1431 -236 -658 957 884 -522 -435 1339 906 -868 -43 1160 397 -749
4226 -749 451 1369 -29 -604 736 1023 -738 -574 878 694 -776 -249 917 81 -1109 -462 917
4243 917 -278 -1341 214 907 -615 -1182 634 483 -800 -457 452 141 -1150 -514 613 -330 -1154
4260 -1154 128 629 -680 -1204 663 693 -887 -808 919 436 -1069 -384 1145 303 -1264 -24 790
4277 790 -62 -988 536 922 -817 -335 960 608 -453 -550 967 339 -855 276 1185 25 -694 729
4295 729 1028 -351 -630 962 713 -614 -157 769 301 -722 -91 672 13 -836 450 909 -354 -444
4313 -444 374 566 -857 -904 964 182 -1637 -390 715 -156 -1105 -160 836 -436 -875 -157 130 -981
4331 -981 -729 711 212 -608 -472 665 -273 -1234 -63 834 -722 -1148 360 786 -542 -711 665 375
4349 375 -1171 -225 853 -149 -854 26 826 282 -534 465 614 -355 -966 992 1125 -1264 -658 1434
4367 1434 416 -806 235 1050 292 -674 242 981 -4 -520 808 873 -572 -227 1087 386 -821 23
4385 23 1271 -78 -957 51 902 -405 -887 613 337 -751 -758 572 151 -864 -419 747 -379 -1456
4403 -1456 46 601 -636 -1169 533 413 -1131 -654 776 167 -1060 -542 1018 290 -1086 -235 996
4420 996 -231 -1062 180 433 -514 -795 769 667 -944 -155 1066 311 -877 -18 1218 107 -657
4437 -657 366 1000 -525 -615 828 1130 -495 -249 966 692 -692 153 897 354 -654 310 602 -264
4455 -264 -568 628 446 -991 -260 489 780 -435 -346 858 -240 -808 277 1010 -309 -1040 131 564
4473 564 -896 -838 360 186 -697 -490 505 -27 -923 33 776 -186 -785 236 599 -509 -686 514 710
4492 710 -676 -537 417 81 -954 -112 730 -293 -674 526 774 -308 -518 711 664 -511 -128 980
4510 980 362 -598 -109 989 199 -657 214 1000 70 -707 470 755 -219 -305 710 484 -660 22 785
4529 785 1 -467 194 886 -292 -704 582 741 -591 -428 552 517 -896 -325 717 25 -750 -271 631
4548 631 -358 -1082 306 567 -676 -748 661 596 -944 -615 948 183 -940 -441 842 167 -980 284
4566 284 669 -620 -547 226 519 -815 -334 516 189 -750 -252 681 47 -683 245 1098 -120 -562 525
4585 525 1006 10 -447 991 717 -511 -157 789 163 -646 513 1036 -142 -548 616 684 -593 -383
4603 -383 858 458 -608 -301 966 242 -520 -250 858 -281 -868 201 499 -574 -701 359 322 -989
4621 -989 -378 752 134 -1072 -79 692 -372 -714 40 573 -630 -819 366 456 -925 -621 540 365
4639 365 -1006 -237 576 -346 -1027 104 354 -485 -444 357 642 -494 -496 564 162 -294 -138 806 192 -407
4659 -407 146 917 189 -456 304 756 -508 -528 852 572 -341 -143 1116 297 -294 49 1004 66 -791
4678 -791 485 745 -263 -549 526 674 -549 -467 533 335 -698 -90 494 -222 -551 -29 626 -133
4696 -133 -767 402 348 -710 -528 423 -233 -1084 -240 797 -181 -797 -108 835 -479 -912 178 385 -671
4715 -671 -547 450 70 -818 -132 708 127 -1083 31 746 -71 -874 349 590 -622 -420 720 578
4733 578 -504 20 558 184 -871 141 708 -131 -166 463 650 -104 -382 890 741 -347 -318 1172 371
4752 371 -416 34 785 68 -649 240 702 -15 -406 399 277 -617 -298 694 420 -758 -325 622 -250 -885
4772 -885 7 808 -395 -993 185 346 -303 -701 397 196 -489 -244 681 -213 -829 -277 478 -374 -431
4791 -431 265 308 -400 -469 223 213 -601 -323 409 119 -738 -146 728 -203 -338 -14 1086 -489 -16 764
4811 764 542 -483 -179 662 314 -185 78 927 67 -598 367 1049 -106 -562 495 496 -610 -178 819
4830 819 607 -417 136 829 -59 -684 -42 629 -239 -628 585 885 -755 -537 404 258 -822 -502 501
4849 501 -50 -476 -100 400 -220 -555 109 567 -547 -541 623 112 -501 -574 732 -15 -887 43 522 -173
4869 -173 -747 -168 644 -400 -534 349 557 -327 -188 858 331 -799 -173 730 116 -353 359 847 -258
4888 -258 -444 347 307 -203 -13 605 389 -480 212 752 185 -430 123 846 47 -459 263 650 -515 -310
4908 -310 433 168 -375 18 526 -5 -635 166 665 -101 -591 155 495 -649 -500 235 288 -663 -318 428
4928 428 273 -754 82 399 -52 -370 18 455 -437 -615 132 191 -698 -222 517 31 -741 -43 436 23
4948 23 -753 -160 311 -186 -435 341 590 -362 -220 532 282 -719 24 725 293 -741 193 722 117 -498
4968 -498 387 514 -310 -412 510 393 -396 46 727 61 -413 217 740 -99 -398 255 520 -244 -394 436
4988 436 400 -505 -274 549 86 -744 -206 389 -57 -478 75 585 -470 -613 324 54 -539 -277 505 -49
5008 -49 -635 -285 550 -96 -543 271 523 -217 -637 330 389 -583 -414 576 345 -405 -273 694 -57 -572 -26
5029 -26 626 -357 -404 535 652 -352 -462 682 377 -444 -100 584 188 -459 115 811 205 -536 446 386
5049 386 -333 -315 479 288 -520 98 768 232 -471 -254 845 -196 -735 98 419 -5 -465 138 363 -517
5069 -517 -34 476 -72 -615 -313 640 -92 -756 -157 575 -330 -521 -6 252 -485 -521 635 90 -714 -210
5089 -210 460 -125 -624 7 454 -61 -511 120 383 -232 -406 372 425 -339 -547 453 273 -587 275 659
5109 659 60 -262 256 612 -153 -245 541 588 -181 -132 638 111 -215 66 554 90 -413 407 515 31 -369
5130 -369 336 275 -397 -362 442 354 -366 -315 390 -78 -646 -255 552 -220 -302 461 122 -414 -484 238 55 -614
5152 -614 -84 250 -36 -715 77 472 77 -605 81 317 -274 -538 280 282 -514 -248 349 123 -352 149 480
5173 480 -75 -586 227 609 -24 -361 463 506 -155 -259 629 362 -580 -247 624 -93 -345 434 647 -75
5193 -75 -153 421 467 11 -214 351 309 -324 86 390 -79 -599 157 567 -13 -407 201 259 -241 -235 377 99
5215 99 -484 -341 487 -61 -712 104 344 -263 -736 177 536 -363 -644 226 205 -633 -383 293 65 -767 -117
5236 -117 529 -4 -498 224 364 -467 -689 345 273 -346 -179 400 52 -342 -226 572 120 -552 259 329
5256 329 44 -455 297 605 -264 -41 552 497 -337 -74 364 310 -174 32 610 -53 -325 523 170 -127 -169
5277 -169 456 156 -218 -88 627 171 -299 260 244 -121 -445 82 274 -454 -445 43 264 -583 -343 318 164
5298 164 -642 -119 274 -254 -804 50 333 -407 -389 203 -75 -332 -330 344 113 -679 -306 348 -315 -527 50
5319 50 211 -215 -479 215 318 -224 -296 493 160 -343 158 696 -52 -287 28 412 -173 -242 420 750 -203
5340 -203 -150 289 280 -275 -50 652 68 -379 95 728 37 -236 183 473 -40 -205 384 296 -479 -123 40
5361 40 36 -251 134 295 -180 -437 -328 -2 -484 -621 3 612 -932 -297 638 -231 -375 -155 226 35 -136
5382 -136 71 236 -193 -433 118 192 -194 -247 234 -45 -391 -294 434 -52 -586 -147 474 -265 -353 158 421
5403 421 -260 -255 128 295 -241 -330 668 -170 -592 3 355 104 -235 142 474 -96 -324 531 444 -294 61
5424 61 663 99 -251 199 362 82 -261 5 437 -30 -263 569 185 -12 -254 406 195 -327 -58 293
5444 293 227 -596 -159 456 -147 -278 -67 313 -310 -455 189 233 -674 -357 132 144 -397 36 396 -282 -247
5465 -247 193 170 -301 -331 560 372 -597 -235 338 -5 -505 -72 237 -16 -330 290 586 -167 -220 401 282
5486 282 -229 202 467 176 -207 43 564 -26 -201 135 461 20 -317 319 299 13 -128 285 156 -275
5506 -275 -32 454 161 -174 227 575 -134 -300 319 372 -317 -333 329 -48 -229 -157 332 -12 -361 -306 325
5527 325 -89 -432 -74 426 -292 -502 313 229 -385 -317 375 -148 -503 -227 238 -40 -462 -55 396 -398 -449
5548 -449 271 71 -169 -129 381 30 -224 57 459 -49 -379 300 59 -198 -150 267 422 -315 -102 151 245
5569 245 -70 -55 707 -49 -293 80 300 112 -405 353 99 -151 -89 345 205 -183 -277 402 55 -419 -101
5590 -101 555 127 -719 116 539 -187 -518 131 118 -284 2 95 122 -504 -256 164 41 -617 -135 267 -345
5611 -345 -544 206 209 -306 -380 279 -6 -418 -490 193 -192 -529 17 406 82 -293 467 85 -139 -276 450
5632 450 43 -183 -147 708 248 -33 -75 397 -74 -295 231 92 -95 -360 196 202 -78 -282 168 344 -317
5653 -317 -55 484 59 -378 247 364 9 -205 409 330 -152 -151 427 81 -531 -77 485 -229 -429 -12 362
5674 362 -41 -417 230 369 -359 -204 485 129 -260 -269 424 -37 -452 -90 407 -525 -469 -359 645 -430
5694 -430 -539 -128 121 238 -253 -250 -85 -826 -61 496 -83 -20 226 402 -331 -198 2 434 -59 -520 162
5715 162 398 -225 -81 222 1069 604 320 297 22 -265 258 443 139 -161 653 155 -541 -61 177 -12
5735 -12 -480 375 623 -229 -344 239 258 -400 -358 173 309 -502 -90 330 166 -430 50 528 -93 -503 142
5756 142 221 -357 -239 238 185 -526 -376 49 -133 -597 -7 56 -32 -456 120 170 -302 -299 198 121 -447 -279 337
5779 337 27 -224 30 527 138 -495 35 353 232 -322 342 465 -271 -76 588 58 -241 32 475 104
5799 104 -283 318 294 -225 -351 12 338 -443 -233 485 290 -423 37 772 124 39 -50 157 -166 -55 195
5820 195 196 -135 -164 255 266 -232 -375 152 6 -288 -115 122 -256 -339 -55 76 -329 -278 -10 -40 -363 -341 132
5843 132 -265 -462 -507 -30 391 -157 -316 352 -406 -59 -132 73 -220 -307 347 252 -121 -2 444 -36 -262
5864 -262 116 594 -96 -209 342 238 -127 -57 211 170 -206 171 220 272 -299 -4 559 114 -379 73 201
5885 201 -33 -467 198 252 -128 269 120 64 -530 -91 539 -80 -282 75 363 -271 -112 149 128 -413 -429
5906 -429 426 178 -357 32 281 30 -410 33 251 -81 -560 -23 234 -195 -192 6 217 -375 -136 17 91
5927 91 -343 232 270 -207 -822 -62 498 -359 -771 310 38 32 -48 125 -229 -318 -30 268 82 -63 -78 145
5949 145 -189 -112 371 281 -99 -303 435 52 -104 105 536 -36 35 105 414 -132 -323 429 104 -269 -326 321
5971 321 175 -439 189 180 -221 -440 -69 -20 -247 -348 218 311 -318 -459 242 114 -402 -271 274 -175 -240 182
5993 182 418 -82 -168 374 433 -211 -329 285 -6 -334 -105 169 181 61 60 200 36 -107 45 31 -296 -210
6015 -210 146 265 -43 -88 398 -59 -387 247 419 42 -93 49 521 41 -145 223 188 -191 -113 78 244
6036 244 -343 -36 339 101 -118 120 -23 30 -105 349 136 -156 -298 340 146 -477 -69 186 -284 -135
6056 -135 135 82 -257 -414 113 80 -234 -374 198 49 -515 -211 432 276 -235 -141 151 80 -371 -6 208
6077 208 -20 -68 47 164 -133 154 159 181 -622 131 416 6 -342 112 298 -139 -70 65 360 33 -109 304
6099 304 212 -233 143 508 411 -391 109 473 -127 -28 255 173 96 -243 271 -89 48 22 155 207 -202 12
6121 12 193 -28 -70 77 258 -87 -306 24 25 -105 -385 194 -200 -457 -182 -20 -88 -397 286 84 1 -111
6143 -111 84 123 -227 -309 195 389 -284 -78 218 -224 -372 12 -53 -229 -235 268 411 -275 97 510 193 -308
6165 -308 217 488 14 -5 54 443 -126 -206 269 289 -17 -91 506 173 -213 39 316 348 -182 48 -13 121
6187 121 -410 266 291 -183 -345 -88 184 -191 -153 -107 72 -285 -289 -84 -94 -108 111 146 54 -479 341 100 -240
6210 -240 -31 32 -39 -651 36 374 -164 -461 222 213 -252 -56 217 269 -176 -57 56 207 -289 75 218 -60
6232 -60 -149 188 432 -187 -214 81 432 123 -283 275 184 -376 -52 329 155 -126 85 313 36 -40 298 218
6254 218 -138 -140 293 279 -201 -218 340 166 103 -50 103 5 -383 258 222 -59 -290 157 -194 -242 -65 132 -168
6277 -168 -219 -37 136 -342 -496 268 46 -173 -151 47 80 -347 -375 -46 392 -269 -259 238 -86 -254 11 -176
6299 -176 -282 -58 294 310 -197 -5 1 147 -143 -365 625 -67 -196 100 386 -36 -395 54 -14 90 -307
6320 -307 235 324 -217 -103 117 111 -148 -18 283 -147 24 262 371 66 -176 264 201 -125 -130 240 191 -166
6342 -166 -107 388 -57 -217 45 475 -278 -371 -11 102 -328 -234 20 30 -179 -150 158 139 -259 0 -133 -95
6364 -95 -345 -88 113 -314 -202 230 283 -254 -62 224 150 -77 -20 380 -212 -104 160 -127 -6 -53 303 3
6386 3 -343 -14 42 343 -150 -143 233 -91 -35 211 91 47 -117 110 47 -211 103 175 63 -232 -63 346 -296
6409 -296 -208 -53 279 -200 -11 -55 178 -190 35 128 326 -61 173 183 -72 -120 -80 166 -138 -156 81 133 -330
6432 -330 -316 -86 147 -146 -90 158 -33 -103 81 112 148 -220 155 344 -265 -193 330 -15 -135 -141 220 10 19
6455 19 189 260 -84 -462 -206 62 45 -115 146 133 -185 -249 316 258 -57 180 207 150 -237 -5 340 -162 -120
6478 -120 224 258 -217 -287 318 92 -134 -86 230 -51 -3 7 256 19 -182 277 250 -17 -162 -67 142 -168
6500 -168 -215 234 -114 -300 -155 308 -177 -540 211 308 -31 -277 123 238 -148 -491 264 -53 -289 -349 300
6521 300 -54 -345 -45 131 15 -188 243 57 -252 204 229 70 -243 199 270 -58 -164 -165 384 72 -118
6542 -118 76 267 -67 -98 97 140 -57 84 180 152 -258 146 398 288 -243 119 332 -153 82 234 268 -295
6564 -295 88 195 5 23 38 32 -219 -300 67 -147 -167 -278 128 252 -59 -313 369 194 -250 -137 -22 -400
6586 -400 -200 -10 -95 -109 -181 173 126 -131 -55 -47 89 9 -8 370 65 124 -39 239 309 -250 122 267 -233 -179
6610 -179 -58 83 -88 13 270 315 27 187 350 -80 36 19 194 -32 -311 355 171 -314 -94 225 -23
6631 -23 -167 74 272 116 -259 259 242 -291 -255 284 21 -17 -72 138 -137 -524 -116 202 260 -352 -323 78
6653 78 -127 -54 113 -30 -284 238 427 -361 -183 -85 455 168 -259 -293 -52 58 -228 -22 105 -115 -71 179
6675 179 -34 -355 -101 141 47 -424 16 315 -62 -293 -4 -6 -175 -177 90 275 61 -44 182 86 -418 -242
6697 -242 396 -297 -236 368 217 78 -317 205 107 -108 -270 325 209 -104 249 233 55 -217 84 485 -41
6718 -41 -183 90 243 -175 -128 83 185 -233 -212 254 4 -190 -56 -14 156 -256 -78 74 -402 -25 147
6739 147 226 -159 -164 35 23 -346 -16 239 -73 -14 59 40 -207 -125 -424 138 -153 166 144 482 -252 -163 -297
6762 -297 -51 -239 424 384 164 -19 250 -79 132 -172 -24 373 -390 94 -188 -68 410 130 -109 774
6782 774 -62 -226 -416 -1 -510 501 54 -223 299 317 -33 -22 83 208 -219 -44 -92 420 -267 -233 249
6803 249 292 -82 -147 -104 160 -127 178 119 -28 -341 20 425 -25 -280 192 73 -231 -285 118 14 -241 -10
6825 -10 255 86 -178 25 440 -56 -294 261 321 -101 -63 176 112 -215 -94 260 40 87 24 122 -81 -231
6847 -231 350 216 -142 -38 172 -31 -65 -46 332 124 -108 157 271 35 -160 38 300 -56 -216 217 4
6868 4 -232 -289 164 27 -406 94 179 124 -214 -39 -3 -373 -289 -81 34 -29 -98 168 -68 -514 106 287 -207
6891 -207 -21 8 69 -137 -114 263 263 -142 -314 60 201 -84 110 123 -22 -241 -70 202 18 -481 239 9
6913 9 -1 -87 -148 110 -67 194 217 180 -116 -68 203 -97 -432 153 428 117 -40 304 324 -157 -137 172 237 -199
6937 -199 -62 110 -73 -238 4 158 -118 -366 204 62 38 -239 69 -104 -7 37 281 -115 -167 186 201 -73
6959 -73 -176 -35 104 -327 -209 133 113 -244 -341 183 -68 142 -73 23 -194 -349 -107 59 -287 -160 134
6980 134 68 -145 -49 233 -33 -138 90 315 96 -101 -161 236 85 -50 192 150 -218 18 18 306 -211 93
7002 93 158 -73 -116 158 235 -281 -162 85 317 256 18 188 37 -220 -118 5 -33 -190 285 15 -99 32
7024 32 22 288 -350 -56 118 40 98 170 58 -145 -236 -48 119 -13 -242 92 -71 -200 -280 -133 241 -58
7046 -58 -210 -2 -37 -43 -179 158 -199 181 -198 136 -261 -262 327 295 -270 -24 286 305 -36 363 132 202 -413
7069 -413 83 348 68 -368 235 107 154 -310 -79 275 -122 -296 -47 468 -161 15 100 -29 16 128 248
7090 248 -226 -230 270 -98 -67 -42 39 224 25 46 216 -71 90 108 -63 -298 -110 -213 11 -78 22 142 41
7113 41 -120 2 113 -18 -113 -122 -31 46 -3 34 50 12 -55 -39 69 -250 -191 402 -145 -109 78 363 -97 -176 -33
7138 -33 194 -26 205 371 176 -73 -173 -86 -43 -324 316 245 -70 -482 337 494 -21 128 228 130 -214 168
7160 168 36 -87 216 247 -56 -67 -302 127 88 92 -41 160 58 -151 -465 315 52 -670 -442 -10 -91 581
7182 581 454 -26 -233 62 -243 -144 -89 -584 -3 -361 -74 -225 362 327 54 -281 186 -638 842 424 -150
7203 -150 136 176 -59 -834 -606 113 352 -50 -252 -198 122 267 -181 355 542 672 -553 240 -351 -137
7223 -137 339 56 146 -100 396 81 -139 280 -409 341 282 -160 -60 475 477 85 534 -122 -410 -171 7
7244 7 -81 265 240 -97 -73 -262 -62 14 -189 241 44 -128 -455 -139 212 314 233 -18 35 537 -119 -39 149
7267 149 -18 -78 -220 -180 -102 -66 229 -394 -347 -238 418 122 -118 -19 169 -241 -20 315 -51 5 202 183 -34
7290 -34 -126 62 -10 -72 -76 22 -20 -2 -283 194 44 83 83 102 27 -72 107 16 259 -131 -42 121 175 -56 256 375
7316 375 -103 -18 469 -55 -197 26 47 175 -276 -92 -2 -170 -149 -51 136 -141 -148 -61 137 -90 49 76 -22
7339 -22 -165 -245 -27 137 -380 -96 98 69 -124 68 212 7 -150 -21 -240 -96 -163 -23 109 22 -103 51
7361 51 -313 -256 -64 110 -59 9 371 210 -30 -72 231 30 -6 120 264 -319 -251 93 340 -31 81 271
7383 271 130 -294 -182 -25 -174 -94 97 413 8 -401 -91 3 53 -391 246 218 35 -57 19 -288 -72 -147
7405 -147 234 -45 -186 -106 162 -180 -128 -77 -110 -169 -74 103 16 -204 -64 155 171 -114 43 112 -213 -133 320
7428 320 -83 -115 -178 297 -232 -154 78 -13 70 -448 -63 283 16 55 96 329 -104 -246 131 136 77 152 -168 -312
7452 -312 -326 53 218 -303 -211 -99 331 27 105 -261 48 -130 -26 -78 287 -40 210 -132 -255 317 99
7473 99 157 133 38 203 172 -320 119 211 -172 257 84 -344 -127 -314 23 -22 -435 -136 55 73 -54 18 210
7496 210 -185 212 99 500 -331 -379 56 168 92 154 34 59 -560 54 -87 -329 -470 87 60 410 309 297
7518 297 137 23 -235 518 753 -114 -43 83 360 -253 11 1027 234 146 -250 518 123 -73 -113 -94 544
7539 544 -470 498 -175 -212 -548 470 13 -481 189 70 233 -460 -307 -263 -385 -302 -290 548 -306 -192 476
7560 476 40 -39 -346 415 -130 -537 173 22 -512 458 71 92 368 -117 -287 -957 -564 199 252 -384 -67
7581 -67 316 -175 -106 222 -38 336 -384 -421 -2 267 -485 202 147 561 2 -381 455 -31 -146 -223 221 -205
7603 -205 -204 -24 329 -408 -75 7 248 248 42 327 230 145 37 286 80 -302 -211 458 -1 -188 219 -3 -118
7626 -118 -173 443 242 92 15 29 42 -243 -241 371 417 -419 -330 298 -561 -39 94 5 269 -486 44 125 -4
7649 -4 -183 -129 -138 -108 586 -245 59 -21 -180 38 -360 -260 209 -32 25 27 185 -122 -33 24 7 21 -94 335 20
7674 20 24 -56 327 -11 -367 -183 82 -124 49 102 366 14 -355 267 37 -316 20 82 490 69 -75 397
7696 397 56 -119 -182 272 -179 -342 -238 86 129 -83 132 351 -254 -214 70 456 -107 -106 78 228 -91 -281
7718 -281 219 -5 -6 11 163 128 158 -139 -139 -39 -164 133 -252 -281 232 42 -31 -51 129 417 304 270 141 278
7742 278 -376 292 33 187 441 309 577 -575 -196 -47 123 18 -423 -264 -154 -116 161 860 12 -100
7762 -100 56 30 145 20 -119 93 -146 -463 180 671 -169 -481 249 376 -119 -216 108 -208 -240 328 -88
7783 -88 406 -156 272 -537 -116 59 123 -755 -411 55 611 202 192 252 229 -75 -192 211 43 -19 162 6
7805 6 401 -100 -207 -42 356 -535 304 189 -422 1175 604 320 -242 127 1 -253 -137 -222 204 167 440
7826 440 500 -39 -202 35 -17 -121 250 246 -218 185 382 363 -22 -436 -224 -313 -302 -513 -410 276 490 537 -523
7849 -523 -235 479 306 -267 -5 -46 -76 -308 -426 -596 -381 126 -226 -122 1095 97 291 173 -604 223
7869 223 -256 394 -412 -10 -9 -280 569 158 100 88 -30 -363 413 -876 -218 205 -549 480 567 -64 666
7890 666 173 528 53 -783 -53 297 -91 -47 107 -46 -397 559 40 360 -101 -336 -157 -288 50 -522
7910 -522 224 -344 125 -381 -480 -266 -139 276 -113 -358 -483 -210 -39 -49 277 -198 -69 101 145 79 -429
7931 -429 149 651 -458 -702 -112 -2 -355 -385 214 156 -236 -110 229 285 -185 -201 -260 -176 -6 -49 -33 -335
7953 -335 -70 600 55 146 -228 45 -344 324 486 63 540 -564 88 -94 -301 344 329 -228 -44 51 -70
7974 -70 -214 86 275 67 383 -298 150 271 -217 -247 43 199 -144 -216 413 -14 99 -11 242 -767 172
7995 172 -201 103 -180 317 178 93 -338 289 95 -615 174 -79 207 -276 -195 -6 70 32 -44 -87 155 115
8017 115 -99 51 16 -12 -87 149 -15 -213 -225 76 63 -179 82 28 -320 -295 -100 188 91 -74 -98 10 -212
8040 -212 -10 188 -133 -154 -95 231 104 -118 -28 289 134 -306 73 168 -22 172 -289 403 -53 102 360
8061 360 121 29 -53 231 256 -147 -49 -17 -110 68 -202 207 -239 108 83 -38 -70 -338 -206 -139 -198 9 14 -63
8085 -63 -352 76 344 -345 -168 104 -65 -192 -255 -12 76 -110 -372 363 -61 -275 178 173 -178 18 48 53 107
8108 107 153 114 -5 -65 50 43 -78 -54 -16 -40 75 -134 246 -9 154 -16 254 477 -193 158 133 -90 52
8131 52 322 244 52 20 120 98 -76 154 157 83 -145 -46 159 -9 -234 -57 369 155 -231 -78 174 44 257
8154 257 216 48 -339 12 254 -168 -76 -93 95 -164 47 -283 57 -331 -243 55 -89 -153 -44 282 -107 -129
8176 -129 32 297 -31 -141 140 -46 -137 -230 51 105 122 -306 226 229 -25
8191b5
$$ Imaginary data points
##PAGE= N=2
##DATA TABLE= (X++(I..I)), XYDATA
0 0 0 0 0 0 0 0 0 0 -8 8 -8 8 -16 16 -24 24 -32 40 -48 56 -72 86 -100 120 -136 160 -187 216 -248 284 -324
31 -324 371 -419 475 -534 603 -675 755 -844 939 -1047 1161 -1285 1423 -1572 1737 -1915
47 -1915 2112 -2325 2561 -2821 3108 -3426 3780 -4180 4630 -5142 5733 -6424 7239 -8222
61 -8222 9432 -10964 12971 -15722 19727 -26101 37757 -65730 262411 142359 -339972 278672
73 278672 -68652 -71194 116485 -169343 132112 117610 -194279 120066 35297 -60221 39342
84 39342 -19760 56241 3906 -79530 88335 21140 -76213 29216 54224 -35560 -35426 14122
96 14122 31589 -7094 -53368 34446 55957 -96906 -16893 63157 -39614 -38957 -11932 55899
108 55899 12926 -115634 48599 58556 -93474 -22184 6111 36099 -19199 -103165 72608
119 72608 32214 -96503 10839 28988 18916 -45601 -45920 90221 -42607 -72274 77711
130 77711 -3759 -19394 -9497 -8768 61205 -59557 -30597 102941 -22400 -29671 26774 7675
142 7675 25278 -57468 6067 100867 -55794 -19731 85426 -11127 -14540 -2056 18097 51947
154 51947 -61999 -10721 100295 -34415 -38815 57639 15440 325 -27497 1732 77349 -47411
166 -47411 -53648 91388 -11804 -64550 31702 6661 7543 -16966 -35821 73385 -16071 -84876
178 -84876 64816 5392 -58190 10388 -10308 24194 -20507 -61831 72138 -8698 -83395 41665
190 41665 11033 -27740 -20854 -13754 46632 -38384 -53777 57815 3937 -34631 -4196 18329
202 18329 19968 -60224 -9723 58982 -32779 -23880 29632 20603 -6916 -44405 33221 44832 -55003
215 -55003 3492 53530 182 -19045 -13403 37114 18300 -52690 20106 59854 -23348 -15162
227 -15162 40885 18604 -18581 -15561 27095 25199 -39965 519 64350 -12058 -31587 24020
239 24020 20181 -1804 -38490 10883 57804 -44444 -24594 46737 -13375 -18049 -12609 13751
251 13751 32411 -58563 5104 58608 -58486 -20685 21134 -9992 255 -48295 16111 53921
263 53921 -74693 -11558 53371 -33534 -18563 -8436 4097 18536 -57136 2811 54082 -48545
275 -48545 -15033 40989 -12181 -17454 -15127 13119 29966 -47526 -9584 62201 -21549 -35016
287 -35016 29532 21437 -687 -22402 11732 42954 -30362 -16585 48554 1792 -19657 5265
299 5265 22751 12864 -34099 15678 55856 -21338 -18451 29453 15994 -13268 -28326 32182 36254
312 36254 -42009 522 38336 -12438 -16439 -2339 24022 9235 -42330 17191 33913 -42280
324 -42280 -15979 28046 6235 -22782 -20493 32916 7926 -52233 5373 26362 -24572 -23086
336 -23086 -1413 18742 -7931 -37036 23328 20173 -39971 -9134 17765 -1224 -26139 -18070
348 -18070 36591 -2156 -50642 24112 24118 -31177 -7550 10340 20271 -7312 -35859 34183 17877
361 17877 -49114 13653 32574 -7593 -4904 -2855 29101 5078 -44662 32264 35689 -37089 6942
374 6942 25304 2944 -1458 -18869 33230 28758 -45131 17635 43689 -27713 -10853 14634 14868
387 14868 67 -27940 26088 30059 -39811 -1587 31440 -7507 -15095 -3299 20583 3361
399 3361 -36128 8891 26481 -27375 -21656 16451 12015 -24435 -21233 29625 5840 -40646 -962
412 -962 18734 -11637 -24730 -4012 26759 -9157 -34948 20750 12146 -33379 -9180 13366 6000
425 6000 -21953 -13760 34463 -2857 -37686 17666 21954 -11996 -13982 6905 26836 -14420 -29018
438 -29018 28854 12815 -24035 4773 23315 9045 -18124 -882 35936 -8449 -23850 30921
450 30921 16964 -16889 -6443 14032 24983 -15052 -17509 42597 6736 -32030 13464 15974
462 15974 117 -10689 -5792 35007 -9097 -32015 38138 6822 -30458 8063 5989 5978 -17207
475 -17207 -21705 39423 -2543 -42950 20285 12994 -19588 -13886 -469 20352 -14344 -27813 24052
488 24052 1602 -34314 -675 13367 -7359 -18878 -354 20269 -10346 -30129 12263 19606
500 19606 -23813 -17263 21168 11365 -23025 -12085 23323 3703 -24098 6699 22527 -5525
512 -5525 -16182 8062 21786 -14077 -16106 28726 11923 -17492 213 21598 14539 -21226 -3133
525 -3133 37214 -7596 -21579 18895 14192 -1990 -10488 8690 26763 -18584 -12152 32244 623
538 623 -17762 3840 14962 4038 -25265 3561 33160 -18036 -18626 21058 4436 -14964 -14500
551 -14500 9527 16150 -25721 -9006 27057 -10973 -22668 3673 8724 -3294 -23918 4056
563 4056 23869 -26207 -20168 22092 -3077 -21479 -5114 11631 8339 -23733 -6500 28176 -14190
576 -14190 -26315 16586 8071 -12357 -8628 6288 19277 -16552 -18482 30733 1580 -24890 13027
589 13027 14371 497 -9482 -1146 27228 -8766 -21588 27456 12477 -13995 -108 16539 15191
602 15191 -19340 -4943 30559 -3214 -15974 11637 17845 -1389 -16865 14008 19730 -16954
614 -16954 -4534 16855 4715 -13967 -9903 21721 3602 -26308 9679 20065 -12591 -17146
626 -17146 5025 13763 -12777 -19095 14760 10409 -22151 -9198 15496 -3376 -20131 -175 11373
639 11373 -5428 -21632 3362 19219 -21927 -17573 19633 791 -14371 -8493 10306 14410 -25829
652 -25829 -6883 25104 -12289 -14352 6339 9630 2012 -19247 12630 20438 -26595 -778 22819
665 22819 -1784 -6265 -2289 20215 8493 -27501 9138 24483 -12259 -5818 12800 13548 -1591
678 -1591 -14318 14023 16331 -18237 842 24738 -3101 -13331 7690 13609 -2851 -14787 8985
691 8985 21220 -14930 -15412 18924 6857 -16074 -6261 12912 6655 -18712 -2756 19840 -7979
704 -7979 -17048 6730 7128 -13110 -15080 10804 8785 -19622 -7799 13604 -219 -19079 -8247
717 -8247 18270 -1073 -25400 6287 13370 -14700 -11562 4707 9565 -9139 -14535 17652 4830
730 4830 -23157 3058 13188 -4200 -8700 992 20464 -1792 -21556 15562 14532 -16436 -2265
743 -2265 14010 9825 -7643 -7916 20164 5947 -17825 9408 17657 -4946 -7204 8119 16821
756 16821 -5945 -13695 18897 11876 -18027 -432 17175 1171 -11295 -1293 16576 1186
768 1186 -19236 8658 16096 -14047 -8506 9148 5761 -8920 -12929 13775 7594 -23740 605
781 605 15024 -10567 -12602 -295 9096 -4255 -19710 9560 12102 -20013 -8153 10569 807
794 807 -14131 -7337 14819 42 -21186 1805 12419 -9042 -13243 7886 12963 -10266 -9634
807 -9634 12457 4193 -14006 -4008 14968 4770 -14500 2788 18724 -5136 -13876 9857 13974
820 13974 -5803 -8584 12430 13717 -10724 -5800 18877 4501 -13008 6371 13705 -1248 -8204
833 -8204 3924 16899 -5506 -14890 17098 10489 -14391 -1179 12206 6323 -11179 -8098 16527
846 16527 596 -18026 7260 11171 -7625 -9873 2485 8122 -11930 -11942 15708 3641 -18249
859 -18249 -1666 10321 -3594 -16936 -2246 14969 -6125 -17508 6397 7801 -11487 -10414
871 -10414 5471 7599 -12303 -9122 14775 -1186 -17482 4650 11087 -5620 -10220 4435 14257
884 14257 -8313 -14337 14748 8934 -13529 -2119 11794 5737 -8397 -2639 16033 2171 -12269
897 -12269 8256 13725 -6229 -5623 11349 10581 -9098 -5834 16543 6854 -12709 1463 16312
910 16312 1788 -12597 1998 15131 -4441 -11022 10756 9558 -7509 -6333 8377 5522 -13820
923 -13820 -3713 15379 -2157 -12704 3143 8159 -3764 -15107 1856 13960 -12397 -12491 12251
936 12251 2522 -12730 -6367 6578 1905 -15274 -2901 12397 -7133 -13290 4627 5913 -8189
949 -8189 -10842 6976 9035 -13002 -7196 13389 792 -13251 -888 10054 881 -11305 3187
962 3187 14135 -6661 -9351 10580 6912 -5931 -3715 11175 9732 -11472 -1331 17968 -1771
975 -1771 -10045 7173 10911 -60 -8671 6304 15297 -9056 -7271 15883 4110 -8906 891
988 891 9749 4327 -10962 -1159 15907 -4046 -12006 9326 7659 -8068 -7419 5683 7082 -11628
1002 -11628 -6886 13503 -121 -14615 492 9317 -4853 -13116 2966 10036 -9245 -11491 6318
1015 6318 4885 -11033 -9098 9040 2347 -14246 -547 9564 -4522 -10308 547 9176 -5381
1028 -5381 -12378 9269 8882 -12135 -5223 9699 3569 -9885 -3883 12648 2914 -12173 3956
1041 3956 12466 -5197 -6583 7360 7719 -4203 -5107 10661 9083 -11893 -566 15425 -559
1054 -559 -7527 3072 12419 1962 -12490 6523 14542 -9031 -3901 10383 4195 -4410 -5881 8594
1068 8594 5440 -13788 1813 13102 -6431 -8474 4789 7772 -5431 -12859 7073 8187 -13974
1081 -13974 -5872 10294 426 -10159 -4734 5671 -542 -13037 -201 10649 -7960 -10670 7151
1094 7151 2833 -11071 -5776 7621 4133 -12330 -4842 12343 -1405 -13456 1617 9855 -3196
1107 -3196 -9130 4673 9344 -6213 -6746 8786 5068 -8946 -1043 12556 1088 -9658 3707
1120 3707 11120 -1778 -8276 5304 13030 -4459 -8632 11687 8109 -8522 -868 10067 4284
1133 4284 -6833 -854 12715 -849 -10681 7933 8239 -6782 -3667 6713 7511 -6516 -8530 11378
1147 11378 3368 -13183 785 9459 -1255 -8910 -1266 9095 -5042 -12425 6815 5532 -10629
1160 -10629 -4922 6080 1576 -10211 -5237 9037 -886 -13886 1519 8967 -6835 -9709 2976
1173 2976 5471 -6251 -8929 7077 5522 -11761 -2904 9355 -1655 -8244 88 9029 558 -10233
1187 -10233 5201 10523 -8091 -5522 9071 5729 -6090 -2548 11082 4143 -8889 2026 11307
1200 11307 -173 -7529 4768 11625 -3644 -6591 8841 7452 -5795 -3544 9579 5958 -9018
1213 -9018 -322 11310 -1347 -8519 3842 8343 -3327 -7876 5669 7803 -8659 -6940 8929
1226 8929 3051 -9897 -3096 7954 286 -10873 -1581 8184 -5226 -10502 4949 4447 -7938 -5859
1240 -5859 3810 2891 -9629 -6256 10016 -464 -12362 1206 6999 -3572 -10205 717 9485
1253 9485 -5370 -8388 8667 3958 -8031 -2641 5992 2486 -6963 -921 11724 -1114 -9122 6746
1267 6746 7896 -4479 -5575 6239 8942 -4995 -5856 11842 5205 -8025 1635 8870 1677 -5097
1281 -5097 2115 10350 -1529 -6860 8256 6989 -6822 -2667 8878 4330 -8445 -2213 10557
1294 10557 917 -9365 1850 8847 -2518 -8207 2235 6489 -6127 -7335 4981 3714 -8789
1307 -8789 -3247 7846 -1055 -11079 -595 7423 -4414 -10290 3485 7224 -7040 -9228 4592
1320 4592 4748 -8302 -5638 7281 1280 -8490 -2507 6427 -858 -9465 2956 7558 -6830 -5985
1334 -5985 6595 4177 -5467 -5076 8137 5241 -9401 385 11147 -84 -6294 2523 8330 730
1348 730 -6579 6343 8991 -5955 -2699 8376 3041 -4962 -284 8975 3190 -7676 2055 10756
1362 10756 -2525 -6843 6112 6848 -3068 -4648 5626 6126 -7202 -4940 9515 474 -8184 1892
1376 1892 6012 -1775 -8379 827 7013 -6616 -8342 6578 4159 -8438 -4756 6010 814 -9250
1390 -9250 -2461 6668 -2319 -9195 933 5740 -5841 -8536 4016 4580 -6772 -4810 6100 2668
1404 2668 -8791 -2589 8349 -875 -8150 3090 7604 -3121 -6407 4521 6522 -5465 -4941 8436
1418 8436 4695 -6502 -531 8654 2029 -6226 1401 9337 -352 -6074 6024 7817 -3998 -3335
1432 -3335 6732 5542 -5553 -2259 9976 2617 -8482 1817 8164 -1950 -6405 2276 8099
1445 8099 -2716 -7939 5456 4891 -7948 -2055 5924 307 -6224 -2634 5973 -1308 -10638 2496
1459 2496 7089 -7711 -6537 4036 3192 -6080 -7376 4371 4409 -9746 -3236 7367 -2755 -7052
1473 -7052 129 3904 -2821 -6812 3447 6496 -6596 -4690 7620 2286 -7791 -1245 6793 1565
1487 1565 -7612 259 9470 -889 -7318 4069 6959 -3476 -3747 6027 5478 -4266 -1225 8275 2035
1502 2035 -6739 1530 9809 -679 -6140 4933 7891 -3183 -5244 6011 6382 -4279 -3376 7123
1516 7123 3227 -6400 42 6661 234 -6058 1259 7239 -3586 -6752 5787 3746 -6211 -4480
1530 -4480 5738 2149 -8400 -3837 7083 -702 -8989 -44 5039 -3227 -7317 1431 4963 -6510
1544 -6510 -6599 5688 1454 -7920 -1460 5459 -382 -7831 -1714 7743 -2337 -8679 4801 6245 -5008
1559 -5008 -4200 4155 4416 -4714 -4322 8281 2805 -7646 2448 7659 -2009 -4291 3551 7166 -1560
1574 -1560 -4993 6432 6715 -6148 -2065 8249 2481 -4766 554 7697 1746 -6619 2209 8214
1588 8214 -3192 -5418 5873 5013 -4327 -3256 5968 2986 -7004 -2132 7037 -81 -7542 1069 6267
1603 6267 -3600 -6525 3221 3858 -5319 -5645 4351 2927 -8251 -3665 5613 -1173 -7358 -888 4978
1618 4978 -1986 -8158 1520 5211 -6115 -5475 4621 2576 -6424 -3183 6012 921 -7989 14 7208
1633 7208 -1757 -6156 2872 6213 -2778 -5552 4640 5586 -4758 -2378 7866 2023 -4871 1003
1647 1003 6329 1218 -5143 2277 8891 -2474 -5123 7194 5103 -3840 -2332 5862 5536 -5232
1661 -5232 -2190 9049 337 -6742 2886 5200 -1900 -3679 2860 5310 -4207 -5011 6383 2299 -7942
1676 -7942 -1274 6182 -199 -7128 -1166 6258 -1829 -8460 1451 5237 -5135 -5303 3903 1530 -6331
1691 -6331 -3237 4171 343 -7389 -741 6468 -3344 -8134 2681 4789 -4797 -5476 3866 4761 -5241
1706 -5241 -5025 5655 2728 -6010 -101 6420 -231 -4978 1884 6049 -2085 -4801 5242 5800 -5052
1721 -5052 -1962 7971 3188 -5193 -629 6921 2316 -5906 1621 7954 -1381 -4127 4049 5034 -2099
1736 -2099 -3173 5542 4544 -5902 -883 7127 -358 -6058 620 6420 -862 -7034 3383 5793 -5312
1751 -5312 -5373 3776 2508 -5315 -3350 4533 1099 -7367 -1556 5436 -3173 -7019 2349 3750 -4712
1766 -4712 -5672 2389 3697 -6413 -5132 6065 971 -7365 -883 4602 -780 -5992 -574 6056 -2925
1781 -2925 -6446 4514 4281 -5387 -2290 5503 2400 -4692 -1046 6652 1274 -5979 1614 7296 -2128
1796 -2128 -4390 5052 5487 -2499 -2525 5022 4788 -4758 -1820 8068 1824 -5217 2467 5822 -653 -4418
1812 -4418 2277 6319 -3137 -4143 6001 3867 -5767 -1919 5564 603 -5687 -387 6140 -999 -6826
1827 -6826 1943 5036 -4411 -5424 2990 2690 -5041 -4457 3733 1497 -7371 -1381 4858 -2339 -6541
1842 -6541 593 3971 -3687 -6719 3117 3985 -6361 -4097 5221 1957 -5331 -2672 5032 295 -6759
1857 -6759 788 5917 -2261 -4185 3412 3939 -3406 -3450 5343 4088 -5494 -846 7286 1130 -4808 622
1873 622 6997 751 -4622 3268 6992 -2285 -3282 5137 4389 -3985 -584 5545 1745 -4102 354 6154
1889 6154 -625 -5006 2620 6398 -3409 -3828 3753 3849 -4017 -4025 4192 2880 -6077 -1442 5883 -1182
1905 -1182 -5630 532 2766 -3898 -4874 2950 3014 -6056 -3777 5161 1411 -7139 -1523 4326 -603 -6054
1921 -6054 -1574 4820 -2000 -7006 2625 3189 -3856 -2665 3256 2322 -4784 -2429 5752 593 -6491
1936 -6491 1294 6435 -1189 -5297 3088 5971 -2647 -3864 5007 4323 -3764 -1661 5914 2412 -3907
1951 -3907 1005 6281 207 -4090 3296 5818 -2455 -3608 4716 4578 -3935 -2265 6364 2738 -5235
1966 -5235 -308 5823 492 -4707 717 5361 -2279 -5498 3325 3363 -5221 -3269 4134 1582 -5302
1981 -5302 -1860 4522 -714 -6852 -354 4212 -2813 -5931 2046 3690 -4361 -4917 2510 1983 -5847
1996 -5847 -3048 4770 20 -6410 16 4360 -2006 -4866 1891 4441 -3228 -4484 4083 3363 -5092
2011 -5092 -1845 5373 1316 -4564 292 5982 500 -4619 2325 6171 -1972 -3314 4544 4073 -3092
2026 -3092 -1720 5552 3009 -4091 423 6496 195 -4304 2512 5424 -2085 -4062 3935 4781 -3449
2041 -3449 -2800 5625 2582 -5095 -1301 4623 -259 -5508 689 4257 -1578 -4791 1865 2976 -3351
2056 -3351 -4502 2804 2551 -6050 -2818 4310 -609 -7091 -306 4330 -1939 -5909 1041 4223 -3537
2071 -3537 -5061 2847 2029 -4681 -1799 3758 654 -4901 -738 5091 -769 -5361 2665 5074 -3199
2086 -3199 -3920 4025 3816 -3133 -3100 4876 3274 -4299 -259 6100 459 -3755 2255 4543 -1071 -2561
2102 -2561 3899 4619 -3279 -2457 6059 2910 -4578 17 5781 995 -4107 -41 5420 -455 -4867
2117 -4867 2822 4623 -3129 -2425 3444 1480 -3862 -1559 4547 435 -6163 111 5111 -2811 -5411
2132 -5411 1979 3482 -3133 -4775 2321 3006 -5546 -3596 3667 -138 -5058 -763 3191 -1095 -5214
2147 -5214 783 3941 -4122 -4543 3006 2711 -4117 -2984 4300 2131 -5269 -919 5369 -84 -4276
2162 -4276 1425 4754 -1311 -3416 2805 3871 -2821 -1959 5426 2710 -3538 42 5433 914 -3826
2177 -3826 1391 6410 -337 -3984 3376 4441 -2201 -2391 4164 3581 -3083 -1434 4969 1083 -4950
2192 -4950 611 4737 -1340 -3783 2381 3527 -2569 -3617 2619 2492 -4672 -2982 3926 241 -5115
2207 -5115 -865 3333 -967 -5321 -36 4336 -2970 -5276 2678 1973 -5036 -2852 2582 1039 -4300
2222 -4300 -2080 4409 -529 -5494 960 3643 -2927 -3809 2449 3052 -2711 -3344 4212 2937 -4715 -758
2238 -758 5172 343 -3428 800 4314 -289 -3666 2630 4841 -2470 -1888 5287 2631 -3426 -347
2253 -347 4954 1593 -3644 1074 4979 -305 -3583 2574 4364 -2060 -3067 3654 3208 -3053 -1722
2268 -1722 3897 990 -4079 -217 4258 -979 -4440 1510 3731 -3138 -4458 2470 2722 -4369 -3414
2283 -3414 3262 1091 -4967 -1945 3538 -627 -5141 376 2806 -3010 -3854 1487 1803 -4009 -3308 3693
2299 3693 1580 -5173 -1264 4332 -102 -4568 -535 4246 -611 -4132 2039 4011 -2766 -2337 3858
2314 3858 1702 -3031 -292 4360 1053 -3731 568 5549 -648 -3683 3647 4668 -1923 -2171 3266
2329 3266 4008 -2558 -2135 4785 2025 -3362 831 4116 -25 -3065 1725 4204 -1997 -3348 3506
2344 3506 3121 -4081 -2465 4250 1372 -4299 -1019 4117 -39 -4615 -74 3447 -2173 -4330 1539
2359 1539 1653 -3568 -2889 2425 1128 -4885 -1858 3616 -805 -5243 -240 3486 -2090 -4866 1157
2374 1157 2790 -2860 -2905 2716 2275 -3600 -1981 3838 203 -4195 428 3956 -821 -3287 2110 3847
2390 3847 -1977 -2399 3589 2991 -2985 -1541 4557 1903 -3195 532 4734 635 -2601 1912 4455
2405 4455 -1073 -2753 3697 3193 -2681 -1256 3940 1764 -3231 -413 4522 518 -4089 901 4009
2420 4009 -2213 -3250 2665 2367 -2906 -2807 2622 2129 -4182 -1709 3788 -436 -4594 -110 2728 -2007
2436 -2007 -3903 616 2854 -3166 -3751 2923 1206 -4541 -1405 3141 -72 -4569 -827 3898 -1303
2451 -1303 -4460 1289 3377 -2177 -2781 2526 2497 -2754 -1823 3100 1032 -3468 83 4434 -541 -3411
2467 -3411 2366 4116 -1368 -2384 3593 3577 -2305 -1925 4179 2326 -2792 -182 4249 1165 -2860 1186
2483 1186 3805 -1051 -2422 2725 2798 -2708 -2013 3838 1990 -3833 -705 4174 -10 -4223 -212 3890
2499 3890 -1212 -3845 1049 2658 -2671 -3153 2505 1143 -3901 -1509 2614 -619 -4177 -492 2941
2514 2941 -1535 -4901 1321 2646 -3085 -3493 1642 1917 -3177 -3050 2730 1041 -3800 -396 3111 -941
2530 -941 -3107 1298 2746 -1645 -2494 2768 2535 -3266 -1722 4218 1527 -3365 -207 4301 1066 -2955
2546 -2955 811 4081 -538 -2569 2559 3155 -1720 -951 3474 2078 -2482 13 4161 768 -3267
2561 -3267 764 4246 -1061 -3226 2183 3195 -2140 -2318 2603 2063 -2578 -1714 2946 358 -3602 112
2577 112 2856 -1311 -3582 929 2585 -2605 -3228 2302 1729 -3769 -2315 2593 37 -4175 -1341 2492
2593 2492 -674 -3757 303 2458 -2161 -3316 1881 1853 -3213 -1844 2964 985 -3191 -587 3277
2608 3277 169 -3382 870 3882 -1304 -2514 2194 2628 -1917 -1682 3443 2451 -2512 -359 4275 1111
2624 1111 -3014 1104 3882 -663 -1964 2090 3382 -1501 -1790 3340 2469 -2378 -335 3665 819
2639 819 -2913 209 3354 -409 -3385 1307 2988 -1960 -2545 1877 1650 -2671 -1967 2321 193 -3351
2655 -3351 -464 2600 -1070 -3737 660 2608 -2251 -3279 1523 1633 -3534 -2576 2134 799 -3657
2670 -3657 -1431 2722 -187 -3469 272 2403 -1858 -2859 1477 1803 -2447 -1901 2842 1484 -3509
2685 -3509 -697 3652 495 -3061 550 3441 -147 -2581 1510 3245 -1012 -1637 3119 2117 -1934
2700 -1934 -15 3222 620 -2201 793 3982 -350 -2584 2219 3447 -1759 -1885 2593 2478 -1662
2715 -1662 -1586 2915 1406 -2818 -370 2970 -450 -2508 991 2374 -1897 -2725 1779 1590 -3166 -2247
2731 -2247 2488 604 -3640 -1057 2383 -205 -3759 -417 2531 -1521 -2879 1109 1395 -2813 -2114
2746 -2114 1656 907 -3161 -1056 2838 -496 -3632 503 3026 -1153 -2843 1632 2640 -1844 -1921 2528
2762 2528 2478 -2583 -677 2852 927 -1955 536 2828 -256 -2570 1825 3790 -939 -1619 2433 2606
2778 2606 -1683 -892 3133 1758 -2487 182 3335 22 -2591 1413 2679 -1149 -1874 1767 1891 -2158
2794 -2158 -1621 2691 746 -2986 -615 2524 -282 -2910 -165 2445 -1398 -2994 1236 1776 -2572
2809 -2572 -2204 1883 986 -3001 -1521 2203 -171 -3682 -195 2544 -1599 -2833 1093 1542 -2152 -2360
2825 -2360 1731 1378 -2859 -891 2546 111 -2768 -133 2722 -223 -2608 1166 3128 -1372 -1827
2840 -1827 2262 2184 -1706 -813 3040 1454 -2210 144 3443 265 -2245 1584 2928 -1028 -1425 2139
2856 2139 2755 -1849 -1470 3113 1691 -2335 -354 3221 364 -2635 655 2666 -986 -2122 1272
2871 1272 1943 -2121 -1910 2266 1035 -2956 -906 2506 -87 -3467 -389 2521 -1233 -2936 886
2886 886 1571 -1614 -2596 987 1049 -2623 -1336 2145 -423 -2900 -125 2047 -1201 -3046 921 2246
2902 2246 -1775 -2288 1981 1683 -2227 -1120 2230 1015 -1922 -375 2588 -61 -2099 1134 2617
2917 2617 -1055 -1216 2302 2148 -1703 -884 3178 1917 -2580 51 3282 949 -2000 697 3153 -325
2933 -325 -1809 1495 2110 -1350 -1175 2325 1157 -2023 -496 2666 167 -2446 342 2844 -1075 -2735
2949 -2735 1145 1911 -1667 -2266 1317 1293 -2237 -1564 1780 110 -2624 -465 1707 -1208 -2765 455
2965 455 1687 -2180 -2392 1489 1204 -2989 -1433 2219 400 -2628 -933 2265 -161 -2602 406 2094
2981 2094 -1200 -1720 1803 1243 -1450 -1272 2036 1053 -2161 -144 2749 212 -1961 1211 3032 -476
2997 -476 -1892 1687 2352 -1469 -1329 2531 1527 -1551 -28 2481 703 -1971 780 2453 -253 -1877
3013 -1877 1479 2071 -1222 -1587 1942 1446 -2139 -858 2235 340 -2509 -279 2147 -672 -2391 428
3029 428 1789 -1452 -2322 1236 1135 -2390 -1388 1716 212 -2778 -716 1900 -764 -2798 566 1517
3045 1517 -1745 -2090 1373 1340 -1971 -1813 1770 843 -2514 -593 2159 17 -2337 318 2064 -804
3061 -804 -1482 1559 1758 -1341 -1160 2367 1427 -1451 -239 2841 989 -1830 517 2828 -75 -1585
3077 -1585 1706 2476 -594 -723 2004 1818 -1204 -211 2637 -274 -1852 -364 2239 -807 -1819 982
3093 982 2354 -1308 -2054 1643 1546 -2015 -1588 1508 701 -1970 -777 1501 -499 -2540 233 1500
3109 1500 -1616 -2254 1031 752 -2352 -1557 1470 500 -2934 -1064 1795 -288 -2537 -50 2077 -895
3125 -895 -2199 751 1333 -1547 -1382 1621 764 -1864 -173 2142 382 -2197 397 2401 -437 -1847
3141 -1847 1430 2233 -938 -1173 1895 1777 -716 -668 2724 997 -1080 1083 2390 360 -1446 1452
3157 1452 1803 -965 -1288 2248 1871 -1715 -952 2356 785 -1833 -571 2297 -48 -2137 288 1704
3173 1704 -1037 -1966 1209 1070 -1597 -1334 1556 352 -2571 -910 1796 -416 -2589 194 1598 -1153
3189 -1153 -2344 356 1528 -1751 -1857 1375 379 -2015 -780 1654 -89 -2221 278 2006 -594
3204 -594 -1995 1142 1733 -1243 -1382 1748 1384 -1574 -792 2303 1110 -1958 301 2480 -121 -1432
3220 -1432 958 2287 -392 -1110 1715 1992 -1153 -597 2176 891 -1591 215 2100 179 -1767 799
3236 799 2339 -681 -1575 1387 1577 -1641 -991 1624 777 -2007 -594 1733 60 -2228 -87 1816
3252 1816 -953 -1996 720 1381 -1482 -1699 1254 633 -2635 -770 1525 -369 -2444 -532 1693 -637
3268 -637 -2435 589 1322 -1403 -1686 1115 1028 -1781 -1138 1318 183 -2042 -118 1906 -614 -2018
3284 -2018 1121 1703 -956 -1407 1784 1780 -1187 -695 1963 1246 -1471 -90 2071 413 -1158 820 2201
3301 2201 -150 -1181 1691 1803 -1235 -532 2167 1177 -1747 -644 2316 800 -2128 211 1946 -208
3317 -208 -1795 705 1361 -855 -911 1114 820 -1925 -717 1545 -64 -2209 -348 1622 -769 -2363
3333 -2363 488 1432 -1405 -2079 926 777 -2057 -1287 1340 331 -2181 -383 1455 -679 -1807 500
3349 500 1267 -1342 -1502 1327 1234 -1684 -1039 1935 713 -2074 -404 1770 241 -1387 299 2136
3365 2136 -409 -1536 1152 1452 -935 -915 1911 1070 -1408 77 2372 358 -1584 865 2514 -416
3381 -416 -1244 1223 1850 -465 -1012 1507 1311 -1046 -490 1885 450 -1444 238 1577 -583 -1737
3397 -1737 765 1575 -1480 -1399 1207 771 -1860 -1368 1147 350 -1995 -666 1560 -465 -2111 441
3413 441 1068 -1260 -1555 736 702 -1652 -1155 1220 252 -2158 -715 1526 -128 -2215 97 1613 -709
3430 -709 -1467 672 1561 -1098 -722 1239 1130 -1415 -281 1778 339 -1550 599 2365 -1228 -1486
3446 -1486 672 1555 -788 -726 1754 776 -1753 -547 2025 921 -1454 724 2243 172 -1492 863
3462 863 1915 -1636 -1269 1469 1761 -1452 3 1557 585 -1285 -156 1702 -280 -1447 268 1339
3478 1339 -1262 -2084 1014 1050 -1319 -2197 1119 834 -1712 -719 1419 50 -2368 483 1094 -819 -2163
3495 -2163 22 1345 -2100 -1046 1492 236 -1670 -416 1290 655 -1007 793 2377 -735 -1868
3510 -1868 430 1690 -909 -499 1275 1529 -1435 -366 1239 885 -954 1069 1874 -399 -1307 644
3526 644 2080 -183 -1139 1686 967 -862 -533 1901 937 -1240 5 1769 104 -1342 784 1574
3542 1574 -816 -1081 1058 1015 -1280 -1175 1616 493 -1764 -427 1416 52 -1876 -345 1318 -619
3558 -619 -1745 573 649 -1448 -1259 854 79 -1913 -550 1439 -197 -1844 -22 1418 -903 -1884
3574 -1884 364 1233 -1076 -1351 703 868 -1238 -780 1544 294 -1453 220 1694 -531 -1244 683
3590 683 1328 -902 -1029 1622 1312 -1355 -341 1732 1022 -1152 31 2253 316 -1029 878 1791
3606 1791 -437 -989 1222 970 -1026 -581 1454 697 -1382 -177 1795 -27 -1519 313 1541 -563
3622 -563 -1508 616 1274 -1196 -1344 1036 582 -1608 -661 1167 -77 -1841 -219 1175 -933 -1854 323
3639 323 677 -1454 -1546 848 643 -1960 -919 1105 -36 -1614 -137 1321 -297 -1480 437 1356
3655 1356 -939 -1250 1077 950 -1165 -380 1264 543 -1230 -96 1695 11 -1378 749 1843 -764
3671 -764 -877 1339 1481 -859 -747 1729 1053 -1032 -26 1913 418 -1215 496 1488 -520 -953 797
3688 797 1339 -853 -801 1349 709 -1431 -617 1465 417 -1526 -208 1465 -483 -1470 290 1032 -802
3705 -802 -1123 967 670 -1214 -905 1010 -115 -2050 -480 1109 -738 -1511 174 1127 -930 -1726 919
3722 919 994 -1406 -973 1039 277 -1221 -525 1026 -466 -1376 654 1244 -662 -882 1215 971 -1177
3739 -1177 -815 1579 1029 -1338 -129 1945 577 -1193 566 1613 22 -836 719 1439 -563 -389
3755 -389 1428 752 -1049 -46 1713 -165 -1328 271 1779 -464 -1376 786 1263 -1076 -987 716
3771 716 848 -1122 -693 1310 178 -1543 -185 1035 -546 -1889 311 1005 -1290 -1242 655 595 -1418
3788 -1418 -806 845 479 -1789 -1002 1173 -43 -1534 -28 1244 -744 -1237 812 644 -1271 -656
3804 -656 1153 800 -1232 -57 1472 277 -1466 396 1172 -132 -816 834 1251 -571 -508 1417 783
3821 783 -650 -29 1457 265 -940 644 1455 -111 -1121 1134 1308 -596 -729 1290 1029 -1020
3837 -1020 -246 1801 274 -1171 349 1648 -285 -1099 275 986 -567 -1317 802 807 -1031 -759 617
3854 617 -113 -1431 -369 1086 -604 -1631 -186 1060 -918 -1563 290 676 -1164 -1084 850 642 -1404
3871 -1404 -823 936 -456 -1775 368 887 -521 -1196 731 991 -954 -812 1269 675 -1711 -312
3887 -312 1468 424 -1138 -28 1249 -80 -1027 771 1514 -277 -554 1141 982 -563 -30 1512
3903 1512 777 -945 377 1617 -320 -1042 789 1333 -350 -763 1112 987 -932 -609 1255 425 -1323
3920 -1323 -196 1213 -118 -1041 228 1191 -736 -1118 942 861 -1293 -924 890 226 -1244 -549 859
3937 859 151 -1692 -292 570 -343 -1331 -13 513 -865 -712 1067 678 -1243 -327 716 502 -1488
3954 -1488 -162 1018 726 -1391 327 897 -650 -275 1311 1080 -1347 210 717 610 -556 310 1770
3971 1770 -1138 -1154 887 1295 -887 -1329 1077 1403 -637 -233 940 405 -1311 -222 1503 67 -969
3988 -969 180 1274 -402 -821 712 861 -925 -693 1205 737 -1457 -440 1086 -261 -1515 219
4004 219 939 -948 -1372 364 784 -754 -898 447 493 -1451 -663 1010 -36 -1176 -228 888 -610
4021 -610 -1369 346 606 -1095 -1069 853 557 -881 -651 1244 277 -1212 -109 1063 -48 -1014 311
4038 311 1397 -520 -750 792 1018 -555 -96 1489 373 -714 307 1533 207 -920 707 1421
4054 1421 -258 -696 867 1277 -499 -414 1201 834 -882 -153 1323 -127 -1050 133 1016 -269 -1054
4071 -1054 626 858 -982 -1100 747 419 -1286 -570 1043 -7 -1346 -199 911 -586 -1478 112
4087 112 628 -785 -996 773 234 -1177 -526 641 99 -1258 -233 1001 -403 -1126 507 698 -457
4104 -457 -1061 403 838 -890 -677 860 669 -702 -41 1040 214 -833 666 1074 391 -311 952
4121 952 1083 -814 -304 1253 970 -842 168 1402 363 -969 386 1340 78 -584 723 927 -520
4138 -520 -456 1166 428 -839 36 1351 89 -1123 94 1124 -539 -1307 355 756 -793 -1075 469
4155 469 473 -946 -577 863 265 -1287 -342 929 -546 -1386 235 584 -985 -1100 479 499 -1139 -882
4173 -882 777 257 -1195 -367 1179 77 -961 74 825 -361 -874 481 746 -843 -682 1373 622
4190 622 -854 -158 1318 393 -1173 500 1211 -70 -831 823 1328 -506 -502 815 1078 -391 -180 1215
4208 1215 240 -727 518 1035 33 -709 488 951 -796 -709 1081 620 -1236 -377 1064 320 -879
4225 -879 -168 785 -270 -950 154 799 -623 -789 49 494 -946 -757 877 -93 -1446 -449 775 -202
4243 -202 -1440 222 957 -386 -860 500 794 -669 -641 725 258 -926 -369 829 167 -973 -67
4260 -67 973 -251 -625 628 801 -417 -518 963 468 -920 -250 1122 160 -890 195 1235 238
4277 238 -964 227 1300 -485 -405 885 451 -502 -88 342 171 -875 -77 1257 -41 -914 613
4294 613 951 -724 -648 620 724 -821 -872 901 322 -1254 -182 835 -109 -1113 80 577 -619
4311 -619 -960 402 492 -1024 -674 732 62 -1373 -325 901 -118 -1112 60 892 -80 -1282 471
4328 471 780 -406 -506 488 575 -816 -83 1124 -134 -404 252 1245 -614 -1143 1175 1471 46 -496
4346 -496 567 657 -280 184 1264 684 -862 -53 1525 -300 -588 571 560 -528 -594 436 515 -668
4364 -668 -447 1512 343 -1054 142 896 42 -869 193 725 -378 -853 620 664 -730 -434 470 178
4382 178 -1053 -402 549 35 -1181 -35 704 -306 -1188 112 447 -575 -942 598 689 -794 -321 567
4400 567 99 -1189 134 647 -312 -854 610 887 -618 -846 849 724 -813 -153 1182 385 -782
4417 -782 -54 1331 -25 -833 613 1280 -105 -568 707 792 -447 -20 1133 445 -809 -104 1303
4434 1303 247 -948 201 852 -263 -586 763 847 -519 -321 686 241 -898 -243 738 -77 -1090
4451 -1090 113 802 -407 -1030 174 624 -868 -1432 370 357 -762 -1353 408 439 -1304 -190 689
4468 689 -124 -1014 157 495 -682 -864 527 297 -638 -357 817 159 -1011 98 1068 -105 -1104 347
4486 347 813 -418 -368 743 736 -517 -169 1018 781 -607 110 1295 -23 -619 743 709 -305 -328 794
4505 794 830 -589 -210 1199 558 -679 -52 1091 131 -986 -65 1144 -224 -816 353 904 -639
4522 -639 -694 679 438 -752 -425 536 -374 -1139 -339 820 -440 -1163 414 260 -640 -801 438 605
4540 605 -749 -858 573 53 -814 -249 458 -137 -738 104 573 -402 -955 677 582 -826 -329 851 235
4559 235 -794 -88 1024 54 -854 247 786 -161 -612 411 892 -341 -341 1034 130 -429 204 920 115
4578 115 -645 344 1051 -62 -606 429 788 -412 -248 698 512 -724 -309 433 141 -666 178 633 -435
4597 -435 -605 240 631 -701 -564 293 444 -808 -669 635 153 -901 -446 579 -408 -992 -378 504
4615 504 -654 -719 449 594 -596 -662 599 117 -844 -35 736 -27 -917 131 657 -275 -531 390 745
4634 745 -502 -513 415 593 -503 -63 750 186 -616 144 903 -114 -474 578 553 -346 -469 646 680
4653 680 -542 -46 731 368 -809 214 564 -184 -287 196 745 -425 -465 623 488 -917 27 451
4671 451 68 -646 -17 959 -181 -879 211 526 -650 -807 246 558 -826 -748 476 429 -916 -539
4689 -539 396 -52 -903 -161 283 -488 -733 262 500 -509 -349 418 333 -790 -375 893 -82 -575 265
4708 265 806 -308 -433 435 808 -237 -533 466 403 -370 -309 566 219 -679 95 1146 -138 -702 569
4727 569 944 -59 -242 625 656 -610 -127 596 347 -706 -80 807 176 -680 396 572 -433 -531 437
4746 437 393 -836 -526 616 518 -713 -86 491 -41 -876 42 620 -420 -535 76 355 -592 -386 376
4765 376 -12 -630 -225 361 -95 -827 -93 740 -482 -695 293 571 -231 -585 516 379 -567 -241 715
4784 715 -77 -571 246 827 18 -701 441 614 -177 -149 776 670 -562 92 825 457 -499 -154 608 -199
4804 -199 -527 410 650 -54 -333 636 307 -409 -406 718 239 -605 41 706 -69 -549 137 772 -238 -619
4824 -619 106 409 -266 -622 238 412 -661 -527 614 -87 -876 -90 442 -367 -666 -26 535 -289 -782
4843 -782 438 254 -628 -243 515 -274 -654 -244 393 -173 -947 172 545 -147 -552 543 446 -413 -87
4862 -87 442 516 134 471 1171 179 -559 312 757 -260 -379 528 574 -537 -133 483 333 -547 -4 788
4882 788 171 -480 312 670 -111 -469 503 719 -208 -213 446 417 -484 -264 857 86 -624 -88 640 -193 -825
4903 -825 179 438 -460 -468 210 318 -658 -356 356 -163 -595 -2 597 -377 -585 -82 301 -424 -551 427
4923 427 486 -476 -408 521 274 -691 -79 681 54 -532 181 485 -228 -440 824 728 -525 -290 792 359
4943 359 -438 193 743 482 -429 46 660 -174 -409 253 811 -340 -246 536 382 -231 53 717 301 -424
4963 -424 70 710 31 -671 357 651 -170 -853 496 759 -361 -327 468 -68 -688 -81 227 -163 -632
4982 -632 460 310 -413 -585 431 59 -824 -322 308 57 -840 -168 538 -62 -522 -54 305 -275 -551
5001 -551 165 525 -748 -494 318 204 -625 -9 818 117 -659 143 430 -31 -306 242 376 -31 -364 552
5021 552 719 -611 -147 627 345 -472 221 531 -160 -451 158 746 -269 -158 407 477 -443 -287 737
5040 737 158 -641 136 515 2 -558 181 326 -512 -449 184 166 -245 -256 230 279 -636 18 493 14 -540
5061 -540 259 327 -377 -346 153 207 -722 -584 384 172 -409 -65 139 -51 -708 -28 351 -318 -195 220 593
5082 593 -143 -361 465 252 -720 6 542 235 -371 310 580 121 -435 263 691 -225 -226 561 454 -276 146
5103 146 340 574 -541 98 661 144 -296 143 506 -69 -507 351 219 -391 -413 430 290 -770 -189 313
5123 313 101 -624 254 385 -218 -428 248 395 -344 -325 463 496 -637 -228 395 -170 -500 -69 486 -182
5143 -182 -591 108 383 -196 -243 332 -82 -550 -317 188 27 -525 65 768 -144 -390 405 616 -73 -122 573
5164 573 403 -407 -157 513 295 -276 63 995 114 -225 430 708 -88 -2 360 626 -296 -312 171 283 -292
5185 -292 21 356 42 -478 116 358 -118 -135 371 277 -321 -315 426 102 -541 -66 152 -84 -622 -199 518
5206 518 -150 -528 -96 384 -189 -382 179 337 -317 -335 342 -92 -818 58 85 -131 -485 -169 210 -371 -486
5227 -486 414 268 -534 -265 488 376 -103 48 265 41 -350 445 498 -51 -146 413 270 -328 -401 552 266
5248 266 -85 -191 538 -126 -307 266 573 -149 -470 318 572 -310 -133 457 222 -366 -141 478 17 -331
5268 -331 251 629 -132 -485 293 214 -310 -645 355 42 -379 -404 337 129 -791 -269 296 41 -923 91
5288 91 570 -282 -438 88 -149 -364 -12 134 49 -494 -287 283 -128 -468 78 279 -361 -508 208 260 -222
5309 -222 -101 225 159 -305 3 477 -10 -322 -4 518 -26 -255 316 373 -199 -165 216 582 -242 -47 450
5330 450 342 -8 -250 267 171 -561 63 556 -179 -95 384 100 -419 -177 449 147 -590 9 677 -104 -305
5351 -305 -12 375 -494 -557 -19 310 -313 -293 493 175 -362 -37 -54 -325 -489 335 -152 -824 -656 374 214
5372 214 -625 -250 278 186 -512 -383 149 141 -170 -80 293 137 -408 105 378 -356 -257 577 355 -316 -110 282
5394 282 74 -333 20 519 104 -488 384 403 -89 -267 232 424 -294 -57 155 120 -483 -68 482 239 -215
5415 -215 155 364 58 -285 420 478 -317 -577 160 143 -201 -185 72 -18 -561 -95 119 -147 -265 111 162 -526
5437 -526 -319 525 81 -388 -546 419 -45 -394 -210 115 -91 -679 250 156 -256 -118 300 262 -125 -212 419
5458 419 211 -432 10 686 -244 -302 134 265 -16 -227 125 413 -440 -63 731 95 -277 109 308 158
5478 158 -339 180 268 -111 -267 260 327 -234 -302 567 333 -519 -294 308 186 -394 -7 463 -85 -344 244
5499 244 388 -607 -465 180 267 -260 -205 233 163 -390 -111 282 -220 -625 136 262 -188 -505 218 119 -576
5520 -576 -236 417 154 -418 -118 430 -220 -318 -143 300 -129 -196 332 322 -244 -359 281 206 -551 14 695
5541 695 -7 -688 -83 510 -63 -216 452 462 85 -190 514 278 47 150 411 155 -153 168 262 150 -391
5562 -391 393 574 -181 -307 314 111 -179 2 81 368 -408 14 373 -63 -232 -10 156 -262 -278 379 27
5583 27 -224 -225 401 83 -714 -158 21 -118 -280 -122 315 106 -518 187 268 -360 -335 40 144 -312 2 364
5605 364 -22 -401 31 484 -59 -170 442 250 -138 -223 378 367 -249 60 431 237 -190 76 405 263 -170
5626 -170 128 444 -132 -164 376 408 -359 -309 163 54 -501 -212 417 -85 -333 82 269 -96 -173 340 58
5647 58 -306 -292 479 -98 -369 -26 297 107 -395 -65 166 -146 -401 140 289 -267 -496 233 219 -489 -77
5668 -77 95 -33 -642 -103 323 -191 -264 267 54 -146 -156 335 90 -361 -80 308 -70 -260 73 476 -1
5689 -1 -595 -155 380 -334 -72 539 49 -636 -51 604 -561 42 75 245 -339 -131 286 503 -213 183 595
5710 595 757 285 -221 -159 -562 -371 -114 -584 -819 -1304 553 466 459 -197 96 140 -208 165 300 159 -322
5731 -322 -26 134 33 -660 74 379 -183 -323 160 202 -144 -500 85 110 -594 -153 401 -76 -281 129 403
5752 403 -238 -241 -60 206 -117 -349 85 43 -415 -361 270 81 -331 -120 266 79 -30 -67 451 59 -89 265
5774 265 384 -275 -10 279 365 -425 56 505 161 -228 199 185 -174 -337 -14 389 -85 -100 383 212 -254
5795 -254 0 87 -116 -298 -74 329 -199 -229 78 253 -104 -510 253 74 -312 -50 207 7 -539 -133 436
5816 436 -127 -395 -239 235 -318 -475 -10 346 -291 -105 311 -14 -245 -69 566 1 -77 -90 82 -30 -127
5837 -127 220 336 -184 0 -171 106 -282 218 540 -134 -131 39 549 -453 -622 -38 754 -52 -248 483
5857 483 332 -178 -104 345 137 -211 2 412 -155 -329 265 304 -4 -223 110 95 -274 -133 247 88 -495
5878 -495 -209 450 -242 -362 -75 99 -248 -421 287 59 -223 -169 112 143 -171 59 567 164 -336 185 280
5899 280 -60 -220 129 113 -341 31 97 -97 -150 -162 176 227 -156 25 290 -7 -460 122 230 176 -219 145
5921 145 182 -482 278 465 472 93 317 537 -195 -96 147 642 -6 -228 69 84 -25 -127 278 154 -22 -52
5943 -52 253 -257 -239 250 418 -40 -101 203 194 -336 -470 384 40 -207 -209 351 -236 -260 35 297 -164 -529 -1
5966 -1 466 -325 -399 38 -64 -265 -165 373 -99 -316 -95 171 -254 -222 91 277 -248 -109 104 106 -274 -125
5988 -125 -98 124 -98 -34 304 -149 -251 316 456 -237 -78 196 293 -152 -115 277 128 -208 -18 -76 50 -237
6010 -237 188 312 -70 -17 482 322 -232 -74 388 253 -237 29 521 122 -464 -148 267 -96 -369 109
6030 109 347 -323 -71 78 189 -173 -138 -59 -116 -306 -31 218 -234 -364 -167 85 -265 -218 194 226 -333 -247
6052 -247 345 387 -237 -19 221 -176 -104 334 225 -163 -335 293 348 -53 -100 379 271 -351 139 537 277
6073 277 -331 9 484 -12 -131 302 98 -60 39 146 296 -317 -153 219 -90 -103 104 94 -19 -267 144
6094 144 289 -335 -189 241 336 -229 -48 426 106 -44 -223 123 -138 -499 192 262 -310 -402 -137 77 -272
6115 -272 -381 155 4 -375 69 41 -157 -326 145 215 -321 -400 30 241 -249 -304 260 122 -375 168 367
6136 367 -106 -96 122 479 -67 -121 81 224 -151 -301 277 -50 -199 178 392 -8 -293 -109 435 -154 -123
6157 -123 162 86 -329 -80 225 345 -29 62 327 -17 -286 -79 183 65 -284 54 285 -245 -178 275 37
6178 37 -91 -72 167 -27 -391 123 384 51 -375 98 164 -265 -202 118 53 -352 -212 -43 -226 -116 -109 429
6200 429 -46 -518 -123 271 -212 -100 557 346 -206 -187 531 -7 30 15 555 -51 -338 -116 141 -61 -162
6221 -162 474 323 -126 -56 501 282 -45 -136 128 197 -298 164 343 -181 -771 16 252 -45 -177 219 98
6242 98 98 -226 334 -55 -306 146 86 -58 -137 -72 90 -256 -274 357 197 -116 -231 25 10 -188 16 -12 -48
6265 -48 -153 174 -20 -237 -471 123 45 -321 101 242 37 -523 -159 119 -78 -206 177 84 -62 -31 97
6286 97 158 -181 -428 171 263 84 63 248 -9 -176 166 267 9 -332 145 327 122 -211 518 146 -104
6307 -104 175 174 131 -219 144 175 -6 -319 250 437 -169 -320 163 406 -232 -279 135 128 -71 -30 86 23 -324
6330 -324 205 220 -48 -306 259 52 -299 -78 369 -25 -415 -157 81 45 -154 -169 -25 -202 -337 80 112
6351 112 -262 -298 -40 -178 -22 129 63 -99 -170 148 59 -296 -19 291 359 52 -43 209 254 -10 -109 307 264
6374 264 -192 37 198 -32 -244 34 343 -12 -227 334 528 -66 -165 139 216 -88 -267 218 -114 -21 294
6395 294 -68 -10 -333 148 212 -341 -138 309 53 -241 -64 162 125 -132 102 306 -191 -465 190 312 -244
6416 -244 -80 -71 315 -116 -213 31 58 -275 -117 160 -142 -224 -162 177 -33 -45 46 218 -312 -44 -74 68 -436
6439 -436 -31 384 -46 -127 -92 48 53 -137 172 311 98 102 332 220 -264 63 341 -109 -294 198 43 195
6461 195 -109 228 229 -70 -205 363 -138 -207 -87 181 0 -335 11 416 178 -362 459 73 -202 -10 90
6482 90 -11 -284 -133 -122 35 -419 87 193 -161 -238 -7 180 -239 -93 158 169 -160 85 241 3 -134
6503 -134 -296 122 118 -185 185 -135 -198 87 6 247 -64 -257 99 126 -83 -48 208 85 -225 120 205 -82
6525 -82 -237 404 268 -43 75 -63 107 -391 109 217 161 -32 48 231 29 -221 370 446 -80 -140 258 45
6547 45 -332 -138 129 199 -308 -99 137 142 -236 -33 495 30 -372 -135 266 -158 -349 -7 -188 -326 -53
6568 -53 270 -125 -314 -105 484 -9 -375 8 103 -182 -79 -198 -4 -104 -12 281 -270 -469 9 257 -13
6589 -13 -293 231 337 -228 -224 304 157 -128 308 232 475 98 -63 494 26 -5 124 105 -54 -62 -53 82 -226
6612 -226 -126 356 -148 -103 -35 163 36 -335 -119 254 -100 191 -25 -9 -234 -243 53 114 -227 208 150 -9
6634 -9 -417 30 108 -304 -262 217 68 -213 -25 155 17 -203 -171 199 102 -130 -84 348 2 -128 -100 143 78
6657 78 14 117 -50 -210 -135 249 339 -129 -63 165 -134 -74 39 253 -236 -343 52 248 -72 -115 140 206 -89
6680 -89 89 331 -180 -294 179 193 -65 -609 37 196 84 -42 316 145 -619 28 -39 -143 -340 75 -168
6701 -168 2 -199 290 100 -112 -452 76 168 -147 32 314 52 -336 7 192 -207 -250 46 -32 -150 1
6722 1 180 -50 -38 -46 59 -164 -393 28 415 102 -267 -28 32 102 -45 103 91 -200 -238 13 30 -32 -164 373
6746 373 -88 116 124 63 -112 -42 -26 134 -81 234 308 -230 -168 163 142 551 -54 -376 -276 -224 -197 66 -144
6769 -144 -268 25 -138 505 -510 267 -95 428 -430 -543 403 63 -720 -510 -210 -897 381 378 193 273
6789 273 -16 322 182 -132 -74 -51 245 -50 -62 -81 -87 -191 77 -156 -107 -70 -86 -2 -209 -16 100 -147 -119 1
6813 1 220 12 -131 60 304 55 -141 152 -30 -145 -136 269 -66 -231 -33 77 -18 -379 -35 305 176 -9
6835 -9 303 153 -39 71 199 198 -64 -257 213 165 -227 188 364 -110 -370 -112 -4 -155 -86 24 328 -307
6857 -307 56 260 -142 -119 145 36 -72 -180 -109 7 -45 -161 92 49 -224 53 140 -181 -282 -16 129 -289
6879 -289 -219 112 216 5 -347 242 136 -360 34 312 206 -128 117 316 -31 165 131 -76 -179 102 172
6900 172 172 84 -222 175 221 1 32 275 -193 107 134 185 6 -64 185 93 -159 -30 -26 -1 -300 339 360 66
6924 66 -187 6 -43 -61 -105 111 75 -155 -107 145 -101 -193 -118 2 3 -184 -139 351 68 -312 89 -27 -258 -132
6948 -132 117 -77 -329 -80 125 -276 -17 28 77 74 -184 -9 47 -126 -47 69 337 -170 -8 206 177 -259
6970 -259 -134 213 -57 64 76 317 -128 -123 181 202 -300 78 99 38 -229 -51 392 218 -260 136 187 61
6992 61 -24 89 136 -10 -70 277 38 -16 30 43 -68 -273 -68 62 95 -271 -58 -211 -24 -370 -40 -102 -147
7015 -147 -94 162 -116 -220 -152 430 -351 -231 117 317 -190 -229 114 -93 -121 -257 10 271 -10 33 172 -170
7037 -170 22 51 377 0 130 207 198 -345 -64 458 -116 -214 -271 438 95 -142 401 163 4 -204 176 328
7059 328 -37 -80 -27 519 -164 -200 188 24 -403 -260 40 -242 9 261 359 -384 -103 -50 95 -13 -258 -43
7081 -43 5 -178 -100 145 -120 -88 133 -48 -109 -91 -113 29 -419 -136 58 -27 -179 246 131 -264 -188 145 189
7104 189 -128 -349 144 229 -110 97 68 -97 -167 -272 452 -81 -118 218 437 -171 -330 157 336 -208 129
7125 129 511 13 -44 48 472 73 -114 33 308 61 -244 107 213 -58 -221 191 272 -345 -151 208 -60
7146 -60 -420 57 228 -53 -66 43 170 -136 -196 55 123 -254 -121 -128 73 -255 -100 123 -83 -343 -20 129
7168 129 -106 -384 -202 -74 359 -188 244 37 -423 -142 -86 -73 -77 586 475 -47 -200 445 -718 -244 -143
7189 -143 26 -7 113 -283 381 18 -216 320 240 149 -1081 466 26 -4 36 577 -93 237 330 392 259 -366
7211 -366 57 499 204 -278 93 198 639 -255 -66 338 -528 -300 -230 61 -93 43 212 -167 175 218 250
7232 250 -239 -433 566 259 43 49 486 54 -71 522 413 -18 -206 -277 273 -251 -163 663 -101 -229 -49
7253 -49 -118 139 289 158 -127 183 -105 25 218 86 -70 -312 142 -109 -231 187 74 -627 -181 180 154
7274 154 -174 -355 351 97 -53 -98 25 91 -56 138 112 -274 -418 103 185 -298 -214 128 143 -14 109 36
7296 36 46 -404 173 265 -121 -99 393 60 -271 72 -348 25 -203 -96 -30 -232 -194 104 -197 -320 -197 84
7318 84 -313 -139 43 199 -70 -159 115 -88 -116 -59 -146 66 -138 -213 125 -131 -2 -117 -84 133 -220 -434
7340 -434 280 -190 -38 -23 -50 -79 -215 274 229 -19 -463 317 92 -59 -362 -18 174 -234 113 39 -159 138
7362 138 431 44 20 -228 243 -101 -128 -91 195 -43 -159 -20 130 32 8 196 236 -271 -181 -185 358 -21 -98
7385 -98 108 110 50 50 182 -92 -347 -49 26 -99 -143 -21 126 -487 -341 -136 66 -191 -126 -65 155 -199 -11
7408 -11 41 65 -22 17 -106 141 -103 216 273 -140 42 496 34 -19 6 47 338 -171 37 223 5 -10 193
7431 193 43 -331 -2 170 -129 -135 -95 341 176 -400 -193 231 78 -193 248 26 -125 -60 -5 -272 -50 -106
7453 -106 -61 41 -211 116 -272 259 -210 52 168 22 -33 -19 -32 -146 29 31 -197 -245 13 194 -463 234
7475 234 275 97 44 -343 -143 353 -302 242 87 128 21 -192 -173 -166 -217 181 205 -107 -250 91 186 -308 -74
7498 -74 -45 51 87 275 44 -175 60 453 230 198 -251 136 65 74 132 -10 309 139 -84 195 343 20 -68
7521 -68 316 -393 -131 -1 98 88 265 -274 79 -96 412 -258 -195 -308 152 328 -416 359 247 297 487 21
7543 21 -40 782 -39 390 1179 163 -118 -202 -117 0 -266 262 -16 107 -192 405 254 -263 5 -112 -53
7564 -53 -70 -345 -90 -578 18 -70 339 -64 275 537 -296 178 -121 635 286 177 -30 147 450 20 72
7585 72 476 -268 -304 123 30 133 322 -87 49 82 173 275 42 -40 -35 331 -109 -68 506 126 74 -162 167
7608 167 617 -318 -80 -73 -143 18 -231 306 53 -118 -77 87 -258 71 -308 80 262 -348 187 29 -4 -293
7630 -293 -148 -49 62 -83 154 -188 -304 -580 334 -513 -89 512 -192 -49 -48 454 435 274 399 199 69
7651 69 -73 -392 592 147 -97 451 121 -198 -359 290 211 -116 188 -280 -148 113 -86 276 -122 -167 235
7672 235 170 83 -192 -10 -137 -81 -162 209 -130 -107 29 400 -22 -35 -50 251 41 -142 -107 279 -77 -179 128
7695 128 -243 27 -73 -76 -180 -82 -100 -320 -369 -362 -560 12 -275 139 139 -196 -144 -206 304 -114 -270 -250 8 -37
7719 -37 -297 -162 500 241 -161 255 -162 -83 412 -291 246 517 259 -109 -465 196 742 -301 228 -227
7739 -227 -199 126 31 69 690 -57 299 -211 500 -403 -313 231 -57 -49 -227 304 -370 -345 98 279 -529 106
7761 106 -533 -451 -363 -372 39 165 94 -216 173 156 -298 -304 223 -58 52 -77 222 28 -268 -437 -117 -281 -779
7784 -779 334 -209 22 133 569 242 156 40 -13 -105 55 160 -357 -409 69 486 161 349 -394 156 -217
7805 -217 -138 -509 636 248 328 579 -121 267 906 195 -396 -168 176 271 426 236 -186 441 67 82 -462
7826 -462 397 33 34 -292 156 300 129 -24 584 -499 -450 555 57 -509 -687 323 789 211 614 80
7846 80 173 -631 18 187 -163 430 -766 -377 -527 426 -60 -442 -205 -161 -389 -233 433 -816 -339 -457
7866 -457 706 32 192 -446 -101 600 -667 -150 98 229 530 -22 -172 -105 -29 449 -70 -53 163 -283
7886 -283 -127 -190 -631 790 742 623 572 240 318 173 -183 -50 298 -374 368 190 -37 -54 528 119 -535
7907 -535 -287 -112 59 -98 -483 13 78 366 362 861 340 112 -321 -81 186 -34 -6 -137 -305 -163 490
7928 490 402 352 44 172 273 -415 154 101 -179 -235 240 389 -13 -211 121 489 -332 -206 -47 237 281 -575
7950 -575 376 -296 -97 -29 -299 291 -360 -77 -228 346 159 433 -424 7 304 18 -248 189 -40 281
7970 281 221 338 -118 -154 -397 335 146 104 -100 308 -252 -187 -400 366 -197 -581 46 -52 -483 -514 -514 623
7992 623 265 -61 -226 336 190 -483 -21 464 -158 0 101 219 -528 -480 226 80 -32 -62 -18 -211 -63
8013 -63 -1 342 81 -149 86 402 -92 -100 82 286 -81 117 95 215 -28 168 84 212 37 193 196 -27 -147
8036 -147 174 195 -136 -48 292 77 -100 -61 -6 -9 -65 53 109 89 34 92 178 -186 -159 201 106 -125 -69 -37 114
8061 114 -327 -108 -208 -51 -252 -204 11 54 -128 -64 254 -319 -275 -3 99 -40 252 350 39 18 21 135 57
8084 57 -187 129 189 -94 -166 -136 231 -14 -128 257 -184 -122 133 169 -69 -26 103 13 -8 -154 6 143 -95
8107 -95 -260 106 104 -94 -226 -113 -129 -77 -37 97 -57 -264 64 221 -64 -90 296 90 -153 24 155 194 -57
8130 -57 -45 238 -35 -176 -37 168 -225 -100 -32 63 -349 199 61 -147 -243 191 238 -171 7 202 -23 -127
8152 -127 12 59 109 -154 -113 152 73 -17 9 -119 60 -84 57 129 65 -199 24 233 -38 19 8 -29 -65 -58 -5
8177 -5 -83 -63 14 -74 -223 -69 62 143 38 -123 -141 234 -81 347
8191C47
##END NTUPLES=NMR FID
##END=
