##TITLE=1H_SAV-32-singlet-bat24(2)
 CDCl3, 8 sc, 
 25.11.2020
##JCAMPDX= 6.0         $$ Bruker NMR JCAMP-DX V2.0
##DATA TYPE= NMR FID
##DATA CLASS= NTUPLES
##ORIGIN= UXNMR, Bruker Analytische Messtechnik GmbH
##OWNER= root
$$ XWIN-NMR		Version 3.5
$$ Wed Nov 25 11:33:21 2020 Russian Standard Time (UT+4h)  she@DPX200
##.OBSERVE FREQUENCY= 200.1315066352
##.OBSERVE NUCLEUS= ^1H
##.DELAY= (6, 6)
##.ACQUISITION MODE= SIMULTANEOUS
##.ACQUISITION SCHEME= undefined
##.AVERAGES= 8
##.DIGITISER RES= 18
##SPECTROMETER/DATA SYSTEM= spect
##.PULSE SEQUENCE= zg30
##.SOLVENT NAME= CDCl3
##.SHIFT REFERENCE= (INTERNAL, CDCl3, 0, 15.7039)
##AUDIT TRAIL= $$ (NUMBER, WHEN, WHO, WHERE, WHAT)
$$ ##TITLE= Audit trail, XWIN-NMR		Version 3.5
$$ ##JCAMPDX= 5.01
$$ ##ORIGIN= Bruker BioSpin GmbH
$$ ##OWNER= she
$$ F:/spectra/data/she/nmr/H-F/1/audita.txt
$$ ##AUDIT TRAIL=  $$ (NUMBER, WHEN, WHO, WHERE, WHAT)
(   1,<2020-11-25 11:32:02.43 +0400>,<she>,<DPX200>,
      <created by zg, POWCHK disabled, PULCHK disabled
       configuration hash MD5:
       00 E9 B6 7A A2 85 ED C7 34 08 36 98 17 FE 4E 26
       data hash MD5: 16K
       CE CB E1 BA 4D 40 35 B8 B2 ED 2C CC 29 83 3A 3B>)
$$ ##END=
$$ 
$$ hash MD5
$$ 81 60 B1 C3 1D 25 02 E5 41 5B F2 82 E2 13 40 49
##$RELAX= 
##$RELAX= 
##$RELAX= 
##$RELAX= 
##$RELAX= 
##$RELAX= 
$$ Bruker specific parameters
$$ --------------------------
##$DU= <F:/spectra>
##$EXPNO= 1
##$NAME= <H-F>
##$PROCNO= 1
##$TYPE= <nmr>
##$USER= <she>
##$AMP= (0..31)
100 100 100 100 100 100 100 100 100 100 100 100 100 100 100 100 100 100 
100 100 100 100 100 100 100 100 100 100 100 100 100 100 
##$AQSEQ= 0
##$AQ_mod= 1
##$AUNM= <au_zg>
##$AUTOPOS= <>
##$BF1= 200.13
##$BF2= 200.13
##$BF3= 200.13
##$BF4= 200.13
##$BF5= 200.13
##$BF6= 200.13
##$BF7= 200.13
##$BF8= 200.13
##$BYTORDA= 1
##$CFDGTYP= 0
##$CFRGTYP= 5
##$CHEMSTR= <none>
##$CNST= (0..31)
1 1 145 1 1 1 1 1 1 1 1 1 1 1 1 1 1 1 1 1 1 1 1 1 1 1 1 1 1 1 1 1 
##$CPDPRG= <>
##$CPDPRG1= <>
##$CPDPRG2= <>
##$CPDPRG3= <>
##$CPDPRG4= <mlev>
##$CPDPRG5= <mlev>
##$CPDPRG6= <mlev>
##$CPDPRG7= <mlev>
##$CPDPRG8= <mlev>
##$CPDPRGB= <>
##$CPDPRGT= <>
##$D= (0..31)
0 1.2 0 0 0 0 0 0 0 0.06 0 0.03 0 0 0 0 0.0002 0 0 0 0 0 0 0 0 0 0 0 0 
0 0 0 
##$DATE= 1606289521
##$DBL= (0..7)
120 120 120 120 120 120 120 120 
##$DBP= (0..7)
150 150 150 150 150 150 150 150 
##$DBP07= 0
##$DBPNAM0= <>
##$DBPNAM1= <>
##$DBPNAM2= <>
##$DBPNAM3= <>
##$DBPNAM4= <>
##$DBPNAM5= <>
##$DBPNAM6= <>
##$DBPNAM7= <>
##$DBPOAL= (0..7)
0.5 0.5 0.5 0.5 0.5 0.5 0.5 0.5 
##$DBPOFFS= (0..7)
0 0 0 0 0 0 0 0 
##$DE= 6
##$DECBNUC= <off>
##$DECIM= 32
##$DECNUC= <off>
##$DECSTAT= 4
##$DIGMOD= 1
##$DIGTYP= 9
##$DL= (0..7)
0 120 120 120 120 120 120 120 
##$DP= (0..7)
150 150 150 150 150 150 150 150 
##$DP07= 0
##$DPNAME0= <>
##$DPNAME1= <>
##$DPNAME2= <>
##$DPNAME3= <>
##$DPNAME4= <>
##$DPNAME5= <>
##$DPNAME6= <>
##$DPNAME7= <>
##$DPOAL= (0..7)
0.5 0.5 0.5 0.5 0.5 0.5 0.5 0.5 
##$DPOFFS= (0..7)
0 0 0 0 0 0 0 0 
##$DQDMODE= 0
##$DR= 18
##$DS= 0
$$ [...]
##$SUBNAM2= <"">
##$SUBNAM3= <"">
##$SUBNAM4= <"">
##$SUBNAM5= <"">
##$SUBNAM6= <"">
##$SUBNAM7= <"">
##$SUBNAM8= <"">
##$SUBNAM9= <"">
##$SW= 16.9725356469052
##$SWIBOX= (0..15)
0 0 2 0 0 0 0 0 0 0 0 0 0 0 0 0 
##$SW_h= 3396.73913043478
##$TD= 16384
##$TD0= 1
##$TE= 0
##$TE2= 300
##$TE3= 300
##$TEG= 300
##$TL= (0..7)
0 120 120 120 120 120 120 120 
##$TP= (0..7)
150 150 150 150 150 150 150 150 
##$TP07= 0
##$TPNAME0= <>
##$TPNAME1= <>
##$TPNAME2= <>
##$TPNAME3= <>
##$TPNAME4= <>
##$TPNAME5= <>
##$TPNAME6= <>
##$TPNAME7= <>
##$TPOAL= (0..7)
0.5 0.5 0.5 0.5 0.5 0.5 0.5 0.5 
##$TPOFFS= (0..7)
0 0 0 0 0 0 0 0 
##$TUNHIN= 0
##$TUNHOUT= 0
##$TUNXOUT= 0
##$USERA1= <user>
##$USERA2= <user>
##$USERA3= <user>
##$USERA4= <user>
##$USERA5= <user>
##$V9= 5
##$VALIST= <valist>
##$VCLIST= <CCCCCCCCCCCCCCC>
##$VD= 0
##$VDLIST= <DDDDDDDDDDDDDDD>
##$VPLIST= <PPPPPPPPPPPPPPP>
##$VTLIST= <TTTTTTTTTTTTTTT>
##$WBST= 1024
##$WBSW= 4
##$XGAIN= (0..3)
0 0 0 0 
##$XL= 0
##$YL= 0
##$YMAX_a= 215740
##$YMIN_a= -190889
##$ZGOPTNS= <>
##$ZL1= 120
##$ZL2= 120
##$ZL3= 120
##$ZL4= 120
##$ABSF1= 10
##$ABSF2= 0
##$ABSG= 5
##$ABSL= 3
##$ALPHA= 0
##$AQORDER= 0
##$ASSFAC= 0
##$ASSFACI= 0
##$ASSFACX= 0
##$ASSWID= 0
##$AUNMP= <proc_1d>
##$AZFE= 0.1
##$AZFW= 0.1
##$BCFW= 1
##$BC_mod= 2
##$BYTORDP= 1
##$COROFFS= 0
##$CY= 11.3945322036743
##$DATMOD= 1
##$DC= 2
##$DFILT= <>
##$DTYPP= 0
##$F1P= 15.9154993809931
##$F2P= -4.1035820241983
##$FCOR= 0.5
##$FTSIZE= 0
##$FT_mod= 4
##$GAMMA= 1
##$GB= 0.15
##$INTBC= 1
##$INTSCL= 1
##$ISEN= 128
##$LB= 0.24
##$LEV0= 0
##$LPBIN= 0
##$MAXI= 10000
##$MC2= 0
##$MEAN= 0
##$ME_mod= 0
##$MI= 1.114404
##$NCOEF= 0
##$NC_proc= 0
##$NLEV= 6
##$NOISF1= 3.799351
##$NOISF2= 2.8
##$NSP= 1
##$NTH_PI= 0
##$NZP= 0
##$OFFSET= 15.70392
##$PC= 1
##$PHC0= -11052.21
##$PHC1= 15.00089
##$PH_mod= 1
##$PKNL= yes
##$PPARMOD= 0
##$PSCAL= 0
##$PSIGN= 0
##$REVERSE= no
##$SF= 200.130013532006
##$SI= 16384
##$SIGF1= 3
##$SIGF2= 2
##$SINO= 400
##$SIOLD= 16384
##$SREGLST= <1H.CDCl3>
##$SSB= 0
##$STSI= 0
##$STSR= 0
##$SW_p= 3612.71676300578
##$SYMM= 0
##$S_DEV= 0
##$TDeff= 0
##$TDoff= 0
##$TI= <>
##$TILT= no
##$TM1= 0
##$TM2= 0
##$TOPLEV= 0
##$USERP1= <user>
##$USERP2= <user>
##$USERP3= <user>
##$USERP4= <user>
##$USERP5= <user>
##$WDW= 1
##$XDIM= 8192
##$YMAX_p= 0
##$YMIN_p= 0
$$ End of Bruker specific parameters
$$ ---------------------------------
##NTUPLES= NMR FID
##VAR_NAME=  TIME,          FID/REAL,        FID/IMAG
##SYMBOL=    X,             R,               I
##VAR_TYPE=  INDEPENDENT,   DEPENDENT,       DEPENDENT
##VAR_FORM=  AFFN,          ASDF,            ASDF
##VAR_DIM=   8192,          8192,            8192
##UNITS=     SECONDS,       ARBITRARY UNITS, ARBITRARY UNITS
##FACTOR=    0.0002944,     1,               1
##FIRST=     0,             0,               0
##LAST=      2.4114304,     0,               0
##MIN=       0,             -190889,         0
##MAX=       2.4114304,     215740,          0
$$ Real data points
##PAGE= N=1
##DATA TABLE= (X++(R..R)), XYDATA
$$ [...]
$$ plain form
2336 -42 2042 517 -1312 886 1861 196 -631 901 1458 -97 -457 1230 1708 -96 -141 1566 465
2353 465 -625 486 1586 323 -909 547 1787 -640 -974 676 1113 -810 -1241 579 676 -1466
2369 -1466 -623 965 -260 -1231 -416 625 -739 -1837 -55 381 -1391 -1491 420 452 -1759 -1261 672
2386 672 -121 -1802 -505 812 -700 -1924 237 602 -998 -835 188 537 -983 -1008 1239 512 -1457
2403 -1457 420 1192 1 -735 272 1408 32 -789 1496 1489 -265 9 1629 1027 -574 217 1499
2420 1499 1042 -836 294 2017 50 -483 1492 1160 -72 27 789 1199 -593 -398 1478 196 -1029
2437 -1029 651 1160 -518 -1058 65 1116 -667 -1547 357 372 -1364 -917 447 -78 -1459 -800 652
2454 652 -538 -1941 98 597 -1110 -1401 265 437 -1471 -1510 752 420 -1505 -734 1012 -80 -1358
$$ packed form
2336d2K084j525j829K198R75j665q27J532N57j555l60J687M78j804m5J707j101
2353D65j090J111J100j263j232J456J240k427l34J650M37j923m31J820R7k142
2369a466Q43J588j225r71Q15J041j364j098J782M36j772j00J911L2k211M98J933
2386F72p93j681J297J317j512j224K161L65j600J63J023L49j520k5K247p27j969
2403a457J877P72j191p36J007J136j376q21K285pj754K74J620o02j601P91J282
2420A499m57j878J130J723j967n33J975l32j232R9P62M10j792J95J876j282j225
2437a029J680N09j678n40J123J051j783q80J904J5j736M47J364n25j381O59J452
2454F52j190j403K039M99j707k91J666J72j908l9K262l32j925P71J746j092j278
$$ plain form
2471 -1358 -388 879 -125 -1156 626 832 -361 -294 1169 179 -880 -238 1318 663 -1112 36 1973
2488 1973 338 -1106 846 1898 428 -815 878 1052 -413 77 1597 645 -802 435 1723 468
2504 468 -697 669 1520 13 -1667 1408 1541 -708 -724 171 837 -1690 -647 1023 123 -1608 -478
2521 -478 530 -1604 -1683 -130 288 -570 -1136 907 207 -886 -773 359 -3 -1756 -1068 75 -464 -1139
2539 -1139 -531 977 -660 -1353 566 533 -1221 -215 1173 -12 -1133 -124 1081 -181 -1448 700
2555 700 1391 -292 -719 1059 1549 -437 -362 1176 958 -159 411 1312 1074 -312 387 1676 181 -420
2573 -420 1050 1650 -371 -372 1376 1178 -752 -93 1482 684 -931 144 1217 -152 -948 343 832
2590 832 -478 -1257 537 503 -1563 -831 800 -58 -1414 -553 635 -580 -1641 -311 724 -800 -1618
$$ packed form
2471a358R70J267j004j031J782K06j193O7J463r90j059O42J556o55j775J148J937
2488A973j635j444J952J052j470j243J693J74j465M90J520r52j447J237J288j255
2504D68j165J366Q51j507j680L075J33k249j6Q95O66k527J043J670r00j731J130
2521d78J008k134p9J553M18q58n66K043p00j093J13J132l62j753O88J143n39o75
2539a139O08J508j637o93J919l3j754J006J388j185j121J009J205j262j267K148
2555G00O91j683m27J778M90j986P5J538k18j117N70R01k38j386O99J289j495o01
2573d20J470O00k021jJ748j98j930O59J575p98j615J075J073j369p96J291M89
2590H32j310p79J794l4k066P32J631q58j356Q61J188j215j061J330J035j524q18
$$ plain form
2607 -1618 49 428 -1399 -1170 360 446 -1045 -103 891 61 -1224 -550 1009 -671 -474 437 951 -673
2625 -673 -1424 586 680 -318 -285 1469 881 -818 819 1602 114 -784 433 1726 203 -245 1129 953
2643 953 -159 154 1419 875 -322 498 1573 684 -771 651 1501 21 -1050 797 1302 -629 -400
2660 -400 962 819 -863 -425 849 56 -1018 -62 935 -838 -1305 345 220 -1389 -1351 277 231 -1407
2678 -1407 -1319 398 111 -1655 -558 812 7 -751 218 906 -826 -1372 486 156 -1392 -620 746
2695 746 22 -1412 6 1146 -220 -1079 274 1266 -202 -781 570 1226 -99 -487 854 683 -373
2712 -373 157 1466 193 -346 734 1428 -4 -477 888 1148 -159 -633 1359 1379 -512 -444 1515 663
2730 663 -784 313 1205 114 -900 469 851 -469 -514 656 457 -1095 -648 806 179 -1500 -794
$$ packed form
2607a618J667L79j827K29J530Q6j491R42R94q30j285O74J559j680J97R11N14j624
2625f73p51K010R4r98L3J754n88j699J637P83j488q98J217J293j523m48J374j76
2643I53j112L13J265n44j197Q20J075q89j455J422Q50j480j071J847N05j931K29
2660d00J362j43j682M38J274p93j074R56R97j773m67J650j25j609L8J628m6j638
2678a407Q8J717k87j766J097J370q05p58R69O88j732n46J858l30j548P72J366
2695G46p24j434J418J140j366q59J353R92j468n79J351O56j325l88J341j71j056
2712c73N30J309j273n39J080O94j432m73J365K60j307m74J992K0j891O8J959q52
2730F63j447J097Q92j091j014J369L82j320m5J170j99j552M47J454o27j679P06
$$ plain form
2747 -794 958 -366 -1587 -389 587 -768 -1120 -184 215 -892 -940 94 -34 -1422 -766 583 -393
2764 -393 -1528 -213 868 -535 -1385 378 794 -528 -915 423 826 -702 -311 932 492 -755 54
2781 54 1130 233 -680 576 1224 -73 -440 1258 785 -504 -292 1409 861 -653 337 1567 494
2798 494 -494 275 1286 -176 -568 654 955 -249 -367 850 795 -672 -358 704 178 -1059 70
2815 70 992 -445 -888 160 873 -890 -1093 306 212 -994 -792 713 -181 -1596 -613 515 -567 -1523
2833 -1523 -152 541 -973 -1149 109 486 -1241 -948 656 88 -1303 -395 729 22 -1203 112 1002
2850 1002 -248 -876 417 933 -462 -480 1163 853 -320 -60 955 494 -672 540 1469 34 -409
2867 -409 895 1473 55 -310 918 1180 -392 -15 1414 713 -123 -16 1270 413 -649 358 1134
$$ packed form
2747g94J752j324j221J198R76j355l52R36L99j107m8J034j28j388O56J349r76
2764c93j135J315J081j403q50J763M16j322l87J338M03j528L91J243m40j247Q09
2781E4J076q97r13J256O48j297l67J698m73j289K12J701n48j514R90J230j073
2798D94r88P69J011j462l92J222L01j204j18J217n5j467L14J062n26j237J129
2815G0R22j437m43J048P13j763k03J399r4j206K02J505q94j415R83J128j082r56
2833a523J371O93j514j76J258L77j727K93J604n68j391R08J124p07j225J315Q90
2850A002j250o28J293N16j395j8J643l10j173K60J015m61j166J212R29j435m43
2867d09J304N78j418l65J228K62j572L77J429p01q36J07J286q57j062J007P76
$$ plain form
2884 1134 -399 -586 878 445 -785 -590 790 210 -1368 -185 821 -50 -1336 -404 493 -480 -1295
2901 -1295 -117 330 -877 -946 138 -166 -1404 -520 206 -333 -1352 -411 693 -570 -1520 -40 674
2918 674 -746 -1230 400 654 -873 -625 787 299 -904 161 893 -191 -752 322 860 -133 -477
2935 -477 857 1240 -565 -208 1203 634 -471 156 1341 648 -230 351 1021 -8 -414 588 1141 -103
2953 -103 -427 1125 635 -578 -231 1342 225 -928 83 918 -453 -849 28 641 -555 -820 364
2970 364 171 -942 -862 407 -150 -1090 -634 313 -750 -1235 287 474 -769 -1228 284 429 -869 -1104
2988 -1104 450 197 -953 -480 416 -240 -1063 20 692 -228 -788 586 633 -487 -693 767 539 -308
3006 -308 -203 1259 258 -616 391 1343 38 -426 612 977 -7 -347 1008 1095 67 100 1230 590
$$ packed form
2884A134j533j87J464m33j230J95J380n80j578J183J006q71j286R32Q97r73q15
2901a295J178M47j207o9J084l04j238Q84P26n39j019R41J104j263r50J480P14
2918F74j420m84J630K54j527K48J412m88j203J065P32j084n61J074N38r93l44
2935d77J334L83j805L57J411n69j105O27J185o93q78N81O70j029m06J002N53j244
2953a03l24J552m90j213L47J573j117j153J011Q35j371l96Q77O13j196k65J184
2970C64j93j113Q0J269n57r40M56R47j063m85J522J87j243m59J512J45j298k35
2988a104J554k53j150M73Q96o56q23J083O72r20n60J374M7j120k06J460k28q47
3006c08J05J462j001q74J007R52j305m64J038L65r84l40J355Q7j028L3J130o40
$$ plain form
3024 590 -563 213 1213 248 -398 328 1075 -469 -609 740 768 -523 -661 666 229 -906 -435 791
3042 791 53 -1145 -331 608 -646 -1065 -81 235 -692 -861 129 85 -907 -980 760 -283 -1666 -399 601
3061 601 -636 -1211 -81 629 -776 -925 319 448 -836 -586 571 174 -802 132 1068 -160 -790 451
3079 451 981 -379 -272 1039 904 -262 -250 1170 792 -562 181 1172 811 -688 279 1249 242 -436
3097 -436 889 987 -320 155 561 523 -699 -276 1192 380 -618 146 1045 -31 -820 352 570 -316 -674
3116 -674 273 279 -704 -650 296 -362 -941 -408 336 -397 -1360 -23 510 -831 -1201 220 255 -1069 -1022 289
3136 289 72 -1141 -538 170 -178 -992 -223 529 -518 -861 535 447 -958 -717 757 689 -891 -1 1068
3155 1068 324 -673 1 953 303 -383 441 1296 -251 -134 695 948 -155 -87 1174 621 -597 391 1089
$$ packed form
3024E90j153P76J000r65o46P26P47j544j40J349K8j291j38J327m37j135M71J226
3042G91p38j198Q14R39j254m19R84L16r27j69R90m4r92p3J740j043j383J267J000
3061F01j237n75J130P10j405j49J244J29j284K50J157l97r76R34R36j228o30J241
3079D51N30j360J07J311j35j166J2J420l78j354P43R91l61j499R67R70j007o78
3097d36J325R8j307M75M06l8j222M23J468q12r98P64Q99j076p89J172K18q86l58
3116f74R47Or83N4R46o58n79N33P44p33r63J337N33j341l70J421L5j324M7J311
3136B89k17j213O03P08l48q14P69P52j047l43J396q8j405K41J474o8j580Q90J069
3155A068p44r97O74R52o50o86Q24Q55j547J17Q29K53j103O8J261n53j218R88O98
$$ plain form
3174 1089 544 -511 474 1043 -140 -580 715 911 -661 -388 639 396 -736 -125 752 130 -818 58
3192 58 704 -254 -1089 310 500 -1006 -885 218 198 -1165 -631 402 -30 -1270 -438 557 -448 -949
3210 -949 -177 53 -702 -948 362 353 -961 -442 434 149 -879 -229 610 127 -934 -41 943 -441 -636
3229 -636 554 1194 -105 -285 833 655 -224 58 1043 444 -350 517 781 221 -274 636 1109 -131 -147
3248 -147 759 785 -612 -19 1140 509 -760 -102 754 202 -373 253 803 -221 -468 203 554 -374 -374 558
3268 558 124 -1023 -205 690 -451 -973 -262 223 -363 -869 110 313 -785 -917 -77 -145 -1004 -585 213
3287 213 -164 -1091 -165 425 -598 -941 420 451 -773 -758 509 306 -601 -519 891 539 -563 235 891
3306 891 64 -227 510 976 323 -311 898 827 -383 134 980 342 -321 326 1317 323 -667 387 876
$$ packed form
3174A089n45j055R85N69j183m40J295J96j572K73J027k43j132O11Q77o22r48Q76
3192E8O46r58q35J399J90j506J21J103k0j363N34J033m32j240Q32R95j005n01
3210i49P72K30p55k46J310rj314N19Q76k85j028O50Q39m83j061Q93R84j384j95
3229f36J190O40j299j80J118j78q79K82R85n99p94Q67K64n60m95R10M73j240j6
3248a47R06K6j397N93J159o31j269O58Q56n52n75O26N50j024k47O71L51r28%R32
3268E58m34j147Q18Q95j141n22P11M85n86n06R79K03j098j32Q40o8q59M19P98
3287B13l77r27R26N90j023l43J361L1j224J5J267k03r07Q2J410l52j102P98O56
3306H91q27k91P37M66o53o34J209p1j210N17Q46o38o63O47R91r94r90J054M89
$$ plain form
3325 876 228 -236 606 890 -140 -439 554 346 -242 -203 703 -115 -761 156 758 -642 -825 277 532
3344 532 -497 -872 550 218 -912 -907 320 67 -948 -429 422 -534 -968 -136 -113 -784 -881 262 124
3363 124 -1063 -572 406 -10 -1277 -383 817 -196 -1153 -201 813 -197 -785 80 744 -305 -170 699
3381 699 269 -311 130 1018 453 -490 589 1374 24 -470 735 991 9 -216 762 1234 -166 -41 926
3400 926 514 -305 185 926 167 -239 246 943 6 -545 440 540 -600 -517 615 193 -856 -346 478
3419 478 -166 -835 -16 341 -474 -941 -142 107 -892 -769 42 50 -828 -568 249 -280 -1148 -432 531 -522
3439 -522 -841 92 304 -761 -648 246 215 -439 -370 761 189 -735 66 736 -73 -462 680 834 -126 -507
3459 -507 603 1005 -337 -135 1013 589 -319 458 1141 398 -230 164 1185 -88 -250 518 1173 -314
$$ packed form
3325H76o48m64Q42K84j030k99R93k08n88L9R06q18o46R17O02j400j83J102K55
3344E32j029l75J422l32j130NJ227k53j015N19Q51r56m34Q32K3o71r7J143j38
3363A24j187M91R78m16j267Q94J200j013r57R52J014j010n88Q65O64j049J35Q69
3381F99m30n80M41Q88n65r43J079P85j350m94J205K56r82k25R78M72j400J25R67
3400I26m12q19M90P41p59m06M85O97r37n51R85J00j140Q3J132m22j049N10Q24
3419D78o44o69Q19L57q15m67P99K49r99J23Q11Qq78K60Q17n29q68P16R63j053
3439e22l19R33K12j065J13Q94l1o54O9J131n72r24Q01O70q09l89J142J54r60l81
3459e07J110M02j342K02J148m24r08P77O83p43o28L94J021j273j62P68O55j487
$$ plain form
3477 -314 234 661 326 -137 -76 645 405 -512 140 823 -366 -882 257 495 -841 -616 579 311 -721
3496 -721 -726 286 19 -930 -226 55 -147 -718 198 39 -637 -925 330 112 -889 -773 468 -211 -930
3515 -930 -394 662 187 -1030 -265 429 -255 -634 262 528 -300 -172 686 353 -335 78 906 185 -237
3534 -237 427 1041 266 -400 398 1111 55 -328 521 810 -38 16 818 270 -293 289 698 168 -277 365
3554 365 829 -51 -385 565 721 -468 -566 297 207 -724 -181 536 -11 -577 -262 295 -359 -662 9 46 -683
3575 -683 -491 411 272 -807 -510 491 -74 -1090 -418 535 -533 -1095 -119 33 -326 -784 -1 329 -791
3594 -791 -320 498 39 -657 80 753 -12 -697 229 895 -318 -398 645 702 -282 -171 638 710 -440 -208
3614 -208 1062 435 -274 543 1211 149 -146 480 863 -89 -50 796 719 -439 -143 943 420 -662 -58
$$ packed form
3477c14N48M27l35m63O1P21k40r17O52O83j189n16J139K38j336K25J195k68j032
3496g21nJ012k67r49P04K81k02n71R16j59o76k88J255k18j001J16J241o79p19
3515i30N36J056m75j217P65O94o84l79Q96K66q28J28Q58l33o88M13Q28p21m22
3534b37O64O14p75o66P98P13j056l83Q49K89q48N4Q02n48n63N82M09n30m45O42
3554C65M64q80l34R50J56j189r8Q63r0r31N43P17n47n66L15N57o54l03O71L7p29
3575f83J92R02j39j079K97J001n65j016O72R53j068n62R76J52l59m58P83L30j120
3594g91M71Q18m59o96P37O73p65o85R26O66j213q0J043N7r84J11Q09P2j150K32
3614b08J270o27p09Q17O68j062k95O26L83r52L9Q46p7j158K96J086n23j082O04
$$ plain form
3633 -58 781 -67 -531 233 390 -337 -629 432 411 -921 -654 395 -100 -1024 -479 714 -673 -762 -236
3652 -236 240 -479 -928 -8 203 -830 -1072 241 153 -828 -292 370 -130 -812 156 504 -119 -636 68 249
3672 249 -486 -403 620 297 -540 55 745 185 -515 227 893 204 -430 491 885 -50 -237 727 737 -110
3692 -110 -148 1016 581 -132 6 1003 459 -453 518 828 41 -437 662 688 -385 -303 746 320 -461 -52
3712 -52 580 308 -713 67 534 -100 -636 396 -60 -903 -546 285 98 -669 -564 422 -2 -871 -383 540
3732 540 114 -814 -61 529 -348 -628 96 278 -507 -474 381 -54 -731 -56 543 -391 -675 210 627 -52
3752 -52 -431 645 921 -454 -398 597 621 -174 -69 888 333 -297 429 830 92 -184 623 734 -303 -20
3772 -20 765 581 -54 134 967 402 -366 80 532 422 -395 80 373 -224 -382 370 272 -654 -512 477 98
$$ packed form
3633e8Q39q48m64P64J57p27k92J061k1j332K67J049m95r24N45J193j387q9N26
3652b36M76p19m49R20K11j033k42J313q8r81N36O62n00o82R68L48o23n17P04J81
3672B49p35Q3J023l23q37N95O90n60p00P42O66o89o34R21L94r35j87R64J0q47
3692a10l8J164m35p13J38R97n44r12R71L10p87m78J099K6j073Q2J049m26p81M09
3712e2O32k72j021P80M67o34n36J032m56q43L57Q31j87p67J05R86m24q69M88R23
3732E40m26r28P53N90q77k80P24J82p85L3Q55m35o77O75N99r34k84Q85M17o79
3752e2l79J076K76j375N6R95K4p95J05R57n55o30P26M01p38k76Q07J11j037K83
3772b0P85j84o35J88Q33n65p68M46M52j10q17M75K93n97j58P52r8r26J42R89l79
$$ plain form
3793 98 -748 -313 362 -316 -894 -113 457 -285 -684 339 139 -746 -829 184 -67 -445 -221 335 -292 -943
3813 -943 -331 162 -180 -912 -45 358 -606 -724 325 254 -552 -26 533 58 -505 -198 833 271 -451 281
3833 281 848 69 -182 724 791 -370 107 667 354 -136 419 817 390 -381 291 834 238 -496 379 668
3853 668 -185 -243 606 557 -661 -36 537 202 -438 -94 183 -325 -651 242 341 -471 -708 188 357 -997
3873 -997 -544 328 -74 -702 -336 373 -164 -761 -192 221 -453 -742 144 -26 -538 -426 382 -92 -731 -181
3893 -181 305 16 -706 65 563 -85 -629 108 703 -129 -242 448 284 -284 56 558 57 -259 364 778
3913 778 -176 -113 590 553 192 -156 761 731 -251 -159 792 910 -263 80 834 62 -183 32 667 -215 -96
3934 -96 460 332 -229 -61 409 -138 -619 -241 443 31 -914 -27 233 -226 -671 -372 211 -619 -647 -122 55
$$ packed form
3793I8q46M35O75o78n78P81N70p42l99J023k00q85q3J013k51l78K24N56o27o51
3813i43O12M93l42p32Q67M03r64j18J049p1q06N26N59m75n63L07J031n62p22P32
3833B81N67p79k51R06O7j161M77N60l13m90N55L98m27p71O72N43n96p34Q75K89
3853F68q53n8Q49m9j218O25N73l35o40L44K77n08l26Q93R9q12k37Q96J69j354
3873i97M53Q72m02o28L66P09n37n97N69M13o74k89Q86j70n12J12Q08m74o39N50
3893a81M86k89p22P71M98o48n44P37N95q32j13O90j64n68L40N02n01l16O23M14
3913G78r54O3P03l7l61l48R17l0r82R2R51J18j173L43P54p72k45K15O35q82J19
3934i6N56j28n61J68M70n47m81L78O84m12r45Q87K60m59m45K99N83q30k8N25J77
$$ plain form
3955 55 -572 -454 313 -314 -810 -69 531 -575 -737 237 189 -468 -604 288 348 -500 -463 470 268 -324 -25
3976 -25 488 174 -240 352 457 -84 -44 422 605 -241 30 757 555 -248 104 683 500 -233 253 738 385
3997 385 -368 367 341 -198 -230 427 190 -201 -33 497 293 -404 -23 506 -162 -754 208 663 -394 -762
4017 -762 -16 449 -588 -336 262 -128 -900 -440 93 -392 -661 1 182 -630 -493 65 101 -814 -701 295
4037 295 132 -606 -549 491 -66 -831 -169 221 -97 -615 159 467 -214 -453 168 564 -378 21 348 456
4057 456 -430 -41 828 87 -381 785 684 -167 50 679 503 -510 -82 540 585 19 -45 697 244 -307
4077 -307 522 548 -78 -396 439 376 -479 -346 671 425 -478 -113 560 -10 -425 141 327 -257 -755 -275
4097 -275 404 -616 -508 96 -282 -672 -262 154 -214 -591 -76 -7 -645 -824 -198 516 -426 -501 391 261
$$ packed form
3955E5o27J18P67o27m96P41O00j106j62R74m8o57j36Q92O0q48L7R33k02n92K99
3976b5N13l14m14N92J05n41M0M66J83q46K71P27k02q03L52N79j83p33M86M85l53
3997C85p53P35k6n39l2O57k37l91J68N30k04o97L81N29o68n92R62M55j057l68
4017g62P46M65j037K52N98l90p72M60N33m85k69O62J81q12J37N58L6r15J13R96
4037B95j63p38N7J040n57p65O62L90l18n18P74L08o81k39O21L96r42L99L27J08
4057D56q86L89Q69p41m68J166j01q51K17O29j76j013M28O22M5n66o4P42m53n51
4077c07Q29K6o26l18Q35o3q55J33J017k46r03L65O73n70m15N66J86n84m98M80
4097b75O79j020J08O04l78l90M10M16l68l77N15O9o38j79O26P14r42p5Q92j30
$$ plain form
4117 261 -637 -93 336 -43 -507 -60 367 61 -709 -106 581 -132 -381 402 346 -269 81 800 518 -221
4137 -221 29 795 359 -367 68 707 -51 -275 223 752 142 55 640 555 -166 135 598 86 -540 225 512
4158 512 -88 -635 -73 288 -168 -702 80 153 -402 -117 351 -85 -656 -251 97 -283 -724 -167 184 -440
4178 -440 -704 147 74 -749 -780 344 -61 -757 -530 345 -56 -430 51 209 -153 -567 197 343 -527 -452 235
4199 235 325 -676 -278 692 -35 -339 -8 753 249 -277 199 636 410 -44 522 477 -117 -12 755 375
4219 375 -371 283 648 287 -272 110 636 11 -324 561 857 -338 -198 421 545 -500 -260 466 89
4238 89 -445 -129 401 -188 -499 44 139 -538 -507 175 78 -797 -555 267 -220 -700 -207 271 -541 -755 52
4259 52 408 -227 -688 47 -120 -394 -389 306 135 -382 -223 419 50 -288 127 364 -327 -340 179 412 -279
$$ packed form
4117B61q98N44M29l79m64M47M27l06p70O03O87p13k49P83n6o15L50P19k82p39
4137b21K50P66m36p26M35O39p58k24M98N29o10q7N85q5p21L01M63n12o26P65K87
4158E12o00n47N62L61m56n34P82P3n55K85M68m36n71M05L48l80m41N57L51o24
4178d40k64Q51p3q23l1J124m05o96K27Q75m01l74M81J58l62m14P64J46q70P5O87
4199B35R0j001L98R70p27l04L31P61n04n26M76M37k26m54N66m5n94J05P67l80
4219C75p46O54L65l61n59L82N26o25l35Q85K96j195J40O19J24j045K40P26l77
4238H9n34L16N30n89l11N43R5o77L1O82r7q75K42Q22m87m80M93M78q12k14Q07
4259E2L56o35m61P35j67k74NO95j71n17J59O42l69l38M15K37o91j3N19K33o91
$$ plain form
4280 -279 -43 464 718 -384 -204 573 151 -302 -45 830 329 83 411 631 90 -91 340 631 54 -59
4300 -59 653 332 -263 59 677 -96 -514 62 349 -39 -144 275 400 -202 -148 262 98 -343 -179 381 -102
4321 -102 -753 -241 424 -499 -1132 -33 99 -575 -788 157 -131 -857 -496 113 4 -822 -146 275 -196 -517
4341 -517 55 201 -384 -506 347 299 -343 -383 582 304 -358 -142 629 164 -318 -69 698 -118 -468 238 497
4362 497 -186 -121 575 382 -219 133 844 -51 -513 211 911 -27 -301 407 640 -185 -151 625 478 -200 -195
4383 -195 237 11 -263 94 348 -274 -645 422 216 -529 -670 68 74 -522 -359 50 -142 -528 -557 263 -331
4404 -331 -819 -244 197 -304 -618 118 -2 -790 -547 265 -20 -597 -200 725 -74 -667 118 297 23 -331
4424 -331 67 371 -263 -254 245 104 -321 98 505 34 -196 291 387 60 -127 476 709 -90 -7 740 433
$$ packed form
4280b79K36N07K54j102J80P77m22m53K57Q75n01k46L28K20n41j81M31K91n77j13
4300e9P12l21n95L22O18p73m18N76K87l88j05M19J25o02N4M10j64m41J64N60m83
4321a02o51N12O65r23o33J099J32o74k13R45k88p26L61O09j09q26O76M21m71l21
4341e17N72J46n85j22Q53m8o42m0R65k78o62K16P71m65m82K49P67q16l50P06K59
4362D97o83O5O96j93o01L52P11q95m62P24P00r38k74P08K33q25L4P76j47o78N
4383a95M32k26k74L57K54o22l71J067k06p45j41P38On96J63M09j92l86k9Q20n94
4404c31m88N75M41n01l14P36j20p88K43Q12k85n77L97R25p99n93P85J79k74l54
4424c31L98L04o34RM99j41m25M19M07m71k30M87R6l27j87O03K33p99Q3P47l07
$$ plain form
4445 433 -139 -23 609 493 -300 126 600 343 -166 131 775 44 -249 269 583 -460 -316 606 113 -677
4465 -677 -246 442 -215 -464 -202 28 -458 -645 213 17 -475 -629 33 179 -420 -249 335 -23 -474 -214
4485 -214 40 -634 -393 108 -85 -128 -649 162 203 -552 -286 556 359 -429 -72 448 -6 -440 141 494 282
4506 282 -269 262 663 -276 50 674 396 69 277 736 260 -496 251 649 148 -339 349 699 112 -234
4526 -234 636 523 -60 147 289 -53 -387 -76 271 -380 -313 110 279 -137 -469 410 292 -560 -629 80 266
4547 266 -366 -341 5 -192 -467 -56 216 -327 -390 225 -88 -844 -486 205 104 -651 -393 217 190 -735 -224
4568 -224 486 -10 -539 -93 29 -239 -339 303 245 -228 -62 376 423 -313 209 700 -60 -113 247 761 -157
4589 -157 -37 431 531 -113 3 348 338 153 43 508 25 66 290 499 107 -414 288 414 -290 -296 377
$$ packed form
4445D33n72J16O32j16p93M26M74k57n09K97O44p31k93N18L14j043J44R22m93p90
4465f77M31O88o57k49K62K30m86j87Q58j96m92j54O62J46n99J71N84l58m51K60
4485b14K54o74K41N01j93m3n21Q11M1p55K66Q42j97p88L57N20m54m34N81L53k12
4506B82n51N31M01r39L26O24k78l27K08M59m76p56P47L98n01m87O88L50n87l46
4526b34Q70j13n83K07J42l42l34L11L47o51O7M23J69m16l32Q79j18q52o9P09J86
4547B66o32K5L46j97k75M11K72n43o3O15l13p56L58O91j01p55K58O10k7r25N11
4568b24P10m96n29M46J22k68j00O42n8m73J66M38M7p36N22M91p60n3L60N14r18
4589a57J20M68J00o44J16L45j0j85j10M65m83M1K24K09l92n21P02J26p04oO73
$$ plain form
4610 377 425 -331 -150 256 124 -353 -535 204 -200 -413 -105 82 -387 -639 65 -15 -416 -341 244 -101 -773
4631 -773 -78 278 -643 -731 53 246 -321 -418 226 118 -292 -267 419 115 -236 -123 304 -117 -337 3 365
4652 365 -30 -54 251 468 -146 106 285 263 -369 118 648 360 28 244 676 187 -188 289 500 -263 -25
4673 -25 404 253 130 -39 426 367 -183 -22 351 85 -629 228 218 -308 -240 133 159 -500 -274 -24 250 -678
4695 -678 97 334 -3 -727 -199 320 -338 -481 116 129 -351 -350 80 38 -146 -424 223 95 -678 -148 112
4716 112 -88 -391 52 271 -344 -430 82 221 -330 -88 376 40 -235 32 437 170 -281 312 807 -168
4736 -168 -113 388 502 -123 -91 593 440 126 70 644 287 -172 266 472 155 -225 440 417 -243 -436 577
4757 577 200 -298 27 469 256 -524 -9 247 -179 -282 185 117 -452 -197 -65 102 -428 -250 168 -77
$$ packed form
4610C77M8p56J81M06j32m77j82P39m04k13L08J87m69k52P04q0m01P5N85l45o72
4631g73O95L56r21q8P84J93n67r7O44j08m10K5O86l04l51J13M27m21k20L40L62
4652C65l95k4L05K17o14K52J79k2o32M87N30k88l32K16M32m89l75M77K11p63K38
4673b5M29j51j23j69M65n9n50J61L73k66p14Q57j0n26O8L73K6o59K26K50K74r28
4695f78P75K37l37p24N28N19o58j43N97J3m80JM30m2j84k78O47j28p73N30K60
4716A12k00l03M43K19o15q6N12J39n51K42M64l36k75K67M05k67m51N93M95r75
4736a68N5N01J14o25L2O84j53l14n6N74l57m59M38K06l17l80O65k3o60j93J013
4757E77l77m98L25M42k13p80N15K56m26j03M67o8n69K55J32J67n30J78M18k45
$$ plain form
4777 -77 -587 -272 254 -295 -662 -91 186 -176 -594 -93 -6 -422 -304 269 124 -552 -149 303 -137 -350 30
4798 30 397 -198 -372 180 415 -324 -237 190 628 -120 153 284 199 -113 316 627 -19 -214 323 337 163
4819 163 19 728 465 -290 -127 530 430 -239 439 391 96 -384 185 523 -313 115 175 67 -464 -385 441
4840 441 121 -232 -267 179 -203 -379 -243 225 -266 -555 -202 28 -298 -276 41 214 -511 -437 62 -153 -435
4861 -435 -61 178 -213 -608 79 128 -189 -233 164 205 -241 -133 354 80 -138 87 390 -109 -438 144 246
4882 246 -31 -61 470 282 -48 2 544 517 -150 439 569 214 -93 219 508 172 -120 394 495 -292 -106
4903 -106 413 285 -176 -31 457 33 -164 -139 413 68 -341 -40 191 -342 -179 240 165 -572 -420 76 46
4924 46 -371 -266 90 -165 -437 -146 320 -233 -435 -160 -55 -406 -375 -77 -187 -401 -93 142 -103 -395 75
$$ packed form
4777g7n10L15N26n49l67N71K77l62m18N01Q7m16J18N73j45o76M03M52m40k13L80
4798C0L67n95j74N52K35p39Q7M27M38p48K73J31q5l12M29L11o46j95N37J4j74
4819A63j44P09k63p55J63O57j00o69O78m8k95m80N69L38q36M28O0j08n31P9Q26
4840D41l20l53l5M46l82j76J36M68m91k89L53K30l26K2L17J73p25P4M99k15k82
4861d35L74K39l91l95O87M9l17m4L97M1m46J08M87k74k18K25L03m99l29N82J02
4882B46k77l0N31j88l30N0N42k7o67N89J30l55l07L12K89l36k92N14J01p87J86
4903a06N19j28m61J45M88m24j97K5N52l45m09L01K31n33J63M19p5p37J52M96l0
4924D6m17J05L56k55k72K91M66n53k02K75J05l51L1K98j10k14L08K35k45k92M70
$$ plain form
4945 75 184 -35 -329 -31 383 -296 -171 365 554 -121 94 428 163 66 -22 337 151 -328 219 469 -87
4966 -87 13 621 537 -90 256 309 112 -187 -114 457 243 -322 17 658 82 -224 213 359 -307 -351 240 7
4988 7 -357 -278 80 -332 -592 -362 289 -282 -581 -178 -19 -400 -539 -20 -17 -354 -466 -132 -46 -427 -207 381
5010 381 -186 -619 -92 100 -364 -567 132 -86 -520 -197 418 -142 -285 -601 254 208 -463 -43 376 0
5030 0 -222 515 390 12 -214 263 84 -237 -10 585 235 -260 413 758 153 -306 540 454 -72 46 78
5051 78 441 -13 324 324 296 19 -91 334 -18 -109 -42 324 -190 -389 85 119 -484 -362 189 -27 -366 -114
5073 -114 258 -112 -385 -83 -70 -406 -691 -102 147 -452 -450 161 -8 -350 -368 25 3 -425 -405 51 36 -484
5095 -484 -49 324 -221 -217 182 331 -262 17 234 385 25 -160 543 197 78 373 484 -32 -248 304 346
$$ packed form
4945G5J09k19k94K98M14o79J25N36J89o75K15L34k65r7q8L59j86m79N47K50n56
4966h7J00O08q4o27L46N3j97k99P3N71k14n65L39O41n76l06M37J46o66m4N91k33
4988Gl64P9L58m12k60K30O51n71k99M03J59l81j39N19Ll37j12L34Q6l81K20N88
5010C81n67m33N27J92m64k03O99k18m34L23O15n60j43l16Q55m6o71M20M19l76
5030@k22P37j25l78k26M77j79l21K27N95l50m95O73L45o05m59Q46q6n26J18L2
5051G8L63m54L37%k8k77j10M25l52r1O7L66n14j99M74L4o03J22N51k16l39K52
5073a14L72l70k73L02J3l36k85N89K49n99KO11j69l42j8L93k2m28K0M56j5n20
5095d84M35L73n45ML99J49n93K79K17J51l60j85P03l46j19K95J11n16k16N52M2
$$ plain form
5116 346 117 -263 556 547 44 108 460 245 46 -5 121 259 -282 352 236 -216 -161 80 143 -209 -298 100
5138 100 100 -282 -86 546 -123 -480 -148 236 -493 -451 -93 102 -603 -386 -189 32 -416 -195 232 -125 -603
5159 -603 -188 -45 -203 -212 -13 187 -256 -451 310 468 -431 -66 209 196 -113 -65 315 16 -129 288 278 -126
5181 -126 124 437 314 52 12 504 435 -124 401 547 274 -168 338 507 40 15 320 124 -146 138 380
5202 380 90 -215 82 299 -114 -387 242 219 -343 -335 48 10 -387 -291 68 -127 -78 -354 112 95 -344 8
5224 8 -81 -517 -540 -283 101 -350 -178 273 74 -389 -323 249 -126 -300 -269 -25 -193 -434 -191 176 -253 -98
5246 -98 279 157 -132 -156 43 149 -103 203 306 18 -255 269 640 158 -107 57 612 153 42 433 314
5267 314 -340 100 255 130 -207 430 315 135 -92 426 455 15 -55 242 250 -373 30 171 133 -188 -154 308
$$ packed form
5116C46k29l80Q19rn03O4L52k15j99n1J26J38n41O34j16m52N5K41O3l52q9L98
5138A00%l82J96O32o69l57L32L84p29M2L58J95p05K17J97K21m48K21M27l57m78
5159f03M15J43j58rJ99K00m43j95P61J58q99L65K75j3l09M8L80k99j45M17j0m04
5181a26K50L13j23k62m0M92o9n59N25J46k73m42N06J69m67k5L05j96k70K84K42
5202C80k90l05K97K17m13k73O29k3n62QL83l8l97R6L59j95M9k76M66j7m39L52
5224Hq9m36k3K57L84m51J72M51j99m63O6N72l75j74L1K44j68k41K43L67m29J55
5246i8L77j22k89k4J99J06k52L06J03k88k73N24L71m82k65J64N55m59j11L91j19
5267C14o54M40J55j25l37O37j15j80k27N18K9m40p0K97Qo23M03J41l8l21L4M62
$$ plain form
5289 308 64 -389 76 236 -145 -307 393 9 27 -258 -190 -122 -424 -399 230 -251 -192 -49 -37 -433 -381 111
5311 111 220 -265 -297 116 40 -300 -278 208 14 -229 349 207 -174 -97 298 375 46 -176 477 210 -155 -60
5333 -60 464 359 -224 -32 350 216 -64 76 276 189 -66 382 -44 -294 52 451 73 -117 375 433 30
5354 30 -242 154 170 -184 -69 346 516 -385 -397 89 -745 -278 -287 0 -454 -1115 73 9 -625 -425 -336 -172
5376 -172 -446 -1258 261 82 -467 -628 230 61 -611 -352 0 -193 -234 -217 207 -230 -396 -47 119 -247
5396 -247 -230 184 56 -230 -235 489 -79 -214 263 255 -69 -18 70 487 -111 -390 241 401 127 70 703 69 128
5419 128 -208 343 161 -430 245 500 -21 -163 368 164 -8 -517 388 65 -128 78 305 -55 -232 -193
5439 -193 32 -463 -37 78 65 -447 -367 217 154 -140 -390 302 -64 -107 -60 -22 -159 -431 65 294 -435 -448
$$ packed form
5289C08k44m53M65J60l81j62P00l84J8k85O8O8l02K5O29m81N9J43J2l96N2M92
5311A11J09m85l2M13p6l40K2M86j94k43N78j42l81P7L95P7l29k22O53k67l65R5
5333f0N24j05n83J92L82j34k80J40K00q7k55M48m26k50L46L99l78j90M92N8m03
5354C0k72L96J6l54J15M15J70r01j2M86q34M67rK87m54o61J188o4o34K00Q9J64
5376a72k74q12J519j79n49j61Q58j69o72K59L52j93m1J7M24m37j66L49J66l66
5396b47J7M14j28k86nP24n68j35M77ql24N1Q8M17n98k79O31J60k74n7O33o34N9
5419A28l36N51j82n91O75K55n21j42N31k04j72n09R05l23j93K06K27l60j77L9
5439a93K25m95M26J15j3n12Q0N84o3k94k50O92l66m3M7L8j37k72M96K29p29j3
$$ plain form
5461 -448 157 8 -644 123 292 58 -288 -3 222 -368 -355 14 333 -108 -171 208 275 -284 58 531 138
5482 138 -84 64 256 -184 -2 244 331 63 -202 117 252 -147 -66 275 322 -255 -175 387 137 -136 223
5503 223 399 98 -230 265 385 -64 -170 251 426 -229 -179 117 -77 -226 15 -6 -146 -464 112 387 -417
5524 -417 -405 93 340 -302 -398 -101 -164 -331 -219 -172 -167 -174 254 373 -264 -606 176 88 -478 -241 282 170 -165
5547 -165 -149 320 105 -224 75 359 -122 -141 88 336 212 -59 256 219 -113 -33 148 261 -232 113 533
5568 533 245 -123 118 311 -75 -83 339 112 -185 -29 461 226 -100 134 353 28 -241 34 261 -2 -228
5589 -228 355 10 -266 -257 454 -72 -495 -112 175 -150 -368 -266 325 -218 -536 -6 -9 -434 -179 330 114
5610 114 -438 -128 19 22 -266 -98 350 24 -313 -237 102 -335 -209 162 102 -160 -212 152 127 -360 121 254
$$ packed form
5461d48O05j49o52P67J69k34l46K85K25n90J3L69L19m41o3L79O7n59L42M73l93
5482A38k22J48J92m40J82K46Q7k68k65L19J35l99Q1L41M7n77Q0N62k50k73L59
5503B23J76l01l28M95J20m49j06M21J75o55N0K96j94j49K41k1j40l18N76K75q04
5524d17J2M98K47o42r6K97o3j67J12M7NpM28J19o37l42P82q8n66K37N23j12l35
5547a65J6M69k15l29K99K84m81j9K29K48j24k71L15l7l32Q0J81J13m93L45M20
5568E33k88l68K41J93l86qM22k27k97J56M90k35l26K34K19l25k69K75K27k63k26
5589b28N83l45k76RP11n26m23L83K87l25k18J02N91n43l18N30lm25K55N09k16
5610A14n52L10J47Lk88J68M48l26l37P6L39m37J26L71o0k62n2L64k5m87M81J33
$$ plain form
5632 254 -120 -235 225 237 72 -176 589 226 -148 -45 517 404 216 -35 367 138 64 5 392 109 -203
5653 -203 177 336 -53 -370 219 243 -90 -160 280 -60 -84 -186 84 -226 -502 13 140 -357 -249 289 176
5674 176 -201 -225 -230 -238 -582 -305 336 -200 -310 -332 -20 -358 -389 106 129 -633 -217 54 198 -258 -86 343 191
5697 191 -311 17 281 94 -53 -127 385 251 -248 400 430 19 185 377 93 -186 -82 430 44 129 190
5718 190 511 176 -28 158 505 -132 -35 417 198 -192 192 322 234 -223 93 15 64 -467 120 244 -147
5739 -147 -44 -65 243 -255 -141 372 118 -206 -82 75 41 -277 -43 -6 -271 -249 58 -73 -140 -194 67 86
5761 86 -613 -151 31 84 -303 -170 110 -16 -88 -64 261 -134 48 247 -169 -78 -46 83 -9 -202 349 161
5783 161 150 -175 256 450 -74 -154 542 285 -28 3 353 438 -164 169 133 144 149 244 152 -212 -52 254 195 -76
$$ packed form
5632B54l74j15M60J2j65k48P65l63l74J03N62j13j88k51M02k29p4n9L87k83l12
5653b03L80J59l89l17N89K4l33p0M40l40k4j02K70l10k76N15J27m97J08N38j13
5674A76l77k4nql44K77O41n36j10k2L12l38l1M95K3p62M16K71J44m56J72M29j52
5697A91n02L28K64j87j47p4N12j34m99O48L0m11J66J92k84k79J04N12l86Q5O1
5718A90L21l35k04J86L47o37R7M52k19l90L84J30q8m57L16p8M9n31N87J24l91
5739a47J03k1L08m98J14N13k54l24J24J57l4l18K34L7k65K2L07j31o7n4K61J9
5761H6o99M62J82N3l87J33K80j26p2K4L25l95J82J99m16R1L2J29r2j93N51j88
5783A61j1l25M31J94n24q0O96k57l13L1L50Q5o02L33l6J1NR5r2l64J60L06n9k71
$$ plain form
5807 -76 -211 401 139 -200 -163 335 -52 -257 -98 98 -141 -455 -174 177 -391 -186 134 -273 -508 -24 52
5828 52 -109 -386 71 109 -384 -286 73 108 -333 -374 133 168 -285 -67 -3 -159 -243 79 15 -184 -296 10 298
5851 298 -141 -367 109 216 -167 -215 272 268 -148 -65 571 14 -66 114 127 347 -96 277 408 131 -84 223
5873 223 236 -253 -13 457 93 -15 105 288 130 -43 48 418 8 -238 322 -57 -187 -270 162 -28 -294
5894 -294 -184 149 37 -332 221 477 -320 -387 51 76 -302 -457 -111 -62 -163 -64 -94 -167 -138 64 118 -413 -328
5917 -328 -28 144 21 -420 177 -106 -85 21 69 49 -21 75 305 -126 -194 34 309 43 -198 183 474 -220
5939 -220 -32 435 155 212 201 276 50 -173 205 424 79 -149 73 240 -19 -220 366 -78 -264 -246 256
5960 256 61 -212 65 65 -257 -24 123 -8 -23 -279 82 2 -187 -140 293 -137 -38 -269 105 26 -294 -95
$$ packed form
5807g6j35O12k62l39L7M98l87k05J59J96k39l14K81L51n68K05L20m07k35M84P6
5828E2j61k77M57L8m93R8L59L5m41m1N07L5m53K18O4j56q4L22o4j99j12L06K88
5851B98m39k26M76J07l83m8M87mm16Q3O36n57q0J80J3K20m43L73J31k77k15L07
5873B23J3m89K40M70l64j08J20J83j58j73R1L70m10k46N60l79j30q3M32j90k66
5894b94J10L33j12l69N53K56p97o7M38K5l78j55L46M9j01R9l0p3K9K02N4n31Q5
5917c28L00J72j23m41N97k83K1J06M8k0p0R6K30m31o8K28K75k66k41L81K91o94
5939b20J88M67k80N7j1P5k26k23L78K19l45k28K22J67k59k01N86m44j86J8N02
5960B56j95k73K77%l22K33J47j31j5k56L61q0j89M7M33m30R9k31L74p9l20J99
$$ plain form
5982 -95 116 -94 -336 278 57 -247 41 -8 -78 -93 -15 188 -355 -346 342 187 -182 -224 230 238 78 98 383 220
6006 220 -138 108 149 148 -126 243 279 125 20 147 146 178 -49 63 373 -63 -70 332 203 71 169 441 46
6029 46 -234 79 494 -115 -66 247 34 -138 -153 51 195 -12 -133 260 -328 -78 -99 323 -206 -338 13
6050 13 146 36 -89 82 273 -318 -179 -163 -196 -436 54 292 -345 -172 81 183 -168 -98 193 57 -262
6071 -262 248 -56 223 -55 -59 426 50 -199 168 216 -34 70 317 5 -12 434 471 -113 -13 207 448 177
6093 177 -45 221 225 61 -85 302 360 -135 -123 380 -2 -112 -255 258 -119 -63 143 331 -125 -290 208 278
6115 278 -204 -185 -98 3 30 14 253 -91 16 -120 215 -247 -576 -216 5 -350 -132 -61 -97 -55 -118 8 81
6138 81 -40 -166 167 -169 -285 319 76 -145 -311 -19 226 -241 23 190 167 -236 -80 221 319 -6 415
$$ packed form
5982i5K11k10k42O14k21l04K88m9p0j5P8K03n43RO88j55l69m2M54Qj60K0K85j63
6006B20l58K46M1jk74L69L6j54j05J27jL2k27J12L10m36pM02j29j32R8K72l95
6029D6k80L13M15o09M9L13k13j72j5K04J44k07j21L93n88K50k1M22n29j32L51
6050A3J33j10j25J71J91n91J39J6l3k40M90K38o37J73K53J02l51P0K91j36l19
6071b62N10l04K79k78mM85l76k49L67M8k50J04K47l12j7M46L7n84J00K20K41k71
6093A77k22K66Mj64j46L87N8m95J2N03l82j10j43N13l77N6K06J88m56j65M98P0
6115B78m82J9Q7J01K7j6K39l44J07j36L35m62l29L60K21l55K18P1l6M2o3J26P3
6138H1j21j26L33l36j16O04k43k21j66K92K45m67K64J67k3m03J56L01R8l25M21
$$ plain form
6159 415 323 256 -37 415 205 71 27 202 120 -52 -91 430 417 -59 168 268 -12 -141 97 335 136 -67
6181 -67 366 -44 -277 28 255 -86 -356 -218 209 -184 -245 198 99 -217 -260 -193 31 -166 -150 98 10 -214
6203 -214 -217 -54 -45 -195 -99 270 -19 7 -79 30 -385 -234 221 255 -39 -266 250 -39 -119 -35 241 0 -368
6226 -368 79 43 -159 -108 239 152 -93 120 161 245 -282 9 52 42 -149 310 326 132 -167 51 234 199 -159
6249 -159 195 250 -146 131 142 65 55 51 254 -3 -212 283 148 77 -168 78 -5 11 -195 -89 94 -200 37
6272 37 -53 -198 -166 60 -34 34 -309 143 188 -140 -279 53 176 -274 -45 197 79 -169 27 136 94 -162
6294 -162 -102 -31 -180 -143 -46 -49 -29 -109 147 154 -291 52 278 -38 -187 -21 -194 -356 -398 296 192 -240 67 302
6318 302 67 -108 36 396 50 -266 9 297 32 -66 102 -144 -257 216 202 138 -186 238 333 99 -199
$$ packed form
6159D15r2o7k93M52k10j34m4J75q2j72l9N21j3m76K27J00k80j29K38K38j99k03
6181f7M33m10k33L05K27l41k70J38M27l93o1M43r9l16m3O7K24j97J6K48q8k24
6203b14lJ63Rj50R6L69k89K6q6J09m15J51M55L4k94k27N16k89q0Q4K76k41l68
6226c68M47l6k02N1L47q7k45K13M1Q4n27K91M3j0j91M59J6j94k99K18J83l5l58
6249a59L54N5l96K77J1p7j0mK03k57k09M95j35p1k45K46q3J6k06J06J83k94K37
6272C7r0j45L2K26r4O8l43M52M5l28j39L32J23m50K29K42j18k48J96J09m2k56
6294a62O0P1j49L7R7lK0q0K56Pm45L43K26l16j49J66j73j62m2O94j04m32L07K35
6318C02k35j75J44L60l46l16K75K88k65r8J68k46j13M73j4o4l24M24R5k34k98
$$ plain form
6339 -199 -146 159 64 -373 -180 180 -175 -268 47 -139 -281 -221 411 207 -72 -69 137 -217 -232 12 225 -268
6361 -268 -327 75 -84 -267 -235 83 -97 -274 117 17 8 -209 111 133 -104 21 223 204 -418 -157 337 159
6383 159 16 187 239 249 -8 9 247 15 -230 86 372 1 57 148 307 -125 185 180 -135 -29 -94 211 0
6406 0 -80 105 105 72 -362 99 149 -139 -164 145 175 -164 -351 298 -261 -356 71 64 -266 -379 17 137 -169 -32
6430 -32 33 -119 -29 -275 -29 -179 -313 -226 221 -149 -165 -98 -8 -71 -219 233 99 154 -114 463 -83 -96 86
6453 86 163 -113 61 295 154 -55 -14 455 308 -35 -16 424 225 41 -3 295 172 -126 147 62 16 -135
6475 -135 196 208 75 -1 346 321 -47 -68 190 142 -14 15 175 -133 -127 81 357 -322 36 169 -151 -147 -113 -48
6499 -48 -271 -202 -123 52 -175 -410 -64 207 -148 -33 -107 159 -191 -139 47 134 -197 -76 48 -284 -229 83
$$ packed form
6339a99N3L05r5m37J93L60l55r3L15j86j42O0O32k04k79LK06l54j5K44K13m93
6361b68n9M02j59j83L2L18j80j77L91j00rk17L20K2k37J25K02j9o22K61M94j78
6383A59j43J71N2J0k57J7K38k32k45L16K86l71N6R1J59m32L10nl15J06o5L05k11
6406@q0J85%l3m34M61N0k88k5L09L0l39j87O49n59r5M27pl30j13L96J20l06J37
6430c2O5j52R0k46K46j50j34Q7M47l70j6O7R0o3j48M52j34N5k68N77n46j3J82
6453H6P7k76J74K34j41k09M1M69j47l43J9M40j99j84m4K98j23k98K73q5m6j51
6475a35L31J2j33p6L47k5l68k1K58m8j56K9J60l08OK08K76o79L58J33l20ML4O5
6499d8k23O9P9J75k27k35L46K71l55J15p4K66l50N2J86Q7l31J21J24l32N5L12
$$ plain form
6521 83 321 -319 -359 180 299 -110 -49 168 90 76 19 86 -194 -80 84 220 -94 -118 81 -33 -191 -164 98
6544 98 -57 170 129 84 157 -46 188 207 14 -39 33 258 -90 -231 177 221 -50 -109 83 77 -496 -53 -134 -57
6568 -57 -207 34 -79 -237 -204 178 218 -475 -360 110 279 -244 -82 12 143 -272 -121 -92 -80 -297 335 85
6590 85 -290 2 202 49 14 -100 210 -93 -276 -115 254 165 -449 -147 359 -78 -96 312 111 239 50
6611 50 154 286 16 47 112 -199 138 259 384 80 -65 -176 246 -20 -12 429 547 -177 -112 381 -126 -222
6633 -222 -24 157 -37 -257 302 -28 82 -167 -74 81 -253 135 -103 -173 -247 -74 -18 -189 -135 -142 -160 -167 -253 440
6657 440 -242 -214 -179 85 160 -199 2 201 -66 -94 213 62 -243 -310 -32 282 -88 7 -44 331 -66 4 119
6680 119 74 -177 27 163 38 104 245 295 -71 -14 508 249 169 -212 -33 9 -146 -105 343 238 -44 255
$$ packed form
6521H3K38o40m0N39J19m09O1K17p8j4n7O7k80J14J64J36l14k4J99j14j58K7K62
6544I8j55K27m1m5P3k03K34J9j93n3P2K25l48j41M08M4k71n9J92on73M43q1P7
6568e7j50K41j13j58L3L82M0o93J15M70J69n23J62R4J31m15J51K9J2k17O32k50
6590H5l75K92K00j53l5j14L10l03j83J61L69q9o14L02N06m37j8M08k01J28j89
6611E0J04J32k70L1O5l11L37J21J25l04j45j11M22k66QM41J18p24O5M93n07r6
6633b22J98J81j94k20N59l30J10k49R3J55l34L88k38p0p4J73N6j71N4pj8pq6O93
6657D40o82K8L5K64P5l59K01J99k67k8L07j51l05o7K78L14l70R5n1L75l97P0J15
6680A19m5k51K04J36j25O6J41N0l66N7N22k59q0l81J79M2j55M1M48j05k82K99
$$ plain form
6702 255 375 114 -102 209 108 -106 -41 -83 133 75 -83 156 -257 -179 -161 43 -64 62 1 182 -45 -178
6724 -178 1 65 -118 -47 -5 -21 -263 -61 -99 11 -53 -276 -74 -201 86 90 61 -134 -20 507 333 -121 -200
6747 -200 -174 -30 -229 226 130 46 20 50 17 -31 -42 260 127 -90 17 310 32 -208 183 153 131 -221 99
6770 99 -38 30 132 375 203 48 237 177 281 111 4 272 -135 -116 -26 -56 -131 -33 119 80 -320 -224 -38
6793 -38 38 -78 -132 -68 -213 -132 -137 81 12 139 -159 -72 -281 -52 -73 -25 -53 -205 303 -162 -270 8 140 67
6817 67 -290 102 -41 -272 10 230 -61 17 -1 80 439 -196 101 -25 -280 -655 72 1140 -139 43 223
6838 223 227 -83 185 297 32 21 159 270 -305 22 28 20 -10 -137 169 162 -91 -57 139 216 25 2 124 21
6862 21 49 -19 175 -296 -151 48 171 -162 -95 71 -58 119 -186 260 -46 -194 98 -185 26 -204 45
$$ packed form
6702B55J20k61k16L11j01k14O5m2K16n8j58K39m13P8J8K04j07J26o1J81k27j33
6724a78J79O4j83P1M2j6k42K02l8J10o4k23K02j27K87Mk9j95J14N27j74m54p9
6747b00K6J44j99M55r6q4k6L0l3m8j1L02j33k17J07K93k78k40L91l0k2l52L20
6770I9j37O8J02K43j72j55J89o0J04j70j07K68m07J9R0l0p5R8J52l9m00R6J86
6793c8P6j16n4O4j45Q1nK18o9J27k98Q7k09K29k1M8k8j52N08m65j08K78J32p3
6817F7l57L92j43k31K82K20k91P8j8Q1L59o35K97j26k55l75P27J068j279J82J80
6838B23Ml10K68J12k65j1J38J11n75L27Oql0j27L06pk53L4J96P7j91k3J22j03
6862B1K8o8J94m71J45J99J23l33O7J66j29J77l05M46l06j48K92k83K11k30K49
$$ plain form
6883 45 58 -26 14 -242 89 -121 -99 -77 -3 103 -109 -88 -58 -52 -13 181 -32 -168 -39 189 -338 21 608 39
6907 39 -318 -126 65 -32 80 7 335 -17 -261 367 189 209 25 274 314 48 245 173 236 -109 17 163
6929 163 35 130 308 186 -134 -129 118 -40 -124 -116 213 205 -285 69 326 -78 -204 130 45 -15 -249 -109 -61 -348
6953 -348 -321 -31 -74 -153 -141 -68 -10 -328 1 144 -202 -297 184 258 9 -295 211 158 -219 -62 89 -226 -160
6976 -160 89 149 326 -41 208 361 183 -297 253 357 135 95 -21 -35 -9 -145 -16 -120 -27 244 150 -164
6998 -164 -103 240 191 1 -187 184 236 -274 71 271 111 21 148 14 119 -88 229 -38 -85 -3 140 -3
7020 -3 -199 204 185 -124 -177 -4 5 -135 -318 59 98 34 -114 -170 41 -326 -183 22 -49 -104 -127 -39 -123 -119 41
7045 41 248 -98 -70 0 147 -61 53 195 134 -126 38 288 3 -64 -60 75 -55 49 2 161 282 176 165
$$ packed form
6883D5J3q4M0k56L31k10K2K2P4J06k12K1L0OL9J94k13j36J29K28n27L59N87n69
6907C9l57J92J91r7J12p3L28l52k44O28j78K0j84K49M0k66J97p2O3l45J26J46
6929A63j28R5J78j22l20NK47j58q4QL29qm90L54K57m04j26L34q5o0k34J40M8k87
6953c48K7K90m3p9J2P3N8l18L29J43l46r5M81P4k49l04N06n3l77J57J51l15O6
6976a60K49O0J77l67K49J53j78m80N50J04k22m0j16j4K6j36J29j04R3K71r4l14
6998a64O1L43m9j90j88L71N2n10L45K00j60r0J27j34J05k07L17k67m7Q2J43j43
7020cj96M03j9l09n3J73Rj40j83L77L9o4j48n6K11l67J43K05p1n5k3Q8q4MJ60
7045D1K07l46K8P0J47k08J14J42o1k60J64K50k85o7MJ35j30J04m7J59J21j06j1
$$ plain form
7068 165 284 95 -29 418 170 -70 245 386 10 42 172 134 30 -297 -201 200 -2 -49 20 -117 -261 -54
7090 -54 156 -103 -160 -207 39 -9 -137 -232 -16 -53 -257 -189 -8 24 -288 158 -70 -466 -44 208 -15 -206 131
7113 131 59 -268 19 133 -125 -135 30 112 -7 -19 102 -75 201 -37 -25 120 -1 -234 -64 161 -17 122
7135 122 -53 34 64 17 470 362 72 -53 183 155 80 30 337 -12 -26 33 0 53 275 140 77 -88 -73 84
7159 84 64 126 -72 149 191 -123 48 127 -314 -93 165 -243 -166 5 209 -108 -198 -65 231 -100 -289 -85
7181 -85 220 -127 -64 -84 14 -141 -94 -186 -343 -215 -17 -76 114 -256 310 209 -273 28 40 57 -310 -281 106
7204 106 74 -325 -17 360 228 167 61 175 -41 3 316 323 2 -130 259 275 -210 141 132 97 72 -42 282
7227 282 126 -163 61 187 -87 -140 220 -59 122 -272 127 73 21 -57 47 -240 -254 302 41 -154 -314 11
$$ packed form
7068A65J19j89j24M47k48k40L15J41l76L2J30l8j04l27R6M01k02m7O9j37j44K07
7090e4K10k59n7m7K46m8j28r5K16l7k04O8J81L2l12M46k28l96M22K52k23j91L37
7113A31p2l27K87J14k58j0J65Q2j19j2J21j77K76k38J2J45j21k33J70K25j78J39
7135A22j75Q7L0m7M53j08k90j25K36k8p5n0L07l49j4N9l3N3K22j35o3j65J5J57
7159H4k0O2j98K21M2l14J71P9m41K21K58m08P7J71K04l17r0J33K96l31j89K04
7181h5L05l47O3k0R8j55M7r2j57J28J98n9J90l70N66j01m82L01J2J7l67K9L87
7204A06l2l99L08L77j32o1j06J14k16M4L13Pl21j32L89J6m85L51rl5k5j14L24
7227B82j56k89K24J26k74n3L60k79J81l94L99n4n2p8J04k87j4N56k61j95j60L25
$$ plain form
7249 11 -58 -134 -268 125 -30 -92 -220 -22 137 -135 23 -50 -88 -412 8 -63 -41 -190 7 196 -161 -13 107
7272 107 -172 -150 -179 -14 28 -109 -61 155 58 71 45 73 -128 33 256 -57 -171 144 207 174 54 31 302 41
7296 41 -35 199 -117 -5 -181 213 194 8 -108 98 246 -163 90 109 -146 -146 58 75 -146 -163 -110 178 -212
7319 -212 8 -61 132 -268 -316 -105 -377 -411 -160 74 -211 -119 -212 -87 41 -120 12 41 -204 -302 210 -203
7341 -203 -192 -235 90 103 -174 114 327 139 123 91 84 72 172 61 -27 23 105 284 2 -8 179 217 -94 -69 333
7366 333 133 -81 141 39 308 149 -179 122 -149 121 115 60 307 -68 -23 -55 -108 -110 17 35 9 63 22 -119
7390 -119 -148 -201 326 -26 -53 -243 149 -15 -106 19 -37 -86 -5 25 -52 -248 42 -42 -136 -264 -13 118 -294 0
7414 0 95 -1 -51 26 -9 -16 -58 -90 -34 111 -25 4 -44 286 -119 17 -80 -138 98 168 -9 -127 57 -98 140 197
$$ packed form
7249A1o9p6j34L93j55o2j28J98J59k72J58p3l8l24M20p1K2j49J97J89l57J48J20
7272A07k79K2k9J65M2j37M8K16r7J3k6K8k01J61K23l13j14L15O3l3j20k3K71k61
7296D1p6K34l16J12j76L94j9j86j16K06J48m09K53J9k55%K04J7k21j7N3K88l90
7319b12K20o9J93m00m8K11k72l4K51K34k85R2r3J25J28j61J32K9k45r8N12m13
7341b03J1m3L25J3k77K88K13j88j6l2pj2J00j11q8N0Q2J79k82j0J87L8l11K5M02
7366C33k00k14K22j02K69j59l28L01k71K70on5K47l75M5l2n3kJ27J8k6N4m1j41
7390a19k9n3N27l52k7j90L92j64r1J25n6m9Q1L0p7j96K90q4r4j28K51J31m12K94
7414@R5r6n0P7l5pm2l2N6J45j36K9m8L30m05J36r7n8K36P0j77j18J84j55K38N7
$$ plain form
7440 197 161 286 -2 10 275 -6 -191 33 224 62 -190 20 212 66 27 -59 218 176 -80 277 294 58
7462 58 -59 -34 99 -117 -17 221 -22 -41 -130 276 -96 -58 -90 -94 -227 -2 154 -117 41 -192 106 -59 159
7485 159 -73 39 66 150 -145 7 100 5 -118 82 -32 11 52 197 37 152 194 127 -258 59 40 132 -208
7508 -208 108 56 -54 66 145 123 -15 198 97 106 -97 221 239 29 0 -69 143 32 113 86 -80 -184 -184 293
7532 293 21 -266 -30 -95 -101 -196 101 26 -79 -406 71 -77 -34 115 -161 182 -190 -46 188 -354 -198 -165
7554 -165 36 68 34 229 -15 -295 -139 -11 -226 -37 -157 14 68 -45 -85 86 72 -18 143 5 -79 -251
7576 -251 136 -160 -146 -136 19 184 -121 0 118 180 -252 105 -39 -52 38 229 132 -89 69 84 -194 -56
7598 -56 99 94 265 -32 -82 45 -4 -7 -5 41 3 42 65 -129 74 -8 312 -120 -177 85 85 -43 -70 -114 -135 110 70
$$ packed form
7440A97l6J25k88J2K65k81j85K24J91j62k52K10J92j46l9q6K77m2k56L57J7k36
7462E8j17K5J33k16J00K38k43j9q9M06l72L8l2mj33K25J56k71J58k33K98j65K18
7485A59k32J12K7Q4k95J52R3r5j23K00j14M3M1J45j60J15M2o7l85L17j9R2l40
7508b08L16n2j10J20P9k2j38K13j01Rk03L18J8k10k9o9K12j11Q1k7j66j04%M77
7532B93k72k87K36o5or5K97p5j05l27M77j48M3J49k76L43l72J44K34n42J56L3
7554a65K01L2l4J95k44k80J56J28k15J89j20J71N4j13m0J71j4r0J61j38q4j72
7576b51L87k96J4J0J55J65l05J21J18O2m32L57j44j3R0J91r7k21J58J5k78J38
7598e6J55nJ71k97n0J27m9lKM6l8L9K3j94K03q2L20m32n7K62%j28k7m4k1K45m0
$$ plain form
7625 70 181 -31 42 -124 -107 47 -116 -236 20 22 -273 -130 214 56 -62 182 221 -82 -165 140 -74 -341
7647 -341 -150 -106 364 118 -81 174 24 -211 266 214 68 -94 399 -180 -48 157 146 -8 -41 92 154 5
7669 5 -58 148 200 64 -142 136 -9 -25 -90 -173 11 180 14 94 -1 -52 26 119 -62 -102 187 -13 -10 -257 -174
7694 -174 21 -283 -82 -53 18 14 -2 -19 217 -355 95 7 219 -242 159 139 -211 -82 225 -79 -367 217 -290
7717 -290 9 -61 129 204 -223 -113 17 186 -92 -201 175 144 -198 10 177 42 -62 123 93 -189 -32
7738 -32 -10 45 32 134 286 133 -198 33 -67 74 -81 -267 201 18 -211 288 21 -47 -175 135 132 -80
7760 -80 117 62 108 -261 -130 57 11 -133 6 111 -310 -28 -34 -175 -77 -125 56 -156 -101 200 175 -122 -108 -141
7784 -141 130 -149 -177 51 -150 17 5 45 243 -16 -102 38 79 -99 -88 186 -162 47 189 190 114 -35 149
$$ packed form
7625G0J11k12P3j66J7J54j63j20K56Kk95J43L44j58j18K44L9l03q3L05k14k67
7647c41J91M4M70k46j99K55j50k35M77n2j46j62M93n79J32K05j1j54l3J33O2j49
7669Eo3K06N2j36k06K78j45j6o5q3J84J69j66Q0r5n1P8R3j81m0K89k00Lk47Q3
7694a74J95l04K01K9P1mj6j7K36n72M50q8K12m61M01k0l50J29L07l04k88N84n07
7717b90K99p0J90P5m27J10J30J69k78j09L76l1l42K08J67j35j04J85l0k82J57
7738c2K2N5j3J02J52j53l31K31j00J41j55j86M68j83k29M99k67o8j28L10lk12
7760h0J97n5M6l69J31J87m6j44J39J05m21K82oj41R8m8J81k12N5L01k5k97J4l3
7784a41K71k79k8K28k01J67j2M0J98k59q6J40M1j78J1K74l48K09J42Jp6j49J84
$$ plain form
7807 149 -8 -33 -156 258 -79 52 -55 117 98 36 -77 -43 -60 -12 243 109 246 76 184 -109 -158 110
7829 110 101 -130 -43 116 99 94 -72 -19 36 -48 -74 117 -172 19 98 247 -16 -250 -350 262 -113 -216 -94 73
7853 73 -66 69 27 -84 63 -148 -39 103 -232 -277 111 -268 -87 80 -25 -267 -113 176 163 -182 -160 14
7875 14 -88 -136 27 279 69 -481 142 25 136 162 -119 190 -156 -2 146 102 125 153 -37 96 -101 37
7897 37 230 96 -103 11 401 -229 15 -46 144 96 -127 249 -56 -187 13 13 69 -217 -44 154 -172 -106
7919 -106 58 99 -132 45 7 251 -328 -112 51 -285 -33 126 -141 -36 -123 138 36 82 -3 18 -46 -86 -4
7942 -4 43 100 126 -118 130 -81 -171 4 -109 -218 48 188 65 29 -118 -24 295 -105 144 73 19 -160 135
7965 135 456 -61 48 205 53 -166 77 -61 118 146 104 141 14 -202 61 -6 -57 -228 103 137 74 29 -132
$$ packed form
7807A49j57k5j23M14l37J31j07J72j9o2j13L4j7M8K55j34J37j70J08k93m9K68
7829A10rk31Q7J59j7nj66N3N5q4k6J91k89J91P9J49k63k34j00O12l75j03J22J67
7853G3j39J35m2j11J47k11J09J42l35m5L88l79J81J67j05k42J54K89j3l45K2J74
7875A4j02m8J63K52k10n50O23j17J11K6k81L09l46J54J48m4K3K8j90J33j97J38
7897C7J93j34j99J14L90o30K44o1J90m8k23L76l05j31K00%N6k86J73J98l26O6
7919a06J64M1k31J77l8K44n79K16J63l36K52J59k67J05q7K61j02M6q5K1o4m0Q2
7942dM7N7K6k44K48k11r0J75j13j09K66J40j23l6j47R4L19m00K49p1n4j79K95
7965A35L21n17J09J57j52k19K43j38J79K8m2L7j27k16K63o7n1j71L31L4o3m5j61
$$ plain form
7988 -132 173 -45 -237 51 -125 -107 34 -83 6 -294 -226 -36 -75 -190 218 9 -20 -19 298 -242 -36 -107 -83
8011 -83 -80 -262 59 91 -220 -208 -112 -5 -84 -83 282 86 -130 -218 247 24 113 178 242 -224 -319 65 148 239 -164
8036 -164 96 387 -31 -70 102 230 24 179 200 214 -103 56 204 69 -88 182 364 -72 115 -90 -24
8057 -24 -11 40 266 42 -301 -55 -150 21 -144 96 30 141 -4 69 -34 -10 -67 -58 130 47 -56 -29 -185 -105
8081 -105 46 -62 -32 36 59 135 -214 -261 275 -31 -12 -18 199 44 -66 -75 101 136 -120 40 78 -52 69 76 -82
8106 -82 -91 93 177 -226 -183 -9 202 49 68 -36 -13 218 294 50 -47 32 215 25 148 -124 45 -62 250
8129 250 46 102 1 105 -295 -104 210 -153 -116 221 100 -14 -359 23 62 -370 175 162 -99 -117 126 18
8151 18 -231 94 146 -15 10 -60 187 -18 -26 -43 57 2 -17 224 83 -127 -226 -204 119 2 39 48 -108 -133 77
$$ packed form
7988a32L05k18j92K88j76J8J41j17Q9l00O8J90l9j15M08k09k9JL17n40K06p1K4
8011h3Lj82L21L2l11J2R6J07p9JL65j96k16q8M65k23Q9O5O4m66r5L84Q3R1m03
8036a64K60K91m18l9J72J28k06J55K1J4l17J59J48j35j57K70J82m36J87k05O6
8057b4J3N1K26k24l43K46r5J71j65K40o6J11j45P3j03K4n7RJ88q3j03K7j56Q0
8081a05J51j08L0O8K3P6l49m7N36l06J9oK17j55j10rJ76L5k56J60L8j30J21Pj58
8106h2rJ84Q4m03M3J74K11j53J9j04K3K31P6k44r7P9J83j90J23k72J69j07L12
8129B50k04N6j01J04m00J91L14l63L7L37j21j14l45L82L9m32N45j3k61j8K43j08
8151A8k49L25N2j61K5p0K47k05qj7J00n5j9K41j41k10r9K2L23j17L7Rj56k5K10
$$ plain form
8176 77 212 77 -145 -78 71 -65 154 108 80 65 218 243 50 -42 26
$$ packed form
8176G7J35j35k22O7J49j36K19m6k8j5J53K5j93r2O8
8191B6
$$ Imaginary data points
##PAGE= N=2
##DATA TABLE= (X++(I..I)), XYDATA
$$ plain form
0 0 0 0 0 0 0 0 0 0 0 0 -8 8 -8 8 -16 16 -16 24 -32 32 -40 48 -56 72 -80 96 -111 128 -144 168 -191 216 -246
33 -246 278 -313 351 -396 443 -493 551 -611 680 -753 833 -922 1018 -1122 1236 -1361 1501
50 1501 -1652 1819 -2007 2214 -2447 2710 -3012 3358 -3759 4236 -4811 5520 -6413 7585 -9190
65 -9190 11525 -15239 22026 -38304 155394 78643 -190889 170986 -39611 -41884 79459 -93710
77 -93710 57146 72214 -81689 66699 520 -14028 44089 -33853 22615 25188 -43836 33255
89 33255 9123 -27775 30442 24302 -24755 -63 6225 -14109 -2024 -16352 6416 34555 -43869
102 -43869 -10032 34903 -32772 -19462 -6471 11035 14450 -60639 8100 33289 -43335 -5988
114 -5988 -9318 7759 10619 -67910 10720 25908 -42782 6782 -317 5764 2119 -39248 24146
$$ packed form
0@%%%%%%%%%%qJ6j6J6k4L2l2M0n6O4p2Q8j04J28j52J76k07K39k72L12l59M07m62
33b46N24n91O64p47Q39r36J044j162J291j433J586j755J940k140K358k597K862
50A501l153L471l826M221m661N157n722O370p117P995r047J0331j1933J3998j6775
65i190K0715k6764L7265o0330J93698p6751k69532L61875k10597k273J21343j73169
77i3710J50856J5068j53903J48388o6179j4548N8117p7942N6468K573o9024P7091
89C3255k4132l6898N8217o140m9057K4692O288k0334J2085j4328K2768K8139p8424
102d3869L3837M4935o7675J3310J2991J7506L415p5089O8739K5189p6624L7347
114e988l330J7077K860p8529P8630J5188o8690M9564p099O081l645m1367O3394
$$ plain form
127 24146 -9186 -32202 36197 -16012 -7257 15378 -18369 24729 -15753 -16355 48787 -18742 -11295
140 -11295 24620 -4797 20053 -15880 -3167 54059 -25147 -13880 45590 -3835 650 5032
152 5032 1568 35789 -15416 -19281 48642 2753 -21436 23195 7935 5063 1536 -15157 29474
165 29474 5762 -33323 31027 5418 -28393 23908 -9377 -6291 15090 -31190 19004 7624
177 7624 -44547 32383 1010 -36932 17990 -15840 -678 1860 -39500 29246 804 -48573
189 -48573 18437 2660 -11540 -4662 -20197 22188 -10542 -41204 16720 4390 -10188 -1512
201 -1512 -3387 17618 -14761 -22392 19060 -4586 -11098 9547 3396 3485 -6444 1053 17067 -6406
215 -6406 -4770 16038 3743 -7889 1039 12958 10971 -3202 3419 22768 -853 -15606 18560
$$ packed form
127B4146l3332k3016O8399n2209Q755K2635l3747M3098m0482o02O5142o7529P447
140a1295L5915k9417K4850l5933J2713N7226p9206J1267N9470m9425M485M382
152E032l464L4221n1205l865O7923m5889k4189M4631j5260k872l527j6693M4631
165B9474k3712l9085O4350k5609l3811N2301l3285L086K1381m6280N0194j1380
177G624n2171P6930l1373l7942N4922l3830J5162K538m1360O8746k8442m9377
189d8573O7010j5777j4200O878j5535M2385l2730l0662N7924j2330j4578Q676
201a512j875K1005l2379p631M1452k3646o512K0645o151Q9r929P497J6014k3473
215f406J636K0808j2295j1632Q928J1919j987j4173O621J9349k3621j4753L4166
$$ plain form
228 18560 13702 -7025 5350 11365 16366 -5636 -14416 28199 7789 -18390 8505 7277 9581
241 9581 -7909 -12077 32770 -1222 -19019 15278 -10616 -4864 -1264 -14202 21673 -6668 -13865
254 -13865 24834 -20457 -18184 9323 -14100 1138 -12102 -11831 25584 -22102 -21184 24921 -12518
267 -12518 -15303 312 -12391 5151 -13452 -16110 25948 -6669 -19960 16292 -3724 -11603 -3960
280 -3960 -8139 19619 -2399 -23884 24692 7297 -20829 8652 4737 5613 2330 -11330 18792
293 18792 3834 -12035 23045 4371 -4964 11671 -2656 7315 -311 -7411 27400 5108 -12150
306 -12150 15607 8861 -311 -5473 -792 22979 -3546 -13749 20476 4034 -10128 2867 3979
319 3979 5950 -7592 -6914 14700 -2409 -15191 3735 6058 -4563 -11779 144 11397 -11784
$$ packed form
228A8560m858k0727J2375O015N001k2002q780M2615k0410k6179K6895j228K304
241I581j7490m168M4847l3992j7797L4297k5894N752L600j2938L5875k8341p197
254a3865L8699m5291K273K7507k3423J5238j3240K71L7415m7686R18M6105l7439
267a2518k785J5615j2703J7542j8603k658M2058l2617j3291L6252k0016p879P643
280c960m179K7758k2018k1485M8576j7395k8126K9481l915Q76l283j3660L0122
293A8792j4958j5869L5080j8674r335J6635j4327R971p626p100L4811k2292j7258
306a2150K7757o746r172n162M681K3771k6525j0203L4225j6442j4162J2995J112
319C979J971j3542O78K1614j7109j2782J8926K323j0621p216J1923J1253k3181
$$ plain form
332 -11784 -11051 6733 -3776 -10880 -5773 -387 -358 -12435 -3415 7406 -12478 -7898 3715 -3885
346 -3885 -4727 -12169 1390 11006 -20446 -5569 19007 -10882 -9374 2287 -299 7320 -13033 -2225
360 -2225 23930 -11732 -8673 17283 -2872 905 431 -703 19228 -9173 -7299 26664 -4691
373 -4691 -4333 17341 -1823 5925 -833 -6229 21168 -3948 -6415 26552 -259 -5901 8342 -1660
387 -1660 7214 -5927 -5245 22393 -6346 -12125 16145 -294 -5118 -97 -1480 9109 -9872 -11870
401 -11870 12846 -2849 -11640 2776 2868 -34 -12703 -8375 10442 -8781 -13567 8007 415 -9627
415 -9627 -5522 -2553 2065 -8668 -7284 7890 -6987 -11761 3671 527 -2646 -6134 1276 8794
429 8794 -13755 -10915 11977 190 -5537 2652 6975 6769 -10268 -2832 12314 -4667 -3394 7368
$$ packed form
332a1784P33J7784j0509p104N107N386K9j2077R020J0821j9884M580J1613p600
346c885q42p442J3559R616l1452J4877K4576k9889J508J1661k586P619k0353J0808
360b225K6155l5662L059K5956k0155L777m74j134J9931k8401J874L3963l1355
373d691L58K1674j9164P748o758n396K7397k5116k467L2967k6811n642J4243j0002
387a660Q874j3141O82K7638k8739n779K8270j6439m824N021j383J0589j8981j998
401a1870K4716j5695q791J4416R2k902j2669M328J8817j9223m786K1574p592j0042
415i627M105K969M618j0733J384J5174j4877m774J5432l144l173l488P410P518
429H794k2549K840K2892j1787n727Q189M323k06j7037P436J5146j6981J273J0762
$$ plain form
443 7368 5633 3576 -5855 7922 15748 -10959 919 16650 -3247 -2413 3287 7758 10930 -6593
457 -6593 3476 15502 -6617 -2050 7195 248 4780 -2649 2888 11941 -11877 -245 16810 -10351
471 -10351 -5923 7433 -1341 -99 -9630 -745 14516 -12486 -10307 10025 -5252 -7382 -5374 -2363
485 -2363 6601 -11786 -6599 11508 -11180 -10702 5555 -5177 -5309 -5829 -2519 6896 -10504 -9014
499 -9014 9691 -2417 -8621 -1108 2547 3284 -8889 -2119 10919 -7004 -5830 9614 429 -2425
513 -2425 1191 5398 6838 -8278 -269 13963 -2094 -4972 6585 8432 3791 -5443 4712 13782
527 13782 -3999 -3283 9358 3443 -1265 403 7202 7586 -4739 1712 10107 -3701 -4800 5081
541 5081 5637 -181 -5413 5243 7951 -10183 -3226 8316 -3036 -5446 -2109 2387 1352 -10027
$$ packed form
443G368j735k057r431J3777P826k6707J1878J5731j9897Q34N700M471L172j7523
457f593J0069J2026k2119M567R245o947M532p429N537R053k3818J1632J7055k7161
471a0351M428J3356q774J242r531Q885J5261k7002K179K0332j5277k130K008L011
485b363Q964j8387N187J8107k2688M78J6257j0732j32n20L310R415j7400J490
499i014J8705j2108o204P513L655P37j2173O770J3038j7923J174J5444r185k854
513b425L616M207J440j5116Q009J4232j6057k878J1557J847m641r234J0155R070
527A3782j7781P16J2641n915m708J668O799L84j2325O451Q395j3808j099R881
541E081N56n818n232J0656K708j8134O957J1542j1352k410L337M496j035j1379
$$ plain form
555 -10027 2038 7625 -10131 -5687 -314 -3326 -3781 -10415 5289 7746 -15003 -1936 6113 -9748
569 -9748 -6989 -3917 2303 1166 -12308 2726 7634 -10635 -2309 4841 -2275 -2558 -6249 1778 6544
584 6544 -8626 1483 13164 -4746 -4025 5800 226 216 -1921 3908 12468 -5764 -1453 13696
598 13696 -1264 -1602 3810 4634 9015 -7540 439 16689 -4867 -1950 11343 1381 265 -3313
612 -3313 2035 7822 -6948 1891 11290 -1822 -2827 -406 2942 580 -9524 2715 8116 -7184
626 -7184 -5152 3979 1188 -5273 -4650 2617 -827 -9108 -2643 3739 -4244 -6532 2098 2040 -6360 -8297
642 -8297 1185 3248 -9610 -6356 6565 -1411 -7547 -3205 2515 1913 -8698 -1435 6564 -5439
656 -5439 -3325 2681 1641 236 -5190 6019 5713 -10537 2697 8694 -2052 54 -8 8210 4981
$$ packed form
555a0027J2065N587j7756M444N373l012m55o634J5704K457k2749J3067Q049j5861
569i748K759L072O220j137j3474J5034M908j8269Q326P150p116k83l691Q027M766
584F544j5170J0109J1681j7910P21R825n574j0k137N829Q560j8232M311J5149
598A3696j4960l38N412Q24M381j6555P979J6250k1556K917J3293r962j116l578
612c313N348N787j4770Q839R399j3112j005K421L348k362j0104J2239N401j5300
626g184K032R131k791o461O23P267l444q281O465O382p983k288Q630n8q400j937
642h297R482K063j2858L254J2921p976o136M342N720o02j0611P263P999j2003
656e439K114O006j040j405n426J1209l06j6250J3234N997j0746K106o2Q218l229
$$ plain form
671 4981 -9384 7281 9208 -5847 3378 4397 2587 3876 -3180 7458 6443 -7858 5517 8943
685 8943 -3584 11 3681 5661 1069 -8182 5118 8884 -7515 -1468 7933 -227 -3571 -3126 628
700 628 2354 -7783 -1221 6854 -6633 -5123 4193 -1255 -4656 -5201 752 2360 -11131 -4323 6147
715 6147 -3497 -5337 -1599 762 -545 -10168 -1777 5144 -7011 -3057 3658 -151 -3328 -4765 4736
730 4736 2364 -9647 2264 5945 -4304 -2550 1570 6493 1692 -5867 5044 4932 -5508 -345
744 -345 5127 4713 1013 500 7858 2064 -5382 3854 5886 -836 -1101 4999 7207 -1235 -2419 8210
760 8210 4978 -5037 249 5753 239 -2817 746 6806 1900 -5656 2864 4371 -6702 -2683 2263
775 2263 1343 -1437 -5467 4027 3045 -10800 73 4356 -5919 -3654 -2725 696 -1100 -9529 3340
$$ packed form
671D981j4365J6665J927j5055R225J019j810J289p056J0638j015j4301J3375L426
685H943j2527L595L670J980m592r251J3300L766j6399O047R401q160l344M45L754
700F28J726j0137O562Q075j3487J510R316n448l401n45N953J608j3491O808J0470
715F147r644j840L738K361j307r623Q391O921j2155L954O715l809l177j437R501
730D736k372j2011J1911L681j0249J754M120M923m801p559J0911j12j0440N163
744c45N472m14l700n13P358n794p446R236K032o722k65O100K208q442j184J0629
760H210l232j0015N286N504n514l056L563O060m906p556Q520J507j1073M019M946
775B263r20k780m030R494r82j3845J0873M283j0275K265R29L421j796q429J2869
$$ plain form
790 3340 3836 -9602 -2120 723 -3211 -3918 -4944 4074 1591 -8133 1159 3167 -4928 -4112 633 3024
806 3024 -2620 -4674 5573 3019 -5657 516 5607 262 -3501 47 5887 1763 -3404 3688 7102
821 7102 -973 -1549 3713 4491 -29 -2049 7109 4740 -5633 3795 7277 -2240 147 3316 4467
836 4467 1182 -5378 3869 6584 -4180 -655 4371 1776 -2036 -3703 4123 1660 -6926 2054 3968
851 3968 -4834 -2760 1686 1273 -3898 -5330 2711 1040 -7019 -3634 3005 443 -6918 -3605 4147
866 4147 -2684 -6751 953 581 -4331 -3060 -778 638 -3978 -3540 4477 123 -6535 541 3279 -1399
882 -1399 -4492 -1057 6440 -809 -6474 5757 4128 -4077 1123 2627 1853 -286 -1493 5899 2626
897 2626 -3434 5010 5951 -1442 -704 2626 5577 10 -3802 7046 5638 -4351 1021 5291 1713
$$ packed form
790C340M96j3438P482K843l934p07j026R018k483r724R292K008q095Q16M745K391
806C024n644k054J0247k554q676O173N091n345l763L548N840m124n167P092L414
821G102q075n76N262P78m520k020R158k369j0373R428L482r517K387L169J151
836D467l285o560R247K715j0764L525N026k595l812j667P826k463q586Q980J914
851C968q802K074M446m13n171j432Q041j671q059L385O639k562p361L313P752
866D147o831m067P704l72m912J271K282J416m616M38Q017m354o658P076K738m678
882a399l093L435P497p249n665J2231j629q205N200J504p74k139j207P392l273
897B626o060Q444R41p393P38L330K951n567l812J0848j408r989N372M270l578
$$ plain form
912 1713 -699 -882 4732 1331 -5212 3589 4101 -3230 270 2534 1087 -3036 -5348 4028 1283 -7311
928 -7311 1204 4326 -2188 -4075 -2870 1781 -1947 -7114 1605 1696 -5275 -2447 632 -281 -4088 -3821
944 -3821 2270 -1814 -7476 -118 3877 -2849 -4294 1575 2665 -3927 -4374 2400 1877 -3198 -1113 3403
960 3403 1326 -2899 -196 4967 46 -3619 3159 4021 -1556 -1127 3739 5150 -1039 -1160 6483 1973
976 1973 -3679 2052 4312 2616 -698 847 7182 262 -4489 5649 3330 -2978 862 2727 2472
991 2472 -1326 -2075 5191 594 -4837 1685 2119 -1547 -2709 -468 3920 -2520 -5634 3775 672 -6328
1007 -6328 -1368 1413 -506 -4179 -3248 2650 -2092 -6049 285 1013 -3282 -3366 -69 1553 -4533 -4269
1023 -4269 3666 -645 -5903 338 2580 -1174 -3560 -637 3506 -875 -4575 2153 3594 -1883 -1235
$$ packed form
912A713k412j83N614l401o543Q801N12p331L500K264j447m123k312R376k745q594
928g311Q515L122o514j887J205M651l728n167Q719R1o971K828L079r13l807K67
944c821O091m084n662P358L995o726j445N869J090o592m47O774n23n075K085M516
960C403k077m225K703N163m921l665O778Q62n577M29M866J411o189j21P643m510
976A973n652N731K260j696l314J545O335o920m751J0138k319o308L840J865k55
991B472l798p49P266m597n431O522M34l666j162K241M388o440l114R409l103p000
1007f328M960K781j919l673R31N898m742l957O334P28m295q4L297J622o086K64
1023d269P935m311n258O241K242l754k386K923M143m381l700O728J441n477O48
$$ plain form
1038 -1235 2524 2258 -1498 -917 5277 1452 -3813 3406 4570 -1097 -440 3009 5383 -57 -2494 4621
1054 4621 3393 -2379 263 3892 3707 -1492 -464 5329 -630 -3011 3002 2065 -709 -1155 2018 3736
1070 3736 -3561 -2297 4374 165 -4443 -1639 2378 167 -4671 -910 3572 -2679 -4769 478 159
1085 159 -3536 -2235 558 110 -3783 -2921 2553 -1566 -6103 89 2072 -2948 -4404 -750 2856 -2302
1101 -2302 -4744 2681 1745 -3803 -1820 1110 932 -2993 -147 5077 -1438 -2024 3404 1512 -764 -1709
1117 -1709 1817 5170 -2433 -1581 6201 2197 -1494 1107 3502 2434 -2040 418 5579 511 -1222
1132 -1222 4329 2740 -1518 -130 2328 2500 -1909 -1178 5508 951 -4618 1707 3215 -1342 -2560
1147 -2560 -21 2860 -1770 -4123 2008 986 -3766 -845 1187 -174 -4015 -2682 2336 -1608 -5018
$$ packed form
1038a235L759k66l756N81O194l825n265P219J164n667O57L449K374n440k437P115
1054D621j228n772K642L629j85n199J028N793n959k381O013r37k774m46L173J718
1070C736p297J264O671m209m608K804M017k211m838L761M482o251k090N247l19
1085A59l695J301K793m48l893Q62N474m119m537O192J983n020j456L654L606n158
1101b302k442P425r36n548J983K930j78l925K846N224o515n86N428j892k276r45
1117a709L526L353p603Q52P782m004l691K601K395j068m474K458N161n068j733
1132a222N551j589m258J388K458J72m409P31O686m557n569O325J508m557j218
1147b560K539K881m630k353O131j022m752K921K032j361l841J333N018l944l410
$$ plain form
1162 -5018 477 1940 -3146 -4095 390 1377 -4191 -3401 2019 -225 -3916 -1617 1942 -183 -4199 -51
1178 -51 2413 -1959 -2890 1736 1915 -1620 -2274 2455 2121 -2870 -172 4191 653 -2087 1095 3434
1194 3434 631 -2319 2150 4880 -880 -969 4323 2398 -785 -196 3139 3032 -2502 545 5970 -531
1210 -531 -1357 3174 1585 -7 -1452 992 3919 -2141 -1981 4248 256 -3001 -488 1815 954 -3806
1226 -3806 -1592 3797 -2670 -3986 2011 33 -2742 -1605 -136 113 -3942 -3078 2522 -912 -4592
1241 -4592 52 1687 -2209 -4003 -974 1988 -2537 -3951 1625 1067 -2881 -1386 1262 323 -2327
1256 -2327 -1185 2346 -598 -2899 1842 3639 -1144 -1545 2574 2623 -2470 -1224 4377 2470 -1050 537
1272 537 3225 1958 -1449 812 3894 18 -729 2498 2563 -32 -348 3622 3142 -2711 212 3952
$$ packed form
1162e018N495J463n086r49M485R87n568P90N420k244l691K299L559k125m016M148
1178e1K464m372r31M626J79l535o54M729l34m991K698M363l538k740L182K339
1194C434k803k950M469K730n760q9N292j925l183N89L335j07n534L047N425o501
1210e31q26M531j589j592j445K444K927o060J60O229l992l257K513K303q61m760
1226c806K214N389o467j316N997j978k775J137J469K49m055Q64N600l434l680
1241d592M644J635l896j794L029K962m525j414N576n58l948J495K648r39k650
1256b327J142L531k944k301M741J797m783m01M119M9n093J246N601j907l520J587
1272E37K688j267l407K261L082l876p47L227O5k595l16L970m80n853K923L740
$$ plain form
1288 3952 -342 -2151 464 3522 1244 -3127 1196 2986 -2506 -1875 1129 542 -1606 -1939 1768 495
1304 495 -4060 -208 2187 -2309 -3778 -117 910 -1871 -3725 308 2320 -3647 -3677 1512 -884 -3253
1320 -3253 -1671 566 55 -3236 -1026 2493 -2648 -2671 2476 603 -2219 -1693 1392 1990 -3065 -948
1336 -948 4065 908 -1815 118 2682 1046 -1972 1312 3758 -757 -763 3080 1929 -1148 39 3450
1352 3450 1702 -1812 1273 3872 820 -1386 1330 3379 -46 -1914 2437 3085 -1456 -1022 2842
1367 2842 794 -1932 -112 1811 -84 -2184 -52 2082 -1352 -2860 630 1449 -2150 -2893 710
1382 710 1381 -3570 -2034 2122 -1262 -3580 -1043 1188 -1552 -3613 259 1024 -2406 -2590 354 851
1398 851 -2495 -2559 2011 566 -3791 6 2519 -1198 -1824 108 1879 -529 -2473 1838 2785 -1550
$$ packed form
1288C952m294j809K615L058k278m371M323J790n492O31L004n87k148l33L707j273
1304D95m555L852K395m496j469L661J027k781j854M033K012n967l0N189k396k369
1320c253J582K237n11l291K210L519n141k3N147j873k822N26L085N98n055K117
1336i48N013l157k723J933K564j636l018L284K446m515oL843j151l077J187L411
1352C450j748l514L085K599l052k206K716K049l425j868M351O48m541M34L864
1367B842k048k726J820J923j895k100K132K134l434j508L490Q19l599p43L603
1382G10O71m951J536M156l384k318K537K231k740k061L872P65l430j84K944M97
1398H51l346o4M570j445m357L797K513l717o26J932J771k408j944M311R47m335
$$ plain form
1414 -1550 -731 2862 1622 -1142 -822 2963 2003 -2265 1878 4169 -734 -127 2592 1653 -326 -685
1430 -685 2492 2743 -1792 135 3693 1206 -1481 367 2756 462 -2859 843 2985 -978 -1145 1864
1446 1864 819 -1690 -1310 848 487 -3068 -540 2472 -1585 -3163 517 1295 -1506 -3460 -110 1315
1462 1315 -3224 -2789 1446 -131 -2705 -1512 332 -496 -3129 -828 1387 -1653 -2402 1193 1069 -2313
1478 -2313 -2352 1639 1288 -2623 -1073 2454 1084 -2277 91 2866 296 -1428 1217 1855 -165 -370
1494 -370 1917 2782 -756 -43 3591 1210 -1906 1421 3415 1071 -1251 744 3705 531 -1916 2188
1510 2188 2615 -1035 -321 1538 952 -852 -529 2532 977 -2710 1144 2153 -2436 -2056 1068 1079 -1140
1527 -1140 -2552 1352 1313 -3455 -1649 980 -648 -2174 -1587 716 -528 -3328 -249 1419 -2853 -2619
$$ packed form
1414a550Q19L593j240k764L20L785r60m268M143K291m903O07K719r39j979l59
1430f85L177K51m535J927L558k487k687J848K389k294l321L702K142l963j67L009
1446A864j045k509L80K158l61l555K528L012m057j578L680P78k801j954L350J425
1462A315m539M35M235j577k574J193J844q28k633K301K215l040p49L595j24l382
1478b313l9L991l51l911J550L527j370l361K368K775k570j724K645O38k020k05
1494c70K287Q65l538P13L634k381l116L327J994k344k322J995K961l174k447M104
1510B188M27l650P14J859n86j804L23L061j555l687L854J009m589L80L124J1k219
1527a140j412L904l9m768J806K629j628j526N87K303j244k800L079J668m272K34
$$ plain form
1543 -2619 937 -156 -2761 -2220 1521 432 -3211 -723 2155 -557 -2448 -194 1791 -135 -2007
1558 -2007 899 2046 -1555 -794 2197 1459 -1238 249 2627 1000 -1590 640 3379 172 -1004
1573 -1004 2310 2772 -605 -479 1904 2283 -642 149 3019 1238 -1482 768 2461 422 -1349 1252
1589 1252 2287 -963 -1476 1642 1314 -1364 -1350 2068 447 -2842 -250 1117 -519 -2316 -717 2317
1605 2317 -1322 -3410 1236 344 -2636 -1656 -65 130 -2502 -2320 1325 -524 -3015 -134 778 -1457
1621 -1457 -2641 30 1460 -1817 -2108 1611 1134 -2494 -1594 1543 291 -1711 -145 1799 582 -1886
1637 -1886 353 2789 -761 -832 1986 1657 -738 -541 2742 1763 -1801 1449 3168 357 -694 562
1653 562 2567 1033 -1463 1565 2909 -484 -134 1646 1479 -899 -376 2296 671 -2157 1142 2227
$$ packed form
1543b619L556j093k605N41L741j089l643K488K878k712j891K254J985j926j872
1558b007K906J147l601P61K991p38k697J487K378j627k590K230K739l207j176
1573a004L314M62l377J26K383L79k925P91K870j781k720K250J693k039j771K601
1589A252J035l250n13L118l28k678J4L418j621l289K592J367j636j797J599L034
1605B317l639k088M646q92k980R80J591J95k632J82L645j849k491K881R12k235
1621a457j184K671J430l277k91L719m77l628R00L137j252k002J566J944j217k468
1637a886K239K436l550p1K818l29k395J97L283r79l564L250J719k811j051J256
1653E62K005j534k496L028J344l393L50J780j67k378N23K672j625k828L299J085
$$ plain form
1669 2227 -921 -1772 914 1633 -1475 -2209 1104 1201 -1936 -2003 1222 79 -2715 -878 638 -1173 -2015
1686 -2015 -413 549 -1903 -2649 405 666 -2740 -1968 1122 -38 -2670 -1862 1559 130 -2569 -295
1702 -295 1884 -1028 -2014 907 623 -1437 -579 1071 1357 -1120 -511 2798 390 -2095 1263 2249 186
1719 186 -1427 917 3243 107 -1509 2812 2011 -809 373 1746 1391 -453 208 3141 201 -1176
1735 -1176 2015 2097 -362 -787 1493 1904 -1255 -1480 2212 1359 -1888 -622 1542 -302 -1698 -688
1751 -688 644 -604 -1708 332 1014 -2168 -1837 760 -324 -2151 -1344 1483 269 -3398 -842 1581
1767 1581 -1658 -2158 -48 485 -842 -2154 313 1213 -2122 -1320 1331 227 -2052 -406 1618 -482
1783 -482 -1677 614 1884 -406 -1293 1433 1959 -1226 -406 1785 1248 -576 -101 2573 1649 -1474 1118
$$ packed form
1669B227l148q51K686P19l108p34L313R7l137o7L225j143k794J837J516j811q42
1686b015J602R62k452p46L054K61l406P72L090j160k632Q08L421j429k699K274
1702b95K179k912r86K921k84k060Q58J650K86k477O09L309k408k485L358R86k063
1719A86j613K344K326l136j616M321q01k820J182J373l55j844O61K933k940j377
1735a176L191Q2k459m25K280M11l159k25L692q53l247J266K164j844j396J010
1751f88J332j248j104K040O82l182L31K597j084j827Q07K827j214l667K556K423
1767A581l239n00K110N33j327j312K467R00l335Q02K651j104k279J646K024k100
1783d82j195K291J270k290q87K726N26l185Q20K191n37j824M75K674r24l123K592
$$ plain form
1800 1118 3275 -514 -505 1910 1397 14 -133 1842 1758 -843 -251 2421 608 -1167 543 1878 176
1817 176 -1680 508 1964 -1058 -2003 1731 869 -1915 -819 469 218 -1687 -1412 1391 -621 -2909
1833 -2909 273 781 -1896 -1985 192 653 -1850 -2273 1220 -208 -2738 -681 758 -413 -2086 -917
1849 -917 1222 -458 -2036 267 1131 -1361 -1192 1118 615 -1420 -388 1852 670 -1586 294 2499
1865 2499 -224 -1252 1191 2260 88 -795 1411 1974 -532 -281 2194 1407 -450 786 2319 686
1881 686 -972 1175 2446 -176 -1259 1973 2062 -1170 -1035 2091 1269 -1233 -784 1275 634 -1618 -403
1898 -403 1433 -905 -1492 335 517 -1242 -1398 606 480 -2640 -1481 1383 -434 -2455 -882 795
1914 795 -534 -2540 -546 1167 -1585 -1904 614 -254 -1677 -1225 539 267 -1785 -560 1632 -539
$$ packed form
1800A118K157l789RK415n13j383j47J975q4k601N92K672j813j775J710J335j702
1817A76j856K188J456l022r45L734q62k784J096J288k51j905K75K803k012k288
1833b909L182N08k677q9K177M61k503m23L493j428k530K057J439j171j673J169
1849i17K139j680j578K303Q64k492J69K310n03k035J032K240j182k256J880K205
1865B499k723j028K443J069k172q83K206N63k506K51K475p87j857J236J533j633
1881F86j658K147J271k622j083L232Q9l232J35L126q22k502M49K059o41k252J215
1898d03J836k338n87J827J82j759j56K004j26l120J159K864j817k021J573J677
1914G95j329k006J994J713k752l19K518q68j423M52J764k72k052J225K192k171
$$ plain form
1930 -539 -1827 706 1218 -564 -1634 703 2142 -892 -1358 1636 1397 -927 195 1751 686 -757
1946 -757 699 2177 490 -769 1403 2211 -380 -666 2024 1977 -1049 -245 2570 1309 -1217 427
1962 427 1858 274 -1069 717 2048 -289 -1068 1179 1117 -1411 -443 1075 473 -1833 -842 1325 -380
1979 -380 -2089 -254 1007 -1232 -2092 83 540 -1700 -1852 720 378 -2047 -1248 604 -797 -1976
1995 -1976 -256 872 -1032 -1859 14 1128 -1071 -1625 1058 829 -1339 -973 1598 614 -1298 -23
2011 -23 2043 261 -1348 577 2015 -362 -639 1382 1512 -85 -403 1783 1469 -858 395 2139
2027 2139 230 -493 980 1767 100 -924 1296 2419 -456 -887 1795 1139 -1063 -500 1508 964
2043 964 -1398 -160 1669 -445 -1498 744 486 -1084 -1434 665 734 -2098 -1498 1197 -55 -2179
$$ packed form
1930e39j288K533N12j782j070K337J439l034m66K994k39k324J122J556j065j443
1946g57J456J478j687j259K172Q08k591k86K690m7l026Q04K815j261k526J644
1962D27J431j584j343J786J331k337p79K247o2k528R68J518o02k306R91K167j705
1979c80j709J835J261k239q60K175M57k240j52K572l42k425P99J852j401j179
1995a976J720J128j904q27J873J114k199n54K683k29k168L66K571r84j912J275
2011b3K066j782j609J925J438k377k77K021J30j597l18K186l14k327J253J744
2027B139j909p23J473P87j667j024K220J123k875m31K682o56k202N63K008n44
2043I64k362J238J829k114j053K242k58j570l50K099O9k832O00K695j252k124
$$ plain form
2059 -2179 -727 574 -614 -2246 -938 429 -1302 -1934 392 247 -1723 -1159 495 149 -1739 -672
2075 -672 1477 -737 -2192 172 1431 -720 -1770 579 1305 -408 -1039 1185 1296 -1093 -149 1448
2091 1448 431 -807 718 1826 220 -914 1186 2021 -515 -475 2163 1509 -523 -247 1837 1272
2107 1272 -929 121 2257 547 -1387 857 1318 -400 -541 1027 1090 -807 -1056 1560 857 -1913
2123 -1913 -252 1477 -444 -1711 -526 658 -440 -2090 -95 1006 -1407 -1674 459 17 -1487
2138 -1487 -758 497 -69 -2339 -636 1458 -1484 -2217 561 680 -1168 -1664 189 913 -1513 -1202 1313
2155 1313 408 -1229 -403 1152 41 -1332 649 1553 -309 -1009 1312 1430 -708 -31 1604 1067 -637
2172 -637 31 2297 1430 -1279 771 2164 193 -327 1139 1661 -224 -499 1474 864 -783 245 1256
$$ packed form
2059b179J452J301j188j632J308J367j731o32K326j45j970N64J654l46j888J067
2075f72K149k214j455K364J259k151j050K349P26j713o31K224J11k389R44J597
2091A448j017j238J525J108j606j134K100Q35k536M0K638o54k032K76K084n65
2107A272k201J050K136j710j934K244M61j718j41J568O3j897k49K616p03k770
2123a913J661J729j921j267J185J184j098j650J995J101k413k67K133m42j504
2138a487P29J255n66k270J703K094k942p33K778J19j848m96J853P24k426L11K515
2155A313r05j637Q26J555j111j373J981R04j862p00K321J18k138O77J635n37j704
2172f37O68K266q67k709K050J393j971n20J466N22j885k75J973o10j647J028J011
$$ plain form
2189 1256 482 -846 178 1747 261 -1368 353 1597 -894 -1653 809 599 -1298 -882 384 -30
2205 -30 -1375 -1336 978 -617 -2204 -31 361 -1283 -1596 -53 706 -1540 -1868 1013 -218 -2149 -787
2222 -787 697 -442 -1403 -422 1121 -295 -1739 259 1478 -1097 -1131 884 610 -752 -334 1251 989
2239 989 -1097 357 1841 -345 -686 1200 1571 -34 -548 1293 2133 -598 -443 1973 1170 -461 141
2256 141 1608 1019 -553 583 1650 -114 -625 1089 1172 -647 -557 1325 886 -1694 -350 1372 -88
2273 -88 -1668 -390 986 -284 -1744 -154 720 -1098 -1086 372 57 -1676 -951 460 -568 -1871 -832
2290 -832 641 -729 -2418 -155 565 -1314 -1968 486 545 -1162 -1467 789 345 -1438 -438 978 -405
2307 -405 -1081 368 1273 -270 -1175 1003 1493 -742 -1111 1893 1450 -1159 254 1638 816 -609 -74
$$ packed form
2189A256p74j328J024J569j486j629J721J244k491p59K462k10j897M16J266m14
2205c0j345L9K314j595j587K173L92j644l13J543P59k246l28K881j231j931J362
2222g87J484j139r61R81J543j416j444J998J219k575l4K015k74j362M18J585k62
2239I89k086J454J484k186l41J886L71j605n14J841Q40k731J55K416q03j631O02
2256A41J467n89j572J136J067j764n11J714Q3j819R0J882m39k580J344J722j460
2273h8j580J278J376j270j460J590Q74j818J2J458l15j733P25J411j028j303J039
2290h32J473j370j689K263P20j879o54K454N9j707l05K256m44j783J000J416j383
2307d05o76J449R05j543r05K178M90k235l69L004m43k609J413J384q22j425N35
$$ plain form
2324 -74 1812 541 -860 1180 1429 -290 318 1117 1423 -356 -73 2079 584 -1333 662 1659 -11
2341 -11 -903 535 1329 -137 -1242 469 1193 -976 -901 713 -5 -1775 -307 850 -697 -1587 -361
2358 -361 805 -1298 -1725 235 607 -1448 -1455 207 321 -1852 -1224 680 -479 -1512 -326 419 -393
2375 -393 -1306 110 1002 -1187 -1036 853 511 -1134 -527 1324 482 -1257 75 1663 87 -875 955
2392 955 1630 -312 -272 1238 1347 132 -222 1526 1186 -921 320 2028 383 -562 1078 1532 295
2409 295 -743 980 1482 -184 -312 1120 808 -833 -464 1348 337 -1032 -47 1471 -86 -1513
2425 -1513 602 648 -1120 -1039 121 235 -1080 -1341 849 29 -1940 -401 848 -864 -1515 -378 537
2442 537 -810 -1649 382 456 -1579 -906 803 96 -1263 -575 754 -136 -1278 48 1200 -746 -987
$$ packed form
2324g4J886j271j401K040K49j719O08P99L06j779K83K152j495j917J995R97j670
2341a1q92J438P94j466j105J711P24k169P5J614p18j770J468J157j547q90J226
2358c61J166k103m27J960L72k055pJ662J14k173O28J904j159j033J186P45q12
2375c93r13J416Q92k189J51J889l42j645O07J851q42j739J332J588j576r62J830
2392I55O75j942M0J510J09j215l54J748l40k107J241J708j645r45J640M54j237
2409B95j038J723N02j666j28J432l12j641L69J812j011j369R85J518j557j427
2425a513K115M6j768Q1J160J14j315k61K190q20j969J539J249j712o51J137R15
2442E37j347q39K031P4k035O73J709p07j359O88J329q90j142J326J152j946k41
$$ plain form
2459 -987 695 1030 -752 -694 1168 1311 -806 -98 1606 818 -463 329 1522 588 -562 826 1563
2476 1563 -53 -308 1609 1168 -776 -214 1847 1181 -1013 424 2172 411 -941 441 1282 -467
2492 -467 -32 819 815 -1136 -922 120 624 -1196 -672 1757 -756 -1166 129 693 -1581 -2162 611 982
2510 982 -1660 -774 448 624 -1220 -808 849 -589 -805 -447 568 -368 -892 469 252 -1125 -1180 687
2528 687 358 -716 -109 1578 -135 -1041 -627 1341 536 -1148 501 833 -69 -738 1282 1310 -367 -321
2546 -321 1533 774 -549 430 1753 608 -722 1045 1771 11 -980 689 1607 -138 -521 1388 1108
2563 1108 -647 -116 840 484 -790 102 1106 -561 -1054 409 726 -794 -1285 498 288 -1314 -903
2580 -903 798 -25 -1766 -772 574 -578 -1506 -487 300 -851 -1444 -34 12 -1276 -1168 689 -170
$$ packed form
2459i87J682L35j782N8J862J43k117P08J704p88j281P92J193r34j150J388P37
2476A563j616k55J917m41j944N62K061o66k194J437J748j761j352J382Q41j749
2492d67M35Q51mj951K14J042N04j820N24K429k513m10J295N64k274n81K773L71
2510I82k642Q86J222J76j844M12J657j438k16L58J015r36n24J361k17j377n5J867
2528F87l29j074O07J687j713r06M14J968q05j684J649L32r02o69K020K8j677M6
2546c21J854p59j323R79J323j145j330J767P26j760r91J669R18j745l83J909k80
2563A108j755N31R56l56j274Q92J004j667m93J463L17j520m91J783k10j602M11
2580i03J701q23j741R94J346j152r28J019P87j151n93J410M6j288J08J857q59
$$ plain form
2597 -170 -1698 -553 884 -108 -1343 -94 978 -405 -1075 397 940 -556 -1035 703 1147 -843
2613 -843 -435 1129 503 -604 -355 806 -544 -537 808 1737 231 -495 1269 1314 -847 -505 1540 526
2631 526 -1025 183 1265 619 -803 442 1817 -210 -1071 811 1352 -726 -308 957 352 -1247
2647 -1247 -86 958 -542 -1401 -408 464 -596 -1536 60 359 -1301 -1287 258 218 -1440 -1032 -82 -157
2665 -157 -1529 -275 447 -599 -1521 4 516 -943 -1202 689 443 -1148 -1093 1045 665 -1261 632
2682 632 1421 -312 -494 561 1372 53 -1125 984 1281 -402 -356 1639 720 -997 163 1594 300
2699 300 -765 782 1745 99 -854 652 1298 -42 -476 785 1204 -320 -151 1342 584 -974 544
2716 544 1021 -387 -978 754 1039 -736 -1269 896 981 -1230 -1236 707 215 -1241 -509 577 -367 -1405
$$ packed form
2597a70j528J145J437r92j235J249J072j383o70J472N43j496m79J738M44j990
2613h43M08J564o26j107K49J161j350PJ345R29j506p26J764M5k161L42K045j014
2631E26j551J208J082o46j422J245J375k027q61J882N41k078M18J265o05j599
2647a247J161J044j500q59R93Q72j060r40J596K99j660J4J545m0j658M08R50p5
2665a57j372J254P22j046r22J525N12j459k59J891k46j591N5K138l80j926J893
2682F32P89j733j82J055Q11j319j178K109K97j683M6J995r19j717J160J431j294
2699C00j065J547R63j646r53J506O46j340m34J261M19j524J69J493p58j558J518
2716E44M77j408n91J732K85j775n33K165Q5k211oJ943m92j456P32J086r44j038
$$ plain form
2734 -1405 -262 381 -982 -999 364 29 -1450 -1048 476 169 -1402 -811 934 -303 -1517 -343 688
2751 688 -439 -955 179 799 -281 -781 550 178 -625 -76 1132 548 -923 593 1576 158 -830
2768 -830 856 1430 -112 -336 1261 1302 -203 -28 1287 1060 -683 218 1504 441 -391 573 1245 -118
2786 -118 -382 863 889 -526 -487 961 612 -815 -300 737 121 -1255 -139 882 -302 -944 -37 630
2804 630 -932 -1188 197 -18 -913 -927 444 -493 -1179 -966 541 -553 -1560 13 491 -782 -1355 161
2822 161 337 -1158 -1161 806 300 -1084 -303 957 93 -1064 0 1189 -167 -679 641 1090 -393
2839 -393 -182 865 754 -553 17 1278 722 -484 590 1581 254 -553 924 1235 24 -320 987
2856 987 1058 -414 17 1250 370 -484 277 1042 15 -894 308 877 -395 -876 611 807 -854 -588
$$ packed form
2734a405J143O43j363j7J363l35j479M02J524l07j571N91J745j237j214J174J031
2751F88j127n16J134O20j080n00J331l72q03N49J208n84j471J516R83j418r88
2768h30J686N74j542k24J597M1j505J75J315k27j743R01J286j063q32R64O72j363
2786a18k64J245K6j415L9J448l49j427N15J037o16j376J116J021j184o42R07O67
2804F30j562k56J385k15q95j4J371r37o86K13J507j094j007J573M78j273n73J516
2822A61J76j495lJ967n06j384P81J260q64j157J064J189j356n12J320M49j483
2839c93K11J047j11j307N70J261n56j206J074R91j327q07J477L11j211l44J307
2856I87P1j472M31J233q80q54P61P65j027r09J202N69j272m81J487J96j661K66
$$ plain form
2874 -588 674 230 -914 -612 478 -175 -1192 -166 416 -633 -1032 82 -94 -1218 -1288 273 204 -1485
2892 -1485 -791 504 -294 -1324 -713 802 -496 -1085 -48 686 -647 -683 334 189 -679 -76 851 75
2910 75 -997 164 1507 111 -813 665 1190 139 -363 960 1282 -65 -41 1353 891 -440 387
2927 387 1250 518 -458 668 1039 265 -448 730 1223 -479 -615 1224 651 -893 -49 1095 233 -791
2945 -791 -418 608 -197 -856 -50 672 -751 -926 419 93 -1537 -840 603 -206 -1628 -503 583
2962 583 -390 -1226 -296 565 -822 -1375 24 130 -1313 -962 408 -149 -998 -283 740 -142 -944 160
2980 160 930 -407 -1009 754 757 -318 -617 1008 1039 -822 -81 1268 408 -224 525 1131 212 -396 611
2999 611 1020 -227 -291 1042 755 -155 91 1219 893 -701 370 1344 168 -883 374 893 -54 -447
$$ packed form
2874e88J262m44j144L02J090o53j017J026N82j049l99J114j76j124p0J561o9j689
2892a485O94J295p98j030O11J515j298n89J037P34j333l6J017j45q68O03R27p76
2910G5j072J161J343j396r24J478N25j051n02J323L22j347K4J394m62j331Q27
2927C87Q63p32r76J126L71p74p13J178M93j702j36J839n73j544Q44J144q62j024
2945g91L73J026q05o59Q06P22j423j75J345l26j630O97J443q09j422J125J086
2962E83r73q36R30Q61j387n53J399J06j443L51J370n57q49P15J023q82q02J104
2980A60P70j337o02J763Lj075k99J625L1j861P41J349q60o32P49O06r19o08J007
2999F11M09j247o4J333k87r10K46J128l26j594J071R74j176j051J257N19r47l93
$$ plain form
3017 -447 674 617 -623 -661 562 603 -1158 -243 500 -425 -1014 -159 458 -458 -1088 5 309 -1002 -940
3036 -940 267 12 -1284 -873 424 -92 -1279 -478 548 -373 -1390 -62 312 -604 -665 200 -12 -774
3054 -774 -450 679 197 -903 310 981 168 -418 433 1085 -177 -632 891 882 -185 -314 1003 961 -472
3073 -472 222 1118 384 -226 786 1118 -225 -438 1143 1068 -268 -416 1009 927 -805 -234 757 133 -821
3092 -821 -52 882 -1 -1152 108 474 -811 -781 669 -93 -862 -694 401 -208 -1435 -670 736 -331
3110 -331 -1259 -321 503 -748 -1253 -31 -93 -874 -846 321 -269 -1253 -311 620 -367 -917 -2 1057 -350
3129 -350 -929 497 700 -685 -396 682 688 -235 4 846 518 -409 163 1196 231 -405 874 892 -73
3148 -73 -111 1253 912 -332 266 1350 688 -365 310 904 702 -537 323 908 -84 -486 381 522 -486
$$ packed form
3017d47J121n7j240l8J223M1j761R15P43r25n89Q55O17r16o30J093L04j311O2
3036i40J207k55j296M11J297n16j187Q01J026r21j017J328L74r16o1Q65k12p62
3054g74L24J129m82j100J213O71q13n86Q51O52j262m55J523rj067j29J317m2j433
3073d72O94Q96p34o10J012L32j343k13J581p5j336j48J425q2j732N71R91o24r54
3092h21P69R34q83j151J260L66j285L0J450p62p69J68J095o09j227P65J406j067
3110c31r28R38Q24j251n05J222o2p81K8J167n90r84R42R31r87n50R15J059j407
3129c50n79J426K03j385K89J078Or23K39Q42l28r27N72J033r65o36J279J8r65
3148g3l8J364l41j244N98J084o62j053O75N94k02j239Q60N85r92m02Q67J41j008
$$ plain form
3167 -486 -375 417 117 -937 -178 795 -202 -1101 -36 908 -417 -1247 54 627 -964 -1088 355 119
3185 119 -954 -874 204 -269 -901 -206 472 -267 -1030 178 362 -751 -837 297 221 -774 -638 610 420
3204 420 -871 -205 1061 24 -824 426 699 -108 -357 700 978 -341 -319 833 394 -512 343 1052
3222 1052 408 -329 189 1172 66 -596 841 767 -313 -294 622 474 -424 -159 997 375 -704 33 969
3241 969 -102 -483 463 542 -481 -932 509 270 -954 -463 389 -226 -954 -523 324 -55 -1060 -295 391
3260 391 -542 -1086 -173 297 -879 -924 470 -145 -1156 -490 613 -258 -883 -154 541 -406 -754 330 820
3279 820 -709 -862 668 464 -513 -379 766 530 -510 -66 764 31 -483 450 904 -354 -266 790
3297 790 960 -444 -257 1300 534 -332 96 1005 262 -569 394 566 13 -339 545 805 -380 -83 787
$$ packed form
3167d86J11P92l00j054P59R73r97q99J065R44j325q30J301N73j591j24J443k36
3185A19j073Q0J078m73o32O95O78p39p63J208J84j113q6J134p6r95J36J248j90
3204D20j291O66J266j037q48J250K73q07k49J057K78j319K2J152m39r06Q55P09
3222A052o44p37N18R83j106o62J437p4j080J9R16j48q98K65J156o22j079P37R36
3241I69j071l81R46P9j023m51J441k39j224M91Q52o15p28M31Q47l79j005P65O86
3260C91r33n44R13M70j176m5J394o15j011O66J103q71o25P29O95r47l48J084M90
3279H20j529j53J530k04r77J34J145k36j040M44Q30p33n14R33M54j258Q8J056
3297G90J70j404J87J557p66q66M28R09p43q31R63J72n53l52Q84K60j185K97Q70
$$ plain form
3316 787 493 -656 -295 837 220 -1116 9 542 -478 -821 60 518 -781 -985 62 169 -951
3333 -951 -758 165 -407 -1003 -352 383 -769 -1147 10 287 -755 -1195 176 495 -977 -717 501 90
3351 90 -997 -612 548 90 -842 132 431 -55 -588 341 783 -283 -92 1159 729 -405 2 1296
3369 1296 430 -569 423 1145 388 -389 830 894 -116 -180 751 585 -239 13 722 235 -594 308 1138 -121
3389 -121 -989 337 902 -272 -545 277 478 -680 -400 608 78 -914 -153 477 -381 -989 -380 196 -481
3408 -481 -1060 301 -150 -939 -725 38 30 -1260 -447 537 38 -873 -115 485 -333 -900 16 625 -456 -545
3428 -545 235 580 -492 -326 752 261 -615 40 727 -34 -636 632 942 176 -366 1067 804 -297
3446 -297 -56 903 786 -267 199 982 292 -588 314 921 19 -329 675 757 -254 -515 947 310 -672
$$ packed form
3316G87k94j149L61J132o17j336J125N33j020l43Q81M58j299k04J047J07j120
3333i51J93R23n72n96O51P35j152l78J157K77j042m40J371L19j472K60J218m11
3351I0j087L85J160m58r32R74K99m86n33R29M42j066J91J251m30j134M07J294
3369A296q66r99R92P22p57p77J219O4j010o4R31j66q24K52P09m87q29R02Q30j259
3389a21q68J326N65j174k73Q22K01j158K80J008n30r92P61O30q58o08O09N76o77
3408d81n79J361m51p89K14P63qj290Q13R84m99r11P58O00q18n67R16O09j081q9
3428e45P80L45j072J66J078m91q76O55O87p61o02J268L10p66n42J433k63j101
3446b97K41R59j17j053M66P83o90q80R02O07r02l48J004Q2j011k61J462o37r82
$$ plain form
3465 -672 -225 938 115 -634 -29 548 -369 -866 7 360 -413 -644 443 119 -475 -743 243 -270 -1110
3484 -1110 -549 405 -617 -1372 -95 568 -757 -1060 222 347 -979 -984 378 148 -711 -252 188 -47
3502 -47 -534 109 580 -367 -504 742 773 -466 -295 726 517 -568 -95 923 505 -392 -20 789 239
3521 239 -158 426 1061 97 -264 672 607 -186 -292 878 198 -376 80 1066 102 -818 452 845 5 -534
3541 -534 407 794 -428 -309 352 392 -664 -278 364 -183 -844 -131 551 -727 -834 168 161 -803 -963 349
3561 349 -15 -1016 -805 255 -218 -864 -489 -60 -329 -1079 -130 283 -465 -636 581 218 -709 -247 604
3580 604 240 -729 30 880 -2 -557 267 789 -328 -140 472 681 203 94 868 537 -239 9 918 170
3600 170 -377 444 847 46 -283 670 747 -497 -221 550 520 -545 -132 646 164 -520 71 519 -34 -538
$$ packed form
3465f72M47J163q23p49O05N77r17m97Q73L53p73k31J087l24n94k68R86n13q40
3484a110N61R54j022p55J277O63j325l03J282J25j326nJ362k30q59M59M40k35
3502d7m87O43M71r47j37J246L1j239J71J021k09j085M73J018m18q97L72Q09n50
3521B39l97N84O35r64l61R36o5p93j06J170o80n74M56R86r64r20J270L93q40n39
3541e34R41L87j222J19O61M0j056L86O42n47o61P13O82j278j07J002pr64j60J312
3561C49l64j001K11J060m73o46L75M29k69p50R49M13p48j71J217l63r27M62Q51
3580F04l64r69P59Q50q82n55Q24N22j117J88O12K09m78j09P74l31p76K48R09p48
3600A70n47Q21M03q01l29R53P7j244K76P71l0j065M13P78m82o84N91M48n53n04
$$ plain form
3620 -538 180 425 -473 -549 310 67 -607 -525 422 -38 -1046 -269 554 -293 -907 -35 83 -563 -815 90
3640 90 171 -766 -769 451 52 -1212 -309 486 -202 -670 -4 367 -386 -439 382 396 -357 -475 884 288 -515
3661 -515 -216 882 388 -434 55 917 148 -432 505 595 -73 -80 877 891 -202 -74 1026 439 -346 126
3681 126 868 195 -477 155 834 107 -276 222 969 -444 -381 351 109 -475 7 638 -367 -1008 89
3700 89 516 -353 -775 246 382 -597 -909 202 69 -968 -372 372 -189 -900 -294 56 -381 -791 90
3719 90 208 -735 -597 471 35 -514 -462 522 -78 -782 -193 555 -20 -854 362 727 208 -202 458 520
3739 520 -220 -243 807 360 -425 -62 821 396 -131 346 889 292 -260 493 928 -179 -173 835 646 -40
3759 -40 -126 721 312 -422 230 659 -72 -412 258 528 -357 -341 393 40 -816 -964 187 110 -823 -235 492
$$ packed form
3620e38P18K45q98p6Q59k43o74Q2R47m60j008P77Q23q47o14Q72J18o46k52R05
3640I0Q1r37lJ220l99j264R03P95o88m68O66L71p53n3Q21J4p53j18J359n96q03
3661e15K99J098m94q22M89Q62p69n80R37R0o68pR57J4j093J28J100n87p85M72
3681A26P42o73o72O32O79p27l83M98P47j413O3P32k42n84M82O31j005o41J097
3700H9M27q69m22J021J36r79l12J111j33j037N96P44n61p11O06L50m37m10Q81
3719I0J18r43J38J068m36n49N2R84o00p04N89P48n75q34J216L65n19m10O60O2
3739E20p40k3J050m47p85L63Q83m25n27M77N43n97n52P53M35j107OJ008j89o86
3759d0q6Q47m09p34O52M29p31l40O70K70q85J6P34l53q56j48J151p7r33N88P27
$$ plain form
3780 492 -264 -932 -335 223 -530 -763 31 195 -745 -369 251 -94 -811 -278 283 -232 -653 -116 525 -356
3800 -356 -869 105 202 -150 -307 508 373 -439 -95 669 148 -338 62 745 219 -379 506 962 -46 -447
3820 -447 797 820 -12 -65 865 478 -296 233 802 253 -194 231 926 15 -124 437 600 -356 -300 842
3840 842 129 -548 -204 702 6 -591 43 445 -201 -699 -33 97 -567 -908 300 38 -884 -545 225 -131
3860 -131 -818 -519 87 -404 -925 -182 -222 -462 -729 250 193 -454 -380 430 -1 -602 -233 483 347 -439 211
3881 211 378 -78 -356 441 534 -227 -276 806 275 -345 76 807 232 -468 237 885 94 -47 587 998
3901 998 277 -282 483 575 18 -180 573 174 -42 142 351 100 -332 299 630 -423 -406 173 655 -340
3921 -340 -736 521 68 -625 -146 479 -75 -805 -267 282 -433 -550 -5 -214 -614 -388 401 8 -918 -427
$$ packed form
3780D92p56o68N97N58p53k33P94J64r40L76O20l45p17N33N61n15m21N37O41q81
3800c56n13R74R7l52j57Q15j35q12L44P64n21m86M00O83n26n98Q85M56j008m01
3820d47J244K3q32n3R30l87p74N29N69n49m47M25O95r11j39N61J63r56N6J142
3840H42p13o77L44R06o96n97O34M02o46m98O66J30o64l41J208k62r22L39P70l56
3860a31o87K99O06m91n21P43m0k40k67R79n7o47P4Q10m31o01L69P16j36p86O50
3881B11J67m56k78P97R3p61m9J082n31o20M21P31n75p00P05O48p91j41O34M11
3901I98p21n59P65R2n57j98P53l99k16J84K09k51m32O31L31j053J7N79M82r95
3921c40l96J257m53o93M79O25n54p30N38N49p15j17N45k09m00K26P89l93r26M91
$$ plain form
3941 -427 405 -249 -787 -43 451 -475 -466 -142 221 -118 -462 549 175 -684 145 465 -79 -290 102 655
3961 655 -57 -325 238 973 -122 -231 689 704 140 -63 751 491 -199 71 793 246 -131 337 774 44
3981 44 -123 614 624 -210 -414 593 324 -490 43 672 328 -362 66 384 91 -679 -105 611 -402 -298
4001 -298 137 54 -718 -579 279 -105 -737 -226 328 -409 -1088 -118 464 -513 -594 -138 93 -474 -423 166 156
4022 156 -716 -462 401 121 -675 -185 625 -331 -411 230 462 -300 -496 622 499 -373 -378 859 366 -507
4042 -507 206 858 282 -403 372 774 124 -72 659 667 -44 -108 539 333 -224 123 509 185 -530 290 519
4063 519 -174 -395 339 326 -343 -160 376 124 -437 -154 412 72 -445 -152 382 -120 -433 -11 326 -798
4083 -798 -663 308 -170 -801 -630 371 -94 -804 -431 86 -178 -608 -238 538 -315 -714 242 367 -466 -382
$$ packed form
3941d27Q32o54n38P44M94r26RL24L63l39l44J011l74q59Q29L20n44k11L92N53
3961F55p12k68N63P35j095j09R20J5n64k03Q14k60o90K70P22n47l77M68M37p30
3981D4j67P37J0q34k04J007k69q14N33O29l44o90M28L18k93p70N74P16j013J04
4001b98M35q3p72J39Q58l84o32N11N54p37o79R70N82r77q1M56K31n67N1N89j0
4022A56q72K54Q63k80p96M90Q10r56q0O41K32p62j96J118j23q72nJ237m93q73
4042e07P13O52n76o85P75M02o50j96P31Qp11o4O47k06n57L47L86l24p15Q20K29
4063E19o93k21P34j3o69J83N36k52n61K83N66l40n17K93N34n02l13M22L37j124
4083g98J35R71m78o31J71J001m65p10L73N17k64m30L70P76q53l99R56J25q33Q4
$$ plain form
4103 -382 232 276 -535 -22 254 -120 -287 174 635 -242 -399 752 727 -69 -25 752 419 -59 301 694 218
4124 218 15 253 777 141 -393 734 563 -399 -492 926 517 -371 -92 577 144 -484 -110 313 79 -448
4144 -448 36 437 -390 -657 390 -9 -712 -389 470 -150 -727 -284 253 -154 -1150 -61 265 -117 -471
4163 -471 -27 107 -488 -646 245 -294 -637 -394 103 -231 -614 229 303 -449 -460 113 547 -149 -491 659
4183 659 425 -270 -6 458 230 -282 202 428 151 -527 527 734 -193 -214 471 777 -90 21 607 427
4203 427 -338 411 738 256 -453 104 494 -76 -412 187 349 -431 -204 162 300 -485 -30 244 -84 -669
4223 -669 -36 469 -177 -651 51 245 -738 -718 177 189 -875 -381 250 -165 -773 -264 402 -310 -665 -74
4243 -74 122 -330 -499 293 127 -780 -159 404 128 -748 -184 241 119 -418 139 493 -247 -468 362 412 276
$$ packed form
4103c82O14M4q11N13K76l74j67M61M61q77j57J151k5p96M4P77l33m78L60L93m76
4124B18k03K38N24o36n34J127j71r62r3J418m09q88K79O69m33o28L74M23k34n27
4144d48M84M01q27k67J047l99p03L23Q59o20n77M43N37m07r96J089L26l82l54
4163d71M44J34n95j58Q91n39l43K43M97l34l83Q43P4p52j1N73M34o96l42J150
4183F59k34o95K64M64k28n12M84K26k77o78J054K07r27k1O85L06q67J11N86j80
4203D27p65P49L27m82p09N57L90n70l36N99J62p80K27L66J38p85M55K74l28n85
4223f69O33N05o46m74P02J94r83K0Q95J2j064M94O31m15o08N09O66p12l55N91
4243g4J96m52j69P92j66r07O21N63k76q76N64M25j22n37N57L54p40k21Q30N0j36
$$ plain form
4264 276 -273 129 662 14 8 448 362 -229 346 720 12 -150 340 506 -105 10 514 621 -222 -54 560
4285 560 213 -342 -135 666 -29 -447 174 389 58 -94 344 119 -651 -335 356 -93 -545 -141 39 -311
4305 -311 -1075 -454 358 -266 -581 -182 -8 -651 -530 59 -274 -787 -442 240 -237 -660 -226 363 -152 -559
4325 -559 289 336 -386 -444 244 208 -496 -225 415 474 -298 185 424 179 13 431 535 75 61 723 744 147
4347 147 -110 699 529 -39 -30 598 393 -458 209 457 221 -205 261 530 -54 -198 523 197 -286 106 383
4368 383 174 -653 -108 250 -14 -629 299 206 -231 -554 7 128 -512 -669 -124 38 -590 -370 132 -505
4388 -505 -685 56 49 -636 -741 224 -70 -581 -494 138 109 -588 -252 335 31 -320 113 277 -88 -95 450 483
4410 483 -345 119 532 399 -394 -82 656 347 -284 172 703 -35 -205 429 573 -30 -188 502 298 65
$$ packed form
4264B76n49M02N33o48oM40q6n91N75L74p08j62M90J66o11J15N04J07q43J68O14
4285E60l47n55K07Q01o95m18O21K15l31j52M38k25p70L16O91m49m52M04J80l50
4305c11p64O21Q12o24l15L99J74o43J21N89l33n13L45O82m77m23M34N89n15m07
4325e59Q48M7p22n8O88l6p04K71O40N9p72M83K39k45j66M18J04m60j4O62K1n97
4347A47k57Q09j70n68RO28k05q51O67K48k36m26M66K69n84j44P21l26m83L92K77
4368C83k09q27N45L58k64o15R28r3m37l23N61J21o40j57N45J62o28K20N02o37
4388e05j80P41po85j05R65k94n11Q7O32k9o97L36N87l04l51M33J64l65pN45L3
4410D83q28M64M13j33p93L12P38l09o31M56N31p38j70O34J44o03j58O90k04k33
$$ plain form
4430 65 24 627 336 -147 350 691 -67 -502 256 456 112 -411 370 284 -456 -358 414 64 -410 -282 398
4451 398 -116 -845 -122 45 -218 -675 -179 164 -607 -734 311 -59 -570 -357 389 -134 -665 -408 432 -296
4471 -296 -630 -186 369 -288 -483 136 268 -486 39 290 156 -165 -128 303 -95 -160 316 690 36 -468 286
4492 286 731 -218 180 568 574 -328 -72 708 361 -179 504 771 292 -326 252 373 -185 213 353 255 -547
4513 -547 -157 519 38 -489 121 457 -164 -340 -21 367 -300 -420 153 -35 -360 -440 264 36 -315 -212
4533 -212 103 -348 -640 -122 178 -663 -554 192 303 -210 -646 287 -112 -416 -419 174 -108 -602 -80 96 -239
4554 -239 -466 78 152 -105 -341 519 249 -209 -110 285 144 -299 221 663 237 -207 491 508 276 -11 427
4575 427 385 -121 46 473 197 -205 -4 497 313 -317 398 395 -134 -213 166 300 -279 -686 133 161 -497 -279
$$ packed form
4430F5m1O03k91m83M97L41p58m35P58K00l44n23P81q6p40R8P72l50m74J28O80
4451C98n14p29P23J67k63m57M96L43p71j27J045l70n11K13P46n23n31K57Q40p28
4471b96l34M44N55o57j95O19J32p54N25K51j34l21L7M31l98o5M76L74o54n04P54
4492B86M45r49L98L88Or02K56P80l47n40O83K67m79o18N78J21n58L98J40r8q02
4513e47L90O76m81n27O10L36o21j76L19L88o67j20N73j88l25q0P04k28l51J03
4533b12L15m51k92N18L00q41J09P46J11n13m36R33l99l04lN93k82m94N22J76l35
4554b39k27N44P4k57k36Q60k70m58R9L95j41m43N20M42m26m44O98J7k32k87M38
4575D27m2n06J67M27k76m02K01N01j84o30P15ln29p9L79J34n79m07Q19K8o58K18
$$ plain form
4597 -279 111 60 -532 -42 -84 -220 -508 -117 78 -499 -427 178 46 -405 -542 213 -98 -815 -251 108 -368
4618 -368 -548 22 382 -154 -308 86 253 -389 -169 370 -41 -128 -86 529 104 -174 210 692 -148 -424 480
4639 480 262 -94 -70 255 280 -1 2 661 277 -306 77 431 265 -218 359 360 61 2 560 211 -410 -198
4661 -198 421 122 -253 -16 467 -206 -384 -28 401 -42 -375 -114 50 -320 -326 11 79 -886 -356 330 -121
4682 -121 -727 -441 121 -402 -893 41 300 -134 -590 243 189 -370 -293 37 -71 -568 -224 280 -485 -494 247
4703 247 159 -107 -336 463 633 -215 -118 581 145 -396 -53 546 188 -22 162 621 160 -364 363 568 -88
4724 -88 55 424 440 -22 224 606 285 -490 242 617 -177 -373 271 431 -220 -331 252 209 -235 -215 458
4745 458 -38 -205 -148 -124 -178 -296 3 114 -569 -473 216 105 -592 -385 433 34 -503 -217 -144 -40 -478 -212
$$ packed form
4597b79L90n1n92M90m2j36k88L91J95n77P2O05j32m51j37P55l11p17N64L59m76
4618c68j80N70L60n36j54L94J67o42K20N39m11q7M2O15m25k78L84M82q40k76R04
4639D80k18l56K4L25K5k81LO59l84n83L83L54j66m83N77Jk99n9N58l49o21K12
4661a98O19k99l75K37M83o73j78L56M29m43l33K61J64l70oL37O8r65N30O86m51
4682a21o06K86N62n23m91R34K59m34m56Q33n4n59P7L30j08m97L44N04p65rP41
4703B47q8k66k29P99J70q48R7O99m36n41L43N99l58k10J84M59m61n24P27K05o56
4724h8J43L69J6m62K46L82l21p75P32L75p94j96O44J60o51j11N83m3m44K0O73
4745D58m96j67N7K4n4j18K99J11o83R6O89j11o97K07Q18l99n37K86P3J04m38K66
$$ plain form
4767 -212 256 -307 -131 -208 26 -468 -179 337 -148 -434 -13 447 241 -555 19 395 31 -504 155 385
4787 385 -26 -110 268 314 -212 -183 628 225 -1 309 925 88 -305 133 585 -78 -56 248 202 -60 -150 551
4809 551 275 -5 13 311 -173 -113 35 320 -398 -393 169 174 -336 -147 348 145 -435 -197 271 -202 -350 -280
4831 -280 231 -438 -565 225 -39 -640 -312 222 42 -605 -401 327 -155 -473 -70 218 -202 -636 90 82 -322
4852 -322 -350 -22 150 -439 -211 250 12 -279 194 231 139 -210 166 671 2 -45 442 246 78 62 768 57
4874 57 -181 180 494 284 -332 190 760 -9 -113 478 689 -64 -133 321 275 -370 -47 327 -265 -301 -108
4895 -108 219 -347 -322 -22 160 -409 -400 -9 27 -605 -620 145 270 -514 -191 136 -269 -280 -72 119 -559 -555 -187
4918 -187 99 -445 -247 195 237 -519 -45 437 34 -356 -46 382 -176 3 169 111 0 -151 91 237 -255
$$ packed form
4767b12M68n63J76p7K34m94K89N16m85k86M21M60k06p96N74L76l64n35O59K30
4787C85m11q4L78M6n26K9Q11m03k26L10O16q37l93M38M52o63K2L04m6k62r0P01
4809E51k76k80J8K98m84O0J48K85p18NN62Nn10J89M95k03n80K38M68m73j48P0
4831b80N11o69j27P90k64o01L28N34j80o47K04P28m82l18M03K88m20m34P26qm04
4852c22k8L28J72n89K28M61k38k91M73L7r2l49L76N05o69m7M87j96j68j6P06p11
4874E7k38L61L14k10o16N22N70p69j04N91K11p53o9M54m6o45L23L74n92l6J93
4895a08L27n66K5L00J82n69RL91L6o32j5P65J25p84L23L27m05j1K08J91o78ML68
4918a87K86n44J98M42M2p56M74M82m03l90L10M28n58J79J66n8j11j51K42J46m92
$$ plain form
4939 -255 68 530 380 -254 329 613 -259 -298 439 465 9 -317 282 428 -207 -236 611 214 -20 132 233
4960 233 -16 -103 116 283 -309 -141 310 369 -517 -197 235 224 -383 -369 400 -78 -636 10 284 144 -587
4981 -587 -153 104 -355 -402 -55 -146 -7 -398 271 -130 -746 22 160 -82 -555 -70 401 -21 -287 167 252
5002 252 -81 -285 234 -135 -398 -20 537 3 -242 25 535 -32 -342 483 461 61 34 489 610 -134 -218
5023 -218 383 196 -29 296 808 129 -42 377 279 34 23 377 531 -211 -18 296 -48 -293 -84 350 -103
5044 -103 -411 125 568 -364 -472 60 -54 -346 -312 77 -227 -501 -92 84 -179 -581 -85 50 -296 -428
$$ packed form
4939b55L23M62j50o34N83K84q72l9P37K6m56l26N99J46o35k9Q47l97k34J52J01
4960B33k49q7K19J67n92J68M51N9q86L20M32j1o07J4P69m78n58O46K74j40p31
4981e87M34K57m59m7L47r1J39l91O69m01o16P68J38k42m73M85M71m22k66M54Q5
5002B52l33k04N19l69k63L78N57n34k45K67N10n67l10Q25k2m00k7M55J21p44q4
5023b18O01j87k25L25N12o79j71M19r8k45j1L54J54p42J93L14l44k45K09M34m53
5044a03l08N36M43r32j08N32j14k92L4L89l04k74M09J76k63m02M96J35l46j32
$$ [...]
8191b5
##END NTUPLES=NMR FID
##END=
