##TITLE=1H_SAV-32-singlet-bat23
 CDCl3, 8 sc, 
 25.11.2020
##JCAMPDX= 6.0         $$ Bruker NMR JCAMP-DX V2.0
##DATA TYPE= NMR FID
##DATA CLASS= NTUPLES
##ORIGIN= UXNMR, Bruker Analytische Messtechnik GmbH
##OWNER= root
$$ XWIN-NMR		Version 3.5
$$ Wed Nov 25 10:56:29 2020 Russian Standard Time (UT+4h)  she@DPX200
##.OBSERVE FREQUENCY= 200.1315066352
##.OBSERVE NUCLEUS= ^1H
##.DELAY= (6, 6)
##.ACQUISITION MODE= SIMULTANEOUS
##.ACQUISITION SCHEME= undefined
##.AVERAGES= 8
##.DIGITISER RES= 18
##SPECTROMETER/DATA SYSTEM= spect
##.PULSE SEQUENCE= zg30
##.SOLVENT NAME= CDCl3
##.SHIFT REFERENCE= (INTERNAL, CDCl3, 0, 15.7039)
##AUDIT TRAIL= $$ (NUMBER, WHEN, WHO, WHERE, WHAT)
$$ ##TITLE= Audit trail, XWIN-NMR		Version 3.5
$$ ##JCAMPDX= 5.01
$$ ##ORIGIN= Bruker BioSpin GmbH
$$ ##OWNER= she
$$ F:/spectra/data/she/nmr/H-F/1/audita.txt
$$ ##AUDIT TRAIL=  $$ (NUMBER, WHEN, WHO, WHERE, WHAT)
(   1,<2020-11-25 10:55:34.70 +0400>,<she>,<DPX200>,
      <created by zg, POWCHK disabled, PULCHK disabled
       configuration hash MD5:
       00 E9 B6 7A A2 85 ED C7 34 08 36 98 17 FE 4E 26
       data hash MD5: 16K
       DA 31 D2 12 4C F2 E6 05 73 9D 8F 7F 0C 94 41 2D>)
$$ ##END=
$$ 
$$ hash MD5
$$ AB D2 A5 41 D2 AF DD 3D 0C F2 62 2F A7 51 0D 8D
##$RELAX= 
##$RELAX= 
##$RELAX= 
##$RELAX= 
##$RELAX= 
##$RELAX= 
$$ Bruker specific parameters
$$ --------------------------
##$DU= <F:/spectra>
##$EXPNO= 1
##$NAME= <H-F>
##$PROCNO= 1
##$TYPE= <nmr>
##$USER= <she>
##$AMP= (0..31)
100 100 100 100 100 100 100 100 100 100 100 100 100 100 100 100 100 100 
100 100 100 100 100 100 100 100 100 100 100 100 100 100 
##$AQSEQ= 0
##$AQ_mod= 1
##$AUNM= <au_zg>
##$AUTOPOS= <>
##$BF1= 200.13
##$BF2= 200.13
##$BF3= 200.13
##$BF4= 200.13
##$BF5= 200.13
##$BF6= 200.13
##$BF7= 200.13
##$BF8= 200.13
##$BYTORDA= 1
##$CFDGTYP= 0
##$CFRGTYP= 5
##$CHEMSTR= <none>
##$CNST= (0..31)
1 1 145 1 1 1 1 1 1 1 1 1 1 1 1 1 1 1 1 1 1 1 1 1 1 1 1 1 1 1 1 1 
##$CPDPRG= <>
##$CPDPRG1= <>
##$CPDPRG2= <>
##$CPDPRG3= <>
##$CPDPRG4= <mlev>
##$CPDPRG5= <mlev>
##$CPDPRG6= <mlev>
##$CPDPRG7= <mlev>
##$CPDPRG8= <mlev>
##$CPDPRGB= <>
##$CPDPRGT= <>
##$D= (0..31)
0 1.2 0 0 0 0 0 0 0 0.06 0 0.03 0 0 0 0 0.0002 0 0 0 0 0 0 0 0 0 0 0 0 
0 0 0 
##$DATE= 1606287334
##$DBL= (0..7)
120 120 120 120 120 120 120 120 
##$DBP= (0..7)
150 150 150 150 150 150 150 150 
##$DBP07= 0
##$DBPNAM0= <>
##$DBPNAM1= <>
##$DBPNAM2= <>
##$DBPNAM3= <>
##$DBPNAM4= <>
##$DBPNAM5= <>
##$DBPNAM6= <>
##$DBPNAM7= <>
##$DBPOAL= (0..7)
0.5 0.5 0.5 0.5 0.5 0.5 0.5 0.5 
##$DBPOFFS= (0..7)
0 0 0 0 0 0 0 0 
##$DE= 6
##$DECBNUC= <off>
##$DECIM= 32
##$DECNUC= <off>
##$DECSTAT= 4
##$DIGMOD= 1
##$DIGTYP= 9
##$DL= (0..7)
0 120 120 120 120 120 120 120 
##$DP= (0..7)
150 150 150 150 150 150 150 150 
##$DP07= 0
##$DPNAME0= <>
##$DPNAME1= <>
##$DPNAME2= <>
##$DPNAME3= <>
##$DPNAME4= <>
##$DPNAME5= <>
##$DPNAME6= <>
##$DPNAME7= <>
##$DPOAL= (0..7)
0.5 0.5 0.5 0.5 0.5 0.5 0.5 0.5 
##$DPOFFS= (0..7)
0 0 0 0 0 0 0 0 
##$DQDMODE= 0
##$DR= 18
##$DS= 0
$$ [...]
##$SUBNAM2= <"">
##$SUBNAM3= <"">
##$SUBNAM4= <"">
##$SUBNAM5= <"">
##$SUBNAM6= <"">
##$SUBNAM7= <"">
##$SUBNAM8= <"">
##$SUBNAM9= <"">
##$SW= 16.9725356469052
##$SWIBOX= (0..15)
0 0 2 0 0 0 0 0 0 0 0 0 0 0 0 0 
##$SW_h= 3396.73913043478
##$TD= 16384
##$TD0= 1
##$TE= 0
##$TE2= 300
##$TE3= 300
##$TEG= 300
##$TL= (0..7)
0 120 120 120 120 120 120 120 
##$TP= (0..7)
150 150 150 150 150 150 150 150 
##$TP07= 0
##$TPNAME0= <>
##$TPNAME1= <>
##$TPNAME2= <>
##$TPNAME3= <>
##$TPNAME4= <>
##$TPNAME5= <>
##$TPNAME6= <>
##$TPNAME7= <>
##$TPOAL= (0..7)
0.5 0.5 0.5 0.5 0.5 0.5 0.5 0.5 
##$TPOFFS= (0..7)
0 0 0 0 0 0 0 0 
##$TUNHIN= 0
##$TUNHOUT= 0
##$TUNXOUT= 0
##$USERA1= <user>
##$USERA2= <user>
##$USERA3= <user>
##$USERA4= <user>
##$USERA5= <user>
##$V9= 5
##$VALIST= <valist>
##$VCLIST= <CCCCCCCCCCCCCCC>
##$VD= 0
##$VDLIST= <DDDDDDDDDDDDDDD>
##$VPLIST= <PPPPPPPPPPPPPPP>
##$VTLIST= <TTTTTTTTTTTTTTT>
##$WBST= 1024
##$WBSW= 4
##$XGAIN= (0..3)
0 0 0 0 
##$XL= 0
##$YL= 0
##$YMAX_a= 338020
##$YMIN_a= -300002
##$ZGOPTNS= <>
##$ZL1= 120
##$ZL2= 120
##$ZL3= 120
##$ZL4= 120
##$ABSF1= 10
##$ABSF2= 0
##$ABSG= 5
##$ABSL= 3
##$ALPHA= 0
##$AQORDER= 0
##$ASSFAC= 0
##$ASSFACI= 0
##$ASSFACX= 0
##$ASSWID= 0
##$AUNMP= <proc_1d>
##$AZFE= 0.1
##$AZFW= 0.1
##$BCFW= 1
##$BC_mod= 2
##$BYTORDP= 1
##$COROFFS= 0
##$CY= 11.3945322036743
##$DATMOD= 1
##$DC= 2
##$DFILT= <>
##$DTYPP= 0
##$F1P= 15.9154993809931
##$F2P= -4.1035820241983
##$FCOR= 0.5
##$FTSIZE= 0
##$FT_mod= 4
##$GAMMA= 1
##$GB= 0.15
##$INTBC= 1
##$INTSCL= 1
##$ISEN= 128
##$LB= 0.24
##$LEV0= 0
##$LPBIN= 0
##$MAXI= 10000
##$MC2= 0
##$MEAN= 0
##$ME_mod= 0
##$MI= 1.114404
##$NCOEF= 0
##$NC_proc= 0
##$NLEV= 6
##$NOISF1= 3.799351
##$NOISF2= 2.8
##$NSP= 1
##$NTH_PI= 0
##$NZP= 0
##$OFFSET= 15.70392
##$PC= 1
##$PHC0= -11059.69
##$PHC1= 23.80089
##$PH_mod= 1
##$PKNL= yes
##$PPARMOD= 0
##$PSCAL= 0
##$PSIGN= 0
##$REVERSE= no
##$SF= 200.130013532006
##$SI= 16384
##$SIGF1= 3
##$SIGF2= 2
##$SINO= 400
##$SIOLD= 16384
##$SREGLST= <1H.CDCl3>
##$SSB= 0
##$STSI= 0
##$STSR= 0
##$SW_p= 3612.71676300578
##$SYMM= 0
##$S_DEV= 0
##$TDeff= 0
##$TDoff= 0
##$TI= <>
##$TILT= no
##$TM1= 0
##$TM2= 0
##$TOPLEV= 0
##$USERP1= <user>
##$USERP2= <user>
##$USERP3= <user>
##$USERP4= <user>
##$USERP5= <user>
##$WDW= 1
##$XDIM= 8192
##$YMAX_p= 0
##$YMIN_p= 0
$$ End of Bruker specific parameters
$$ ---------------------------------
##NTUPLES= NMR FID
##VAR_NAME=  TIME,          FID/REAL,        FID/IMAG
##SYMBOL=    X,             R,               I
##VAR_TYPE=  INDEPENDENT,   DEPENDENT,       DEPENDENT
##VAR_FORM=  AFFN,          ASDF,            ASDF
##VAR_DIM=   8192,          8192,            8192
##UNITS=     SECONDS,       ARBITRARY UNITS, ARBITRARY UNITS
##FACTOR=    0.0002944,     1,               1
##FIRST=     0,             0,               0
##LAST=      2.4114304,     0,               0
##MIN=       0,             -300002,         0
##MAX=       2.4114304,     338020,          0
$$ Real data points
##PAGE= N=1
##DATA TABLE= (X++(R..R)), XYDATA
$$ [...]
2859B568k545k143L116R58k947k11K774J83l019O19L360k071k690K101K324k524
2875a47j768K610K270l418r86K655Q64l891J57L081m82l210K165K352l203q51
2891a802K012K077l630r25L188P64l901OM081j185l016J435K338q63k864J853
2907d32K344k788j772L502K25k822kL111j87l917J568L339j825k967K450K403
2923B230k755j859K694J940l195q37L054N9l067P21K980j098k785J927K253j863
2939C99k568L240J530l514r52L812L11l076k53K922m31l388J396L290k387k051
2955a720J994J510k369j620L570K78l321K68L234n00l508J641L139k334k669J886
2971e21K356k347j998L420O53l279n07L112M77l552L57M145j970k825K303J970
$$ plain form
2859 2568 23 -2120 996 1954 -993 -1204 1570 1753 -1266 -647 2713 642 -2048 53 2377 -147
2875 -147 -1915 695 2965 -453 -1439 1216 2080 -1811 -1654 1427 945 -2265 -100 2252 -951 -1802
2891 -1802 210 2287 -1343 -2268 920 1684 -2217 -2211 1870 685 -2331 -896 1442 579 -2285 -432
2907 -432 1912 -876 -2648 854 1079 -1743 -1745 1366 1179 -2738 -1170 2169 344 -2623 -173 2230
2923 2230 -525 -2384 310 2250 -945 -1782 1272 1331 -1736 -1015 1965 867 -1918 9 2262 399
2939 399 -2169 1071 2601 -913 -1865 1947 2258 -818 -1071 1851 1420 -1968 -572 2718 331 -1720
2955 -1720 274 1784 -585 -2205 1365 1643 -1678 -1410 1824 1324 -2184 -543 2596 262 -2407 -521
2971 -521 1835 -512 -2510 910 1563 -1716 -2223 889 1366 -2186 -1829 2316 346 -2479 -176 1794
2987A794k699j632J871K767k689j478K717R48l418L09K973r52k331J221K840k167
3003G4j778K718J314k930j336K984J029l667O68K735o00l059J155L076j811k561
3019a989K231K110k299j191K491N00k647p61L458j092l233J157L360j999k445
3034b349K662J617k201j294J938K274m432k16L634j98l587Q60L602j569k767R68
3050a058L178k401k212K263K201l278p54K911J04k172j010L130N48m175J771K728
3066A774k373j395J252K258j708j958K479R32k198j491M059k17l549J804K322
3081A991j891k904K916K455k815j948K902J908l815K95K196J046m017Q25K031
3096A175J97k979J486K151j247j668J473J378k929m35K529L45k809Q72K229j187
$$ plain form
2987 1794 -905 -2537 -666 2101 -588 -2066 651 1599 -1819 -1510 1463 511 -1820 -599 2241 74
3003 74 -1704 1014 2328 -602 -1938 1046 2075 -1592 -924 1811 1211 -1848 -693 2383 572 -1989
3019 -1989 242 2352 53 -1138 1353 1853 -794 -1555 1903 811 -2422 -1265 2095 96 -2349
3034 -2349 313 1930 -271 -1565 373 2647 -1785 -2001 1633 1435 -2152 -1292 2310 741 -2026 -1058
3050 -1058 2120 -281 -2493 -230 1971 -1307 -2061 850 954 -1218 -2228 902 1450 -2725 -954 1774
3066 1774 -599 -1994 -742 1516 -192 -2150 329 1261 -937 -2428 1631 1414 -2135 -331 1991
3081 1991 100 -2804 112 2567 -248 -2196 706 2614 -1201 -906 1290 2336 -1681 -856 1175
3096 1175 1372 -1607 -121 2030 783 -885 588 1966 -963 -1398 1131 1476 -1333 -461 1768 581
3112E81k831J554L082k634k060J881K710k776j127K182O42k567j00K654n90k652
3128b051R35L026k052k439K409K175l061j495L128J005k689q85L195q0k980O46
3144a213L056j822j924J738J889j946j674K607J496l260n27L153J35l280M86L008
3160A922o85k747P68L136j824k138K121J416k283j112K605M61k437l92L214p67
3176A258l014J536K581j910k229K117J546j744j912K152J500l563N03K905p35
3191I91k373R49J802j142k329J932K556k819j357K178P24k050r18K697K26k611
3207a544n5L216j283k605J684K134j750j957K372R88k770k98K902j79k370N39
3223i76K961j200k351J058K406j833j574K051J290k505p88K435Q67l159p3K766
$$ plain form
3112 581 -2250 -696 2386 -248 -2308 -427 2283 -493 -1620 562 1204 -1363 -1463 1191 601 -2051
3128 -2051 -1116 1910 -142 -2581 -172 2003 -1058 -2553 575 1580 -1109 -1994 1201 1121 -1859 -1213
3144 -1213 1843 21 -1903 -165 1724 -222 -1896 711 2207 -1053 -1580 1573 1708 -1572 -1086 1922
3160 1922 1237 -1510 -742 2394 570 -1568 553 1969 -314 -1426 1179 1640 -797 -1189 2025 1258
3176 1258 -1756 -220 2361 451 -1778 339 1885 141 -1771 381 1881 -1682 -1179 1726 991
3191 991 -1382 -433 1369 227 -2102 -170 2386 -433 -1790 388 1112 -938 -1856 841 1067 -1544
3207 -1544 -1599 1617 334 -2271 -587 1547 -203 -2160 212 1200 -1570 -1868 1034 855 -1515 -976
3223 -976 1985 785 -1566 -508 1898 65 -1509 542 1832 -673 -1461 974 1841 -1318 -1391 1375
3239A375j14k481O11K875j398k415J689J867k177j078K093J228l082j75K604j25
3255A297k816P91K578r48k973J830K270j962k182K623J192k786l53K351J22k733
3271a699M12K633o95k489J391J978j662j968K007J582k224j581L032O55k855j10
3287a593L016o24k851J144K375j288k155J901J926k690j000K905K61k565M8K884
3303A694n18k683N80K911j092k485J745J918j965j486J854J518k375q83K715N8
3319A506k629M40K622j190k368J919J812j720k104K353J353k361j234K648N99
3334A646k770o3K759n18k687J368J654j203j923K115J245k179j370K879M33k561
3350a175n82L065n43k567O02K726j480k236J703J777j894j223K292O37k071n64
$$ plain form
3239 1375 1261 -1220 -609 2266 868 -1547 142 2009 -168 -1246 847 2075 -1007 -1182 1422 1297
3255 1297 -1519 -728 1850 902 -2071 -241 2029 67 -2115 508 1700 -1086 -1439 912 1034 -1699
3271 -1699 -1287 1346 651 -1838 -447 1531 -131 -2099 -92 1490 -734 -2315 717 1372 -1483 -1593
3287 -1593 1423 799 -2052 -908 1467 179 -1976 -75 1851 -839 -1839 1066 1327 -1238 -1190 1694
3303 1694 1176 -1507 -927 1984 892 -1593 152 2070 105 -1381 473 1991 -384 -1267 1448 1506
3319 1506 -1123 -683 1939 749 -1619 300 2112 392 -1712 641 1994 -367 -1601 1047 1646
3334 1646 -1124 -1187 1572 1054 -1633 -265 1389 186 -1737 378 1623 -556 -1926 953 1386 -1175
3350 -1175 -1757 1308 765 -1802 -1200 1526 46 -2190 -487 1290 -604 -1827 465 1102 -969 -1533
3366a533K527J4k720P73K042q95j929J299K388j930k116K649R85j448j639K552
3382A019P91l112Q56J948q09k325J597J964j769j835K409J164k025j140K360O14
3398A707k560M1K472l58k132J51K459j283j869J658J693k441j172K249R16k818
3414a287L75K213l42k468O09K233q55k320J556K034k185j538K195J040k214p12
3430a666K607kk552K65K412n85k388J401K031j418j436J489J112k206o46K677
3446A095J26k529K60K539r63k000Q21K088j075j989J689J933k110j192K317M95
3462A505k166k81K149n1k382O15K249q64k197J711J555j903j261K116Q80k271
3478e96q46K576J78k435P87J797q17j860Q20K056j797j626K325J014k385m36K096
$$ plain form
3366 -1533 994 1008 -1712 -939 1103 208 -1721 -422 1966 36 -2080 569 1554 106 -1533 1019
3382 1019 1810 -1302 -446 1502 693 -1632 -35 1929 160 -1675 734 1898 -127 -1267 1093 1707
3398 1707 -853 -812 1660 1302 -830 -679 1780 497 -1372 286 1979 -462 -1634 615 1531 -1287
3414 -1287 -912 1301 959 -1509 -900 1333 478 -1842 -286 1748 -437 -1975 220 1260 -954 -1666
3430 -1666 941 939 -1613 -1348 1064 479 -1909 -508 1523 105 -1331 158 1270 -936 -1582 1095
3446 1095 1221 -1308 -1048 1491 528 -1472 -651 1437 362 -1627 62 1995 -115 -1307 1010 1505
3462 1505 -661 -942 1207 1156 -1226 -611 1638 774 -1423 288 1843 -60 -1321 795 1675 -596
3478 -596 -1442 1134 1312 -1123 -336 1461 644 -1216 -396 1660 -137 -1763 562 1576 -809 -1245 851
3495H51K92k624K02K629p91k305J005K074j529j525J663J259k066q81K234M44
3511I32k103J06K305p51k211Q44J993j031j987J580J764j601j592K254Q65j880
3527e13n64K177m3k264P40K040j356j792J602J752j870j348K149J406k984k97
3543a165K600O2k705M34K252m80k251J043J923j333j682J545J070j957m17K233
3559A172mj968m6K215n76k528J075K349j467j860J475J642j776j338K095N77k374
3576a337r5K295l36j966P53J992j275k032J599J974j842j599K182J124k367m96
3592a426K147L81k436K65K057l86k085J213J432j261j355J868J369k219r38K286
3608I12M80k319J06K364o83k278J184J902j515j434J534J272j682q49J820O17
$$ plain form
3495 851 1143 -1481 -1279 1350 559 -1746 -741 1333 -196 -1721 -58 1201 -865 -1746 488 932
3511 932 -1171 -1065 1240 489 -1722 -878 1115 84 -1903 -323 1441 -160 -1752 502 1367 -513
3527 -513 -1077 1100 1057 -1207 -467 1573 217 -1575 27 1779 -91 -1439 710 2116 -868 -1165
3543 -1165 1435 1497 -1208 -774 1478 998 -1253 -210 1713 380 -1302 243 1313 -644 -1061 1172
3559 1172 1168 -800 -846 1369 793 -1735 -660 1689 222 -1638 -163 1479 -297 -1635 460 1037 -1337
3576 -1337 -1432 863 527 -1439 -686 1306 31 -2001 -402 1572 -270 -1869 313 1437 -930 -1426
3592 -1426 721 1102 -1334 -1069 988 602 -1483 -270 1162 -99 -1454 414 1783 -436 -1374 912
3608 912 1392 -927 -821 1543 860 -1418 -234 1668 153 -1281 253 1525 -157 -1006 814 1431
3624A431k113q4K164k49k335Q47K152j128j990J456J319j778j037J870P40k328
3640a063q9K069j32j786J65J971p78k018J207J785j741j303J875J176k221l82
3656a265J949m7j933L05K161o50k268J006K486j936j571K092R16j633j280K408
3672G40M18k330K20J985l75j971R30J827j260j643J684J579k181j131K538M42
3688A472j965l96K182l20j909K79K011n65j924J253J743j781r44J552N60j823
3704e75k06K074j52k202L73K276q68k195R18K176j577j574J608J215k103m97J903
3721E94L02j790R9J900o57k035J147J696j431j274J294J295j717j282K418L54
3737I13k257L65J952l34j987O22J899q56j667J438J174j690q13J858O27k099k96
$$ plain form
3624 1431 -682 -766 1398 1149 -1186 -339 1813 685 -1305 151 1470 -308 -1345 525 1265 -1063
3640 -1063 -1152 917 785 -1001 -836 1135 357 -1661 -454 1331 -410 -1713 162 1338 -883 -1265
3656 -1265 684 637 -1296 -991 1170 520 -1748 -742 1744 -192 -1763 329 1245 -388 -1668 740
3672 740 1158 -1172 -952 1033 658 -1313 -383 1444 184 -1459 225 1804 -377 -1508 1030 1472
3688 1472 -493 -889 1293 973 -936 -657 1354 789 -1135 118 1861 80 -864 688 1248 -575
3704 -575 -781 1293 1141 -1061 -688 1588 720 -1475 -557 1619 42 -1532 76 1291 -812 -1309 594
3721 594 896 -894 -795 1105 448 -1587 -440 1256 -175 -1449 -155 1140 -577 -1859 559 913
3737 913 -1344 -979 973 639 -1348 -726 1173 317 -1350 88 1262 -428 -1241 617 1244 -855 -1151
3754a151K252P7k182J64K336p50k215J138K082j639j330J511R19j773n11J840
3770G68N89k208L19J728m39k070J339J420j249j450J476J106j699j104K318O56
3786A500k220l28J967j81j798P72J550j077j335J039J038j464p13J818O06k311
3802a137q6K210k99k177O02J896p53j802R39J808j470j289J740O85j917k22J945
3819F73mj791PK176q54j784J474J466j436p74J405M36j779o32J788M60j409P0
3837e08J883o90j492K73J720o40j458Q87J451j490p86J850Nk031N46J624l36j985
3855a177R28J582p74j824J264J319j578r36J503O69j712l02J804J26k193K97J966
3872I62n49j713Q48J594j398j081J329J075j899p47K137J76j914J85K135p94j728
$$ plain form
3754 -1151 1101 1178 -1004 -840 1496 746 -1469 -331 1751 112 -1218 293 1212 -561 -1072 768
3770 768 1357 -851 -532 1196 757 -1313 26 1446 197 -1253 223 1329 -370 -1474 844 1500
3786 1500 -720 -1048 919 738 -1060 -288 1262 185 -1150 -111 927 -537 -1250 568 1174 -1137
3802 -1137 -1223 987 688 -1489 -887 1009 256 -1546 -607 1201 -269 -1558 182 867 -1050 -1272 673
3819 673 669 -1122 -1115 1061 207 -1577 -103 1363 -73 -847 558 994 -785 -1417 371 831 -578 -508
3837 -508 1375 685 -807 -534 1186 546 -912 -25 1426 -64 -850 1000 1005 -1026 -480 1144 808 -1177
3855 -1177 -249 1333 559 -1265 -1 1318 -260 -1196 307 976 -736 -1038 766 892 -1301 -1004 962
3872 962 413 -1300 -452 1142 -256 -1337 -8 1067 -832 -1579 558 734 -1180 -995 1140 346 -1382
3889a382Q85J559j022j518J395J248j653p66J961K31j894K16K023m88j951O39
3905e17J923r32j979J333J623j612q13J654L69j740k1J622K3j723K89J865q68
3922D96j581J324J420j721r73J710M80j631l86J474M76j774J67J662o83j433Q90
3939h3J498j581q40J225Q25j815k75J755J33j783JJ606j95j656J99K240j335j072
3957a153R80J245j512q05J429O13j678l13J665K68k246R38J605p76j724J307J431
3974A274j427j153J398J172j682n93J905o7j613J40J650n35j546J085J317j198
3990A27j101J421Q13j324q43J679L26j751p2J714r4j788P28J434p78j592J174
4007G3J085j397q46J562M39j790J19J636k08k017P81J777r73j419R78J247j413
$$ plain form
3889 -1382 -497 1062 40 -1478 -83 1165 -488 -1254 707 938 -956 -740 1283 795 -1156 -517
3905 -517 1406 474 -1505 -172 1451 -161 -974 680 1049 -691 -712 910 933 -790 -501 1364 496
3922 496 -1085 239 1659 -62 -1035 675 1155 -476 -862 612 1088 -686 -519 1143 460 -973 -83
3939 -83 1415 -166 -1006 219 1044 -771 -1046 709 842 -941 -940 666 471 -1185 -986 1254 -81 -1153
3957 -1153 -173 1072 -440 -1245 184 797 -881 -1194 471 739 -1507 -569 1036 260 -1464 -157 1274
3974 1274 -153 -1306 92 1264 -418 -1011 894 827 -786 -646 1004 469 -1077 8 1325 127
3990 127 -974 447 1260 -64 -907 772 1098 -653 -725 989 895 -893 -165 1269 491 -1101 73
4007 73 1158 -239 -1085 477 916 -874 -755 881 673 -1344 -563 1214 241 -1178 -200 1047 -366
4024c66p82J529M22j512n76K145k71j874N04J774q15j819J255J536j346j328J689
4041A65P90j472o08J732J98j908K68J626n37j396N90J809r87j598J407J236j619
4058c04o78J763L36j819J71J479k54j750Q62J661j221j232J252J117j402r31J593
4075F43M35j479m54J947m0j846L69J683q17j560R72J323j302r78J643Q91k058
4092f28k71J678k44j280j10J775p85j433J052J392j322j307J336Q67j064n15J222
4109C63K75j649J98J377k76j540M90J755j009j347J500R17j281j232J746P47j561
4126e27k14J465R8j655M63J501r79j049Q90J277j475o37J254Q55j670m52J945
4143A090n6j758K85J348l31j173L08J666j149j025J198O55j285l96J486J0j726
$$ plain form
4024 -366 -1148 381 803 -709 -1285 860 589 -1285 -781 993 178 -1641 -386 1150 -196 -1524 165
4041 165 955 -517 -1125 607 805 -1103 -835 791 254 -1142 -552 1257 270 -1328 79 1315 -304
4058 -304 -982 781 1117 -702 -531 948 694 -1056 -194 1467 246 -986 266 1383 -19 -950 643
4075 643 1078 -401 -855 1092 1052 -794 -425 1258 441 -1119 -147 1176 -126 -1104 539 1430 -628
4092 -628 -899 779 535 -745 -855 920 135 -1298 -246 1146 -176 -1483 -147 720 -344 -859 363
4109 363 638 -1011 -813 564 288 -1252 -762 993 -16 -1363 137 1054 -227 -1459 287 1034 -527
4126 -527 -741 724 822 -833 -370 1131 152 -897 -7 1270 -205 -842 412 1267 -403 -855 1090
4143 1090 1034 -724 -439 909 578 -595 -287 1379 230 -795 403 1058 -227 -623 863 873 -853
4160h53L44J413m83j303O00J705j262j493J362J332j615j529K692M91k160j75
4176i34J606j86j551N76J484j187j173J217J213j465p25J421O59j498o97J860
4192F20j64j232J84J512m36j842J075J434j212j092J576R52j834m24J581j0j451
4209g63O6J935n38j653Q14J372j047j257J349Q65j285p25J571M91j657j26J846
4226A258o68j471Q86J305r06j339R58J149j377r41J542O56j552l02J512l73j056
4243g19JJ617r92r47R30R61j257j036J648N94j263p30J714K00k004N03J633n59
4261B94j597Q90J493j337j181J603O73j266o13J567R5j455J63J579o97j117M86
4278d20J471q20j397J269J353j225r01J405M96k061M24J634m97j630J095J046
$$ plain form
4160 -853 -509 904 421 -882 -282 1423 161 -1332 30 1362 -253 -1782 910 1401 -759 -934
4176 -934 672 486 -1065 -489 995 -192 -1365 -148 1065 -400 -1125 296 955 -543 -1240 620
4192 620 456 -776 -592 920 484 -1358 -283 1151 -61 -1153 423 1375 -459 -883 698 688 -763
4209 -763 -697 1238 700 -953 -139 1233 186 -1071 278 1143 -142 -867 704 1195 -462 -588 1258
4226 1258 590 -881 5 1310 404 -935 23 1172 -205 -1146 396 1052 -500 -802 710 337 -719
4243 -719 -718 899 -93 -1040 -110 851 -406 -1442 206 800 -463 -1193 521 721 -1283 -780 853 294
4261 294 -1303 -413 1080 -257 -1438 165 838 -428 -1041 526 621 -834 -671 908 211 -906 -420
4278 -420 1051 231 -1166 103 1456 231 -670 735 1231 -830 -406 1228 731 -899 196 1242
4294A242Lj728L96J356j165j265J665N81j685pJ456L8j723M71J582j033j270R31
4312a55J260j006j013Q58J213j387p04J383K76j568L8J684o62j189N53J067n11
4329A37j657J707R63j821n49J824q4j246m44J698J50j763L76J464n70j035N51
4346b99J391j582o69J799o9j288j7J680k84j724N00J697q29j221N74J516q36j063
4364g24J218N60j333k55J172J75j424K91J199l28j405P39J382j146j014J170J011
4381A288j500m55J099O94j717M4J170j88j132L55J254q96j078J093Q19j394o28
4398a172J624K42j493p6J514J47j900N51J412p28j194R38J091j438o87J201N18
4415E50j160m23J644j92j439M89J280l80j431R79J100j254r25J365P88j273o12
$$ plain form
4294 1242 1245 -483 -87 1269 104 -1161 504 1085 -600 -607 849 887 -836 -365 1217 184 -1086 -155
4312 -155 1105 99 -914 -56 1157 -230 -934 449 725 -843 -805 879 217 -972 -419 648 137
4329 137 -1520 187 1150 -671 -1220 604 520 -726 -1170 528 678 -1085 -709 755 185 -850 -299
4346 -299 1092 -490 -1159 640 571 -717 -734 946 662 -1062 -562 1135 306 -915 -341 1175 339 -724
4364 -724 494 1054 -279 -534 638 813 -611 -320 879 551 -854 -115 1267 121 -893 277 1288
4381 1288 -212 -667 432 1126 -591 -547 623 435 -697 -342 912 16 -1062 31 850 -544 -1172
4398 -1172 452 694 -799 -875 639 786 -1114 -563 849 121 -1073 -135 956 -482 -1169 32 550
4415 550 -610 -1033 611 419 -1020 -531 749 369 -1062 -83 1017 -237 -1162 203 991 -282 -894
4432h94J415N45j532M7J403n08j357O72J160p56j252J365J053j390o28J327N07
4449A177j741j5J607m84j271L86J350q22j038Q36R98j217m68J044L64j185l46
4466h25J485O7j832O17J284n19j072N66J143j283p99J390R06j730l57J592k7j634
4484a028PJ786k87j569P59J198r69j066J042Q85j224p35J824J5j425J67J255k85
4502C50j200N28J434q56j113O47J340j179n68R05P57j347l25J426k08j327L11
4519d25J511p95j037Q90J113j265j073J681N48j801j55J231M92j435r2J359l87
4536C60j383J038J107j133j059J249P96j577j97J288L12j356k28J408q0j836O82
4553f09J590j012r60O91R29q33q25J432L6j139j42J474k80j359N93J091n66j247
$$ plain form
4432 -894 521 1066 -466 -419 984 476 -881 -209 951 195 -1057 308 1361 -29 -657 670 1177
4449 1177 -564 -579 1028 544 -727 -341 1009 187 -851 -15 983 -234 -702 342 706 -479 -825
4466 -825 660 727 -1105 -488 796 277 -795 -229 914 -369 -1168 222 1128 -602 -959 633 606 -1028
4484 -1028 -1021 765 478 -1091 -332 866 -103 -1169 -127 758 -466 -1201 623 638 -787 -620 635 350
4502 350 -850 -322 1112 256 -857 -210 1130 -49 -617 288 1045 -302 -627 799 591 -736 -425
4519 -425 1086 291 -746 144 1257 -8 -1081 600 1148 -653 -808 423 915 -520 -612 747 360
4536 360 -1023 15 1122 -11 -1070 179 975 -602 -799 489 801 -555 -783 625 545 -1291 -609
4553 -609 981 -31 -991 -300 629 -204 -1029 403 439 -700 -842 632 352 -1007 -414 677 111 -1136
4571a136J065J262j533p31J353M51j381n6J097N34j349L22Q88n24q69N49Q87q59
4589c0o35J030Q46j413m04J334L99j686M4J538n85j121N16J251q09r03P06Q47
4607I25j210l44J171K48j250k65J584j66j655O21J218p30j117P78J199j356o94
4624a043J561K61j288j70J119j88r09K52J248n83j479J000J107j166p84J220O01
4641G59j240o60J498K77j429J55J259k65j409R46Q08p84o51N78J128j029m75J081
4659E47K11j422M11J237m75j247N48J102o13r40P37J077j168o10J007P37j701
4676e62P8J036J81j291K06J318o50j238P00J008j204o07J258K72r35k52J351k08
4694D61j174K89R44m56j104R48R22q71q80O63P70j053k98J313l2j340L90J068
$$ plain form
4571 -1136 -71 1191 -342 -1073 280 731 -650 -706 391 925 -424 -102 786 262 -607 -58 829 -30
4589 -30 -665 365 1211 -202 -606 728 1127 -559 -515 1023 438 -683 -167 1084 275 -628 78 925
4607 925 -285 -629 542 790 -460 -725 859 693 -962 -341 877 147 -970 -192 1007 -349 -1043
4624 -1043 518 779 -509 -679 440 252 -657 -405 843 260 -1219 -219 888 -278 -1062 158 759
4641 759 -481 -1141 357 634 -795 -640 619 354 -1055 -109 699 -85 -736 -158 970 -59 -534 547
4659 547 758 -664 -253 984 509 -738 -190 912 299 -641 96 1173 5 -605 402 1139 -562
4676 -562 -484 552 733 -558 -352 966 316 -922 -222 786 -418 -1025 233 505 -430 -682 669 461
4694 461 -713 -424 520 64 -1040 -92 830 -41 -921 -258 512 -541 -839 474 442 -898 -508 560
4712E60k70j349M40J517q27j184Q33J000j171n33J270J82r61j11J258l46j113
4729h05M72J308r06p50P70O86q09n11Q37N80j080o87J722k62r96J07J263o27r42
4748f30P23R34o46r05R50M15j122k76J209L3j301K49J177o88j094O28J105n46
4766B15r81Q34J058j315o45J018O30j361K3J060j43j054K90J043n60r67J022N46
4784G13j210j71Q09N70j191m42J615k77j139P6J292n98p97N06P80m79r24J300
4802D33L30j313L6J391k19j277K47J422l79j314O73J083r21r51R82N41r69l80
4820e85J102K44q08k26J121l42j035L88J157q53p45Q95L88q01l44Q06O13j253
4838b78k95J222j71j291M29R95p36n17M92J108j086q56J227M49j286r6J189m37
$$ plain form
4712 560 290 -1059 -619 898 71 -1113 -280 720 -451 -984 286 468 -493 -604 654 308 -805
4729 -805 -333 975 69 -681 89 775 -34 -545 292 872 -208 -895 827 565 -431 -324 939 312 -630
4748 -630 93 1027 381 -524 426 841 -281 -557 652 685 -616 -367 810 122 -972 -344 761 215
4766 215 -766 68 1126 -189 -834 184 814 -547 -524 536 393 -661 -371 672 112 -855 167 713
4784 713 -497 -668 141 711 -480 -922 693 416 -723 -647 645 47 -750 -244 536 57 -867 433
4802 433 763 -550 -514 877 658 -619 -372 1050 671 -643 30 1113 192 -759 223 764 -205 -585
4820 -585 517 761 -47 -273 848 506 -529 -141 1016 163 -582 313 701 -100 -444 362 975 -278
4838 -278 -573 649 478 -813 -384 611 -125 -642 -150 958 -128 -984 243 692 -594 -690 499 62
4856F2r38M35J022n04j125P81P98o16j141J376M95r99m61J323Pj073JJ158j64
4875D37j232P18J047j055o91J045L72p97m13J191L68j548P7J498o27r57K72J195
4893I00n92j032O94J083j074l69J072J35j112k37J289k82j062L82J156o35j152
4910h36O84R92q32p70R20O57j265k29R93J55j286M58Q92k38j211O42Q24n74q22
4929h46R92M47j247q1J159K41j278j21J489k68j478N15J015l05r84N64P25p66
4947b27m83R97O5p40o9J064O0j399K52J189m05j153P93Q90q09m66P07N02j067
4966b99r6R56J12j179L23R52n14r16R32P84q91j002J030O55j271N2J083J80j335
4985d44k62J329j71r08Q6J179j012m79Q13M79j105j22R50Pj087O0J298l88j081
$$ plain form
4856 62 -876 -441 581 77 -1048 -267 531 -85 -1226 150 645 -354 -815 508 515 -558 -557 601 437
4875 437 -795 -77 970 -85 -776 269 641 -156 -569 622 990 -558 -481 1017 390 -567 -295 900
4893 900 308 -724 -30 1053 -21 -390 682 817 -295 -532 757 475 -587 -205 951 316 -836
4910 -836 -152 840 8 -762 158 815 -450 -679 314 469 -817 -359 533 295 -916 -274 550 -24 -846
4929 -846 146 593 -654 -735 424 665 -613 -734 755 487 -991 -476 539 234 -750 -186 539 -227
4947 -227 -710 287 352 -388 -457 607 667 -732 -480 709 304 -849 -56 834 25 -441 266 768 -299
4966 -299 -395 561 673 -506 -183 769 255 -661 271 1055 164 -838 192 847 -424 -372 711 891 -444
4985 -444 -706 623 452 -456 -370 809 -203 -682 131 610 -495 -617 333 340 -747 -687 611 223 -858
5004h58M60J153o12j066R48N96q01n78R62K61r71j51R44J3j081L85J135n34r74
5023g69P80N98p45o63Q91Q70r80p74J183Q4r95K70R45k12j071K86J017n58q93
5042g36J081L79r04n58J230L41j107J3R22l54q28K55J034n68q54P97O56j114k37
5061e52R81K01o99l87R59K51j550K52J391p69r86O97Q80o60q69J015P24j625J04
5080f42J061k04o31J4R07l12r78R32K74k63j138J188L54j086j48R26J49r52J2
5099e37R54kj101M17J056m99r94J059L80q77k28R50Lj029r4J186j46r13M05P78
5119G68k79r07N60O38p85n74J066N02j380J9R11J2o20l03P40J59j090M21Q61q91
5139a72m52Q79M07j183q6R98J76j167L1J077j68j148N92P09n10o10L33O49o12
$$ plain form
5004 -858 -398 755 143 -923 25 621 -180 -758 204 465 -506 -657 287 300 -781 -396 739 205 -769
5023 -769 11 609 -136 -799 92 962 -18 -792 391 475 -520 -250 695 483 -588 -302 715 157 -736
5042 -736 345 724 -180 -738 492 833 -274 -261 661 307 -521 -266 768 200 -654 143 799 -315 -552
5061 -552 429 630 -69 -456 503 754 -796 -544 847 78 -908 -211 669 9 -860 155 879 -746 -642
5080 -642 419 215 -416 -402 505 193 -785 147 421 158 -980 208 562 -524 -672 254 403 -549 -537
5099 -537 417 415 -686 -269 787 288 -706 353 733 -144 -372 578 581 -448 -542 644 498 -415 -10 768
5119 768 489 -418 142 780 -5 -579 487 989 -391 -372 539 551 -69 -372 368 527 -563 -142 719 -172
5139 -172 -624 255 662 -521 -607 391 567 -600 -569 508 340 -808 -216 493 -17 -627 -294 355 -257
5158b57m58Q32K00q17R0R35j81j207M52R36m75q29P73P44j026l32Q96J58r49O6
5178d49P66K25r93J66R78o05o33M14Q07q38k87P83J77q02P3O91O7r13K27P85l71
5199B68o98M79P24p67m33N65O89p79m84P76L24r91k15J197m51p47L85R58p56r40
5219h96Q89Q20p12o70Q28J84o64k86R94k19q68Q0R18l48p44N38P30q19m55P31
5239C1M87q14k25Q31K71j311L33J049p7q93j26R04p45n32R78M29q01j85Q35L24
5259G63j284K03J003m04r87P07P97o53n60N19Q61r66n18R32J89q56JR41k12q56
5279c80J2J199p33o17M58P64p69n03O79L60q92P1Q62m7r98L42P05l78j051O23
5299b93O36k71p51P95M31p28m94P60M67j440M12J103n07q72N60P70p28n41M12
$$ plain form
5158 -257 -715 117 317 -500 -410 525 344 -863 -411 525 50 -779 -6 738 -288 -620 276 434 -515 -449
5178 -449 317 542 -451 -285 693 88 -545 -131 676 -162 -449 334 511 -291 -218 473 540 -373 -146 639 268
5199 268 -430 49 773 6 -427 138 827 48 -436 340 664 -327 -542 655 204 -543 -158 800 44 -896
5219 -896 -7 813 101 -569 259 443 -221 -507 487 268 -600 -520 398 50 -694 -156 574 -245 -700 31
5239 31 518 -296 -521 310 581 -730 -397 652 575 -318 -444 460 -285 -817 161 590 -211 -396 439 763
5259 763 -521 -318 685 281 -706 1 798 145 -415 104 965 -1 -519 413 602 -254 -253 688 476 -380
5279 -380 -368 831 98 -519 -61 703 -66 -569 110 470 -422 -351 511 464 -534 -192 513 135 -916 -293
5299 -293 343 72 -679 116 547 -181 -675 85 552 -888 -476 627 120 -752 -192 578 -150 -691 -279
5318b79M67m57j86O78L99q84k07Q07j27n92Q3J089o98n28N80P98j091l67J129
5337F14m1r69k4R51J1j081J91J075n39p12N85O96o92n83P76N95j364K42R78m93
5357B16o83K7J133n38n55L49O33n51o43N04O06n31n16O73K23j120J49R47nr82
5377f64K60R18o05o18R75j22l50l36R75j38n66m84J202j76q31O5J042l16o96M84
5397A9L95o01k52R09k43m84l47J095j24q35K91Q99n52o97M21O70m30o76Q11K77
5417E46n53n25R98K70j001J64N46P0r55M84Q02o61p45O43P17o95m21P45L2o55
5437a94K0P01m31o41R2J266p45o50M69N26n11m40Q12Q2m79n19R37N1r63J49Q79
5458D11l42q71N89O78n08o32O96M57n34n91P70M81j252M20M67m5o23K93N22j80
$$ plain form
5318 -279 188 -269 -455 223 622 -262 -469 338 211 -381 -298 791 93 -435 145 943 -148 -515 614
5337 614 573 -396 -420 531 542 -539 -348 727 188 -524 61 757 65 -518 258 853 -511 -269 709 216
5357 216 -467 -440 693 155 -400 -51 582 31 -612 -108 498 -33 -549 124 347 -773 -624 323 318 -664
5377 -664 -404 514 -91 -709 266 144 -206 -542 433 295 -271 -755 447 271 -560 -495 547 231 -465 19
5397 19 414 -187 -439 470 227 -257 -604 491 367 -468 -177 722 170 -527 -106 564 134 -542 269 546
5417 546 -7 -532 466 736 -265 -101 445 515 -440 44 846 185 -560 83 800 105 -316 429 461 -194
5437 -194 -174 527 96 -545 -453 813 68 -582 -113 413 -98 -538 274 356 -123 -642 295 346 -617 -468 411
5458 411 69 -802 -213 465 -43 -675 21 478 -56 -647 123 604 -648 -228 239 194 -429 -136 386 206
5478B06p88P53O19j168j42P76K05o24k63R30j17o95K24O26l75p10N63N63p86l70
5498e73P90M36q16k37Q29M7p11L3N53Lr81P32M07n16o38M52O70r20j37J086J42
5519F51j159R60N35q65j085K92J587j077j016J449L13o20n83N57M64o86m34O61
5537e6N29j403Q09N22o42p20P53Q09k81p46O71N7n37j87O06K18j077K32J529n76
5557E10j762J641k96j38j6p7J599j509m08R32L90j144J58J004m24j031R26J40
5575D95j36r20O23Q65j155j49N86j37j05k19O29J22p95K11P62n78q72P18P47l00
5595C92o28k50J050j042L4Q98rq46K33O48k62p36M9P82r0r10P18kl9j6P75n77
5617A72n40N7P31n3j539N60J066k01o42M10N37p46o14J072K31m45k96O29K67j195
$$ plain form
5478 206 -582 171 790 -378 -520 256 461 -163 -426 504 387 -308 -84 542 167 -543 20 583 -203 -573
5498 -573 217 653 -163 -400 429 476 -235 -202 351 354 -627 105 512 -4 -642 -190 480 -440 -577 509 651
5519 651 -508 452 987 122 -963 -671 916 -161 -1177 272 585 -35 -618 -61 403 -283 -717 -56
5537 -56 473 -930 -121 401 -241 -961 -208 601 320 -426 245 302 -235 -422 184 402 -675 -443 1086 510
5557 510 -1252 389 93 -45 -61 -138 1461 -48 -456 476 866 -278 -120 884 460 -571 355 495
5575 495 359 -561 62 927 -228 -377 209 72 -33 -252 377 499 -296 -85 677 99 -773 -55 692 392
5595 392 -236 -486 564 -478 -444 454 445 -401 -168 480 218 -518 -469 313 223 -687 31 29 -10 -26 749 172
5617 172 -368 -311 420 367 -1172 -612 454 253 -389 21 558 -188 -802 270 501 56 -240 389 656 -539
5637e39L76R25p35j18j87J102r09m8N99m0q72L43Q39O3j455N83Q77n95r12O66
5657c7N27k94l27K94L13q63j12Q94jo67K79K97k92p34L87O58m95n04O19N05p11
5678b64l08P83k7p72J31P85l44m46M70N39p68k50N54K81q11j72O99L43r53L59
5698a71O05k60p14N50O17l96n29L41N39m18q14O96M92o88l53J005p3p64M01N73
5718F39m77n34M17Q13o47p62Q26L0n20j64Q37mr87M51M76q0p99M22N93l17o94
5739d81O50K21p30k49Q38j5m80k26J088l31q48J58J096o71o18N51L56m99j32N35
5759B13j33l18pO02m87m63Q6J248m41r70Q52J94p00K20L37L98p28n38O81M34q50
5780c70k99J319o01k34M71K38p31K67M32j41l23j88L94O47j668k09Q16K48q48
$$ plain form
5637 -539 -163 762 27 -91 -278 824 -85 -133 466 426 -446 -103 736 799 -656 -73 804 209 -703 -37
5657 -37 490 196 -131 163 476 -387 -499 395 394 -273 6 303 11 -723 -336 322 -173 -677 -58 447 -264
5678 -264 -572 211 184 -588 -457 328 -16 -462 8 547 -221 -471 83 364 -447 -619 80 423 -530 -171
5698 -171 434 174 -540 10 627 231 -298 43 582 164 -650 46 538 -150 -503 502 429 -335 66 639
5718 639 162 -372 45 858 211 -551 275 305 -215 -379 458 454 -533 -82 394 314 -485 -63 530 213 -481
5739 -481 169 390 -340 -589 249 234 -246 -472 616 285 -563 -405 691 20 -598 -47 309 -190 -322 213
5759 213 80 -238 -245 357 -130 -593 -507 741 300 -670 182 376 -324 -104 233 631 -97 -635 46 480 -370
5780 -370 -669 650 49 -185 286 524 -207 60 492 351 28 -160 234 881 -787 -996 -180 68 -780
5799g80O37M81P4J31o37K51q83N37J17J78k38m61Q09Q4p11L48O58k83r29M44O45
5820D72n82n53Q18L71p49l47P68J24p54L03M36k24p12N20N65p47o3J19M12m21
5840b44j18N09J45q39j2P90j01o97K89P65o40o22P86L66m57o2M45J47p45J23P16
5861E44j08r24L35O21k04n33J44O17n27n03Q63J53n40l02P31R0p87l8J068m95
5881B05m99K38M78n33j77L95L70p04j07O02n7o05J61O83m04o16L73K51k34l10
5901d90L68N40n43m10N85K40p59j56Q88l30o98P56N06l94n40N84J63j98m12N52
5921B52R3n80l02P21R3m63j04N65k53j07K48J16n08k21P40j56m50K61M69j21o75
5942c82K25N51j29n78K53N91k40p31N74N12n95k03M25J94p85J27P19l52m60J08
$$ plain form
5799 -780 -143 338 412 543 -94 157 -726 -189 -72 106 -132 -593 216 300 -411 -63 595 312 -617 -173 472
5820 472 -110 -663 155 526 -223 -570 198 322 -432 -129 307 83 -629 -109 456 -291 -354 -235 177 -244
5840 -244 -362 147 292 -547 -559 231 130 -567 -278 487 -153 -775 11 377 -80 -142 303 450 -295 -172 544
5861 544 436 -488 -153 468 264 -269 -125 492 -35 -538 325 478 -62 -364 367 457 -330 -368 700 205
5881 205 -294 -56 422 -111 -288 107 477 -227 -334 268 211 -394 -233 450 46 -570 -197 54 -180 -490
5901 -490 -122 418 -125 -535 50 290 -469 -625 263 -67 -765 -9 497 103 -437 147 310 112 -300 252
5921 252 345 -235 -537 184 277 -186 -290 275 22 -85 163 279 -229 -450 290 134 -316 -55 414 293 -382
5942 -382 -157 394 265 -313 -60 531 291 -440 134 646 51 -152 273 467 -318 -191 528 176 -284 -176
5962a76N73m68j66M23N33p70k25J90M69o77k72P01K41p55J49K99j99j49q4O75
5982C12m92l06M71L61n13m88R48k9p04J82L01q1k29J81L63k72n47R61q0n30j87
6003c78O86j57l84p9Q18n73l53M48K45j20n93N39M21o09r7N04q1m35P2P94l53
6024C15n25M7O12j28o22M39K91m28l03N50L63q44j25Q56j12n35m0M97j09q37O28
6045a0L80n76k37N89K67o75N9N64n1m87n8L68O6n96J60O27m35l63N03J20n31m36
6067g52P39M6m49J29O44O4p72Q7N13j03n95M67K03k22l30N16K02o95J15P02k54
6088B55o30J20N98l86K4R6K91l67j52K90K39n84J7P29l43o46M73M47j50p25M47
6109D3M99m87m31M95N9m53l0N46J82o60K7O62r9p00L01K99l81j24J34O06r04k4
$$ plain form
5962 -176 397 -71 -237 186 719 -51 -276 -86 383 -294 -566 135 376 -379 -230 69 -130 -279 -363 312
5982 312 -180 -486 -15 346 -167 -655 293 264 -440 -258 43 -38 -267 -86 277 5 -542 419 339 -191 -378
6003 -378 308 151 -233 -312 506 -67 -420 28 273 153 -440 99 520 -89 -186 318 237 -198 -126 668 315
6024 315 -210 -163 449 321 -301 138 429 1 -302 248 611 -233 -358 498 386 -149 -189 308 199 -638 -10
6045 -10 370 -206 -443 146 413 -262 -203 361 310 -177 -235 133 199 -397 -237 390 -45 -408 95 215 -316 -752
6067 -752 -13 33 -416 -287 357 421 -351 -264 249 146 -449 18 221 -1 -331 185 387 -308 -193 509 255
6088 255 -375 -255 343 -43 -19 77 368 1 -151 139 378 -206 -189 540 197 -449 24 471 321 -404 43
6109 43 542 55 -376 119 178 -275 -305 241 423 -237 -210 452 353 -347 -46 253 -128 -252 -118 488 -416 -440
6131d40P60r8l97k69N85K64o92J01P74m94m53L59J67m52m8L06L90q14O1O33n1
6152A92m24J60N30n74k24K80M70n77l67O83K32l81k79O11po09K00M65N2q66L77
6173e6O24n99k29L25N17o43lL33L50p68q4N89Pp60k5P24k00m62J83N07o23k13
6195e06R20J01p70l5L58q7n18J33Q63n22m68M26N28o53m90O85L90p35rP41j74
6216A78n02J09M88j11o44O4Q74m79m03M18N31p29N4K51L62p52M3P53l98m76J74
6237a95P17l15n59L14N56m39l97P20O8q98L98K55q1l48R7O12k80r39L94P70p66
6258c16L1N18L5o15K49M03j54l42j3M12j10m97L40M49m60n66O27R5l60l09Q32
6279B49O2p97o8Q97k63j93j32N92l52m37M77K57l73j46J81K05m29O1M87j98m86
$$ plain form
6131 -440 320 222 -175 -444 141 405 -287 -186 588 94 -359 0 167 -285 -333 -27 363 -451 -390 243 192
6152 192 -232 -72 458 -116 -340 -60 410 -167 -534 149 381 0 -279 332 325 -284 -84 381 433 -433 -56
6173 -56 568 -31 -260 65 582 -61 -64 269 619 -149 -233 356 363 -397 -422 302 102 -360 -177 330 -293 -506
6195 -506 414 515 -255 -290 68 -19 -537 -404 459 -63 -531 -105 423 -230 -720 -35 355 -380 -389 352 178
6216 178 -324 -215 273 162 -482 -418 456 -23 -426 -8 523 -206 -152 99 461 -291 -248 505 107 -369 -195
6237 -195 522 207 -352 -38 518 79 -318 402 470 -428 -30 225 144 -204 -107 505 225 -714 -320 450 -316
6258 -316 -285 233 268 -347 -98 305 151 -191 -204 208 98 -399 -59 390 -70 -636 -9 86 -274 -583 249
6279 249 311 -486 -554 343 80 -113 -245 347 -5 -442 35 292 -81 -227 -46 159 -270 -209 278 80 -406
6300d06K73N10n25lL5N77m32m72O50J62o27q1N16P3l39j05O31n3r15M96L47k16
6322I6m34M48L07n96j25M76J40m05k14P28j69o87M37J09k57j16M53J48m99k62
6342d22O05m0m59K07M55k99k37k09O82j17l78J36K44j50j96K60L27r85L4P83j85
6363E6k80m3M89q5m54J00P17o49k99N70J65m42j78L30M17o92K6M50p3l05q8O31
6385C63l63k31J75M44o08J60L19n4l44M1K40J9m14K03L57j96l20J35L75l15k54
6406b68M65L15n58k07M04o0k94M02K58l65n50M02K63k47l67M19K21l93j24M80
6426A96j15l44qN10k70o62O25L76j50p33O48M65n06l33M36K00o86J07L94j15l88
6447c53J75N75j99o50M53K50m81l09M00L72n54J55N21l7l57QM90l13m88M15M73
$$ plain form
6300 -406 -133 377 -148 -151 -116 461 29 -443 207 369 -258 -339 177 250 -89 -194 437 384 -531 -35 312 96
6322 96 -338 110 417 -179 -304 172 312 -93 -307 421 252 -435 2 111 -146 -262 191 339 -160 -422
6342 -422 183 143 -316 -109 346 47 -190 -399 283 166 -212 -76 168 18 -178 82 409 -576 -542 241 56
6363 56 -224 -267 222 137 -317 -217 500 -149 -448 122 287 -155 -333 -3 414 -278 -252 198 125 -180 -268 363
6385 363 0 -231 -56 388 -220 -60 259 205 -139 -98 142 161 -253 -50 307 111 -209 -74 301 -14 -268
6406 -268 197 512 -46 -253 151 91 -203 199 457 92 -458 -56 207 -40 -407 12 233 -160 -284 196
6426 196 81 -263 -271 239 -31 -693 -68 308 158 -575 73 538 32 -301 135 335 -351 -244 150 35 -353
6447 -353 -178 397 198 -452 1 251 -230 -539 -139 233 -321 -166 355 318 -39 -31 459 146 -342 73 546
6468E46o07k60M95M45p78j40O91j50l79J67J99J19m56K19L75n26j97J76M71m51
6488d1m39N43M67r12J84M40j25l56L23K85m06j58J08R6k31j91L87J17m22L48O6
6509H3j00m51K52M26k67l12J67N55n70l26M81L72m10j77N09K3p64L44L89n6p59
6530e91M22N32p24J37L65Rp3j34L41j13p23Q79p0R9o03m16N88R9k35l24P98q16
6552e53Q63j12k91J61K76l94l61P9k76J043n19l78O30P1j29k71Q36p04j89JO83
6573D66l26j216R69L42j55j65M32j6q19j17M20L23k80j23N20q0o3n33O22m22O1
6594a60M47L7q76J29P67L99j061j01P72k66q5J05j09K03m29J36M77p24p74R77
6614a36R35o21l3j60M85o30N12q7j92j80Q1N19L2q78P82P1p28k53K36J092j224
$$ plain form
6468 546 -61 -321 174 619 -159 -299 392 242 -137 30 229 348 -108 111 486 -40 -237 -61 410 -41
6488 -41 -480 63 530 -382 -198 242 117 -239 84 369 -37 -195 -87 9 -222 -413 -26 91 -331 17 83
6509 83 -17 -468 -216 210 -57 -369 -202 353 -217 -543 -62 310 -100 -277 232 255 -509 -165 224 168 -591
6530 -591 -169 363 -361 -224 141 150 77 -57 284 171 -552 327 257 356 -247 -663 -75 24 -211 -535 263 -553
6552 -553 310 198 -93 68 344 -50 -411 -332 -608 435 -84 -462 168 239 110 -161 675 -29 -218 -217 466
6573 466 140 -1076 -107 235 80 -85 347 331 -488 -605 -185 138 -142 -265 255 175 112 -421 201 -221 -160
6594 -160 287 324 -552 -423 344 743 -318 -419 353 87 2 107 -2 201 -228 -92 385 -339 -1113 -136
6614 -136 799 178 145 -15 470 -160 352 265 73 -107 -26 493 525 -353 429 500 -228 -481 -245 847 -377
6635c77P1N59J90n23p9J41Mj54j99M33J70n20N87l00n38M82R7J306j942K73J024
6656G05j118J184j424M74K63m9oOn63O10k89J87j07J62K47l93r9k54R46n25k29
6677b72M00nj81k33N06K8l96L5K89Q0n15K65M41j76j61k5O2R6l58O6M76m95n5
6700a28K71L43o50j03L73L09o91L33M0l86J43L23j5m06p5M39L40o72j23N24j05
6721H4j94mL75j26k19J47J1n8l75N06j44n9k37M93k04m09L71J81j85n5L23j02
6743A20k56n1K82JL2k78M10k52l05J44K97N9l53J65L47n32k32M33L64m06oL24
6765C07j99l01o3J88R8l11K43M47p8l65J05K31k39o53N89M32o15R7J55J24l50
6786a58J29M50l43l24L45jk69p0M36J47m61l6M86j64l94N8N78m20n13M28L06k19
$$ plain form
6635 -377 -306 253 443 -80 -159 -18 -14 -168 -367 66 236 -284 303 3 -535 -53 44 1350 -592 -319 705
6656 705 -413 771 -653 -179 84 35 29 35 -528 82 -207 -20 -127 35 282 -111 -210 -464 482 -43 -272
6677 -272 128 123 -58 -291 215 243 -153 -118 171 251 -264 1 442 266 105 80 142 238 -120 -54 422 -73 -128
6700 -128 143 486 -164 -267 106 415 -276 57 97 -289 -146 177 162 -244 -319 120 460 -212 -335 189 84
6721 84 -110 -114 261 135 -84 63 74 16 -359 147 3 -56 -293 200 -4 -413 -42 139 -46 -101 222 120
6743 120 -136 -187 95 96 128 -150 260 8 -297 -153 144 203 -150 15 362 -170 -402 31 395 -11 -17 307
6765 307 108 -193 -256 -68 30 -281 -38 409 331 -34 71 302 63 -590 -1 431 -184 -87 68 192 -158
6786 -158 -29 421 78 -246 99 98 -171 -241 195 342 -119 -155 331 167 -227 -169 409 -11 -524 -96 210 -9
6808il65M75m8l29K64m0K55l33j33N97m74k12K22J35R5l08J88K92m54R6K74r9
6830H9m75J5P30j69m12L33J76k82k54N9O17m84j34J14K99k93k44O91k00k85k3
6851a32O28k79n86N32J24m98J25K09K73o24nM33K3o14J3N89K68n03k35L15M04
6872D60p11J5O25n33j87M75M4n35J63N00k11k84jM53l36k33L80J47n71J08L0M55
6894B53m75k34N97M3o52J20N99n27p9L81L75n05J72j33K94k95k16M11Q6j82j38
6915a05O28m18m92J83P01m47k14L08Q5k95m7N40k09k47j11M00j87k64J88L17j84
6936A30l62L45K09n00k31N55J95p38L56N10l16m80K41K24k94j36L90nj26q6K54
6957A35p3l37j2P6J76m00L7P57l46j58q8N95k53o45M78L54k82l06J13L43n11J73
$$ plain form
6808 -9 -374 101 53 -276 -12 -52 203 -130 -263 334 -140 -352 -130 5 100 -208 -20 272 -182 -86 188 89
6830 89 -386 -371 359 190 -222 111 287 5 -249 -190 427 -57 -191 -77 222 -71 -315 376 176 -109 -132
6851 -132 496 217 -369 163 287 -211 -86 123 396 -228 -233 200 223 -391 -378 211 479 -24 -259 56 460
6872 460 -251 -236 389 -144 -331 144 188 -347 -184 316 105 -179 -180 273 -63 -296 84 231 -340 -232 -202 253
6894 253 -222 -456 141 184 -468 -348 251 -276 -355 26 401 -104 68 -65 229 -66 -282 129 215 33 -105
6915 -105 523 105 -387 -204 497 50 -164 144 229 -66 -113 427 218 -29 -140 260 73 -191 -3 314 130
6936 130 -232 113 322 -178 -409 146 341 -397 -41 469 153 -327 -86 138 -156 -292 98 93 -33 -119 135
6957 135 62 -275 -287 -211 -35 -435 -398 359 13 -145 -233 362 109 -536 -58 296 14 -292 -179 164 -347 -174
6979a74N39l46l73K79L95l14j61J59P0k28J7L49J0m00O8K10K76n37J83K33k20
7000C5j14k7L53m97n3O94j55k54k04O17k71l89J58M36m18l43M19L79k68l28M93
7021B63J09m69k86Q08m07l39L53K48l87k12L6O39m59p2J10K36l46k0J49K62m58
7042b42J69L14j91l77J67M55k37j78N7M08n23J33Q8J85n81O2M73n9j45j83M06
7063B01N0n03K04M12l84k89N01K68n33j95N53j24l79k3N54l56k76K26K88j99l61
7084c65N26J67l69j69M62o6l71J43M62J9n49N4L26m37r1L11M04n09m4K00J78l82
7106a00l2M55k34j81J36L1j11k45L73M0k80l41O37J53o02m0M02R1m31Q5K99O0
7128A65k48J43o5j98j16L29K53l31LR0J59j74m8M35k48l50L0M98k19m84L16K34
$$ plain form
6979 -174 365 19 -354 -75 320 6 -155 4 74 -154 -137 212 222 -178 -110 100 376 -161 22 255 35
7000 35 -79 -106 247 -250 -303 391 236 -18 -222 395 124 -265 -107 329 -89 -432 -13 366 98 -230 263
7021 263 372 -97 -383 425 18 -321 32 280 -107 -319 -283 356 -103 -175 -65 171 -175 -195 -46 216 -242
7042 -242 -73 241 50 -327 -160 295 58 -120 -63 345 -178 -45 43 228 -353 -291 182 123 -22 -205 201
7063 201 251 -252 -48 364 -20 -309 192 460 -73 -268 285 161 -218 -241 313 -43 -319 -93 195 -4 -365
7084 -365 161 328 -41 -210 252 186 -185 -42 420 439 -110 -56 270 -167 -258 53 457 -52 -96 104 282 -100
7106 -100 -132 323 89 -92 44 75 -36 -281 92 132 -148 -489 148 301 -301 -341 61 152 -279 -194 105 165
7128 165 -83 60 -5 -203 -319 10 263 -68 -65 25 184 10 -38 397 149 -201 -171 327 108 -376 -60 174
7150A74j83p1J52L71n51K5K92o7n05J30L53q1m02M41K13j74m38N56%l07j25M81
7172B84k32l30J86M15k77j41q7J72m6l29O17j09l16k49K22K81l59J21L22k24l01
7193c80L34K48%l15J41K25j80k57N27k10n40J97J56Mj19K03L82l94k55L40J54
7214B61n73n8L63K86m72K14J41J06p79L22N39m39p0J0L42k25lK24K04m35j88K49
7236A9j7j37r0M19k75j58N37j72j32J33p6L6j01Q3K16m61j73R2N75k54n23L23
7258a36L76m58k79M79R7j17j27K43J31m03N8J69j06J09j15M88m56j64J41q3p5
7279b28K51J05j11Jl07N57j25j45j60M95j48m07J25L26Q1o10L50L79o22L36j18
7300B5L97q75L11L23l0j16m9L89k83l16K46O0j01k27L74Q9l24p1K28jj68J19K08
$$ plain form
7150 174 -9 -80 72 443 -108 -83 209 142 -363 -233 120 39 -363 78 291 117 -321 235 235 -72 -197 284
7172 284 52 -278 -92 323 46 -95 -182 -10 -56 -385 232 123 -193 -442 -220 61 -298 -177 145 -79 -380
7193 -380 -46 202 202 -113 28 253 73 -184 343 133 -407 -210 -54 -50 -169 34 416 22 -233 107 261
7214 261 -312 -370 -7 279 -193 21 162 268 -511 -189 350 -89 -159 -149 193 -32 -35 189 393 -42 -230 19
7236 19 2 -135 -225 194 -81 -239 298 126 -6 127 51 87 -14 69 285 -176 -349 -257 318 64 -459 -136
7258 -136 240 -218 -497 -18 79 -38 -165 78 209 -194 -136 33 -73 36 -79 409 -47 -211 -70 -153 -228
7279 -228 23 128 17 18 -289 268 143 -2 -162 333 185 -222 -97 229 310 -300 50 429 -193 143 25
7300 25 422 -453 -142 181 151 35 -14 375 92 -224 22 82 -19 -246 128 217 -107 -178 50 49 -119 0 208
7323B08j09k11K17l7k28o2L12p6n8l08N22k73q9J36K0K01m44J11M11l06k30M46
7345A53j22o6l6N05l45m72K30J52J44n73L22M58l48k78K97Q3m12J05L99j32o9
7366ej20K95p7k20q3M71L0l65L04R8l19JR8J82n59L19J04L5j92j7R0M1k02J17
7390B6K05l12j99K68K65l86L1K60K39o75J12M96k05l58j75O76l55j57j27O60l20
7411c1l68O51n3m26J29K62l4m74K41K47k48m25M72L27n54J12J61J56m23K47K40
7432B09o0o97M52L80k10l18L73L0m48J86M23K94o65n6N35l35j07j88L60j53j20
7453a15mO2K42k77K26r7j12o6N17k98k34k68P76l80l66M29P9j37q53M39M11l87
7475d13j02J94O08k29n46Q99m51o56P77K03l55n05J09Q62l58l74M74k46L3j48
$$ plain form
7323 208 99 -112 105 68 -160 -222 90 14 -44 -352 170 -103 -192 -56 -36 165 -279 -168 243 -63 -293 153
7345 153 31 -35 -71 434 89 -383 -153 -1 143 -430 -108 350 2 -276 21 104 -308 -203 196 64 -5
7366 -5 -125 170 93 -127 -210 261 291 -74 230 328 9 10 108 290 -269 50 154 189 -3 -20 70 111 -91 26
7390 26 231 -81 -280 -12 253 -133 -102 158 397 -278 -166 330 125 -233 -408 268 -87 -244 -371 289 -31
7411 -31 -399 252 199 -227 -98 164 130 -344 -103 144 -104 -529 -57 270 -284 -172 -11 145 -278 -31 209
7432 209 149 -548 -96 284 74 -244 129 159 -289 -103 320 614 -51 -107 428 93 -14 -202 158 5 -115
7453 -115 -119 -57 185 -92 134 37 -75 -141 376 78 -156 -424 352 -28 -394 35 114 -23 -876 -437 -26 -413
7475 -413 -515 -321 287 58 -488 411 -40 -696 81 284 -71 -576 -467 395 37 -337 137 -109 -76 -224
7495b24L98j17j54kJ84j26j81L33J99l36k16K81K00l37P3jP6l74R8J68L4r8L32
7518B10L03m35j32J77J06j31k60O38k50l16J60N5K87m23j77M72k67j62L4L02m04
7539b13ON95m46Oj95M68r8l18R0R4J12j85J2L18j87m08N24R7m44j4L64o3m23J33
7563a75K01j33K5j6J37J8m25L94M06n96k29M40pj88m5L88m53N5P0J52j34K9N02
7586D16j79l86K2M54k03n5p1J91j25p7J36P3J3m21N20k16j06k50K17L14l44L9
7608c8K24o4l54K29K93j86k90K48J29l0k06N5Pk39N0M13j5n46L23L4Q2l35J75
7631d1K56l15k24J27M60n28m9N05Jn08J50L57j27k82k0L31n0l69M99l92K11q6
7653i4J16P5l31N2M46j0n88L23K06j09k33N2L78k23m88N33J69l27j28L38J39m75
$$ plain form
7495 -224 174 57 -97 -99 85 -41 -222 111 310 -26 -242 39 239 -98 -25 -26 50 -324 -226 -58 -24 -122 210
7518 210 513 78 -54 123 229 98 -162 476 226 -90 70 125 412 -11 -188 284 17 -145 -111 191 -213
7539 -213 -207 388 -58 -52 -247 221 123 -195 -105 -11 101 -84 -72 246 59 -349 175 272 -172 -186 178 115 -308 -175
7563 -175 26 -107 -82 -98 39 57 -368 26 432 -164 -393 47 40 -148 -193 195 -258 -203 -133 19 -115 -86 416
7586 416 237 -149 -127 327 124 69 -2 189 64 -13 123 196 209 -212 308 92 -14 -264 -47 267 -77 -38
7608 -38 186 122 -232 -3 290 104 -186 62 191 161 -45 10 17 -222 -172 241 226 -320 3 37 119 -216 -41
7631 -41 215 -100 -324 -197 263 -265 -314 191 192 -316 -166 191 64 -218 -238 93 43 -326 173 -219 -8 -94
7653 -94 22 97 -234 -182 264 254 -334 -11 195 86 -147 -95 283 60 -428 105 274 -53 -181 157 296 -179
7675a79M23k5j75k55J26L97k88j28J02K2l57J35L65p9j17L0j17K26k97R3K85r4
7697I3m91M37J36j94j09J78p9j54l0L67q3j67j27J58P8n22L63J21k18K60l82M71
7719A06j9k42N50j32n94N05m53N95p54Q75Q83j194m85k05J070m66R2K60m02J93
7739A83J21m55J20L83m0M6m21k7L54O0k63j29M65j75l01J12M37l68m21L48J37
7760A66J05m73J44N3J01j45K61J67o52J54R9J80j86lJ56k53O7O1K11j02m62O56
7782C05q4m17k9L25p5n7k59K87J55n90L91P1J9m74M53K99m29j77M39k76L20m40
7804b43M82Q1l90k4K06j79j69K09J10l4m03L03J80k06J9L1K44k37p5J72q9k30
7826b42K77k1k15R5J48Q7k3l44O41j23m16J1K38J40l34K02k0Ml18K47J61l00r4
$$ plain form
7675 -179 244 219 44 -211 -85 312 24 -104 -2 20 -337 -202 163 84 -33 -3 -120 106 -191 -98 187 93
7697 93 -398 39 175 -19 -128 50 -29 -183 -213 154 71 -96 -223 -65 13 -509 -146 -25 -243 17 -365 106
7719 106 87 -155 395 263 -331 174 -279 316 -438 437 1320 126 -359 -564 506 40 132 392 -10 183
7739 183 304 -151 -31 352 312 358 -63 -90 264 324 61 -68 397 222 -79 33 470 102 -319 29 166
7760 166 271 -202 -58 -5 96 -49 212 379 -273 -119 -20 160 -26 -29 127 -126 -59 2 213 111 -351 305
7782 305 221 -196 -225 100 25 -32 -291 -4 151 -439 -48 23 42 -432 21 320 -109 -286 153 -123 197 -243
7804 -243 239 320 -70 -94 112 -67 -236 -27 83 49 -354 -51 129 -77 -58 -27 217 -20 -95 77 -12 -242
7826 -242 35 14 -201 -106 42 129 106 -238 403 280 -136 -125 113 253 -81 121 101 105 -213 34 195 -105 -199
7849a99L12n0r0j80L40j06k81L67J41k60k62K77J0j18k2J88L15n78J29J46n7k92
7871b70J54K54j4l35L03K24m97o0M49O9m90R4O3J14k73R4L84l32J39q8L60l71
7893b9j36L70p3l04N6L51l65k84L16J93L5j61J91j79m3J08J39Q2Qm24K07K12k81
7916a1J61j25K08n44J87M07j45m92L45M99n75l00N92ol29q6O6J34j54J39k8O5
7938Hl05L96K12l41j76J75K79k45k36M46J69p62K84M0J82m43L10J52l67P7M6J89
7960I0r4j17J63J57l01J8L92l37j74M0L50l32j31L71R4k31k83M12M15n43o6J22
7982A5l0j82N1L97R8n80J90n7M9l84L91J82k74j63R4K44k74MK67J04k31n6L46
8005B01j43k08K27K15k25m83N68k65L5j85M16j6m79L28m3q9n4J86Q2p5Q7J78o1
$$ plain form
7849 -199 113 63 -27 -207 133 27 -254 113 254 -6 -268 9 19 -99 -121 67 382 -196 -67 79 22 -270
7871 -270 -116 138 124 -211 92 316 -181 -241 208 277 -213 -119 -56 58 -215 -121 263 -69 70 -18 342 -29
7893 -29 -165 205 132 -172 -116 235 -130 -414 -98 95 130 -31 160 -19 -62 46 185 267 275 -149 58 270 -11
7916 -11 150 25 233 -311 -124 283 138 -354 -9 490 -85 -385 207 201 -128 -214 -148 -14 -168 -29 -57 8
7938 8 -297 99 311 -30 -206 -31 248 3 -233 213 382 -380 -96 -56 126 -317 -7 145 -222 -145 -99 90
7960 90 -4 -121 42 199 -102 -84 308 -29 -203 -163 187 -145 -276 95 189 -42 -325 87 502 -41 -107 15
7982 15 -15 -197 -146 251 349 -231 -41 -98 -49 -433 -42 140 -134 -297 -203 41 -233 -229 38 142 -89 -145 201
8005 201 58 -150 77 292 67 -416 152 -113 -78 -263 153 137 -342 -14 -57 -146 -200 -14 68 -7 80 258 197
8028A97o01M21J02Q18q71J26L41l66l07M64J7k08l09L98n0k78k0K89j17k37N2
8049a39L6Qn0J74K02j15KlR2j49N5J48l24L2k28L76j30l01L40K63J0k63m4P3Q
8074G3k73K81M5j56q1o9K42k91J15R9J06m81L82L01k66k99L92k57J02k45L07J51
8096A78n95L32oJ22n07N78j36p0k0R7L96m79J5J58J1j48L20Nm9l32M8L05k52O
8120b3J2J94q6j88K74J23m65o2K91rk10j10O00k98j77L77j32p7j32J3R4m1r8L03
8144A73p0k62N5L76m47j88M81J77m34L2K09J54m17J4J67K30o14M27K1j21j70m7
8166b54M00k16k03J56L15p5j61q5K78k51q7K90q8k80M08r9on28N94n0j25k06Q3
8189a90K88j47
$$ plain form
8028 197 -404 17 119 937 66 192 533 167 -140 324 341 133 -176 222 172 -106 -126 163 46 -191 -139
8049 -139 -103 -95 -145 29 231 116 118 115 207 58 113 261 -63 -31 -259 117 -13 -314 26 289 299 36 -8 65 73
8074 73 -200 81 126 -30 -111 -180 62 -229 -114 -15 91 -390 -8 293 27 -272 120 -137 -35 -280 27 178
8096 178 -417 -85 -91 31 -476 102 -34 -104 -124 -27 369 -110 -95 63 74 -74 246 251 202 -130 -82 223 -29 -23
8120 -23 -11 183 97 -91 183 306 -159 -221 70 61 -149 -259 341 43 -134 243 111 34 -98 -85 9 -32 -130 173
8144 173 103 -159 -104 272 -175 -363 118 295 -139 -107 102 256 -161 -147 20 250 -364 63 84 -37 -207 -254
8166 -254 146 -70 -273 -117 198 123 -38 -123 155 -96 -183 107 19 -261 147 48 42 -486 108 58 -67 -273 -190
8189 -190 98 -49
8191d9
$$ Imaginary data points
##PAGE= N=2
##DATA TABLE= (X++(I..I)), XYDATA
0@%%%%%%%%qJ6j6J6j6K4l2M0n6O4p2R6j20J36j60J92k24K64l12L60m12M73n41
31b88O16o97P90q93J005j130J266j415J577j756J954k169K401k653K930l233L563
48A868l927M326m763N246n782O379p046P795q647R624j0757J2090j3679J5617
62H344j8039K1161k5356L1309m0440N6270r0946K87669j22850m07124N54877l33091
74g8216Q948J91616k74130K43871K540k62268K71361p3353p6727P8488o6921P6046
86D1255k9532p9638J37229m6669p9595P0774K5898o1068L97L1593k219r006k5655
99b6236L7614L4085j07053M4249O8153q6148R646K9285K9376k1018r1776J14925
111C5102J3136j20214O1420K0525J2439l1756o9004J33440k7750j05041R1739
$$ plain form
0 0 0 0 0 0 0 0 0 0 -8 8 -8 8 -8 16 -16 24 -32 32 -40 56 -64 72 -88 104 -120 144 -168 192 -220 253 -288
31 -288 328 -369 421 -472 533 -597 669 -746 831 -925 1029 -1140 1261 -1392 1538 -1695 1868
48 1868 -2059 2267 -2496 2750 -3032 3347 -3699 4096 -4551 5073 -5684 6406 -7273 8344
62 8344 -9695 11466 -13890 17419 -23021 33249 -57697 229972 107122 -300002 254875 -78216
74 -78216 -69268 122348 -151782 92089 94629 -167639 103722 30369 -46358 32130 -34791 41255
86 41255 11723 -67915 69314 22645 -56950 13824 39722 -21346 -20949 10644 8425 -581 -26236
99 -26236 11378 45463 -61590 -17341 50812 -35336 -25690 3595 32971 11953 -79823 35102
111 35102 48238 -71976 -10556 9969 22408 -9348 -78352 55088 27338 -77703 14036
122A4036R882p876m5595j2816J18355j03683l5884J29306p0088p794P701j9652
134b4108Q1217r4491k437J21301r8129o075M5272l2114L9093o3986K1210R1722
146G8475j18337J8919Q6246q1478R219J2176l947L7441q2234K6079R0732r9687
158b6396m905P7054l8113q193j2511P755O0046q1320k2054J15276o6830n8495
170e8686Q4910j6650j2341n8k6446P8982m4380p8567J15075k1818o9770O0090
182A0341j3914J7443j3727n2402R5511l2266p6127Q9274q328l6772R734K62M1899
195C0928m8456k0407P3668l0286k5728J2829J6418J5071o5506L0891N6926p3270
207b6922R399L6176j0887l690l7656N1275K4469q7565M2960M6089m9091l178q41
$$ plain form
122 14036 23918 16042 -29553 -42369 75986 -27697 -63581 65725 -4363 -12157 -4456 -24108
134 -24108 57109 -37382 -39819 81482 -16647 -22722 22550 -9564 29529 -34457 -13247 78475
146 78475 -39862 -20943 65303 -16175 -6956 5220 1273 38714 -43520 -17441 73291 -26396
158 -26396 -31301 45753 7640 -553 -13064 -5309 54737 -26583 -48637 66639 -191 -58686
170 -58686 26224 9574 -2767 -2825 -29271 49711 5331 -73236 41839 20021 -49749 10341
182 10341 -3573 13870 143 -52259 43252 10986 -65141 24133 15805 -20967 -11233 -10971 30928
195 30928 -17528 -37935 35733 5447 -20281 -7452 8966 24037 -41469 -10578 46348 -26922
207 -26922 -17523 18653 7766 4076 -33580 17695 42164 -45401 -2441 43648 -5443 -8621 -9462
220i462K7470M155o3977M3176M8861o6771k220M9232j6876k5198j165K4427J2807
233B4459m9438J3310N9268n0133k4245M2336l850p752k6736J7745N0836o9729
245b3929n913O5748m4626o570J3922L301K5906n9792K1866N8857q3422J1872M5649
258B2869l2384J1091k9993K4072N0985q9812K0205P0732o5346j798J9722k099
270a756J8362m9515K2302N4738o9788K702N4492l2974j2353L721J3949K0096n3311
283b9335J0716O3384m8672k4219M5279p30j5369j7743J6622L0695m5387j800M8037
296C1478k5033k0439J0672J4259K836m1247K9169M2877n5887l932L5228j0442
308I539j2327j9791L3626K4147o3847J9972M1272m2985l67J0390R102O916m4019
$$ plain form
220 -9462 18008 22163 -41814 1362 50223 -16548 -18768 30464 13588 -11610 -12775 11652 24459
233 24459 -24979 -11669 47599 -2534 -26779 15557 11707 3955 -22781 -5036 45800 -23929
245 -23929 -29842 35906 -8720 -15290 -1368 1933 27839 -31953 -10087 48770 -34652 -22780 22869
258 22869 -9515 1576 -28417 -4345 46640 -43172 -22967 47765 -17581 -19379 343 -1756
270 -1756 16606 -32909 -10607 44131 -25657 -22955 31537 -1437 -13790 -10069 3880 23976 -29335
283 -29335 -18619 44765 -3907 -28126 17153 16423 1054 -16689 -67 30628 -14759 -16559 31478
296 31478 6445 -13994 -3322 10937 13773 -27474 1695 44572 -11315 -15247 19981 9539
308 9539 -2788 -22579 11047 35194 -28653 -8681 32591 -10394 -10761 -371 8731 15647 -28372
321b8372K8049L6387o3305O007M5117j8645j6876l604L0717K735n1722K7058L2102
334B5648m0877m140J7767J0433p237k5416L3493J4494m9586J2452K6801j3232
346F00j4240k599L8217r851n1563M5432J8049m6804J4419J5019N194o507l2518
359b7152M2085J0090o1829L5717K9934l6345M077J777J6800o52m7813M2147K5263
372C4099o0147J9745K7225j9047O72j5702K6418J6391n9116K6486L8412m9709
384a4273J186K3913n45n766k6598K9635J9773n2597J4390L4996k4597q499M420
397d562J7074r63l7619K4433K5039l8858k919K6049L011k0373j0628L7396j986
410A5094m4237K2977K1933k2151p757O510K4191j0862l4130L5898J1657m1283
$$ plain form
321 -28372 -323 36064 -27241 -21234 23883 5238 -11638 -15242 15475 18210 -33512 -6454 25648
334 25648 -15229 -19369 -1602 8831 1594 -23822 9671 24165 -25421 -12969 13832 600
346 600 -13640 -16239 21978 12127 -39436 5996 24045 -22759 -8340 6679 11873 5366 -27152
359 -27152 14933 25023 -36806 -1089 28845 -7500 -3423 -1646 15154 14502 -33311 8836 34099
372 34099 -26048 -6303 20922 1875 2547 -13155 13263 29654 -29462 -2976 35436 -14273
384 -14273 -13087 10826 10281 4515 -22083 7552 27325 -25272 -10882 24114 -483 -8982 -4562
397 -4562 12512 11549 -26070 -1637 23402 -15456 -18375 7674 10685 -9688 -20316 17080 15094
410 15094 -29143 -6166 15767 -6384 -14141 -7631 16560 5698 -28432 7466 19123 -22160
422b2160J1682K0670n057j5504o470L5889r603l8704L3703J6431k6682m313J0617
435D99J8548j9563k5089L8350L278l4054J5347J7444n458j8412K89L2765k0448
448C496k8480M1050L543l1483O535J0444J1722j7960k1083M4774m282m4638L0185
461C823J1442j7393j817o046K8645j1683l7177N0298j50m4244K5753N498m346
474B603o925j7992M3541p049m7522L7368J2074k7680J476O198J7527j3589k2832
487b2802L5932k261l2977J5939J7370j3036j2272P785K1382j3669k3542K3839
499A688J6728k8256p615K7478L612k3951l481K6658l234k6993J5887J8797j7013
512C05j0708J0063J6218j7295j9652L4100L348l0185R038J7828J388k1953n215
$$ plain form
422 -22160 -10478 10192 5135 -10369 -16839 19050 9447 -29257 4446 20877 -5805 -10118 499
435 499 19047 -516 -25605 12745 16023 -18031 -2684 14760 9302 -9110 -8821 23944 3496
448 3496 -24984 16066 19609 -11874 -5339 5105 16827 -1133 -22216 22558 18276 -26362 3823
461 3823 15265 -2128 -3945 -9991 18654 6971 -30206 20092 19942 -24302 1451 6949 2603
474 2603 -4322 -22314 21227 14178 -33344 4024 16098 -11582 -10106 -3908 13619 30 -22802
487 -22802 13130 10869 -22108 -6169 11201 -1835 -14107 -6322 15060 1391 -22151 1688
499 1688 18416 -9840 -17455 10023 13635 -10316 -13797 12861 9627 -17366 -1479 17318 305
512 305 -10403 -340 15878 -1417 -21069 13031 16379 -13806 -4768 13060 14448 -7505 -12720
525a2720L5880j7654k8136L1456L785j3742l459L378K0971k4207j4309L9514j1459
538I298k4802J5034R292J31k2557L461L5912k7176k0000L2652k815j7766p82J0865
552G47J4199k5271n453L4584j6599k1930J9435Q436p611j4592Q862K5243k5935
565e885j6720L4127l755k4420Q839J3327K891j7850l840L2070j5086k7749K9884
578E833O880k1460K271O767J4515j5472k1405L7654l383l4728K4942J0560j1009
591A965m373m714K4200j2704k7573L5023M051k5120P204R201P546k0997r056L4952
605A9605j2695k3951K0142R375r234j4317J1724J8820k4756o050K2016k409j5969
618g699m056K1942M93k8728J4420K1292j9060j2517J2738J2930j4265j4141J9833
$$ plain form
525 -12720 23160 5506 -22630 8826 12611 -1131 -4590 -1212 19759 -4448 -18757 20757 9298
538 9298 -15504 -470 8822 8953 -13604 -10143 25769 -1407 -21407 11245 8430 -9336 -10118 747
552 747 14946 -10325 -15778 18806 2207 -19723 -288 8148 537 -14055 -5193 20050 -5885
565 -5885 -22605 11522 7767 -16653 -7814 5513 8404 -9446 -13286 18784 3698 -24051 5833
578 5833 12713 -8747 -6476 291 14806 -666 -22071 15583 12200 -22528 2414 12974 1965
591 1965 -2408 -7122 17078 4374 -23199 11824 15875 -9245 -2041 7160 14706 -6291 -15347 19605
605 19605 6910 -17041 3101 12476 3242 -11075 649 19469 -5287 -11337 10679 8270 -7699
618 -7699 -11755 10187 10680 -18048 -3628 17664 -1396 -13913 -1175 11755 -2510 -16651 3182
631C182J0072k2778l573K3007l844k0318R740J3051p165j5385O514K4317k1113
644d293j6872L2942m052j8455M141O150J4472k1805q936L5811j7610j7768J9199
657B924J983L09j6368P696K5901l4610k355L2988j5507q226J949J0781Q461l1463
671a5537P290K9642k3773p635J6597K982n886j4356J1879J5550k5486j191K7827
684A7903j1600j7950J2222R626p419j3479P473K1408j7942j7671K5294L343k0376
697i168P25J2382N220j7592k713K5688j1040j8499J7486O659j3623r435J3105
710h05J2894k0860l602K1778k987j6342k376J9010K562k5513J1732J9807k0327
723e029n837J1191N784n403j4550J9625R081l0946Q575J9073j2063n306J254J5462
$$ plain form
631 3182 13254 -9524 -13097 9910 6066 -14252 -4512 8539 1374 -14011 -7497 16820 -4293
644 -4293 -21165 11777 7725 -10730 -6589 -439 14033 -7772 -16708 19103 1493 -16275 2924
657 2924 4907 5216 -11152 -3456 22445 -12165 -14520 18468 2961 -5265 -3316 7465 15926 -15537
671 -15537 -8247 21395 -2378 -10013 6584 9566 3680 -10676 1203 16753 -8733 -9924 17903
684 17903 6303 -11647 575 10201 2782 -10697 -3224 18184 242 -17429 7865 11208 -9168
697 -9168 -8443 3939 9159 -8433 -11146 14542 3502 -14997 2489 9148 -4475 -13910 -805
710 -805 12089 -8771 -12373 9405 6418 -9924 -12300 6710 9272 -16241 -4509 15298 -5029
723 -5029 -10866 325 6109 706 -13844 5781 14862 -16084 -7509 11564 -499 -5805 -4551 10911
737A0911K33k8089J6269J9353k6598m75J6897j031p480q740J5618O430k5824Q165
751d361K0472j5645r499J0742R719p219j6473J5711J3776k5109k616K2222o044
764E676j3139K845J1876R45j9899P113K0515j8914q944J7167J509r130r311J3218
778A527J2556k6104J805K4790j4761j0979P628P047j37j6650J0196J8253k1837
791f666n989J8206k2j2502l077J6816K360k2089O098J7631j0335j2654J1082J2387
805A1246j3047r441J6449L619j4536j840J3853K748j7005J420K0185q148j7472
818a1969J2153J1546j1601q987J0485J0586j2624j0437J8904L666k0897O304J4745
831A1874q923q487K656J2847m006k0585J6493J4516k4127j29J5781j891q364p500
$$ plain form
737 10911 11144 -16945 -676 18677 -7921 -8396 8501 7470 -10 -8750 6868 13298 -12526 -4361
751 -4361 16111 466 -9033 1709 11428 4209 -12264 3447 17223 -7886 -10502 11720 5676
764 5676 -7463 -4618 7258 8203 -11696 -4583 15932 -2982 -11926 5241 6750 -2380 -11691 1527
778 1527 14083 -12021 -10216 14574 -187 -11166 -3538 3509 3372 -13278 -3082 15171 -6666
791 -6666 -12655 5551 5529 -6973 -10050 6766 9126 -12963 -6865 10766 431 -12223 -1141 11246
805 11246 -1801 -11242 5207 8826 -5710 -7550 6303 9051 -7954 -6534 13651 5503 -11969
818 -11969 184 11730 129 -8858 1627 12213 -411 -10848 8056 11722 -9175 -2871 11874
831 11874 2951 -5536 -2880 9967 5961 -14624 1869 16385 -7742 -7871 7910 6019 -2345 -9845
845i845J4000O089k2347P933J7471j4126p862Q178O038q176j0730J6136Q969k0204
859h476m71J6745l103j5187K067J6639m166j6974J0090J2295j1359p499R319P565
873G485j1079q323J7600K304j9953P890J4585r222r579N021J3302o330j7135J4857
887A423J2017j8632k057J2959Q46q925m637J3369K540j8115P067J4977j2366q354
901g888J0935P885j0943r726J5027O871j8016j069J6202j318j4019L40J3972m017
915D236j5130J1588J1243j3334n175R276M109j1511n842J8105L26j8194O792J0974
929G463n490r843P94J6299p089j7163J6888P381j6040J46R777J588j0731l273
943i293J6089k757j5823R558J0755r499r289Q580J1621j2000q948J6250L453j5476
$$ plain form
845 -9845 4155 10244 -12103 -4170 13301 -825 -8687 -509 5529 -2647 -13377 2759 11728 -8476
859 -8476 -8947 7798 4695 -10492 -8425 8214 4048 -12926 -2836 9459 -1900 -9399 -80 7485
873 7485 -3594 -11917 5683 7987 -11966 -4076 10509 1287 -8292 -3271 10031 3701 -13434 1423
887 1423 13440 -5192 -7249 5710 6556 -2369 -7006 6363 8903 -9212 -2145 12832 466 -7888
901 -7888 3047 10932 -11 -9737 5290 12161 -5855 -6924 9278 7960 -6059 -5719 8253 4236
915 4236 -10894 694 11937 -1397 -6572 2704 6813 -4698 -10540 7565 7891 -10303 -3511 7463
929 7463 1973 -7870 -7076 9223 2134 -15029 1859 9240 -6800 -6654 3123 4711 -6020 -9293
943 -9293 6796 4039 -11784 -2226 8529 -970 -10259 -1679 9942 -2058 -11006 5244 8697 -6779
957f779K05J1971J26j2046K084J5654p745j3670J2089O233j0702l950Q662R372
971A1504j2583q251J9689k595j7595R345Q137m087p017o82J5089p681j6272J8914
985E915M935j7403K985Q292O32p443o352J7203r52j9579J0892J0949j2344m430
999f700O453O953p459j0457J4711M907j6933K263J3637m391j2021L447J3611p082
1013I39j1059R425Q376r456q592J0861P306j4826r12J4994m001j0166K850R484
1027E223j774j3685P485J4518j2827q222J2674L392j0373m185J1304N245j4222
1040e447k1J5223o272j1288Q934O373o501o273N623J0678j2224q527J8402o90
1054G990j4703M084Q230J150j2026r73J8030r544j1861J4372J489o933l417L902
$$ plain form
957 -6779 -6574 5397 5523 -6523 -4439 11215 3470 -10200 1889 8122 -2580 -6530 2132 11504
971 11504 -1079 -9330 10359 7764 -9831 -486 7651 3564 -3453 -4135 10954 3273 -12999 5915
985 5915 10850 -6553 -3568 4724 5356 -2087 -8439 8764 7812 -11767 -875 10074 -2270 -6700
999 -6700 -247 6706 -753 -11210 3501 8408 -8525 -6262 7375 2984 -9037 -5590 8021 939
1013 939 -10120 -695 7681 -1775 -10367 494 7800 -7026 -7938 7056 3055 -7111 -4261 5223
1027 5223 3449 -10236 -2751 11767 -1060 -9282 3392 6784 -3589 -7774 3530 8775 -5447
1040 -5447 -5468 9755 3483 -7805 1129 7502 1001 -5272 351 11029 -1195 -9722 8680 7990
1054 7990 -6713 -2629 5601 6751 -5275 -6248 11782 2238 -9623 4749 6238 -695 -4112 -210
1068b10R235j3650m988J9453o075j3041Q366P020l383j1115L584J4551j1129r967
1082a1349J4643L419j1210r01P645J269r518j690J3524k034j4373R617R902j2771
1096c827n371J0341M996q178o367J1361N089j4904j65J3300k741j0555N105R106
1110G190n894q848P786P436r722n703J3100L479j4894J860J2365l883q913J168
1124c473R982o04j4043O857J2736j2796m831J0976N13o808l541R590L983j5482
1138f941K866J4348j0051p664Q112N513l913r767O870R939j3763m134J3990r35
1152D470r351O42Q529j83j2684M719J1779r573p366J0129M363q809m348Q761N595
1167F673j2275k121J4235l284j2014N910Q212m551p525N097R860r512p908J3141
$$ plain form
1068 -210 9025 -4625 -9613 9840 3765 -9276 -910 6110 2727 -8388 -4804 9747 -1382 -11349
1082 -11349 3294 6713 -4497 -5398 2247 3516 -6002 -7692 5832 3798 -10575 -958 8944 -3827
1096 -3827 -9198 1143 6139 -2039 -8406 2955 8044 -6860 -7025 6275 3534 -7021 -1916 7190
1110 7190 1296 -7552 234 7670 -2052 -7755 5345 8824 -6070 -4210 8155 4272 -4641 -3473
1124 -3473 6509 5905 -8138 -1281 11455 -1341 -6172 4804 5317 -1491 -5032 4558 8541 -6941
1138 -6941 -4075 10273 222 -7442 670 6183 2270 -7497 -627 9312 -4451 -8585 5405 4470
1152 4470 -4881 -4239 4290 4107 -8577 -3858 7921 -1652 -9018 1111 5474 -3335 -7683 1078 6673
1167 6673 -5602 -7723 6512 3228 -8786 -2876 5336 785 -6740 -1643 8217 -1295 -9203 3938
1181C938J485j0885R48Q122K069j0070o61J3951n138j1775P949P328q051n622
1195f412R617N637j1235k419J0298n30r523L99J1551k092j2150O706Q694q175
1209C66o132O839O498q179o571J1947K131j3102K425J0390m056q369L543Q505
1223F235m134j0040O993R203j1014n282J1511J371r084j387Q361J741j1804K765
1237d565J1530p640p320Q089M432n706o674Q096P156j2475k098J2427j543q964
1251e255K59R042n26j1201O089R549r173m447P620K273o294m141J0188L704j2929
1266e242J592J1889n901q185M141Q041k872j0104O679R448j1332l583J0455l70
1280D656o926o21O945J523j1089K861J1579p934p740Q179N793p507o775Q885N347
$$ plain form
1181 3938 5423 -5462 -4514 3608 5677 -4393 -5054 8897 3759 -8016 -67 7261 -790 -6412
1195 -6412 3205 8842 -2393 -4812 5486 4956 -4567 -4168 7383 5291 -6859 -153 8541 366
1209 366 -5766 1073 7571 -608 -7179 4768 6899 -6203 -3778 6612 2556 -5813 -2270 6235
1223 6235 2101 -7939 -946 8257 -2757 -8039 3472 4843 -4241 -5628 2733 4474 -7330 -4565
1237 -4565 6965 -675 -7995 94 4526 -1180 -7854 242 7398 -5077 -7175 5252 3709 -5255
1251 -5255 -4996 4046 3520 -7681 -1592 7957 -1216 -5663 1957 4230 -2064 -6205 3983 7687 -5242
1266 -5242 -3650 8239 2338 -5847 -1706 6335 3463 -6641 38 9486 -1846 -5429 5026 4656
1280 4656 -2270 -2891 4054 5577 -5512 -2651 8928 994 -6746 1433 7226 -281 -7056 1829 7176
1295G176j1148j820J0731o18q834Q60Q548k782q764N108P350p653n547Q700M309
1310E616r242l350J0662R29j1678J624J0634l024q224L357P480m287q381P648
1324b36O122q362l114Q484J227r077m61J1167j858j0578N860P542n761o686M628
1339a103Q117o744p165J0962K367r634M20O696O44q179L76J1172n005r864R032
1354B092M816q257k733O017M902p530n754J1488J225j2050L541Q287m610n857
1368d423K990O965l585r045Q788N130j1805l76Q915k54o459j229Q463j90j1718
1383g833M399R613p023n656O785M516p099m580Q903K483q872n17R055j190r758
1398f774L162R119n186o347O021N488n527o558P843M708j0065o39J0099j279q683
$$ plain form
1295 7176 -3972 -5792 4939 4321 -4513 -3653 4895 2113 -6651 -1543 5807 -1846 -7393 1307 5616
1310 5616 -3626 -6976 3686 4615 -7063 -5439 5195 2171 -6053 -2696 4784 497 -7884 -236
1324 -236 5886 -2476 -5590 2894 4121 -4956 -5417 5750 3892 -6686 -826 6716 955 -5731 -1103
1339 -1103 7014 270 -6895 4067 6434 -3200 -2780 3916 4560 -3619 -3243 7929 2924 -6940 2092
1354 2092 6908 -1349 -4082 1935 6837 -693 -6447 5041 6266 -5784 -2243 6044 1434 -4423
1368 -4423 -1433 5532 1947 -7098 1690 6820 -4985 -5361 3554 3300 -3159 -4388 4075 3885 -7833
1383 -7833 -3434 6179 -844 -6500 285 4801 -2298 -6878 2025 4508 -4364 -4881 4174 2984 -6774
1398 -6774 -3612 5507 321 -6026 -5 5483 -44 -6602 1241 5949 -4116 -4755 5344 4065 -4618
1413d618K375P877l440p888M694P848o457n914P950L941q077k261P753J367q653
1428c503M54R343l379p716M922N797m806o400O139O451r037l785R882L04q187
1443c521k35O889J085q593J027J0087o406p409Q355K882o759j591N429L677q065
1458c148l892J1173m37j1387N456P140m409n297J659P645m092q151Q941M152r942
1473d589O72P316j812n657N90P287j029q990M807Q787p879n806P903L470o593
1488a523l102O792L404q062j132Q948k111p897M351N450m177n242N581N426p218
1503e12m592Q568K607r267r81R926j611q584K432O706k495o294L304P058o596
1518c31n112P732J383o861o79P242R95r239O91R734m797p348N405O212n348n729
$$ plain form
1413 -4618 -2243 5634 2194 -5694 -1000 6848 391 -5523 2427 6368 -1709 -3970 3783 5150 -3503
1428 -3503 -3049 6294 2915 -4801 121 5918 1112 -5288 851 7302 -1735 -5520 4362 4666 -3521
1443 -3521 -3756 3133 4218 -4375 -3348 6739 333 -7076 1279 4161 -2598 -4189 1240 4917 -3148
1458 -3148 -7040 4133 3696 -7691 -2235 4905 496 -4801 -3142 4503 411 -7740 1201 5353 -4589
1473 -4589 -3917 3399 1587 -4070 -3480 3807 2778 -6212 -1405 7382 -497 -6303 1600 5070 -1523
1488 -1523 -4625 2167 5571 -2491 -3623 5325 3214 -4683 -332 5118 941 -4301 1280 6706 -512
1503 -512 -5104 3464 6071 -3196 -4177 5749 4138 -4446 -2014 4692 2197 -4097 -793 6265 -331
1518 -331 -5443 2289 3672 -3189 -3868 3374 4369 -4870 -4179 5555 758 -6590 -1185 5027 -321 -6050
1534f050O039N006p655k905Q279j70o706L27P450j419q191L717P936o768n556
1549f666Q019K941o072l364O132L870q273j966J0307k098p621M359M843l302m793
1564c684K468P089o051o069J0336J779r588J391O513r69n973K49Q326k119r019
1579e321N275O139o711l530O455K873o282l040P289J496q976J478Q374l395o877
1594d753M361N401m804n072N397M099o213m051P828K208q792R14P576k821o516
1609e238K463O731k935p381N937N406p541k569O638J768o249j332P181j4q037
1624e172K105P821l840o242M931N466n562n089O898L771p897r79P669K7o824L99
1640b518O269j067p778M024O893o243l199O618M94m120l515O768L526r440jQ918
$$ plain form
1534 -6050 -11 4995 -2660 -5565 2714 2544 -4162 -3835 3615 2196 -5995 -2278 5658 -1110 -6666
1549 -6666 1353 4294 -1778 -5142 990 4860 -3413 -5379 4928 2830 -4791 -432 4411 1109 -3684
1564 -3684 -1216 5873 -178 -6247 4089 5868 -3720 -2329 4184 3215 -2758 -2509 5817 3698 -5321
1579 -5321 -46 6093 -618 -4148 2307 5180 -1102 -4142 3147 4643 -4333 -2855 5519 2124 -4753
1594 -4753 -392 5009 205 -4867 530 4629 -1584 -5635 2193 4401 -4391 -3477 4099 1278 -5238
1609 -5238 -2775 3956 1021 -6360 -423 4983 -2558 -5127 1511 3279 -2970 -4302 2879 2865 -5172
1624 -5172 -3067 4754 914 -5328 -397 5069 -493 -5582 1316 5087 -2810 -3789 3880 3907 -2917 -2518
1640 -2518 3751 2684 -5094 -1070 5823 -420 -3619 2999 3493 -627 -4142 2626 6152 -3288 -3289 5629
1656E629k823o405L251M518j447o945L669P033p284l803Q962j439o448N63N883
1671B914K88p214J222P956l457p436M992N928o565l611N782K801n791k859O657
1686A607J326p745J778P142l592n626M168M582m857m480N982M686p363l359Q772
1701C021K58p905J531O656j549n318J440N924l155n997N925L942o872j133O154
1716B922Q34o051r28P761m83q950L052P692m474n054M127M714m299m885O321K597
1732D896p293J08O252j598n110P17O636k234p231N094N102n898l775N284L234
1747D184n353l990P820J714q068Q69O709l344n362L413M884l777m116M146N102
1762D831p883k431Q510k25o417M88N173j75o383J157P181l699n699N233L769n834
$$ plain form
1656 5629 2806 -3599 -348 4170 2723 -4222 -553 6480 -804 -4607 4355 2916 -3532 -2969 2914
1671 2914 3202 -4012 -2790 5166 1709 -5727 -735 5193 -1372 -4983 799 3600 -2191 -5050 1607
1686 1607 2933 -4812 -3034 4108 516 -5110 -942 3640 -1217 -5697 285 4971 -2392 -5751 3021
1701 3021 3279 -4626 -3095 3561 2012 -3306 -1866 4058 903 -5094 831 4773 -2099 -3232 2922
1716 2922 3756 -2295 -3223 4538 4055 -4895 -1843 5849 1375 -3679 448 5162 863 -4022 2299 4896
1732 4896 -2397 -2289 3963 2365 -2745 -2028 4608 2374 -4857 237 5339 -559 -4334 950 4184
1747 4184 -1169 -5159 2661 4375 -3693 -2824 3885 541 -4821 -1408 3476 -301 -4417 -271 4831
1762 4831 -3052 -5483 3027 2802 -3615 -3127 2046 1871 -4512 -3355 3826 127 -5572 -339 3430 -2404
1778b404o03M370K315n899j922P067o31p025K846O419l952m688M343M101l782
1793E55m223M944M306p646j501P919j474o051K228M787j234n900J946O906n098
1808D64m698O465K628o094j342M756J183o006l88P526j591p406L691N732n260
1823c40m609N074L551m659l443N932K651p475k29O718j630n460J541N299k311
1838F10n833M358N245o559k378O128J276n246j832O685O70p491J480O823l045
1853H91m870L307M543l563m817N352L135n951j408O951l17o512R69O450j858o266
1869c964L317N885l914n191M958L489n517k684N644J781n610l99O149j301o346
1884c703L026N752m685m043M571L465n075l770N987L055o888j456P197q43o224
$$ plain form
1778 -2404 -3007 1363 3678 -2221 -4143 2924 2293 -4732 -1886 4533 581 -4107 236 4337 555
1793 555 -3668 1276 5582 -2064 -3565 4354 2880 -3171 -943 3844 2610 -3290 -1344 5562 464
1808 464 -4234 2231 4859 -1235 -2577 2179 3362 -2644 -3032 4494 2903 -4503 -812 4920 -340
1823 -340 -4949 125 3676 -983 -4426 1506 4157 -3318 -3547 3171 1541 -3919 -2378 2921 610
1838 610 -5223 -865 4380 -2179 -4557 1571 2847 -2399 -4231 2454 3124 -4367 -2887 3936 891
1853 891 -3979 -672 3871 308 -4509 843 3978 -1973 -3381 3570 3253 -3259 -2290 4160 2302 -3964
1869 -3964 -647 5238 1324 -3867 1091 4580 -937 -3621 2023 3804 -1806 -2205 3944 2643 -3703
1884 -3703 -677 5075 390 -3653 918 4383 -692 -4462 1525 4580 -2308 -3764 3433 2590 -3634
1899c634J978M594k566m129K541M775m608l941O769J929o790J2N114J03n671n73
1915d097P567j646p280M267M854m700k773L911L250m658k995O290M82o404J506
1930b426N761j881m896K098N645l649n305M995M057n058l195O093J845n866n52
1945b334N758o27n514J879N198l160m663M041L935m913l078N707K311o328j194
1960b982N993L94o488R80O459k613n508L556L798l728l552M294L432n634k096
1975c695O638Oo406J075N429j701n974K809N693l935m428M523L046n058k076N097
1991A043J527n492l42N842r91o126K435N793l085n163M410L683m947k440N028
2006A175K197n618r04O262j85o162J742N603k788m772L241M570m515l617N176
$$ plain form
1899 -3634 -1656 2938 372 -3757 -1216 3559 -1049 -4990 1779 3708 -3082 -3070 2044 2147 -3524 -4097
1915 -4097 3470 1824 -5456 -1189 3665 -1035 -3808 103 3353 -1305 -4300 1990 2472 -3932 -2426
1930 -2426 3335 1454 -3442 -1344 4301 652 -4653 342 4399 -659 -3854 2239 4084 -1782 -2334
1945 -2334 3424 2797 -2717 -838 4360 1200 -3463 578 4513 -400 -3478 2229 4540 -1788 -2982
1960 -2982 3011 3405 -3083 -2103 4356 1743 -3765 -209 3589 -139 -3691 603 4035 -1599 -3695
1975 -3695 2943 2949 -3457 -2382 3047 1346 -4628 -1819 3874 -61 -4489 34 3080 -1978 -4054 1043
1991 1043 2570 -2922 -3264 2578 1587 -4539 -2104 3689 604 -4559 -149 3534 -1413 -3853 1175
2006 1175 3372 -2246 -3150 3112 2927 -3235 -1493 4110 1322 -3450 -209 4361 -154 -3771 1405
2021A405K529n356j373N992K29n588M20N559j649n570L173M819m210l962N074
2036A492K985n383k177N477R87o128J06O056j479n285K267M358k889m172L635
2051a50L752m878k433N681M41n475k03N301J6o190J664O097l189m925L637M092
2067C238m039l347M363K807n142j563O071m11o124K554N153k842m678L334M076
2082C450l509m463N543L453o080j535N380O83m421p95N100n97n541K508N060l783
2098D53l483M483K475n105j763N241J536n477j207O818j354o328K568M958l067
2113G48k881K263L341l530l552N161J813o003L39N490j753m399J057N036j633
2128A497o023L417N446n395l153M993J763m318j309L935J701n516o9O436l034
$$ plain form
2021 1405 3934 -1422 -2795 3197 3426 -2162 -1742 3817 2168 -3402 -229 4590 380 -3582 1492
2036 1492 4477 -906 -3083 2394 3381 -2747 -2641 3415 1936 -3349 -1082 3276 387 -3785 -150
2051 -150 3602 -1276 -3709 1972 2413 -3062 -3265 2036 2052 -4138 -2474 3623 434 -4491 -854 3238
2067 3238 -801 -4148 215 3022 -2120 -3683 2388 1977 -4147 -1593 3560 718 -3960 -626 3450
2082 3450 -59 -4522 1021 4474 -1606 -3141 2239 2922 -1499 -2294 2806 2209 -3332 -824 4236 453
2098 453 -3030 1453 3928 -1177 -2940 2301 3837 -1640 -2847 3971 2617 -3711 -1143 3815 748
2113 748 -2133 130 3471 -59 -3611 1550 3363 -2640 -2301 3189 1436 -2963 -1906 3130 1497
2128 1497 -4526 -1109 4337 -1058 -4211 782 2545 -1773 -3082 853 2554 -2962 -3031 3405 371
2143C71m440L591L190l420l033L650L768n403k516O300Q88n849L24N089n09m905
2159b904J424N141l144m396M377L223m605j603M713J350n186j030N847l58n922
2174c073J629N483k455m666L182L937l734l292M854J909n388r53N134k84m685
2189b402O67N293j855n116K711M358l857l667M720K431m939j520M548R94n056
2204b690r4N836j712n202K879L930l349l262L004L760m076l188N671J241o090
2219c342Q85M938j664l702O63M750j566n045M103M219n867k050N660L34l805j006
2235b495M379J019n667O95N712k903l798L584K879k887l132L252K996m920j974
2250c260O385N7n906J400M809j989m069J921M468k735m024L421L460n100j605
$$ plain form
2143 371 -4069 -478 2712 -708 -3741 -91 3677 -1726 -4242 2058 2946 -2903 -2579 2510 2001 -2904
2159 -2904 -1480 3661 517 -3879 498 3721 -884 -2487 2226 3576 -1610 -2640 3207 2849 -3073
2174 -3073 -1444 4039 1584 -3082 100 4037 303 -2989 1865 3774 -1614 -2567 2567 2283 -2402
2189 -2402 -1735 3558 1703 -3413 -702 3656 -201 -3868 852 3283 -1656 -3176 1372 2366 -2690
2204 -2690 -2784 3052 1340 -3862 -983 2947 -402 -3664 -660 3100 -976 -4164 1507 2748 -3342
2219 -3342 -2457 2481 817 -2885 -2222 2528 962 -4083 20 4239 -1628 -3678 1982 2316 -1489 -2495
2235 -2495 1884 2903 -2764 -2069 3643 740 -3058 526 3405 518 -2614 638 3634 -1286 -3260
2250 -3260 3125 3182 -2724 -1324 3485 1496 -2573 -652 3816 1081 -2943 478 3938 -1162 -2767
2265b767M968K76m599L80M398p81m880J562N167l561m372M129L324m299k574M528
2281H99J917m685j288M924o2n011J510M176k263l893L440L372m254k763N169J910
2297C098n150j404N351M89n583R34N295k065l945K392K988k322k714L129K876
2312C369m491j700N483j89n277J338M618j182m244J259N024k465n119M106L259
2327C789m482j486L800J100l828q52N042o73m995K058M634l504l980L828K694
2342C145l775k361L648K732m740j814N417K47n504J230M127j859l566K172L509
2357B608l127k755M211J518m791o11M665Q4m715M56M641j322m395K167M370k938
2373F6l598L933K261m124j335L899J082m160o34N672j422m974K635L989k702l638
$$ plain form
2265 -2767 2201 2477 -2122 -1742 2656 1875 -3005 -1443 3724 163 -4209 -80 3244 -1055 -3629 899
2281 899 2816 -1869 -3157 1767 1705 -3306 -1796 2380 117 -3776 -336 3036 -1218 -3981 1188 3098
2297 3098 -2052 -3456 1895 2384 -3199 -2265 3030 965 -2980 -588 2400 78 -2636 493 3369
2312 3369 -1122 -2822 2661 2472 -2805 -1467 3151 1969 -2275 -1016 4008 1543 -3576 530 3789
2327 3789 -693 -2179 1621 2721 -1107 -1959 3083 2410 -2585 -527 4107 603 -3377 451 3145
2342 3145 -630 -2991 657 3389 -1351 -3165 2252 2499 -3005 -1775 2352 493 -3073 -901 2608
2357 2608 -519 -3274 937 2455 -2336 -2947 1718 1802 -2913 -2457 2184 862 -3533 -1366 3004 66
2373 66 -3532 401 2662 -1462 -2797 1102 2184 -1976 -2610 3062 1640 -3334 -699 3290 588 -3050
2389c050L323L114l877k323M491J673m502r89M712j70m937J861M096k645k915
2404b138K166L512l134l478M451K141m747r57M626l92m134P90M006j462l850J737
2420h63M115l483l326M401K268m379j153L907N26m119p82M941o84m959K677L824
2436B911l201l074L299K354k999k514M101J537n219Q5M964p62m527J473M138j903
2452F63l754K533L477l417k734M233J652m418p2L949l71l698Q43M148j520m503
2468b989K806M026l831k550L524K301l989j459M144Q58m364M40L860j459l989
2483b671K344L852l309k669L387K164l801k266M635J298m882j55M709j048m023
2498b435J166L666j893l213K669K278k987k327L912J616n149j67N092j028m069
$$ plain form
2389 -3050 273 3387 -490 -2813 1678 3351 -1151 -2140 2572 2402 -2535 -674 3422 777 -2138
2404 -2138 28 3540 406 -3072 1379 3520 -1227 -2184 2442 2050 -2084 -1294 2712 1250 -2600 -863
2420 -863 3252 -231 -3557 844 3112 -1267 -2420 1487 2013 -2106 -2888 2053 1369 -3590 -913 2911
2436 2911 -290 -3364 -65 2289 -710 -3224 877 2414 -2805 -2720 2244 1482 -3045 -1572 2566 663
2452 663 -3091 -558 2919 -498 -3232 1001 2653 -1765 -1837 2112 1741 -1957 -1114 3034 1514 -2989
2468 -2989 -183 3843 12 -2538 986 3287 -702 -2161 1983 2841 -1523 -1083 2777 1318 -2671
2483 -2671 -327 3525 216 -2453 934 3098 -703 -2969 1666 2964 -1918 -2073 2636 1588 -2435
2498 -2435 -1269 2397 504 -2709 -40 2238 -749 -3076 836 2452 -2697 -2864 2228 1200 -2869
2513b869J210M025j512m322K303L954l525k613L986J290l332r60L541Q76m401
2528b349N64M551j841m438L107L416k971l154L548K722l637k104M182J332m785
2543a857J74M237j242l090J290L188j838l436L405K552l974j610M116J089m600
2558a596m26M536n97l757N94M017j680l858K375L659m023j731L944L88l311o90
2574b156L809K15m600J181M371k357l291K421K886l042k759K961K454l289j652
2589b848M334M98m507O50L752j188l935K318L151k285k949L042K491l644j890
2604c010M307R08l952M12L320n29l597Q40L820j777l325L208K425l510j408L166
2620A298J335l503j067M277k7m501J255M004j975l150K610K597l203k232L209
$$ plain form
2513 -2869 -1659 2366 854 -3468 -1165 2789 -736 -3349 637 1927 -1405 -2365 1176 2052 -2349
2528 -2349 -1785 2766 925 -3513 -406 3010 39 -3115 433 3155 -482 -2586 1596 2928 -1857
2543 -1857 -1683 2554 1312 -1778 -488 2700 862 -2574 831 3383 -591 -2201 1915 3004 -1596
2558 -1596 -2022 2514 1917 -1840 -1246 2771 1091 -2767 -392 3267 -756 -2487 1457 1845 -1466 -2156
2574 -2156 1653 1868 -2732 -1551 2820 463 -2828 -407 2479 -563 -3322 -361 2093 -1196 -2848
2589 -2848 1486 1984 -2523 -1873 1879 691 -3244 -926 2225 -60 -3009 33 2524 -1120 -3010
2604 -3010 1297 2205 -1747 -1335 1985 1456 -2141 -1301 2519 742 -2583 625 3050 -460 -1868 1298
2620 1298 2633 -870 -1937 2340 2313 -2188 -933 3071 1096 -2054 556 3153 -50 -2282 927
2635I27K068m160j002M101K39m117P52L728j294l768J983L583k669l107L376K039
2651B679m399n31L303R14m321O03L667q32m019J466L572k079l232K567L130l382
2667h94j805L609R32l739k84L553j92l572J162L636k161l231K999K557l032k223
2683b685L543J945l671j611M213M23m281J098L665j219l106J627K625k226k720
2698b380L180K178l917j131L973K63l717K46L487j77m044J427L983k785k757K931
2714G60J482l160j183K805J166k941o33L921j004l869J436M035k449l483K647
2729d70L477l648l061M751O92l264l13L309m60k922O90L490k970j510J608L265
2745B664k738k263M122l58l559r63M178P65m366J297L553j407l495J373L319k359
$$ plain form
2635 927 2995 -1165 -2167 1934 2173 -1944 -1192 2536 1242 -2526 -543 3040 371 -2736 640 2679
2651 2679 -1720 -2251 1052 1966 -2355 -1752 1915 1083 -2936 -1470 2102 23 -3209 -642 2488 -894
2667 -894 -2699 910 1842 -1897 -2181 1372 1180 -2392 -1230 2406 245 -2986 13 2570 -462 -2685
2683 -2685 858 2803 -868 -2479 1734 2157 -2124 -1026 2639 1420 -1686 -59 2566 340 -2380
2698 -2380 800 2978 -939 -2070 1903 2166 -1551 -1305 2182 2005 -2039 -612 3371 586 -2171 760
2714 760 2242 -918 -2101 704 1870 -1071 -1704 2217 1213 -2656 -1220 2815 366 -3117 -470
2729 -470 3007 -641 -3702 1049 1741 -1523 -1836 1473 1013 -1909 -1219 2271 -699 -2209 -601 2664
2745 2664 -74 -2337 1785 1427 -2132 -3095 1083 1848 -2518 -1221 2332 925 -2570 -1197 2122 -237
2761b37k071L161J394l146j134M049pl917Q21L676j135l362J643L236k719l182
2777b930L336K113k575k326L251J922l890o16L782Kl964Q98L911k997k911K843
2793a51K284k187k107L051J602l735j166M017r59k683N91L645j745l187J143M200
2809B613l707j218L036R37l219o20K973l5k224r98M367r41l939K250K809k163
2825g9k556K805K134l180j882L906J150l937M84L781j330l156J063L086j173l075
2841a959K530K298l246j549L243J258l441n89L589k97l429P65L656k008k883K161
2857I9K022j733k336K608J988l605q21L455K98l586M10L580j692l049K158J913
2873A709j548k250K127K186l025j690L079J104l196r34L392Q0l910J439L798k056
$$ plain form
2761 -237 -2308 853 2247 -899 -2033 2016 2009 -1908 -1087 2589 1454 -1908 -265 2971 252 -2930
2777 -2930 406 2519 -56 -2382 869 2791 -1099 -1715 2067 2069 -1895 -997 2914 -83 -2994 -151
2793 -151 2133 -54 -2161 890 2492 -1243 -2409 1608 649 -2034 -1443 2202 457 -2730 -1587 2613
2809 2613 -1094 -2312 724 1661 -1558 -2178 795 760 -1464 -2462 1905 964 -2975 -725 2084 -79
2825 -79 -2635 170 2304 -876 -2758 1148 2298 -1639 -1155 2626 1296 -1860 -797 2289 1116 -1959
2841 -1959 571 2869 -377 -1926 1317 2575 -866 -1455 2134 1837 -1592 -827 2829 821 -2062 99
2857 99 2121 388 -1948 660 2648 -957 -1778 1677 1975 -1611 -1201 2379 687 -2362 -204 1709
2873 1709 161 -2089 38 2224 -801 -2491 588 1692 -1504 -2438 954 1034 -2876 -1437 2361 305
2889C05k759K825J137k354j271K919J384l835r12M147k43l521R30K437r15k491
2905b217J468K545j956j953K842J133l196J62K519Nk672N27L293j667k958K100
2921b5K661k263k263K581J927k726j671L309L25l019k05L570j086k729J672K592
2937B650k443k403K243K463l129j399L490L96l453k10L157j76k814L89L206j203
2953G64l014K492J356k516r45K127J293l215l09L814p64l253P95L317j517k854
2969b429J688K523j958k251K945J228k863j114L031j38k200K29L032q87l319K013
2985d70L230k846k211L080J570k729k040L880L84l441M15L396j162k398O62K254
3001A574n40k887J886K128k344k241L239J544m066Q52K601Q3l759J043K753j281
$$ plain form
2889 305 -2454 371 1508 -846 -2117 802 2186 -1649 -2561 1586 1343 -2178 -1248 1189 274 -2217
2905 -2217 -749 1796 -160 -2113 729 1862 -1334 -1172 1347 1352 -1320 -793 2500 833 -2125 -25
2921 -25 2636 373 -1890 691 2618 -108 -1779 1530 1855 -1164 -1369 2201 1115 -1614 58 2650
2937 2650 207 -2196 47 2510 -619 -2018 1472 1868 -1585 -1795 1362 1186 -1628 -1239 1967 764
2953 764 -2250 242 1598 -918 -1863 264 1557 -1658 -1967 1847 1083 -2170 -1375 1942 425 -2429
2969 -2429 -741 1782 -176 -2427 518 1746 -1117 -2231 800 662 -1538 -1309 1723 836 -2483 -470
2985 -470 2760 -86 -2297 783 2353 -376 -2416 1464 1848 -1593 -1178 2218 1056 -1342 -680 1574
3001 1574 1034 -1853 33 2161 -183 -2424 815 2359 -1707 -855 1746 1829 -1930 -887 1866 585
3017E85k375K173J920k633j679K455J621l061o39K618L47k799l79L610j579k503
3033b318J457K606j891k820K581J072k112p87K897P91l642R59K972j260k309J094
3049g10K649j844k773K585K103k756r35K815L93l846O85L116K48k940k16M190
3065B764k077k757J953K761k676k317K932J667k472j044K277k55k045K05L344
3080B260q76l039J962J843j971k127K788J126l273l49L015j89k657M64L204j504
3096F77k533Q00K140j065l440L214K177k944q61K622Q16l433l62K811J339m024
3112b066J270K779j830k437K162J745j920k006K691R46k599l64K860m33k505P28
3128i79K801j534k430K151K152k611j915L194J171k703q83K876P36l136kK789
$$ plain form
3017 585 -1790 383 2303 -330 -2009 446 2067 -994 -1633 985 1332 -1467 -1846 1764 185 -2318
3033 -2318 -861 1745 -146 -2966 -385 687 -1425 -2212 685 1476 -2166 -1207 1765 505 -1804 -710
3049 -710 1939 95 -2678 -93 2010 -746 -1681 1134 1527 -2319 -1634 1482 1730 -1210 -1426 2764
3065 2764 687 -2070 -117 2644 -32 -2349 583 2250 -222 -1266 1011 756 -1289 -1084 2260
3080 2260 1384 -1655 307 2150 179 -1948 840 1966 -1307 -1656 1359 1170 -1487 -1023 2181 677
3096 677 -1856 -1056 1084 19 -3421 -207 1970 -974 -1835 787 1603 -1830 -2192 619 1958 -2066
3112 -2066 -796 1983 153 -2284 -122 1623 -297 -2303 388 1334 -1265 -1629 1231 798 -1707 -979
3128 -979 1822 288 -2142 9 2161 -450 -2365 829 2000 -703 -1586 1290 2026 -1110 -1112 1677
3144A677q05k309J359K009j591k210K789J291k662j103L122L30l396N50L000m56
3160A595l103J031K492j451k635K520J617k665q62K437J97k376l03L163n58l016
3176a917R26K768j857k246J983K149k121j950K278J759l108o92K789K36l051R92
3192a062K578j384k020J404K288k490j696L032J312k966l56K418L31k525l12K885
3208A437m47k690J233K438j666j682J898J641k589j242K658P08k473J58K489l09
3224A562l021R04K932k057j655J293K479k458j504K449J069k346p97K414J01l412
3240b047J532K665j584k637J929J921k009j523K082J428k482r07K755Q7l007O60
3256a137K668j060k262J264K281j925k354K562J707k840r22K588O09k620M4K313
$$ plain form
3144 1677 872 -1437 -78 1931 340 -1870 919 2210 -452 -1555 1567 1897 -1499 -949 2051 1595
3160 1595 -1508 -477 2015 564 -2071 449 2066 -599 -1461 976 1173 -1203 -1506 1657 1099 -1917
3176 -1917 -991 1777 -80 -2326 -343 1806 -315 -2265 13 1772 -1336 -2028 761 997 -2054 -1062
3192 -1062 1516 132 -1888 -484 1804 -686 -2382 650 1962 -1004 -1360 1058 1389 -1136 -1448 1437
3208 1437 990 -1700 -467 1971 305 -1377 521 2162 -427 -1669 989 1697 -776 -618 1871 1562
3224 1562 -1459 -555 2377 320 -1335 -42 2437 -21 -1525 924 1993 -353 -1150 1264 1365 -2047
3240 -2047 -515 2150 566 -2071 -142 1779 -230 -1753 329 1757 -725 -1632 1123 1210 -1797 -1137
3256 -1137 1531 471 -1791 -527 1754 -171 -2525 37 1744 -1096 -2018 570 1179 -1441 -1397 916
3272I16p0k868J429K355j661k078K238J264k189j251K586J125k945m20L045k48
3288A228k587P54K180r87j997J438K117k038j405K465N69k420k58K331K5k612
3304a197O78K533q71k751J576K252j906j841J920J526k183j191K328M68k760L78
3320a041K731j174k201J331J958j676j918J950J880k728j331K645R61k820j42
3335a575K747n84k239O08K136j383j475J806J506k303j176K391J098l023o9K939
3351A404n91k610O63K428q19k188J516J791j563j455K065J108k450n08K579J40
3367A510k785L63L046p58l121J742K493k352j926K235P08j566j335K477Q13k462
3383i18j12K748j049k010R69J986j415j986J955J865k295j529K619P43k738n2
$$ plain form
3272 916 846 -2022 -593 1762 101 -1977 261 1525 -664 -1915 671 1796 -1149 -1569 1476 1228
3288 1228 -1359 -605 1575 588 -1409 29 2146 108 -1297 1168 1737 -683 -941 1390 1415 -1197
3304 -1197 -519 2014 1143 -1608 -32 2220 314 -1527 393 1919 -264 -1455 873 1341 -1419 -1041
3320 -1041 1690 516 -1685 -354 1604 -72 -1990 -40 1840 -888 -2219 426 1387 -1433 -1575
3335 -1575 1172 588 -1651 -1043 1093 -290 -1765 41 1547 -756 -1932 459 1557 -1466 -1535 1404
3351 1404 813 -1797 -1134 1294 475 -1713 -197 1594 31 -1424 641 1749 -701 -1209 1370 1510
3367 1510 -1275 -912 2134 1376 -1745 -3 2490 138 -1788 447 1155 -411 -1746 731 1544 -918
3383 -918 -1030 1718 669 -1341 -372 1614 199 -1787 168 2033 -262 -1791 828 1571 -1167 -1219
3399a219K174M4k697O61K371j016k127J371J757k062q98J910R71k493l55K405
3415G97p5k280O02K217j024k105J222J963j565j484K094J069k381q23K498M29
3431A154k411K29K656o19k604R82K740k062j602J929J141j691j315K555P12k730
3447i36j40K811q96k004Q11K149r34k174J337J697j953j357K214R27k174k00K262
3464A440k57k057L55K185j232k284J852J719j963j339K080J247k176j435K624
3479G59L00k567L10K355r26j888J063J669j341j536J814J365k473o96K568P3k169
3496a320j29K472k21k503Q86K170j222j727J411J583j747j043K078O68k371J48
3512h67K088l39k112O23K125q55k043J292K119j752j727K032J398k507n29K054
$$ plain form
3399 -1219 955 999 -1698 -1037 1334 318 -1809 -438 1319 -743 -1641 269 1240 -1253 -1608 797
3415 797 722 -1558 -956 1261 237 -1868 -646 1317 -248 -1732 362 1431 -950 -1773 725 1154
3431 1154 -1257 -1028 1628 1009 -1595 -613 2127 65 -1537 392 1533 -158 -1473 1082 1794 -936
3447 -936 -1076 1735 839 -1165 -354 1795 861 -1313 24 1721 -232 -1589 625 1552 -622 -822 1440
3464 1440 1183 -874 -519 1666 434 -1850 2 1721 -242 -1581 499 1746 -430 -1865 759
3479 759 1059 -1508 -1198 1157 231 -1657 -594 1075 -266 -1802 12 1377 -1096 -1792 776 849 -1320
3496 -1320 -1449 1023 802 -1701 -815 1355 133 -1594 -183 1400 -347 -1390 688 1356 -1015 -867
3512 -867 1221 882 -1230 -607 1518 663 -1380 -88 2031 279 -1448 584 1982 -525 -1054 1000
3528A000L00k283L21K213q23j757J068J634j472j436J694J045k139q66K457N60
3544A516k669L5K482n02k164O66K044j368j635J690J205j983r10K218K86k233
3560a322J54K266k30k691O41K646j190k071J436J861j988j221J841J051j873n58
3576a248K195l21k078Q10J935j033j514J366J539j729j518K002J027k022o78K138
3592H71M45k116L79J738m52j851O31K188j509j417J807J068k011o31K035L58k290
3609g57%K042r2k341N81K102j167j787J298J643j827j224J923R03k024l80J965
3626H58Kk385O60K144r62j965J292J613j680j045J468J150k120o91K518J8k062
3643a187K70K049q02k082J343J759j253j883J948J252k077n82J869M67j889p8
$$ plain form
3528 1000 1300 -983 -662 1551 728 -1029 39 1673 201 -1235 459 1504 -635 -1501 956 1516
3544 1516 -1153 -1118 1364 862 -1302 -636 1408 40 -1595 95 1300 -683 -1593 625 911 -1322
3560 -1322 -1168 1098 868 -1823 -1182 1464 274 -1797 -361 1500 -488 -1709 132 1183 -690 -1248
3576 -1248 947 626 -1452 -642 1293 260 -1254 112 1651 -78 -1596 406 1433 -589 -1267 871
3592 871 1316 -800 -421 1317 865 -986 -355 1833 324 -1093 714 1782 -229 -860 1175 1533 -757
3609 -757 -757 1285 1193 -1148 -567 1535 368 -1419 -121 1522 -305 -1529 394 1297 -727 -1107 858
3626 858 860 -1525 -865 1279 317 -1648 -356 1257 -423 -1468 0 1150 -970 -1661 857 875 -1187
3643 -1187 -917 1132 330 -1752 -409 1350 97 -1786 162 1414 -663 -1245 624 1091 -798 -876
3659h76J950j61k199R04J799j101j822J823J351k051p84J998P62k321l56K316
3675A232k01k046P27K019j386j504J319J209j372j271J837J003k217k75K001J16
3691A191k443N10J895m15k059J043J538j354j238J489Q60j584q50K258J01k210
3707a268L87J944o65k074R92J857j545j312J485J439j882r92K044O21j764n32
3723a265J878J18k076O92K157j348j674J612J269j775j179K120J032k283n29K158
3739I07J65k041N55J788o83j673J104J363j178j159J436J064k325n21K266k4j986
3756i42K18K405q54j980O03K249j319j793J665J126j572r85K010K25k183M24K109
3773A406r25j799J149J351j204j736J503J602j743j140J701Q07j738n07J937J0
$$ plain form
3659 -876 1074 913 -1286 -382 1417 316 -1506 317 1668 -383 -1167 831 1593 -728 -1084 1232
3675 1232 1031 -1015 -288 1731 345 -1159 160 1369 -3 -1274 563 1566 -651 -926 1075 1191
3691 1191 -1252 -742 1153 738 -1321 -278 1260 -94 -1332 157 1017 -567 -1417 841 942 -1268
3707 -1268 -881 1063 398 -1676 -684 1173 -372 -1684 -199 1240 -642 -1634 410 1031 -733 -1265
3723 -1265 613 731 -1345 -653 1504 156 -1518 94 1363 -412 -1591 529 1561 -722 -1251 907
3739 907 1072 -969 -414 1374 691 -982 122 1485 307 -852 584 1648 -677 -1198 1068 1044 -942
3756 -942 -724 1681 827 -1153 -550 1699 380 -1413 252 1378 -194 -1179 831 1056 -1127 -703 1406
3773 1406 481 -1318 -169 1182 -22 -1758 -255 1347 -396 -1536 165 972 -766 -1273 664 674
3789F74k044K96K318j006j789J223J482j529r61J666Q04j828n19J870J68j865
3805a040L44J863m70j892Q85J608j307j347J787J175k121m49J757M83k229n4K389
3822A382n11k131J123J407r32j529J254K016k408q73J444P62j680J66J892p85
3838E97j886Q55J563j42k518J259J608j777o18J613P18k141j11J759q2j846L49
3855h00J997q48k145J582J694j789j044J510J020j960m58J650J84j618j59J929
3871G45l18j784J067J496j228j433J496J169j794o09J818O21k029m13K009M4j706
3888h49L91J676p89j460J178J233j428p40J672L56j780n8J859l1k328P36J925
3905A563j119j885J390J655j301j479J501R83j815n51J893p2j422j76K065m52
$$ plain form
3789 674 -1370 -1074 1244 238 -1551 -328 1154 -375 -1336 330 1134 -694 -1213 657 825 -1040
3805 -1040 -696 1167 697 -1195 -310 1298 -9 -1356 431 1606 -515 -964 793 1276 -953 -1007 1382
3822 1382 871 -1260 -137 1270 338 -1191 63 2079 -329 -1202 242 1004 -676 -510 1382 597
3838 597 -1289 -434 1129 987 -1531 -272 1336 -441 -1059 554 1272 -869 -980 779 697 -1149 -800
3855 -800 1197 349 -1796 -214 1480 -309 -1353 157 1177 -783 -1241 409 593 -1025 -1184 745
3871 745 427 -1357 -290 1206 -22 -1455 41 1210 -584 -1193 625 1246 -783 -1196 813 857 -849
3888 -849 -458 1218 429 -1031 147 1380 -48 -788 884 1240 -540 -598 1261 1230 -1098 -362 1563
3905 1563 444 -1441 -51 1604 303 -1176 325 1308 -507 -1058 835 763 -659 -835 1230 778
3921G78k025R62J809j716j220J669R90j929o44J823N72k126r2J904l58j636P61
3938d78J381r14j302J393Q42j479j164K110O53j934O2J617n5j873O31J521l96
3955F15j820R86J370j415o56J111O65j148p98J879J05j738L92J731o97j895J051
3972b62J840j270j584J502J377j621r12J930L04j662l44J694k56j660N29J727
3988A332j054j484J401J300j962p68J696Q83k339M9K087n73j801Q75J506p66j744
4005a362J019J481j463q32J356O02j685k89J920m7j912M21J698o79j710J118J499
4022A135j235j210J284J049j670o12K099J45k033K51J749o33j554J035J267o58
4038D09j855J925Q52j607o29J569N54j826j44J897j24k000N73J647r80j150J091
$$ plain form
3921 778 -1247 -285 1524 -192 -1412 257 1247 -682 -1326 497 1069 -1057 -1149 755 397 -1239 -478
3938 -478 903 -11 -1313 80 922 -557 -1721 389 1042 -892 -830 787 732 -1141 -510 1011 615
3955 615 -1205 -219 1151 -264 -920 191 856 -292 -1090 789 894 -844 -452 1279 582 -1313 -262
3972 -262 1578 308 -1276 226 1603 -18 -930 1000 1304 -358 -702 992 736 -924 -395 1332
3988 1332 278 -1206 195 1495 -467 -1235 461 1344 -995 -946 1141 568 -1233 -358 1148 382 -1362
4005 -1362 -343 1138 -325 -1157 199 801 -884 -1173 747 700 -1212 -791 907 228 -1482 -364 1135
4022 1135 -100 -1310 -26 1023 -647 -1259 840 985 -1048 -797 952 319 -1235 -200 1067 409
4038 409 -1446 479 1331 -276 -905 664 1218 -608 -752 1145 1021 -979 -406 1241 261 -889 202
4055B02J450j686q09J402O58j836k24J496K12j793L34J841p13j526J168P05j131
4072b50q85J388J044j871k90J460J77k008N98J367k33k071J328R62p42j403J595
4089A66M77j364l40J439L57j632J29J653j93k159Q59J775j027j507J252J143j352
4106c24n20J284L89j408k32J905l59j636N71J526n59j552R28J549j605r71J404
4123C90R50j624j004K171j19j384N95J066o27j406J091R38j142j107J467J096
4139A351j868o22J818K44j975K33J546j90j560N85J418n68j636J357P71j371n84
4156a051J469P5j586J23J592k14j731P29J693j496j090J706k69o75l67J285M98
4173F91j668K43J074L20j633N70J473r42j259J183J028j153j185J577Q04j757
$$ plain form
4055 202 1652 -34 -843 559 1217 -619 -843 653 865 -928 -594 1247 534 -992 176 881 -250
4072 -250 -1135 253 1297 -574 -864 596 773 -1235 -637 730 497 -1574 -246 716 -26 -1429 166
4089 166 643 -721 -1061 378 735 -897 -768 885 692 -1467 -608 1167 140 -1367 -115 1028 -324
4106 -324 -844 440 829 -579 -811 1094 735 -901 -330 1196 637 -915 13 1562 -43 -1014 390
4123 390 1340 -284 -1288 883 764 -620 -25 1041 414 -992 99 1037 -105 -1212 255 1351
4139 1351 -517 -1139 679 923 -1052 -819 727 537 -1023 -438 980 412 -1224 133 904 -467 -1051
4156 -1051 418 493 -1093 -970 622 408 -1323 -594 1099 -397 -1487 219 -50 -725 -1092 193 691
4173 691 -977 -734 340 660 -973 -403 1070 128 -1131 52 1080 -73 -1258 319 1123 -634
4189f34l19J784L41k043J71J653k62j482N60J574j143j428J612P16j257n03J401
4206G41K74j850L21J590n37j490P23J634j113j165J045J110j274q76J288N97j880
4223h62R6J691k86j488N80J023p94j439J268J111j180j005J614M24j487l18J735
4240F83rj661L71J384m81j660J256Q09r11r18J199R51j578k69J517nj522j9J773
4259I10l81j399P28J178r64r96J293R03j491n94J320L76j323k9J337o8j486L72
4277c14J487r18r23Q00J016r38j073J361P34j745l49J865k57j609N34J484n45
4294F10j043K77J036j021j001J630L92j451k82J470Rj597K38J457m04j730Q82
4311e28J622r54j429J226R87j417o88J288P39j691jJ619o11j093M35J324j031
$$ plain form
4189 -634 -953 831 1172 -871 -700 953 691 -791 -231 1343 200 -1228 384 1100 -157 -660 741
4206 741 1015 -835 -514 1076 539 -951 -228 1406 293 -872 173 1283 9 -867 421 1018 -862
4223 -862 -766 925 639 -849 -269 754 -40 -1479 -211 900 -280 -1285 329 753 -734 -1052 683
4240 683 674 -987 -616 768 287 -1373 -117 692 -219 -1137 62 1013 -565 -834 683 678 -844 -863 910
4259 910 529 -870 -142 1036 72 -924 369 1272 -219 -813 507 883 -440 -469 868 800 -686 -314
4277 -314 1173 255 -668 132 1148 210 -863 498 1232 -513 -862 1003 746 -863 -329 1155 610
4294 610 -433 -156 880 -141 -1142 488 880 -571 -853 617 626 -971 -733 724 320 -1410 -528
4311 -528 1094 140 -1289 -63 924 -493 -1181 107 846 -845 -846 773 162 -931 -496 828 -203
4328b03q78J007J056j321o01J496N25j695j37J605j47j389J63J603p49j335R83
4345a7J081j182o86J226O80j377n68J935j03j676L38J565o55j558J005J105q78
4362B35j009J034N89r90o68J383J48j284k38J643m55j753J181J243p51j532J105
4379a19J215j323j004J528N70j836J43J269j48j104J12J319o56r73Q64Q75j194
4396d62p11J237O61j319k45J385K22j704K44J576m27j504Q81J176r33j165J260
4413A72P31j246l32J211K32j406K66J384o36j374Q45J362n20j383P87R00r90o93
4431f90J259M82j597j07J336L8j329M31J125q61j152J134Q88j251n84J307J75
4448F04j055l31J481Lj448k2J509n08j333J081Q29j026r16J089J054j537o12J565
$$ plain form
4328 -203 -1081 -74 982 -339 -940 556 1081 -614 -751 854 707 -682 -519 1084 335 -1000 -17
4345 -17 1064 -118 -804 422 1102 -275 -843 1092 989 -687 -349 1216 561 -997 8 1113 235
4362 235 -774 260 849 -141 -809 574 722 -562 -800 843 388 -1365 -184 1059 308 -1224 -119
4379 -119 1096 -227 -1231 297 867 -969 -826 443 295 -809 -697 622 -34 -1007 -143 732 -462
4396 -462 -1173 64 725 -594 -839 546 768 -936 -692 884 457 -1047 -166 1010 77 -1088 172
4413 172 903 -343 -675 536 768 -638 -372 1012 376 -998 -153 1209 689 -694 93 993 3 -690
4431 -690 569 1051 -546 -653 683 721 -608 -177 948 87 -1065 69 957 -294 -878 429 604
4448 604 -451 -782 699 702 -746 -768 741 233 -1100 -19 810 -216 -1132 -43 1011 -526 -1138 427
4466D27K96j636J20J332j90j560J099Q11p42j015J329O04j649l72J587M61j486
4483e84q0J553l11j318M77J346r28j162J233R00j429n85J288L83j331j72J504
4500G84k08j386M37J475o40j229R52P11q87p31J198L53j206n41J599k26j213K91
4518d67J571n41j795J074J143j098r11J294N04j191o72J645J07j501j07J555l10
4535C00j337O63J070p89q74Q87R92j270o99J395L34j469q7J533k10j411O95J272
4553I95j017j012R02R47j034q06J333L18j103q4J117P7j718O40J164n72r65P99
4571a9J281q91j324J277O74j100o62J359L14j468K66R85K9j231O17Q78r15j053
4589i83J163R93j450n23J182M80j332j72J138K38j642O47J270p16j261J102N28
$$ plain form
4466 427 723 -913 -793 539 349 -1211 -112 699 -43 -1058 271 875 -774 -1146 441 902 -584
4483 -584 -664 889 578 -740 -263 1083 155 -1007 226 1126 -303 -888 400 783 -548 -720 784
4500 784 576 -810 -373 1102 462 -767 185 896 9 -722 476 829 -377 -918 681 455 -758 -467
4518 -467 1104 563 -1232 -158 985 -113 -1024 270 774 -417 -1089 556 663 -838 -945 610 300
4535 300 -1037 -374 696 -93 -967 -80 912 -358 -1057 338 672 -797 -884 649 439 -972 -277 995
4553 995 -22 -1034 -132 815 -219 -1025 308 626 -477 -561 556 633 -1085 -445 719 147 -818 -19
4571 -19 1262 371 -953 324 998 -102 -764 595 909 -559 -293 692 721 -510 107 985 70 -983
4589 -983 180 1173 -277 -800 382 862 -470 -642 496 734 -908 -261 1009 293 -968 134 662
4606F62r71n33J193M29j627%J523N0j879N71J253p60r27O84J266r27j135J217
$$ plain form
4606 662 -309 -842 351 780 -847 -847 676 726 -1153 -582 671 -89 -1016 -332 934 7 -1128 89
$$ [...]
8191I4
##END NTUPLES=NMR FID
##END=
