##TITLE=1H_SAV-32-singlet-bat23(2)
 CDCl3, 8 sc, 
 26.11.2020
##JCAMPDX= 6.0         $$ Bruker NMR JCAMP-DX V2.0
##DATA TYPE= NMR FID
##DATA CLASS= NTUPLES
##ORIGIN= UXNMR, Bruker Analytische Messtechnik GmbH
##OWNER= root
$$ XWIN-NMR		Version 3.5
$$ Thu Nov 26 11:00:59 2020 Russian Standard Time (UT+4h)  she@DPX200
##.OBSERVE FREQUENCY= 200.1315066352
##.OBSERVE NUCLEUS= ^1H
##.DELAY= (6, 6)
##.ACQUISITION MODE= SIMULTANEOUS
##.ACQUISITION SCHEME= undefined
##.AVERAGES= 8
##.DIGITISER RES= 18
##SPECTROMETER/DATA SYSTEM= spect
##.PULSE SEQUENCE= zg30
##.SOLVENT NAME= CDCl3
##.SHIFT REFERENCE= (INTERNAL, CDCl3, 0, 15.7039)
##AUDIT TRAIL= $$ (NUMBER, WHEN, WHO, WHERE, WHAT)
$$ ##TITLE= Audit trail, XWIN-NMR		Version 3.5
$$ ##JCAMPDX= 5.01
$$ ##ORIGIN= Bruker BioSpin GmbH
$$ ##OWNER= she
$$ F:/spectra/data/she/nmr/H-F/1/audita.txt
$$ ##AUDIT TRAIL=  $$ (NUMBER, WHEN, WHO, WHERE, WHAT)
(   1,<2020-11-26 10:59:44.70 +0400>,<she>,<DPX200>,
      <created by zg, POWCHK disabled, PULCHK disabled
       configuration hash MD5:
       00 E9 B6 7A A2 85 ED C7 34 08 36 98 17 FE 4E 26
       data hash MD5: 16K
       D1 15 D1 BE 07 A5 3D EA E9 3B 97 CD E0 62 F4 D3>)
$$ ##END=
$$ 
$$ hash MD5
$$ 66 82 04 1B AE 4C 6F B3 1F E3 C2 DE 18 2D 6D 36
##$RELAX= 
##$RELAX= 
##$RELAX= 
##$RELAX= 
##$RELAX= 
##$RELAX= 
$$ Bruker specific parameters
$$ --------------------------
##$DU= <F:/spectra>
##$EXPNO= 1
##$NAME= <H-F>
##$PROCNO= 1
##$TYPE= <nmr>
##$USER= <she>
##$AMP= (0..31)
100 100 100 100 100 100 100 100 100 100 100 100 100 100 100 100 100 100 
100 100 100 100 100 100 100 100 100 100 100 100 100 100 
##$AQSEQ= 0
##$AQ_mod= 1
##$AUNM= <au_zg>
##$AUTOPOS= <>
##$BF1= 200.13
##$BF2= 200.13
##$BF3= 200.13
##$BF4= 200.13
##$BF5= 200.13
##$BF6= 200.13
##$BF7= 200.13
##$BF8= 200.13
##$BYTORDA= 1
##$CFDGTYP= 0
##$CFRGTYP= 5
##$CHEMSTR= <none>
##$CNST= (0..31)
1 1 145 1 1 1 1 1 1 1 1 1 1 1 1 1 1 1 1 1 1 1 1 1 1 1 1 1 1 1 1 1 
##$CPDPRG= <>
##$CPDPRG1= <>
##$CPDPRG2= <>
##$CPDPRG3= <>
##$CPDPRG4= <mlev>
##$CPDPRG5= <mlev>
##$CPDPRG6= <mlev>
##$CPDPRG7= <mlev>
##$CPDPRG8= <mlev>
##$CPDPRGB= <>
##$CPDPRGT= <>
##$D= (0..31)
0 1.2 0 0 0 0 0 0 0 0.06 0 0.03 0 0 0 0 0.0002 0 0 0 0 0 0 0 0 0 0 0 0 
0 0 0 
##$DATE= 1606373984
##$DBL= (0..7)
120 120 120 120 120 120 120 120 
##$DBP= (0..7)
150 150 150 150 150 150 150 150 
##$DBP07= 0
##$DBPNAM0= <>
##$DBPNAM1= <>
##$DBPNAM2= <>
##$DBPNAM3= <>
##$DBPNAM4= <>
##$DBPNAM5= <>
##$DBPNAM6= <>
##$DBPNAM7= <>
##$DBPOAL= (0..7)
0.5 0.5 0.5 0.5 0.5 0.5 0.5 0.5 
##$DBPOFFS= (0..7)
0 0 0 0 0 0 0 0 
##$DE= 6
##$DECBNUC= <off>
##$DECIM= 32
##$DECNUC= <off>
##$DECSTAT= 4
##$DIGMOD= 1
##$DIGTYP= 9
##$DL= (0..7)
0 120 120 120 120 120 120 120 
##$DP= (0..7)
150 150 150 150 150 150 150 150 
##$DP07= 0
##$DPNAME0= <>
##$DPNAME1= <>
##$DPNAME2= <>
##$DPNAME3= <>
##$DPNAME4= <>
##$DPNAME5= <>
##$DPNAME6= <>
##$DPNAME7= <>
##$DPOAL= (0..7)
0.5 0.5 0.5 0.5 0.5 0.5 0.5 0.5 
##$DPOFFS= (0..7)
0 0 0 0 0 0 0 0 
##$DQDMODE= 0
##$DR= 18
##$DS= 0
$$ [...]
##$SUBNAM2= <"">
##$SUBNAM3= <"">
##$SUBNAM4= <"">
##$SUBNAM5= <"">
##$SUBNAM6= <"">
##$SUBNAM7= <"">
##$SUBNAM8= <"">
##$SUBNAM9= <"">
##$SW= 16.9725356469052
##$SWIBOX= (0..15)
0 0 2 0 0 0 0 0 0 0 0 0 0 0 0 0 
##$SW_h= 3396.73913043478
##$TD= 16384
##$TD0= 1
##$TE= 0
##$TE2= 300
##$TE3= 300
##$TEG= 300
##$TL= (0..7)
0 120 120 120 120 120 120 120 
##$TP= (0..7)
150 150 150 150 150 150 150 150 
##$TP07= 0
##$TPNAME0= <>
##$TPNAME1= <>
##$TPNAME2= <>
##$TPNAME3= <>
##$TPNAME4= <>
##$TPNAME5= <>
##$TPNAME6= <>
##$TPNAME7= <>
##$TPOAL= (0..7)
0.5 0.5 0.5 0.5 0.5 0.5 0.5 0.5 
##$TPOFFS= (0..7)
0 0 0 0 0 0 0 0 
##$TUNHIN= 0
##$TUNHOUT= 0
##$TUNXOUT= 0
##$USERA1= <user>
##$USERA2= <user>
##$USERA3= <user>
##$USERA4= <user>
##$USERA5= <user>
##$V9= 5
##$VALIST= <valist>
##$VCLIST= <CCCCCCCCCCCCCCC>
##$VD= 0
##$VDLIST= <DDDDDDDDDDDDDDD>
##$VPLIST= <PPPPPPPPPPPPPPP>
##$VTLIST= <TTTTTTTTTTTTTTT>
##$WBST= 1024
##$WBSW= 4
##$XGAIN= (0..3)
0 0 0 0 
##$XL= 0
##$YL= 0
##$YMAX_a= 389757
##$YMIN_a= -341133
##$ZGOPTNS= <>
##$ZL1= 120
##$ZL2= 120
##$ZL3= 120
##$ZL4= 120
##$ABSF1= 10
##$ABSF2= 0
##$ABSG= 5
##$ABSL= 3
##$ALPHA= 0
##$AQORDER= 0
##$ASSFAC= 0
##$ASSFACI= 0
##$ASSFACX= 0
##$ASSWID= 0
##$AUNMP= <proc_1d>
##$AZFE= 0.1
##$AZFW= 0.1
##$BCFW= 1
##$BC_mod= 2
##$BYTORDP= 1
##$COROFFS= 0
##$CY= 11.3945322036743
##$DATMOD= 1
##$DC= 2
##$DFILT= <>
##$DTYPP= 0
##$F1P= 15.9154993809931
##$F2P= -4.1035820241983
##$FCOR= 0.5
##$FTSIZE= 0
##$FT_mod= 4
##$GAMMA= 1
##$GB= 0.15
##$INTBC= 1
##$INTSCL= 1
##$ISEN= 128
##$LB= 0.24
##$LEV0= 0
##$LPBIN= 0
##$MAXI= 10000
##$MC2= 0
##$MEAN= 0
##$ME_mod= 0
##$MI= 1.114404
##$NCOEF= 0
##$NC_proc= 0
##$NLEV= 6
##$NOISF1= 3.799351
##$NOISF2= 2.8
##$NSP= 1
##$NTH_PI= 0
##$NZP= 0
##$OFFSET= 15.70392
##$PC= 1
##$PHC0= -11051.03
##$PHC1= 14.40088
##$PH_mod= 1
##$PKNL= yes
##$PPARMOD= 0
##$PSCAL= 0
##$PSIGN= 0
##$REVERSE= no
##$SF= 200.130013532006
##$SI= 16384
##$SIGF1= 3
##$SIGF2= 2
##$SINO= 400
##$SIOLD= 16384
##$SREGLST= <1H.CDCl3>
##$SSB= 0
##$STSI= 0
##$STSR= 0
##$SW_p= 3612.71676300578
##$SYMM= 0
##$S_DEV= 0
##$TDeff= 0
##$TDoff= 0
##$TI= <>
##$TILT= no
##$TM1= 0
##$TM2= 0
##$TOPLEV= 0
##$USERP1= <user>
##$USERP2= <user>
##$USERP3= <user>
##$USERP4= <user>
##$USERP5= <user>
##$WDW= 1
##$XDIM= 8192
##$YMAX_p= 0
##$YMIN_p= 0
$$ End of Bruker specific parameters
$$ ---------------------------------
##NTUPLES= NMR FID
##VAR_NAME=  TIME,          FID/REAL,        FID/IMAG
##SYMBOL=    X,             R,               I
##VAR_TYPE=  INDEPENDENT,   DEPENDENT,       DEPENDENT
##VAR_FORM=  AFFN,          ASDF,            ASDF
##VAR_DIM=   8192,          8192,            8192
##UNITS=     SECONDS,       ARBITRARY UNITS, ARBITRARY UNITS
##FACTOR=    0.0002944,     1,               1
##FIRST=     0,             0,               0
##LAST=      2.4114304,     0,               0
##MIN=       0,             -341133,         0
##MAX=       2.4114304,     389757,          0
$$ Real data points
##PAGE= N=1
##DATA TABLE= (X++(R..R)), XYDATA
0 0 0 0 0 0 0 0 0 0 0 0 0 -8 8 -8 8 -13 16 -17 24 -32 34 -40 51 -62 72 -85 99 -116 134 -155 179 -204 234
33 234 -266 301 -341 384 -431 486 -542 605 -675 750 -831 922 -1021 1128 -1244 1372 -1513
50 -1513 1666 -1833 2020 -2226 2453 -2707 2989 -3311 3677 -4096 4587 -5163 5855 -6703 7762
65 7762 -9120 10919 -13328 16334 -30793 389757 -131025 -116603 265162 -225075 122694
76 122694 48681 -234837 154635 9955 -71087 96822 -93469 68542 40049 -106554 74494
87 74494 8365 -44287 62491 -38405 -11727 62380 -17477 -11589 40717 -18063 1543 12127
99 12127 -30545 47498 11812 -48465 61888 -1374 -30396 11544 -29973 65614 -10365 -76687
111 -76687 89520 -2815 -32429 18920 -43201 76360 -9419 -97549 66990 -5038 -19345
122 -19345 5244 -47382 74315 -12168 -60088 54068 -44407 11335 26983 -74674 49783
133 49783 2427 -39881 35283 -57595 16266 36256 -69033 35671 4715 -24197 41299 -61616
145 -61616 6059 50494 -74294 22859 37095 -38736 32966 -13396 -7557 42227 -60827 2784
157 2784 57475 -49444 5645 26570 -16342 37197 -32379 -21317 80275 -34816 -27345 57443
169 57443 -29151 17223 14040 -54882 63549 5358 -51500 56681 -28197 -1915 57201 -63086
181 -63086 25613 37106 -50358 38366 -25526 -17761 70777 -53026 -9401 43569 -29283 19135
193 19135 -20758 -11626 51129 -46379 -14069 24196 -25053 16977 -14341 521 36973 -44526
205 -44526 -1851 18579 -36001 5994 -6402 2730 22210 -39314 2511 22026 -30203 3292
217 3292 368 -3585 23424 -23433 -13517 23847 -15501 -760 7254 -23258 21840 13605 -27655
230 -27655 10810 3770 7140 15651 -42070 15109 41148 -34220 4164 7138 3348 32196 -43180
243 -43180 5397 50776 -34150 11357 7441 -18842 35152 -32032 -2292 43366 -39223 26899
255 26899 24873 -38060 33061 -13959 -13005 37678 -47306 9883 38456 -44139 20769 6269 -25412
268 -25412 37944 -23111 -17771 29477 -32352 11329 14796 -43918 30570 14443 -34012 13032
280 13032 -16692 3973 27715 -51735 -171 38056 -31015 -6075 -1025 226 27042 -33196
292 -33196 -10883 27287 -22386 4515 4144 -12147 26017 -17212 -12087 18199 -27524 9439 19055
305 19055 -19036 15452 -295 -676 14375 -26291 13289 18784 -22614 18399 -601 -12758 24387
318 24387 -11043 2643 17610 -17897 19148 9172 -25388 13665 9645 1580 -1453 -17046 28941
331 28941 13325 -30320 13208 11989 -4279 163 -22190 12402 17571 -24445 6602 7481 -5646
344 -5646 8567 -17025 3443 10357 -19786 14209 -3168 -22227 24555 -11465 -17779 14461 -17000
357 -17000 10061 7311 -30434 22202 616 -27905 17743 -10304 -4118 14373 -24672 15781
369 15781 4758 -34026 28666 98 -26368 23878 -9809 -57 12543 -33975 21439 19672
381 19672 -35120 17282 11107 -5265 13608 -22050 9855 20354 -27491 12764 9201 -13093
393 -13093 20848 -10020 -6268 21926 -8927 8473 7394 -16333 17196 2519 -13629 6945
405 6945 2368 12518 -1756 -17458 20352 3471 -15959 9107 -2640 2997 4248 -16017 12671
418 12671 3571 -15739 14899 -2939 -12218 4461 -7687 9666 -3177 -18648 22671 -2694
430 -2694 -24803 5019 -7743 4602 6377 -18680 16350 6550 -18991 3729 -11225 -3836 10125
443 10125 -13522 3767 696 -5349 18756 -15725 -13119 23371 -7638 -7308 -50 -6592 23022
456 23022 -4710 -19685 23761 770 -7819 6011 -11899 15800 3696 -18012 23995 -3724
468 -3724 -12178 27122 -11789 -3632 15937 -12278 16651 -572 -19746 28264 -136 -13617 12494
481 12494 -8696 9005 3227 -19999 17867 3482 -9076 17019 -10821 -6138 14149 -10328
493 -10328 -3111 523 -3145 15149 -6919 -17192 10060 3715 -7163 -9092 -2365 17492 -5861
506 -5861 -18266 10183 -1475 -7906 1389 -9099 6788 2939 -10152 8701 -7531 -8946 9662
519 9662 -10212 -2452 734 -3667 16516 -10093 -10081 20106 -7968 -5799 4837 -8765 11114 -1374
533 -1374 -8573 14358 -4844 193 11024 -10276 2786 3206 -1132 10316 -11279 2872 23113
546 23113 -11883 -5589 11194 78 5350 -8719 -2475 19847 -5627 -4858 9695 -2437 5861
559 5861 -4976 -9372 13881 -7869 -1933 16304 -12347 1263 10535 -13478 727 -4534 -4939
572 -4939 14386 -12813 -4140 17819 -10466 -3834 1118 -10399 9018 -6449 -10343 16920 -9295
585 -9295 -8641 13289 -13848 -4697 6214 -7440 7111 -6709 -6452 17372 -11267 -10248 8919
598 8919 -2848 5849 -7005 -6697 20019 -8554 -9676 11036 -4927 4153 878 -6476 9058 -3834
612 -3834 392 7606 -8027 7159 7511 -2140 2978 -5822 7151 9121 -13885 2474 12781 -1193
626 -1193 -1158 -1657 4885 7151 -7197 -142 7247 -4552 1567 4359 -3948 3147 232 -293 5308 -11835
642 -11835 434 15214 -10794 -5533 5003 -2435 4375 -11781 -3364 16135 -8731 -3351 1412
655 1412 -8852 7153 -7821 -6451 9986 -11329 5603 5204 -20120 5637 3402 -6569 2987
668 2987 -10985 9501 10269 -19978 2894 6379 -5584 4488 -9187 1844 13310 -12379 624
681 624 8351 -9314 6209 5842 -6438 3980 57 3272 5961 -11157 4023 13952 -6198 -1905
695 -1905 3167 4072 7641 -9167 -1478 11785 -4968 -40 5083 -2037 7410 2497 -1826 897 -6090
710 -6090 6226 3803 -9811 3943 4903 1668 -1224 -12533 8323 8677 -14646 1276 4624 -2645
724 -2645 1644 -9503 2022 6192 -10544 4830 332 -10695 5921 -3900 -5084 2900 -8143
737 -8143 7963 3631 -16548 4875 4166 -7698 -97 -3977 5311 4824 -10712 2817 2939 -6740
751 -6740 3239 -1332 -1569 3584 -2386 3826 1148 -6800 9744 5179 -8503 1230 3760 3206 186
766 186 -6140 8918 7416 -8634 1793 4595 605 4529 -5269 4405 7295 -8076 6124 5021
780 5021 -7168 7771 1556 -2381 2942 -4239 6797 2268 -10811 7196 3376 -3908 511 -5657
794 -5657 4709 2266 -10114 4849 4112 -5693 1145 -2308 -1943 -2157 -3267 3746 -4281 -4881 7290
809 7290 -1417 -6189 -1654 -448 4117 -4479 -8772 7018 3434 -7598 -1786 1280 2881 -1417 -6970
824 -6970 4866 1113 -6513 6051 -1642 -4476 8308 -1389 -783 1703 -4847 9006 826 -11172
838 -11172 8188 4847 -2396 979 -2663 8483 2886 -9184 6253 2915 -2863 6400 -968 1188
852 1188 4609 -2253 3753 -1300 -5641 7239 4325 -4282 -1369 4175 6074 -6290 -6918 6912 2083
867 2083 -3460 -555 -1676 4532 -434 -7326 2492 -844 -3077 4635 -4259 -4502 2830 -1160 430
882 430 -6749 -4056 11062 -4957 -9634 5514 -34 80 -3024 -7630 6792 334 -8322 3653
896 3653 -224 -944 2961 -2842 171 -1515 -1140 6636 -5292 -4920 9317 1075 -3267 175 695 7993
912 7993 -2119 -8108 6378 3225 -1804 2717 620 5543 1775 -3910 4123 -3125 -1693 9286
926 9286 -2818 -1696 5729 576 3733 -4432 -4793 10467 -1708 -7088 4143 3045 3428 -2628 -3868
941 -3868 5594 -2637 -4775 3261 -2278 184 2824 -1840 -374 -3464 -1847 4107 -4477 -5315 4153
956 4153 1593 -3356 -5198 163 5502 -5384 -4940 4543 -1562 -1643 -1474 -3122 2977 -1837 -1930 3537
972 3537 -5018 -1356 4516 -3638 -573 36 2194 5157 -8151 -1762 10027 -3920 -2802 4036 624
987 624 4435 -2414 -3205 7914 -739 -2374 4722 -964 821 2800 16 3667 -1979 491 7006
1002 7006 -5588 -2719 7276 976 -12 -1378 401 6495 -4462 -4128 5306 738 337 -968 -301
1017 -301 3477 -4495 -836 2976 -6040 1283 4019 -3718 -1372 -1552 1273 1549 -8341 -1776 5718 -2009
1033 -2009 -4168 -1681 2333 1443 -6950 -2518 3953 -3150 -1641 1529 -3735 565 1624 -1627 75
1048 75 -3274 681 4294 -5964 -3642 4010 1297 -77 -4630 3305 8898 -5759 -1773 4681 -507
1063 -507 3515 -580 -374 6014 -2336 1451 3068 -5008 2476 3821 -1439 -430 -1806 6965 4726
1078 4726 -8221 1176 6086 -1896 -1561 -1141 3143 5526 -3174 -1653 3042 -2065 -248 1526 -2130
1093 -2130 746 1395 103 -1121 -5769 2369 5785 -5351 -3409 2815 1088 -1993 -6518 443 4754
1108 4754 -3638 -1684 516 -1168 73 -2740 -1583 241 -3935 2392 671 -6232 681 3857 162
1123 162 -2143 -4832 3985 2667 -7038 -23 4759 401 -687 -2928 1695 3549 -3637 1111 3135
1138 3135 -2433 2980 2447 -2816 1320 1457 3512 1380 -5159 3548 5406 -3619 -844 1957 4402
1153 4402 2159 -5201 2683 4469 -3655 589 1274 56 1678 -899 1204 -192 -2713 3212 793
1168 793 -4205 155 2257 903 -2688 -3322 3458 1629 -6180 -1164 3519 -514 -2240 -1960 692 355
1184 355 -4023 -524 970 -2770 882 515 -2368 -1587 -1680 2466 -1148 -5903 3486 3365 -3809 -2019
1200 -2019 13 2963 -189 -4725 3015 2745 -2349 1013 -582 1309 1125 -2434 2944 934 -2259
1215 -2259 5254 1406 -3475 2000 2628 1610 -1571 -1141 5979 2251 -4079 763 3210 1139 -210
1230 -210 -1930 3693 2286 -3432 1486 966 -2604 2374 1467 -1489 -649 425 2685 -1714 -5445 3048
1246 3048 3044 -2681 -2370 -317 3708 -902 -6549 1691 1958 -3173 -705 -764 -597 699 -1658 -269 -1870
1263 -1870 -3150 3156 -964 -4488 395 1559 1524 -3587 -4523 4854 1522 -5739 -61 2114 695 -996
1279 -996 -2315 2428 1262 -1105 1954 -1338 -1160 2497 1082 515 -1466 1195 6040 -1356 -4014 3171
1295 3171 3659 -164 -3036 908 5673 349 -2337 2072 1718 797 79 -1263 518 735 1195 2723
1311 2723 -1370 -1714 4011 243 -4580 -387 3332 2431 -3313 -3275 4115 685 -4241 -67 -1195 908
1327 908 -526 -3980 1675 -972 -2178 2242 -2133 -2462 1171 383 -243 -3965 -468 5550 -2810 -3726
1343 -3726 2137 135 158 -3479 -880 4640 -1065 -3363 1947 -136 -1000 335 -505 -545 -878 2104 2711
1360 2711 -2282 -802 4675 1271 -2616 -445 1904 3412 -807 -2233 5199 2277 -2670 694 1391
1375 1391 1124 373 412 2973 -8 -450 3056 -1211 -1387 1730 1367 706 -2365 78 3874 -1029 -3436
1392 -3436 526 2642 8 -3775 656 2795 -2296 -1124 494 -865 12 -1057 -236 -183 -2443 495
1408 495 1078 -3773 -1513 2107 158 -2798 -2794 1807 1900 -4347 -2104 3186 265 -1914 -1151 -206 1353
1425 1353 -1545 -1283 1755 -1034 -212 2124 -545 -1207 854 2471 165 -3611 1546 4918 -1290 -1701
1441 -1701 1814 2638 957 -3325 514 4271 -47 -233 2178 306 416 848 -148 844 -580 2566
1457 2566 3379 -3468 -922 4252 219 -1118 -1392 1365 3977 -3778 -3133 4022 542 -1626 -497 72
1473 72 1127 -1079 -1464 601 -2464 -984 1793 -2401 -3290 22 1844 -686 -3699 -1086 2845 -1036
1489 -1036 -3591 -24 3635 -674 -2214 43 1214 -1247 -704 -348 -998 -185 712 549 -1237 -2061 2399
1506 2399 1792 -2316 -790 3114 2215 -1890 -2864 3161 3655 -2340 -720 2083 1118 602 -1352 313
1522 313 1915 76 1935 1516 -1647 1403 2743 -759 -1559 -94 3647 1216 -3856 1119 3760 -634
1538 -634 -1794 -767 2115 1204 -2509 434 1440 -1279 405 -158 -1498 237 -353 1064 -1064 -3771
1554 -3771 2099 1744 -4496 -1373 870 1278 -1221 -4007 1050 2113 -3626 -1693 774 -635 -454 -509
1570 -509 -229 -151 -944 166 639 -2536 -121 3008 -766 -2434 579 1734 998 -2238 -955 4320 302
1587 302 -2709 1119 1832 523 -940 467 2106 206 1058 1383 -284 -344 999 1373 19 -1346 2830
1604 2830 1801 -1377 -1215 1704 2826 -1732 -2162 3569 1057 -2033 614 -811 922 296 -2212 1143
1620 1143 -674 -1243 1676 -284 -2448 22 739 -160 -3308 -906 2626 -1406 -3674 25 1496 -937
1636 -937 -2576 -21 1365 931 -2281 346 465 -1886 394 -627 -1035 -226 -404 869 -1105 -3634
1652 -3634 3618 1720 -3632 -45 1144 2226 -664 -3480 2823 2449 -2267 1156 588 918 1559 -835
1668 -835 631 527 -571 2918 725 -2140 1903 2893 131 -2117 -344 2941 798 -2700 -242 3415
1684 3415 253 -2413 464 1777 665 -445 -19 303 127 -231 706 -1254 -1759 1997 888 -2414
1700 -2414 -1660 941 1498 -1649 -3677 667 2974 -2486 -3056 1196 408 -1272 -1164 -1237 389 -213 -586
1717 -586 634 -1897 -745 2613 -1637 -2434 250 978 1405 -2976 -1701 4158 -38 -2958 718 1052
1733 1052 1620 -783 -1504 2134 183 -480 1689 -588 567 2009 682 248 -1604 823 3533 -1301
1749 -1301 -2056 2965 2497 -744 -1490 1105 2639 -646 -1424 1206 1675 -527 111 291 -304 364 310 428
1767 428 -502 -1525 2815 768 -3895 -78 2111 -219 -1755 -1685 1996 1026 -3253 -689 1384 -504
1783 -504 -1286 -1049 72 -473 -1136 -73 -754 -1295 -43 1321 -1157 -2275 1292 1092 -2120 -1549 379
1800 379 1951 41 -3153 1433 2232 -1877 -700 741 591 551 -638 1006 929 -849 1260 773 -1872
1817 -1872 912 2409 174 -543 87 2278 1747 -2302 -376 3829 452 -1729 1032 1312 964 -804
1833 -804 -868 1601 -74 -506 1350 -1017 -518 1433 374 -189 -1807 723 3202 -2364 -2780 2109 693
1850 693 -1734 -2546 -240 1359 -1726 -2417 1228 -176 -829 -299 -677 -822 -1091 -74 333 -2120 -1473
1867 -1473 2130 -203 -2849 -359 1914 797 -2719 -1414 2049 643 -2229 -436 1452 992 -666
1882 -666 -381 227 367 348 903 -55 -1045 1776 2165 -1474 -1523 1701 2297 -269 -1594 1198 3500 -55
1900 -55 -2103 1578 2217 -462 -468 484 719 977 66 532 136 -626 2100 797 -3224 406 2140 -116
1918 -116 -1258 -2053 2005 2016 -3338 -889 1946 -337 -816 -1561 114 625 -1447 -289 7 -1476 431
1935 431 654 -1763 -1473 270 1550 -924 -3113 476 2332 -1281 -2591 372 1734 -502 -1564 -161
1951 -161 918 -430 -892 54 28 -180 698 282 -517 -634 1585 1397 -1945 13 2663 1035 -1311 -859
1969 -859 2392 2047 -1775 6 2016 1042 -155 -97 659 618 -273 645 507 -647 857 1894 26 -1481
1987 -1481 948 2172 -727 -1725 658 1801 -333 -2127 196 1776 -1245 -1703 503 387 -682 -958
2003 -958 -206 -431 -769 -254 513 -1547 -1285 1353 -487 -2138 -1055 172 400 -1296 -2029 2128 452
2020 452 -2554 -304 1002 364 -292 -1041 817 -22 -838 589 -379 -1277 952 838 -471 -423 958 2280
2038 2280 164 -1568 1378 2888 240 -854 1717 2299 30 -637 1337 1512 -283 791 947 -32
2054 -32 498 411 317 -882 -238 2358 1071 -1542 81 1981 479 -2018 -1380 1953 1000 -2304 -341
2071 -341 1024 294 -842 -950 -90 33 -101 111 -160 -1543 117 1175 -1567 -2187 568 1367 -667
2088 -667 -2414 -84 2072 -933 -2687 586 1281 -549 -1345 -623 208 44 -554 24 -473 -528 1464 829
2106 829 -2125 -308 2040 349 -1407 -619 1962 2328 -1856 -1185 2468 1104 -731 -309 663 1300 315
2123 315 -175 871 -188 274 1880 -543 -1340 1632 1540 -19 -1492 -24 2872 -193 -2355 1077
2139 1077 1693 -200 -703 -751 1493 215 -1510 -62 -431 -660 720 -52 -1389 -544 875 757 -1440
2156 -1440 -1583 1378 759 -2168 -1623 1312 887 -1712 -1764 1117 714 -1822 -91 560 -698 -338 -294 26
2174 26 -847 -19 845 165 -2065 -40 2182 -233 -1668 -67 2179 6 -2269 308 2234 217
2190 217 -346 763 1560 522 402 -76 -490 -291 437 947 -18 -982 2130 1324 -957 238 1701 1298
2208 1298 -205 -1649 1873 1895 -1669 -130 1074 -667 242 -1024 109 353 -1797 389 89 -1654
2224 -1654 -229 1104 -1445 -1435 508 561 -225 -1781 -577 2174 -1154 -2501 215 299 -571 -1264 -773
2241 -773 1132 -291 -1174 693 -625 -788 664 -447 -1176 -476 624 1150 -1483 -1286 1905 1136 -1755
2258 -1755 -685 1831 1096 -980 -256 759 787 -44 -74 1279 297 919 670 -157 -289 345 1440 -522
2276 -522 -1561 826 2127 24 -1608 699 2286 -6 -1377 30 1486 -43 -1299 92 596
2291 596 -34 266 131 -5 -544 292 619 -1558 -1489 1417 563 -2060 -1240 911 1399 -2008 -1863 1278
2309 1278 585 -1690 -1227 -118 -445 172 -1183 -4 -536 -94 821 -189 -2318 784 1516 -805 -1303
2326 -1303 -224 1550 979 -2524 -61 2185 -340 -839 -269 1063 353 -422 233 544 -162 190 1328
2343 1328 -471 -424 2324 946 -1368 -188 1259 2103 -954 -1419 1160 1963 -1225 -827 1097 1009 -172
2360 -172 -610 441 186 -344 120 -110 -755 -12 1155 -216 -1516 -208 1277 -88 -1610 -1041 1092
2377 1092 -399 -2187 -13 1107 -450 -939 -771 128 -144 -666 13 -483 -661 -105 1 -765 -1215 413
2395 413 1200 -1336 -1392 1253 689 -904 -1369 731 1121 -1040 -1268 1027 897 -300 -108 214 546 174
2413 174 313 571 -300 -50 1560 293 -1293 703 1652 516 -488 209 1973 976 -1897 522 1674
2430 1674 -116 -537 27 996 388 -634 467 207 -569 505 1036 -802 -637 699 475 -800 -1076
2447 -1076 1000 968 -1115 -1520 1013 725 -1434 -1142 178 258 -643 -979 207 28 -881 -70 -335 -1232
2465 -1232 -337 555 -518 -1535 -86 1107 -424 -1911 -235 1837 138 -1820 -328 1232 210
2480 210 -1063 -396 798 189 164 102 -46 -9 1200 866 -796 -192 1299 1578 -691 -1011 1749 1723 -777
2499 -777 -1161 1120 1534 -229 -742 651 847 -80 -177 20 300 691 647 519 -752 85 1685 -125 -1926
2518 -1926 -320 1502 342 -1901 -867 1807 192 -1391 -327 612 131 -682 -938 -103 -283 -468 18
2535 18 -503 -1223 511 843 -1561 -1268 436 1044 -1015 -2259 598 1217 -878 -1660 298 847 -268
2552 -268 -822 350 493 -113 150 161 -468 -303 1016 508 -903 194 1612 494 -978 -396 1822 869
2570 869 -1272 -163 1783 556 -590 -114 970 505 -75 312 647 161 258 953 -418 -780 856 1393
2588 1393 -384 -918 657 1329 -773 -1604 655 1287 -431 -1365 476 1083 -710 -661 178 -25 -442 -181
2606 -181 -227 -551 -730 697 11 -1668 -541 1003 -255 -1345 -483 948 414 -1826 -575 1106 -148
2623 -148 -1159 -211 339 113 -506 110 60 -105 154 628 -263 -963 817 946 -396 -849 849 1792 -417
2642 -417 -1170 1085 1438 -660 -558 754 1037 -118 -515 607 646 241 628 527 -533 83 1082 295
2660 295 -1204 119 1344 76 -1273 -328 1525 526 -1471 -438 1002 509 -1072 -566 492 58
2676 58 -527 -75 -263 -806 -28 529 -959 -1155 431 524 -1044 -1917 293 1136 -1083 -1665 444 1092 -689
2695 -689 -1445 -47 771 -218 -319 -57 -73 -69 246 -17 -854 -110 1408 419 -1385 -329 1457 715 -1356
2714 -1356 -600 1756 811 -1078 -361 1379 805 -319 -134 329 543 436 445 60 -393 982 1101 -838
2732 -838 -980 906 1645 -135 -1393 509 1632 -700 -1341 175 1048 304 -902 -348 380 -208 -71
2749 -71 -26 -544 -139 367 130 -1279 -755 1112 331 -1572 -873 1149 468 -1717 -981 831 222 -1289
2767 -1289 -776 608 175 -598 -137 -212 -299 106 330 -376 -1164 365 1384 -538 -1365 204 761 -99 -1626
2786 -1626 441 1498 -494 -1088 183 726 785 -986 488 153 -389 -15 -162 -440 -6 492 696 -749
2804 -749 -532 904 836 -757 -407 702 1295 -418 -564 1435 215 -350 -268 859 40 -344 -238 -70
2822 -70 -114 -581 249 -786 -1196 54 444 -473 -802 414 901 -661 -1444 44 774 -850 -1085 22
2840 22 332 -405 -891 -47 0 -422 -127 491 -534 -200 671 188 -1008 -351 1054 395 -1209 -406 1495
2859 1495 837 -957 -644 1044 669 -520 -290 667 603 -107 266 279 -17 644 1075 -20 -493 847 1104
2878 1104 -259 -1074 511 1642 -479 -1213 627 1359 216 -705 -123 785 -152 -525 183 11 197 243
2896 243 54 -783 -421 676 260 -1573 -511 1192 130 -1341 -829 851 431 -1508 -1032 692 306
2913 306 -949 -403 -319 -157 -229 -55 -241 -572 112 810 -505 -1199 669 1093 -456 -1369 186 1670 -45
2932 -45 -1071 337 907 374 -558 302 604 421 -143 295 342 273 1112 394 -679 -275 1296 958 -742
2951 -742 -436 1433 1045 -606 -605 1441 556 -415 -314 542 552 75 53 207 49 -25 471 -144 -877 314
2971 314 733 -382 -1159 126 1066 -342 -1850 -190 1168 -874 -1004 -498 314 -273 -1043 -16 47 -302
2989 -302 -436 100 -603 -462 391 197 -1015 -805 647 395 -1255 -1005 992 691 -653 -698 777 655
3007 655 -439 -770 713 261 -63 -3 467 331 329 974 141 24 402 892 126 -752 93 1449 60 -1273
3027 -1273 769 1092 25 -820 108 1228 9 -740 378 872 31 -85 430 -43 -206 591 442 -418
3045 -418 -791 377 553 -1012 -810 994 736 -1161 -480 544 456 -902 -747 72 -169 -489 -253 79
3063 79 -229 -688 321 -359 -1195 5 673 -260 -953 -304 1003 -6 -1678 223 1091 -87 -936 -84
3081 -84 866 177 -481 74 171 70 234 471 -218 -99 869 830 -759 -299 1117 1023 -760 -712 1706 1071
3101 1071 -441 -572 693 1243 -525 -211 476 492 265 336 -98 -416 291 679 -29 -791 400 1185 -182
3120 -182 -1292 52 968 95 -1379 -265 897 -153 -772 -611 297 118 -480 -419 -61 -538 198 83
3138 83 -940 -687 510 308 -1039 -1043 541 810 -907 -908 633 666 -690 -836 20 504 -446 -162 138 186
3158 186 47 485 -183 -688 273 849 109 -862 148 1390 217 -1136 158 1092 172 -884 376 512
3176 512 549 -624 226 424 -379 227 438 -180 -458 631 606 -572 -732 951 853 -423 -999 1025 775
3195 775 -611 -1089 237 693 -453 -849 446 207 -543 -201 -65 -563 -69 30 -222 -919 -262 867 -465
3214 -465 -1374 -354 721 13 -1246 -504 922 -23 -1112 -146 616 -89 -354 -77 168 -44 -203 47
3232 47 -261 -439 428 913 -392 -700 785 890 -734 -679 742 1052 -127 -639 756 1058 -152 -179 540
3251 540 206 284 309 174 108 285 568 -3 -578 323 1083 -15 -980 92 1168 140 -1135 -22 988
3270 988 64 -1180 -510 567 150 -418 -279 -20 -316 -213 205 -602 -909 179 267 -781 -992 284 596
3289 596 -1399 -1154 571 778 -723 -1023 99 489 -445 -802 226 149 -95 -382 252 -390 -4 535 -209
3308 -209 -763 37 1198 135 -1027 55 1346 530 -871 -208 1096 391 -676 91 612 249 199 316
3326 316 390 36 549 575 -399 -320 1109 894 -513 -693 670 1336 -632 -738 560 832 -173 -799 208
3345 208 560 -15 -131 -180 103 -140 115 44 -578 -292 328 -137 -913 -238 838 137 -1148 -559 1042 85
3365 85 -948 -601 455 32 -772 -319 86 -88 -169 56 -180 -74 295 753 -581 -597 462 654 -453
3384 -453 -831 477 1188 -406 -644 496 635 -65 -336 393 540 -56 130 278 125 246 788 621 -551
3403 -551 -104 1091 649 -758 148 1149 546 -835 -162 896 523 -590 -137 419 107 -375 56 -32
3421 -32 -145 95 69 -178 -497 102 637 -306 -713 121 497 -704 -1091 371 766 -678 -1221 109 756
3440 756 -687 -358 422 443 -956 70 -22 1 -166 -53 -28 -878 -159 647 34 -591 73 855 943 -346
3460 -346 -88 844 437 -108 -689 833 1004 -136 -101 274 158 233 807 -144 340 72 173 -319 -502 788
3480 788 1163 -310 -777 884 1016 -285 -1136 217 1044 -69 -494 -102 416 -222 -292 87 -482 -43 468
3499 468 -49 -737 -416 761 -47 -1146 -465 906 136 -980 -577 655 447 -943 -503 320 30 -167
3517 -167 -410 -141 -198 -93 269 -532 -813 197 760 -722 -1006 527 833 -545 -960 364 959 -145
3535 -145 -840 453 866 121 15 52 45 257 375 334 -400 10 1004 432 -562 -13 1143 515 -476 -208 1254
3556 1254 1037 -513 -488 663 425 -300 -153 205 148 56 15 -33 -39 268 480 -460 -520 415 382 -670 -960 60
3578 60 787 -131 -813 -151 519 -245 -591 -94 192 -242 -350 -25 -355 -48 274 8 -603 -315 430 209
3598 209 -795 -529 632 398 -684 -466 494 293 -688 -299 407 423 -382 -153 205 349 176 337 163
3617 163 -404 182 898 -10 -661 649 808 48 -630 617 853 -146 -808 210 880 17 -472 457 492
3636 492 -248 265 238 -89 -183 340 103 -382 -187 737 240 -946 -497 772 283 -1011 -460 668 289
3655 289 -767 -293 291 -75 -695 -383 -34 -182 -181 -165 80 -577 76 373 -550 -849 225 733 -502 -875
3675 -875 157 858 -135 -1012 219 777 -339 -379 209 152 273 211 342 -146 52 443 362 -291 -137 675
3695 675 669 -389 -286 960 780 -596 -200 751 471 -294 -334 559 591 19 123 46 119 339 243 -240 -399
3716 -399 305 662 -489 -1092 277 915 -220 -866 91 814 -5 -917 -154 421 -17 -549 -234 -78 -199
3735 -199 -85 69 -676 -366 300 -79 -846 -455 409 314 -829 -756 907 286 -756 -633 461 678 -485
3754 -485 -470 356 82 -43 48 54 -393 176 550 -360 -819 354 1076 -150 -838 276 941 280 -737 -6
3774 -6 663 330 -380 34 912 239 61 41 257 13 547 374 -339 66 683 522 -564 -455 585 535 -771
3795 -771 -600 515 252 -531 -479 -41 321 -370 -519 8 -95 -293 174 -267 -557 89 248 -180 -1091 -97
3815 -97 264 -242 -1588 46 114 -206 -1146 -536 351 -274 -949 -284 186 -148 -118 127 -88 -328 454 39
3835 39 -280 -215 435 424 -335 -411 520 777 -472 -402 844 797 -122 -178 666 532 120 -83 503 547 372 177
3857 177 205 -110 283 740 504 -221 187 777 -65 -862 -75 1070 112 -701 -48 572 13 -502 -104 61
3877 61 142 -417 -92 -253 -692 430 -8 -1069 -543 369 1001 -844 -706 613 235 -640 -818 410 673
3896 673 -433 -795 156 469 -370 -340 -49 -3 5 733 34 -554 187 389 -108 -617 164 1019 -13 -981 128
3917 128 747 321 -729 -179 -82 113 -366 308 362 98 375 224 209 -72 489 268 -449 -296 847 631
3937 631 -660 -623 581 798 -539 -460 612 527 -332 -440 348 193 -73 -5 -133 -110 13 476 -105 -726
3957 -726 -35 537 -288 -1220 -187 520 91 -835 -326 611 149 -564 -204 256 -111 -260 -141 -256 -166 106
3977 106 121 -234 -303 488 450 -541 -596 408 683 -311 -797 550 839 -555 -486 658 349 26 -18 212 515
3998 515 280 165 294 -106 492 583 340 -419 132 809 345 -726 -22 849 224 -392 -72 551 333 -260
4018 -260 -202 462 -191 -107 131 37 13 83 408 -439 -578 -68 530 -437 -405 313 529 -426 -612 288 289 -484 -615
4041 -615 -35 214 -417 -518 -132 -48 47 113 159 -302 -93 203 77 -618 71 765 28 -774 98 705 67
4062 67 -575 -240 922 78 -335 -106 445 256 37 249 9 -94 556 633 -92 -402 218 602 -138 -409
4082 -409 445 693 -110 -633 413 648 -338 -381 320 422 -172 69 377 -113 -114 247 -280 -467 -40 415 23
4103 23 -497 92 949 357 -1053 -427 931 243 -1155 -322 561 817 -94 376 549 276 259 -50 -407 -287
4123 -287 372 403 -438 -478 371 572 -699 -568 598 518 -533 -539 342 884 -140 -19 405 368 362 68 131 91
4145 91 363 502 333 -435 115 672 331 -671 -29 1001 421 -731 -471 722 484 -646 27 317 596
4164 596 16 -607 749 -249 643 167 -331 -1000 388 36 -344 -829 113 502 -333 -763 223 764 -433
4183 -433 -670 -41 294 -247 -357 -33 26 -263 -121 -3 -329 -431 222 -285 -666 -194 404 342 -547 -377 525
4204 525 356 -577 -402 481 264 -291 -145 124 194 -64 126 283 145 280 201 -124 -190 337 476 -7 -567
4225 -567 438 992 -340 -465 187 726 85 -299 266 384 28 -234 192 -76 152 220 189 -304 -57 467
4245 467 192 -211 -154 578 171 -509 -57 475 166 -509 -278 321 56 -584 -438 252 78 -204 -309 182
4265 182 -114 -296 186 -183 -392 55 326 -291 -742 207 458 -257 -604 217 542 -347 -494 74 433 -110
4285 -110 -87 84 113 -262 407 -203 -100 -52 533 11 -144 22 304 235 -548 -10 776 212 -655 -43 483
4306 483 714 -74 -232 361 -32 -312 191 -269 186 380 805 -245 -315 367 130 426 -147 -33 286 -282
4326 -282 -419 -212 874 -314 -563 -34 76 -29 -251 -249 -324 59 12 -187 -370 -120 207 58 -827 -416 521
4347 521 245 -623 -383 316 159 -572 -271 402 -4 -174 -76 83 -178 93 174 57 -199 98 502 12 -691
4368 -691 276 793 -290 -665 331 860 188 -312 43 477 246 -30 220 261 205 220 79 2 -82 455 261
4389 261 -378 -92 508 430 -309 -314 692 579 -577 -388 328 -79 -481 -237 -132 136 -274 -139 -56 15 -37
4410 -37 -57 -283 -618 168 455 -149 -750 -66 309 -166 -939 -120 647 -205 -654 141 258 65 -53 -176 -9
4431 -9 -54 305 321 -220 -47 507 235 -315 -214 548 310 -301 -219 580 530 -173 -50 429 318 -68 85 294
4453 294 240 11 24 187 93 104 456 169 -362 39 445 -39 -484 -178 549 53 -789 -126 475 -239 -521
4474 -521 -45 159 -114 -361 167 16 -218 206 -143 -469 -292 243 147 -472 -465 80 189 -459 -560 211 -33
4495 -33 -485 -522 468 130 -482 -389 312 21 -21 34 -89 -318 -110 291 36 -258 186 436 -178 -452 56 773
4517 773 -4 -534 42 556 333 -336 -234 243 407 74 299 -171 12 446 50 -236 129 507 254 -238
4537 -238 -409 751 620 -254 -382 647 505 -230 -436 163 291 -220 -356 69 -25 -59 -107 -254 -421 -320
4557 -320 449 -292 -766 21 346 -170 -685 -350 283 -351 -645 -388 246 -247 -293 -178 192 35 246 -153
4577 -153 -234 -134 9 127 -471 -356 383 386 -358 -295 205 632 -205 -402 264 497 -143 -388 235 228 78 -30
4599 -30 259 2 193 287 -114 -26 198 479 238 -349 -280 501 329 -406 -6 603 -2 -377 189 379 286 -174
4621 -174 -82 86 -155 -119 145 -112 -342 421 171 -596 -527 145 312 -399 -252 173 368 -511 -667 126 289
4642 289 -346 -318 8 -22 -258 -308 -205 -199 131 17 -92 -274 17 341 198 -558 -89 686 199 -206 -163 242
4664 242 325 -143 -96 330 307 -296 -46 162 -84 33 32 90 -165 293 350 -188 -79 551 347 -245 -164 519 397
4687 397 -117 -348 398 212 -33 -164 -215 -25 -153 -24 -109 -272 56 412 -233 -195 -133 534 103 -804 -417
4708 -417 192 44 -442 -280 105 48 -503 -314 -162 10 -156 -187 77 -271 138 98 -254 -287 278 120 -298
4729 -298 -532 244 508 -278 -334 411 540 -249 -323 150 270 -7 -449 43 214 238 124 246 -184 194 518
4750 518 92 -334 -49 655 212 -298 -52 595 417 -398 11 357 230 243 -184 720 111 -100 -321 388
4770 388 -121 419 157 -210 -16 138 493 -377 -548 386 374 -481 -497 -244 356 -213 -478 -137 -95 -74 -148 39
4792 39 -294 -286 259 -41 -554 44 57 -192 -514 20 213 -94 -1260 -777 539 1107 94 -978 14 729
4812 729 387 978 287 153 23 164 -312 -185 15 780 218 -474 515 628 -175 12 -107 242 -624 125
4832 125 472 607 -124 -215 71 91 234 -66 198 -234 -84 262 417 -247 -325 229 158 -335 -83 397 126
4853 126 -682 -416 76 141 -652 -287 94 51 -528 -35 -146 -176 89 58 -80 -340 -78 75 -313 -627 104
4874 104 518 -207 -336 212 400 -264 -280 224 297 -74 -157 292 258 33 78 322 70 -6 253 -105 125 -186
4896 -186 511 152 -346 25 869 410 -249 124 431 346 -327 12 469 221 -301 89 33 -72 192 118 -179
4917 -179 -121 155 331 -363 -538 62 534 -409 -480 94 607 -6 -296 211 18 -15 -198 13 104 -133 -31
4938 -31 -146 -365 -120 93 18 -538 -100 379 236 -673 -194 238 160 -160 -157 -378 365 -310 -328 192 102 81 69
4961 69 -117 -33 283 270 -270 -161 250 613 66 -528 242 364 -184 -378 189 32 -1 -250 41 372 99
4982 99 154 120 -146 -103 246 -39 -152 105 379 405 -344 -292 493 431 -334 -197 88 238 -198 -254 -77 145 -185
5005 -185 -105 594 -278 -695 -52 120 48 -467 -213 -384 -783 427 711 -437 -548 -341 443 553 -469 -182
5025 -182 187 88 -192 154 13 0 -35 13 -151 -117 173 245 -301 -209 234 149 -11 -264 354 393 -427 -250 533
5048 533 612 -96 70 130 293 29 62 77 197 411 296 114 -360 -249 153 65 -570 312 482 -20 -595 57
5070 57 453 -72 -337 -250 314 49 -233 -143 184 -74 87 -130 -158 -144 -73 36 -556 -400 365 86 -565 -190
5092 -190 334 367 -508 -413 98 44 -268 -251 137 137 -204 -163 -51 -141 -95 -59 54 -243 -65 203 -118 -378 31
5115 31 467 292 -329 44 407 60 -50 99 321 135 -224 -37 57 113 114 24 -182 43 456 335 -20 28
5137 28 408 374 -328 -269 603 337 -333 -192 266 426 -173 -118 336 11 74 191 -102 -106 151 138 -196 -340 -136
5160 -136 506 -136 -674 -101 246 -6 -490 -202 268 62 -315 -301 -50 38 -425 -196 -72 -292 275 -4 -300
5181 -300 -202 301 296 -129 -180 411 467 -319 -469 235 568 112 -175 184 227 -45 -117 42 52 -128 126 73 -31
5204 -31 118 604 -97 -222 97 486 195 -384 -128 577 75 -483 -145 488 199 -248 7 329 -31 -248
5224 -248 81 -364 69 72 175 -354 -310 80 254 -378 -197 70 223 -499 -343 -154 188 -403 -342 185 42
5245 42 -348 -370 167 -216 -120 30 -135 -493 -141 321 -113 -149 -439 364 30 -279 -123 822 110 -428 -319
5266 -319 546 701 -87 527 202 -168 156 169 87 -16 -85 196 -161 -54 283 282 -302 -281 157 419 -238 -163
5288 -163 217 157 -211 -187 126 400 -22 -251 146 -103 -31 253 85 -319 -37 361 -127 -534 24 358 92
5309 92 -501 -47 257 -85 -308 -46 253 149 -198 -160 229 -83 77 -174 -163 -140 -114 69 -307 -490 375 201
5331 201 -371 -189 143 351 -266 -290 119 432 -161 -57 42 247 209 -16 165 -166 49 254 80 -261 -115
5352 -115 304 -254 -259 73 618 656 -520 -268 204 102 -282 87 -103 298 131 41 169 -137 -51 259 -347
5373 -347 -130 240 225 -198 -130 264 433 -302 -314 238 287 -274 -503 -9 188 -141 -191 -130 -122 -200 -12 -48 -366
5396 -366 -248 62 -7 -278 -360 302 192 -399 -261 425 218 -279 -218 90 339 -12 -120 76 -107 159 128
5417 128 75 62 58 359 -102 -145 217 302 -159 -432 448 722 -4 -384 115 346 -187 -298 44 205 128 -34
5439 -34 -57 118 -71 226 199 -51 -176 272 79 -90 -90 138 96 -310 -32 232 -90 -336 -17 197 98 -26
5461 -26 33 156 -107 -311 -4 71 -77 73 217 -335 -313 -2 297 -436 -102 13 37 0 -719 -25 91 65
5483 65 -342 194 273 -21 52 -201 -206 -222 123 164 -46 80 137 367 -131 179 355 222 -419 -115 308 289 -448
5506 -448 -130 139 399 62 -22 -84 91 -31 13 76 -220 87 394 -90 -157 56 -52 -36 -525 271 363 -84
5528 -84 -320 128 282 146 -295 32 151 -113 183 44 -335 -103 -50 -182 -401 -259 -28 59 -664 -159 431
5549 431 231 -700 -213 168 108 -337 -402 -59 -6 -9 -257 -132 39 40 35 -105 -345 37 276 237 -432 26 524
5572 524 -177 -298 137 227 81 -263 87 242 266 -42 67 136 140 62 161 -95 -141 454 135 -119 9 468 291
5595 291 -371 -424 119 69 -434 -182 117 279 -151 -129 211 -106 37 -80 -268 -291 -127 120 -205 -409 -125
5616 -125 207 -147 -342 -38 362 104 -628 -254 219 -4 -451 -247 290 -61 -60 -164 -218 -148 62 -13 -213 -237
5638 -237 174 358 -287 -173 117 200 -365 -73 80 393 -490 -121 216 93 79 -126 -27 288 279 110 203 138
5660 138 185 475 -147 -105 244 324 -129 -231 179 258 65 -358 6 264 -354 -344 -224 176 39 -239 74 -17
5682 -17 -169 107 153 -201 -259 13 196 -113 -126 76 360 -437 -370 99 129 -459 -376 89 202 -374 -90 123
5704 123 34 11 44 -32 -148 90 114 -263 -206 -151 425 233 -514 238 345 -47 -325 153 616 160 -48 118
5726 118 307 98 -86 -6 -15 155 87 150 -276 -111 283 210 -118 -106 176 394 -401 -105 319 211 -110 -146 91
5749 91 31 -4 -49 -111 -116 -317 -10 -85 -320 171 115 -153 -316 -132 165 -272 -484 -108 325 73 -308 -52 208
5772 208 -122 -423 -8 -190 -2 -252 -116 26 -14 25 241 -222 -383 129 320 -354 -170 72 136 -37 -125
5793 -125 139 209 -107 -221 76 214 -154 187 101 -205 1 362 119 -11 198 206 116 -403 -4 744 -78 -465
5815 -465 257 226 312 -175 -39 185 264 -34 -142 314 34 119 110 -142 -210 131 276 -112 -302 112 231 -335
5837 -335 -231 45 340 -176 -356 71 297 -97 23 -19 -221 -61 32 -224 20 15 161 -6 -384 -14 405
5858 405 60 -409 79 133 -131 -332 -83 222 246 -147 -295 188 33 -133 106 57 24 7 437 99 -147 115
5880 115 -58 19 -202 -71 366 -256 -157 184 255 -89 -361 319 80 -374 134 -66 43 -65 1 177 169 57
5902 57 114 57 -322 -104 28 90 -226 -114 569 -87 -389 -267 246 -109 -120 -140 -110 -176 -296 -89 -186 77 100
5925 100 -106 -456 -248 226 195 -231 -216 213 337 -12 -12 119 184 -126 -181 -212 91 37 -202 254 55 235 304
5948 304 -47 2 6 259 -174 -138 -309 359 44 -236 -60 154 282 -305 235 424 -38 196 254 139 -203 341
5970 341 224 -252 147 137 371 -830 124 656 461 957 -526 256 518 -821 -337 227 812 284 -131
5989 -131 -139 -126 -160 -302 160 -197 96 -45 -112 -252 -93 122 324 -429 -201 185 143 -233 -47 272 177 -332
6011 -332 45 108 231 -267 -151 216 -117 12 -61 99 -89 196 360 -220 -288 601 148 30 -374 309 370
6032 370 -175 -195 241 175 20 309 1 258 402 24 63 -43 81 207 279 -44 12 125 64 94 -254 143
6054 143 260 -516 24 357 -72 -408 -253 202 -213 -165 31 33 12 -10 160 206 -59 -255 216 30 -598 520
6076 520 477 -339 -203 178 137 -270 -163 -32 10 -178 -35 62 -68 -129 -69 596 286 -102 -126 -378 -230 393
6098 393 443 290 -267 -246 103 213 276 -287 286 544 -183 4 361 -91 8 33 81 2 225 194 -247 -24 238
6121 238 66 46 -354 116 392 67 -337 110 310 95 -166 81 351 287 -39 -122 9 -178 234 -6 -27
6142 -27 -206 318 19 -143 16 455 168 -305 -164 289 24 -65 -201 197 335 -88 -241 -63 -85 131 1
6163 1 -121 -292 65 10 -40 -112 200 431 -58 -227 2 205 157 -476 -15 439 -151 -97 98 292 260 125 30
6186 30 153 38 161 255 34 195 368 100 -147 -102 354 163 -268 -143 84 -6 37 -4 165 322 -140 -89
6208 -89 37 -83 130 -239 -212 -247 52 147 -107 -448 -173 239 8 -378 1 332 14 -226 205 235 24 -231
6230 -231 56 12 -83 -142 65 -19 -201 70 216 -381 -184 -130 29 371 -255 1291 513 -431 5 209 21
6251 21 -416 -71 -67 177 55 -59 5 -18 262 249 -19 5 115 359 164 -210 -47 392 41 -329 77 155 -1
6274 -1 -124 -10 323 -206 -73 17 -7 -132 12 253 93 -32 185 -40 -93 -133 272 91 -310 -171 89 49
6296 49 -296 -161 -99 -2 -237 -294 87 -19 107 -135 57 -243 258 47 -76 -25 -138 187 -131 -193 68 184
6318 184 -8 173 -9 229 -280 -285 -215 164 301 49 10 100 499 261 437 105 -36 288 39 -351 -44 180
6340 180 -16 -12 -275 366 9 -322 -313 387 458 -110 -170 -4 49 -72 217 -180 16 190 293 -147 -236 17 247
6363 247 -32 -343 39 159 -260 -191 82 158 95 -255 -130 -54 -123 -275 -102 -152 -205 160 -173 25 -306 345
6385 345 155 -237 -206 353 306 -243 -138 54 173 -160 -190 11 202 0 -309 135 63 226 107 -81 -127 124
6407 124 240 -3 175 -12 403 -121 -179 -129 233 164 -272 97 272 402 16 -215 -17 -15 66 -352 59 -71
6429 -71 -7 54 -239 -79 -65 202 29 -276 20 73 -314 -192 61 50 104 -390 128 77 130 6 16 -31 51 59 -136
6454 -136 -248 -146 388 -227 -209 -225 -58 98 -588 -64 509 -55 72 -160 264 -12 -64 -247 -20 159 244
6475 244 14 122 218 118 221 -156 -64 113 50 -222 57 486 493 30 -485 161 501 -101 -118 311 -165 216
6497 216 38 340 -19 -24 38 162 -226 -301 30 -173 117 -604 507 502 -158 -829 340 347 -353 -96 452 -104
6519 -104 -332 237 47 244 190 352 -186 66 -467 208 -697 -122 589 149 140 239 511 750 16 -247 619
6540 619 -20 50 -630 248 353 263 550 736 -916 -214 336 501 822 -301 496 7 -936 472 515 312
6560 312 -182 381 47 421 -86 418 10 -304 458 -250 81 -133 215 78 -56 56 116 139 -203 -104 126
6581 126 37 -16 -149 13 39 -103 -96 15 25 64 -192 -277 144 -91 -18 -328 -65 56 63 -104 -292 -37 -25 405
6605 405 -565 -30 353 82 -77 -268 160 189 -146 85 198 143 53 38 25 31 126 235 -199 -283 146 203 -332
6628 -332 -176 146 251 56 -278 129 186 -6 -108 339 262 37 69 108 142 255 89 18 -110 182 159 -31
6650 -31 -230 -76 157 210 -459 -263 -85 225 72 -251 -40 -141 -281 315 -54 -60 22 -175 -10 85 -7 -18 -216
6673 -216 -334 -123 -54 17 -311 82 264 -155 20 62 -44 -8 -264 -141 -62 97 93 55 29 11 118 243 -139
6696 -139 200 563 -171 -200 -34 217 350 36 77 96 159 50 131 222 44 62 138 66 -97 670 360 -392 -485
6719 -485 -51 12 -90 -128 -133 136 435 -578 -165 -96 -22 -508 -123 -190 544 -555 -902 -214 44 702 -86 534
6741 534 206 -106 -104 -141 -106 -172 -234 -132 -51 413 46 1 -653 -386 -93 -496 -571 -128 108 -23 132 -428 351
6764 351 190 -282 68 -371 276 399 143 -330 192 200 21 -334 -106 184 150 -139 -119 391 50 -5 87 -84
6786 -84 94 140 166 6 -74 470 40 -231 -98 -259 359 -320 -32 86 -195 150 -41 -58 368 -113 71 189
6808 189 114 391 -311 53 -593 274 -3 -379 -445 397 -129 94 -33 -106 415 152 146 137 -204 -348 274 -28
6830 -28 -430 -57 272 -161 68 454 216 -230 651 -326 -311 146 415 673 150 -1059 126 -31 5 134
6850 134 -383 -425 96 508 -106 61 150 14 -123 335 141 225 294 506 704 -415 118 246 69 -148 -472
6871 -472 -126 122 -250 186 100 -101 -407 388 349 108 -185 140 -2 436 422 -423 -186 125 227 27 -286
6892 -286 -152 -332 297 -316 -503 -64 7 -291 -58 302 -107 129 -371 244 104 353 -215 -250 106 -74 264
6913 264 -333 -182 185 164 369 -460 -396 246 -134 147 113 136 -539 -197 -267 187 120 372 118 185 -101 234
6935 234 459 -187 165 157 297 -58 255 437 69 -74 -194 126 383 -436 -106 -195 536 -208 -34 126 -230
6956 -230 -105 -2 -72 -155 125 24 -174 -51 -58 378 209 -173 -232 215 23 -397 -117 70 71 -168 1 -176
6978 -176 42 -144 -84 -62 -207 235 200 -191 158 315 325 -106 -146 71 366 -240 39 29 17 -85 -62 -280 236
7001 236 305 47 165 30 -44 198 49 -267 -3 450 206 -188 380 198 100 -197 -22 267 370 -215 -73
7022 -73 -21 220 -16 4 101 201 174 234 87 -4 -211 16 -151 -272 231 372 -101 -327 63 156 -193 -266 181
7045 181 -108 4 -42 206 52 -288 -239 -296 -142 -4 143 -133 -397 323 239 81 -259 72 166 -5 -357 -41
7067 -41 147 -34 -219 144 72 54 180 -17 -356 -210 189 9 -153 -4 215 240 40 -197 492 44 1 -252
7089 -252 76 92 -113 -446 349 30 -137 -166 81 256 142 87 -91 -201 150 140 111 -133 -50 331 58 -136
7111 -136 114 174 -17 -254 -160 376 140 -98 40 -123 70 82 17 -367 -301 157 373 -322 -267 -12 211 -121
7133 -121 -195 -246 68 -343 -301 -90 63 5 -468 129 -121 69 105 210 245 11 84 23 -65 197 212 -103 -164 -37
7157 -37 303 211 -252 -41 320 -188 -158 -232 116 291 -9 108 92 215 -169 -302 257 220 298 162 112 -331 76
7180 76 230 -383 -375 295 309 -332 -315 -129 234 -44 -222 58 134 -112 -258 -298 -97 81 99 -169 -349 54 249
7203 249 45 -82 -178 152 -62 -351 -78 78 -53 -283 -268 -194 -162 -243 -332 -63 -15 312 157 -67 -54 148 132
7226 132 -56 -125 129 315 105 -182 119 39 205 -163 37 249 -42 153 -156 262 382 237 183 155 -83
7247 -83 190 113 -100 15 337 295 -201 -163 278 92 -408 -113 185 -165 -106 -160 -24 35 66 21 -81 -197 -46
7270 -46 -114 98 -70 37 225 -242 -87 127 167 -134 -257 -192 193 -11 -142 133 112 109 -105 23 -53 208 149
7293 149 89 -34 16 50 62 -350 13 214 2 171 -65 135 353 107 -136 238 293 -97 -120 160 106 -11
7315 -11 27 -90 -64 156 300 -148 -60 264 179 -218 -137 352 -1 -166 -133 -80 149 -26 -478 -2 189 124 0
7338 0 -282 -101 -153 209 144 -276 -148 126 -40 -103 -260 200 188 -327 -22 49 194 -368 -339 106 -84 -111 -167
7361 -167 143 -12 225 181 -83 121 -115 208 26 -180 81 -49 53 120 -137 116 38 -177 -86 439 17
7382 17 -287 -63 -57 213 -24 -41 159 -28 239 198 207 -134 122 -5 -95 -100 105 372 -206 -146 122 20 122 -342
7406 -342 268 157 -3 -386 -188 122 187 6 198 -168 91 -196 65 -233 -201 233 -193 -332 30 224 93
7427 93 -166 -128 173 -266 8 -277 69 -122 -30 111 -13 -234 173 66 -268 -175 167 63 -142 -15 -145
7448 -145 208 150 -207 71 255 24 -108 -60 -54 -88 -52 234 134 114 118 247 -38 161 281 93 -173 231 386
7471 386 7 -112 71 217 -84 -240 -186 57 20 -242 -135 49 127 -121 159 -62 -155 164 -58 -141 11 226
7493 226 -16 -35 -438 199 61 -151 -339 -106 49 110 -207 204 27 127 38 -106 -29 70 -121 160 -247 -37
7515 -37 35 132 -76 8 226 -114 -153 -22 101 214 -54 -113 419 327 112 -60 -131 -18 223 79 -103 -85 415
7538 415 336 246 -164 167 29 -151 -128 283 201 -321 -106 288 95 -45 -114 -57 260 56 -217 -22 -16 -119 273
7561 273 103 -345 -15 221 -27 -222 -87 4 -68 -1 -101 153 105 -81 -166 -220 -147 -27 -183 -154 105 -31 69
7584 69 -18 -194 141 178 -276 -410 242 262 -100 -339 80 341 -78 105 32 145 -1 -151 154 -66 80 -131
7606 -131 39 -103 6 276 -194 -39 -23 280 338 -65 33 254 85 -242 -70 374 128 72 38 109 31 -30 145
7629 145 -69 -69 46 123 -183 -65 191 122 -91 -163 52 425 244 -217 -29 317 -138 -49 -137 107 -100 67
7651 67 -13 -429 11 -47 -50 -91 -55 97 -25 -426 -64 175 105 -96 -32 161 152 251 -42 330 223 -302 97 168
7675 168 181 171 200 50 -116 -40 153 -26 -120 395 197 24 -238 60 167 67 -217 79 123 -131 -61 90
7697 90 200 -7 15 -34 -107 -120 124 58 -173 -345 133 20 -152 143 191 297 -236 -4 27 -169 -388 19 -51
7720 -51 -155 97 22 -57 184 77 153 -56 -284 -98 88 -92 -216 66 186 -23 -21 290 144 -44 -103 119
7742 119 25 4 -178 -176 59 -151 393 -160 -161 -244 189 417 163 -200 -290 380 180 -127 245 305 -71 -112 -15 -24
7766 -24 -95 -74 -58 -187 47 -39 -190 -23 20 -82 12 -92 44 -88 -62 -99 100 88 -89 -257 -102 76 179
7789 179 -173 73 191 -69 -134 51 73 -261 45 -31 -167 -57 -39 -281 -223 -101 317 23 -320 -219 -1 157
7811 157 -273 -223 36 -8 -374 -285 117 239 39 -62 12 50 -202 195 21 -69 246 193 -119 -212 219 341 71
7834 71 -167 -340 77 -87 107 193 266 -127 118 -19 -74 184 81 -101 -51 -52 171 74 -120 52 363 -51 -176
7857 -176 -33 -60 -79 -305 13 41 119 210 -149 215 133 -19 -311 49 85 26 -19 -229 103 68 104 -266 -410 -283
7881 -283 262 -76 -12 -108 170 -48 -21 72 83 -146 -107 -33 19 334 6 43 -39 -3 244 64 -8 57 434 135
7905 135 -43 -53 15 333 120 -92 199 142 -21 -203 -177 202 174 158 65 -82 109 226 -134 -148 92 123 274
7928 274 -99 -16 377 -162 -65 -146 351 -121 -276 201 107 -193 -100 -7 -387 -138 205 -138 -308 -135 -11 -123
7950 -123 -219 -79 157 195 -292 107 67 139 -290 72 60 34 115 -149 -117 124 -128 110 -154 -240 -88 292 8
7973 8 -518 100 222 128 89 -26 325 208 89 -50 64 -54 6 -100 -119 159 302 86 15 200 151 -27 82
7996 82 69 274 30 -250 74 130 119 -80 -250 54 5 16 124 -60 82 15 203 -59 -105 101 69 173 -120
8019 -120 -87 323 -87 -251 -27 50 141 -267 -33 -80 172 -233 -110 -11 32 -164 -126 261 -29 156 -161 -139 -324
8042 -324 -132 26 -50 -259 190 95 351 -203 -147 -271 426 -35 -442 -52 484 516 111 -20 -116 -385 -767 -78
8064 -78 133 92 -2 84 109 72 -168 -183 188 -20 346 -2 107 196 -8 -84 102 -42 33 14 -115 -75 -18 244
8088 244 184 38 43 -42 133 -231 192 170 3 -52 -123 -77 -194 140 -122 46 -90 15 -275 -97 -186 51 54 -73
8112 -73 -82 -244 173 -204 -166 -81 -32 115 67 50 317 -12 -97 -182 151 177 -234 -65 306 116 -197 -67 161 -91
8136 -91 207 139 -130 193 38 97 -14 119 196 154 13 -147 3 202 23 -53 62 275 27 33 115 -323 -172
8159 -172 386 -219 -211 -178 -42 -39 -91 -76 172 -97 -352 -67 183 45 -6 -135 245 -199 78 47 164 105 -47
8182 -47 130 -71 -249 34 -113 -238 36 -38 155
8191A55
$$ Imaginary data points
##PAGE= N=2
##DATA TABLE= (X++(I..I)), XYDATA
0 0 0 0 0 0 0 0 0 0 -8 8 -8 8 -16 16 -24 27 -32 40 -48 64 -72 88 -104 120 -144 168 -192 224 -256 294 -336
31 -336 381 -434 491 -553 620 -697 781 -872 971 -1080 1197 -1328 1470 -1625 1795 -1979
47 -1979 2181 -2401 2646 -2911 3209 -3536 3904 -4313 4779 -5309 5919 -6629 7471 -8484
61 -8484 9731 -11309 13374 -16202 20311 -26831 38717 -67053 264976 115720 -341133 306620
73 306620 -125036 -67008 176825 -224079 77579 149205 -153808 95266 -30781 -13706 92893
84 92893 -107991 26566 69203 -78900 48472 490 -37768 61819 -3787 -42073 34600
95 34600 -9498 -23829 20753 -20417 13097 30149 -62615 27313 22725 -62366 15927 -9900
107 -9900 19846 23277 -90044 57292 37354 -81141 24351 -20996 20093 27560 -111620 44952
119 44952 44517 -60191 22424 -27618 34577 28073 -89064 43763 2220 -34106 54321 -57888
131 -57888 14499 48417 -63881 29076 -11876 -17124 66754 -52782 4795 47613 -45134 31520
143 31520 -17977 -24467 74957 -45414 -10407 71377 -39593 8062 20374 -29311 39708 -27386
155 -27386 -24392 73956 -28461 -22147 51457 -18150 10975 -952 -39050 66772 -4469 -62858
167 -62858 58498 -6880 -26557 33826 -47885 26454 39316 -72986 34690 12403 -42880
178 -42880 56856 -40740 -24293 60938 -56187 3036 16497 -45221 59000 -24050 -51731 59324
190 59324 -24478 -12480 8211 -31698 42413 -22909 -41286 44597 -15005 -120 9478 -18344
202 -18344 31366 -28655 -25891 37650 -25792 -3953 19330 -8220 21419 -22856 -11363 38981
214 38981 -20342 -5698 20867 -7075 18037 -7266 -20372 29955 -866 -12823 17939 -11993
226 -11993 9496 25659 -26486 3084 20704 -6219 12854 -23785 -1684 52125 -27870 -16063
238 -16063 27959 -7488 20158 -21784 -19483 57392 -26455 -22046 27266 -27059 19162 -4656
250 -4656 -27722 49517 -24142 -12252 40251 -46407 5231 12946 -37188 33022 -22597 -21456 52367
263 52367 -37654 -10150 30190 -35885 18993 -813 -39454 32286 -13306 -14017 31129 -35993
275 -35993 8046 33300 -42185 2544 8917 -12250 29187 -30959 -17627 52828 -20919 -20355 21305
288 21305 -2078 20262 -15079 -23259 38290 -7841 -9860 21620 -12342 16350 514 -24119
300 -24119 25131 -7864 -2833 33616 -15660 3490 13877 -12854 13543 -13755 -1570 30470
312 30470 -21277 2197 15113 -21515 17781 1518 -14068 20758 -13314 -512 16833 -28305
324 -28305 4206 18579 -10054 -1442 -12534 12503 17338 -36212 -728 20640 -16040 -5447
336 -5447 -13118 1255 22625 -22778 -6476 16872 -12154 978 -8955 -8733 16282 -15760 -31
349 -31 10817 -25419 14224 5216 -27043 18236 -1569 -4894 18304 -25417 7873 19203 -31357
362 -31357 13192 10180 -14829 20306 -11600 183 21771 -29736 15322 22790 -32272 19448
374 19448 10357 -15589 19591 -19014 5044 36190 -31002 3851 28279 -16465 6968 -8522
386 -8522 -4032 28712 -21245 -2305 23412 -18072 10278 3048 -16863 21680 -2861 -8616 10505
399 10505 -17452 5009 10019 -20033 3936 5387 -325 -1187 -19863 9547 10424 -22811 3284
412 3284 4468 -7454 5151 -13105 2268 11035 -19525 5191 4882 -18689 5704 -630 47 4876
426 4876 -19092 12326 8611 -29225 6755 8444 -1736 12691 -13086 5460 15138 -22994 -536
439 -536 4074 -5855 16685 -4327 -1503 12402 -6987 11927 -2519 -18030 25163 3509 -15733
452 -15733 9452 -715 14379 6572 -23313 18780 11499 -19038 7178 -3024 5515 14134 -19776
465 -19776 13108 10268 -23192 20155 371 -18373 19816 -8092 -1125 8915 -24328 17448
477 17448 10822 -26546 9422 -1195 -5896 8781 -19253 7902 13304 -18919 7445 -3931 -17038
490 -17038 13627 -5707 -10976 6895 -3823 6711 -2447 -20136 8651 8814 -10529 -5432 389
503 389 12991 -1123 -21028 8598 8039 -11099 4478 -555 2811 9517 -10459 3836 2255 -10706
517 -10706 12417 38 -5634 10881 -1249 10936 323 -15060 19596 1357 -14487 10765
529 10765 -2498 5178 7974 -10888 11930 3376 -8711 11444 -5757 -3355 10011 -3903 6168
542 6168 -3775 -5821 20241 -8457 -16102 13540 -411 -3829 -3251 -6696 15978 -2174 -14917 9087
556 9087 -2760 -4234 -976 -11738 10430 921 -10607 13571 -7321 -10100 11442 -13331 -7078
569 -7078 5268 -6900 11485 -3690 -12512 17077 -6326 -13724 7485 -6834 4089 4031 -12881
582 -12881 13890 733 -15401 14189 -3813 -10017 13466 -3213 1904 3883 -8381 15127 -1583
595 -1583 -15237 14354 3168 227 2465 -7346 17054 732 -16270 13823 2208 -2317 6797
608 6797 -6630 6774 2892 -5156 9186 -4497 1009 10159 -6669 -1092 -2095 373 9700 -11203
622 -11203 -3486 14972 -3545 -6792 -298 1025 4599 -7697 -5420 7184 -4432 -4651 4124 -5323
636 -5323 -1697 1914 -4708 1902 -6976 -5459 13926 -8140 -12343 8951 -1576 -424 -4605 -7046
650 -7046 15451 -4452 -11898 7129 -6321 3202 1599 -9647 12101 -2866 -3400 11645 -15778
663 -15778 990 14148 -8463 4010 -978 2572 14582 -16606 -3053 15952 -6285 2542 336
676 336 -1762 15255 -6897 -6284 14082 -5323 470 10553 -7261 1311 4677 -885 5371 -7003
690 -7003 -1093 15123 -5935 -7952 6053 1205 3104 -6707 -6359 11974 -2453 -6476 6236 -3061
704 -3061 1090 1664 -7464 -996 -4124 538 4902 -10379 -162 7265 -3992 -2718 -9834 1878
718 1878 10995 -14253 -4084 10089 -5178 -1154 -4701 -2581 9572 -7878 -1610 6686 -10606
731 -10606 3556 3641 -7450 6035 -1859 2548 8442 -14313 901 12035 -7312 912 3185 2839
745 2839 7432 -8580 -650 9022 -4789 2275 4165 -1684 5636 512 757 4731 -5342 5327
759 5327 7896 -9432 -341 7272 338 -377 -4803 4672 9569 -10024 -2366 7788 -2599 1770
773 1770 -3070 -1398 7689 -8749 -2423 7313 -8881 1545 4424 -7594 909 -3612 158 4266
787 4266 -11702 2912 7133 -8485 -1387 -2954 347 4905 -9835 1388 7484 -7843 -1673 110
801 110 -3344 650 -1821 3076 167 -5217 6303 1395 -7558 983 2566 2775 -610 -6775 6480
816 6480 7095 -7650 -856 5797 2331 602 -4782 3856 6257 -5551 4018 4491 -5255 8081 2355
831 2355 -5116 3998 -2340 4477 5067 -10845 5826 9376 -6051 -84 -456 3475 4806 -10012 1757
846 1757 6733 -6281 3026 738 -3654 3773 -3708 -1992 65 -6597 4518 4955 -6967 -2773 2456
861 2456 1736 -6082 -8489 6124 3828 -6784 -1478 -681 618 418 -7724 894 3474 -4915 2929
876 2929 -1387 -6075 4273 482 -1512 -1843 -3361 9590 194 -11493 6663 4559 -3269 108
890 108 -4832 5438 5797 -8111 3604 5304 -1908 3683 -938 -758 2356 -918 5828 -422 -5487
905 -5487 9818 3719 -5966 1343 1670 4604 107 -8851 5294 6958 -4473 1460 1592 1425 1683
920 1683 -5948 1281 575 -4262 7432 -586 -6364 5257 -965 -2174 -3099 -6549 7721 1492 -10152
935 -10152 3477 3494 -1963 -3327 -6181 3220 -377 -7060 2942 60 -2513 2547 -2516 -2491 -1416
950 -1416 -2405 3526 -1916 -5311 4951 2649 -4036 -3378 630 5923 -2599 -5348 5665 1452 -2970
965 -2970 1628 -521 2950 1828 -2743 4258 -574 -2198 7142 -911 -1607 3640 1092 4146 -3840
980 -3840 -3521 11025 -729 -5970 6026 1563 1323 -16 -4302 5911 1594 -5861 3925 1045 -1679
995 -1679 2897 -1359 428 -887 -2501 4884 -3418 -5761 6800 806 -4322 -805 -1696 3341 -3088
1010 -3088 -6859 5091 1351 -3518 -1197 -2209 1704 -3016 -3790 3933 -3789 -1587 5257 -4171 -2940
1025 -2940 498 -25 1560 -5467 -2195 7618 -880 -4863 620 2970 1928 -4651 -2329 6473 -215
1040 -215 -2505 4093 -389 230 3275 -1310 -789 177 1030 5397 -2617 -3756 6579 2937 -1318 -1987
1056 -1987 1393 7388 -4331 -5413 6871 1131 681 1885 -1704 4715 -554 -2478 3830 -3748 362
1071 362 4865 -3561 -1337 -275 2906 3699 -8654 -2517 7050 -3020 -3798 -136 1169 3018 -4347
1086 -4347 -4915 2588 -1200 -2656 1362 -2291 -1178 1254 -1751 -1836 -3616 566 5725 -4296 -5247 3950
1102 3950 937 -2878 -4512 -12 6041 -2033 -3650 2841 294 -365 -779 -1510 2165 -597 1780 3291
1118 3291 -4560 836 5675 -803 -2187 -1260 4097 4413 -5902 -155 7254 645 -1607 -895 1248
1133 1248 4673 -2216 -951 5119 -1440 434 3471 -3325 414 2679 871 1163 -4431 857 5521
1148 5521 -4267 -2745 3149 2045 568 -5823 -704 4966 -4076 -2274 1999 -1122 -92 -1542 -1441
1163 -1441 -5 -3246 848 1212 -4663 -663 2593 -565 -3041 -3203 2073 2437 -5427 -1870 4771 -25
1179 -25 -2991 -1055 396 1290 -2222 -309 2966 -1142 197 1791 -1783 -746 911 2145 1519 -3790
1195 -3790 2743 5837 -3762 -1362 2615 2588 1274 -4159 2500 4957 -2480 747 1368 695 2159 -2149
1211 -2149 1195 2977 -2839 3105 2514 -4727 791 3299 -23 -1457 -1699 3922 2089 -5682 -865
1226 -865 3397 -375 -1373 -1829 1173 1915 -4487 -1376 1978 -2932 568 1476 -3217 -1339 -194 339
1242 339 -1307 -4962 1923 3826 -3954 -3033 362 1998 -511 -6093 798 4532 -3301 -1429 1083
1257 1083 -491 1162 -852 -861 136 -1588 3193 1407 -3541 1779 3739 824 -1749 -3055 4579 4104
1273 4104 -5045 476 4744 1013 -109 -1250 2225 3035 -1288 1261 695 -1369 2783 1268 -305
1288 -305 -165 539 4309 -1069 -5316 2521 3660 -1632 -2881 538 4861 -293 -4212 955 1236 -1262
1304 -1262 -300 -1380 -153 921 -822 180 -1760 -2799 2108 -381 -5518 -592 2445 1286 -3486
1319 -3486 -4184 3408 1972 -5117 -998 1147 -116 -179 -3489 83 1445 -2304 1623 -298 -3122 2196
1335 2196 676 -1001 -1859 -405 5253 -1538 -4931 2454 2524 938 -1718 -1239 5022 1835 -3013 1866
1351 1866 2113 -443 976 369 -96 -114 1111 1962 -1436 -709 3921 1593 -3302 23 2409 2268 -616
1368 -616 -2784 2873 2493 -4575 -550 2292 50 -441 -1502 931 -426 -2610 1613 -910 -2839 1368
1384 1368 616 -800 -2158 -1381 2829 -1533 -4767 256 1935 -919 -3817 -515 3316 -2109 -2733 790
1400 790 -744 -453 -543 -948 532 -1402 -307 1866 -2639 -1400 3192 666 -2076 -1194 2242 2647 -2694
1417 -2694 -1907 4642 1320 -2132 96 1127 1954 -118 -1054 2804 922 -266 2359 69 -1050 1508
1433 1508 1861 686 -2421 1456 4905 -1406 -2755 1751 1935 122 -2630 187 3992 -178 -2745
1448 -2745 1410 -143 -719 228 -1086 -62 -403 496 1765 -3506 -3293 3387 -740 -3244 -1326 838
1464 838 2064 -3013 -4541 3501 1224 -3163 -562 335 542 -326 -1810 39 -456 -602 1242 -1699
1480 -1699 -2331 1501 1906 -1028 -2926 627 4050 158 -3288 359 4236 -196 -2848 472 2981
1495 2981 535 -1154 454 498 524 1369 1101 -650 -327 2275 2597 -2004 -1005 4069 1559 -1753 -1690 3037
1513 3037 3768 -2162 -1651 2814 737 -279 -950 -347 2057 -362 -79 1025 -2133 -68 2143 -2025
1529 -2025 -2167 327 2256 448 -4510 -246 3433 -1586 -3228 -458 1208 710 -3097 -1535 1444
1544 1444 -1854 -758 247 -1807 159 372 -335 -636 -3425 1074 2683 -3877 -1300 2728 1030 -531
1560 -531 -2619 715 3502 -2441 -1855 2719 727 -302 142 252 749 205 551 1428 -1036 -9 3505
1577 3505 98 -2313 1611 2252 853 -1415 -460 4084 1130 -3192 1155 2414 -166 -922 495 1694
1593 1694 -103 -478 622 -535 -1044 658 1328 -626 -1611 1204 1543 -2629 -1505 925 1498 -1475
1609 -1475 -4014 2013 828 -3667 -411 -490 377 -188 -2496 888 110 -1719 1405 -748 -2882 -396
1625 -396 573 603 -1822 -493 3049 -987 -3390 -62 2549 -844 -2037 -312 2006 517 -2295 118
1641 118 1995 -524 503 1296 -1130 1285 695 976 1013 -1952 2107 3537 -4010 160 2325 1091
1657 1091 166 -2598 2337 4265 -2295 -90 2161 182 988 -789 -394 1528 -458 1314 796 -2486
1673 -2486 555 2881 -1287 -2672 114 1728 -135 -2480 -999 2326 -263 -3541 -448 2250 -57
1688 -57 -1864 -678 -335 -45 -926 -255 -946 -1907 1374 1218 -3385 -1816 1318 1205 -1405 -2907 793
1705 793 2907 -1652 -3113 1996 1539 -1684 -854 14 780 1005 -396 491 -466 -837 2792 144 -2449
1722 -2449 1714 2316 1025 -1466 -1511 4239 1491 -3344 1363 2518 686 -116 -1526 2145 1489 -1191
1738 -1191 1748 260 -627 1937 -112 -1043 -877 314 2716 -1247 -2678 2187 2125 -1795 -2140 631
1754 631 1881 -862 -2346 485 1215 -1371 -959 -339 -792 -177 -196 -608 -572 -1802 746 1011 -3988 -688
1772 -688 2375 -1051 -1957 -1081 1252 1406 -2945 -898 2213 -402 -1393 -309 597 -55 -812 377 358
1789 358 -649 658 1742 -354 -1877 1295 2380 -1666 -665 1644 1594 585 -2031 1393 3212 -1837
1805 -1837 -893 2009 904 478 118 643 1258 -1019 628 1388 -1607 261 2641 -347 -1387 -98
1821 -98 1027 926 -2227 -1081 3096 279 -2873 214 1335 -190 -1249 -1370 1073 -310 -1530 691
1837 691 -743 -1628 1001 -281 -1123 -1222 -73 1797 -1736 -3380 1793 1138 -2062 -1368 539 2455 -999
1854 -999 -3015 277 507 -843 199 8 411 -57 138 735 -1039 -246 2769 723 -2415 677 2545
1871 2545 766 -1994 -645 2652 1899 -1893 117 2556 1001 -325 -416 854 813 474 848 403 -728
1888 -728 913 2051 -1465 -1563 1991 1980 -672 -1570 1045 2574 -594 -3135 752 2065 -1073 -1288 519
1905 519 428 46 -736 -856 -608 -1233 642 562 -2990 -394 1959 -928 -2095 -1391 1255 1820 -3376 -1936
1923 -1936 2417 -731 -1839 -670 -58 1169 -825 -872 753 -845 254 1171 -1290 -824 1420 1528
1939 1528 -397 -1899 861 2879 -951 -2254 1318 2212 -186 -1239 773 1798 208 -185 998
1954 998 659 441 1178 588 -187 8 1420 1053 -1605 -773 2787 900 -1588 -697 1797 1769 -1958 -492
1972 -492 2196 583 -969 -519 39 204 -616 -62 267 -636 59 784 -833 -1939 -134 1174 -1244
1989 -1244 -2146 204 1596 -920 -2436 -118 1570 -1098 -2150 656 673 -1008 -799 -226 -37 -443 -98
2006 -98 755 -1090 -690 2110 305 -2082 324 1387 438 -876 -963 2210 1022 -2187 -311 2090 589
2023 589 -372 -684 1688 595 -962 844 1176 -1052 1382 2176 -289 194 1189 2270 -118 -2118 1478
2040 1478 2904 -197 -468 1599 1598 -489 -1612 641 1506 -494 -335 384 -129 -483 -82 -483 -442 -723
2058 -723 1273 496 -2247 -1089 1513 -119 -2420 -1723 1852 712 -2668 -985 1186 54 -1268 -482
2074 -482 87 728 -417 -650 -496 -979 -66 1178 -912 -1674 1400 1741 -966 -1601 503 2015 -519
2091 -519 -2358 955 2216 84 -579 510 1163 737 -248 431 713 -115 1257 1203 -1459 -224 2981
2108 2981 845 -1063 -257 2034 2282 -1654 -1269 2542 1038 -1367 -220 686 976 -132 -1135 454
2124 454 161 -688 1234 -568 -2210 1038 1291 -1623 -1535 -537 1834 -256 -2819 417 1855 -996 -1083
2141 -1083 -671 697 37 -1607 -55 311 -914 147 -12 -1313 -423 770 568 -1509 -1219 1077 772
2158 772 -1981 -1226 1607 1571 -724 -820 1450 1323 -1378 -572 585 610 152 1051 -69 -233 740 1703 1065
2177 1065 -1594 397 2438 362 -1548 843 733 16 -2061 716 2097 -332 -947 468 891 -261
2193 -261 -13 -652 199 567 446 681 768 -1041 1506 1466 -2172 -575 1462 332 -667 -1670 588 469
2211 469 -2673 -1026 1289 -304 -1458 -760 -363 643 -1353 -1096 985 -1528 -325 837 -1247 -1607
2227 -1607 991 526 -680 -1291 -341 2011 -213 -2508 616 1775 -765 -711 -246 1576 460 -1128
2243 -1128 869 610 -775 869 682 -913 426 1216 835 -867 -667 2201 1404 -1214 -753 1891 2283
2260 2283 -1059 -766 1367 1394 -408 -286 913 374 -273 187 86 -713 -168 776 -524 -1259 388 1503
2278 1503 -378 -2296 -51 1656 -487 -2514 -306 1038 -685 -1844 -115 269 -54 -304 -680 -448
2294 -448 -492 -267 33 -1256 -1280 1395 649 -2091 -1015 985 982 -1983 -1782 1989 1586 -1543 -434 1286
2312 1286 296 -82 -218 770 1109 321 202 875 -850 49 1708 -763 -1072 812 1522 971 -1629 233
2330 233 3217 30 -1516 830 1106 738 -440 -402 1238 440 -553 674 -507 -630 1218 1163 -1285
2347 -1285 -1055 1084 547 -1321 -1682 1323 1528 -1607 -1828 765 519 -637 -1505 439 436 -991 -577 -302
2365 -302 -1399 -76 682 -349 -1193 -460 898 -368 -1395 -562 1306 -19 -1658 179 1915 -422
2381 -422 -1166 54 644 12 -469 183 92 -350 446 295 -234 -424 700 1500 -503 -924 1725 1351 -945
2400 -945 -650 950 1860 -656 -1043 1771 1237 -344 -99 573 744 171 -26 673 -4 -451 1218 256
2418 256 -1398 272 1977 -511 -1174 9 1298 714 -2224 -498 1638 -385 -1092 -320 213 22 -870
2435 -870 -457 365 -892 -320 440 -1156 -1022 828 218 -1624 -1340 552 919 -1364 -1490 1024 775 -1522
2453 -1522 -1206 487 1030 -734 -620 373 463 -473 164 153 -592 37 1005 -232 -1023 559 1622 379
2471 379 -1424 327 2125 732 -1674 198 1614 477 -1015 47 1157 709 -207 727 397 34
2487 34 836 598 -746 -530 1662 1087 -511 -1030 1958 2148 -805 -1648 887 1589 -976 -1328 309 727
2505 727 -792 -598 -253 -391 90 187 -542 -920 -352 1066 -354 -1871 -282 1360 2 -2134 -760
2522 -760 1803 244 -2112 -230 971 76 -760 -645 173 280 -302 65 -116 -810 673 962 -938 -934
2540 -934 984 1171 -556 -1356 909 1962 -591 -1112 1040 1285 211 -537 616 1081 -150 -88 561
2557 561 -55 246 1324 627 -837 13 1819 427 -1257 -52 1676 595 -1279 -182 1456 373
2573 373 -1010 -82 456 122 -775 -195 63 -309 -513 137 -581 -1255 519 899 -1123 -1288 256 680 -965
2592 -965 -1764 613 900 -987 -1625 215 692 -625 -1010 475 263 -283 75 -88 -548 -324 456 568
2610 568 -1262 -188 1490 321 -1014 -381 1163 780 -1472 -412 1625 456 -1173 441 1132 402
2626 402 3 353 818 126 169 879 -29 -602 900 1259 -400 -569 732 1503 -528 -1153 911 1431 -986
2645 -986 -806 302 1002 -378 -706 300 369 -315 -278 -13 -548 -398 578 -87 -1658 -218 947 -87
2663 -87 -1412 -761 1008 124 -1702 -900 866 -37 -1194 -731 422 78 -1002 -388 11 -302 136 491
2681 491 -573 -1005 558 646 -945 -1125 750 1628 -391 -1305 919 1654 -566 -1068 377 1261 -124
2698 -124 -388 317 604 304 205 270 -391 393 1532 627 -960 31 1617 647 -1394 -225 1590 922 -1017
2717 -1017 -511 1416 612 -761 -384 331 165 -260 -152 57 -442 568 723 -1014 -1260 420 774 -941
2735 -941 -1709 248 1462 -947 -1958 372 729 -336 -1337 -434 145 -526 -685 -497 -586 -346 453 45
2753 45 -1261 -611 1161 356 -1490 -642 1153 636 -971 -664 1089 857 -490 -530 1035 745 -456 -25
2771 -25 325 12 420 692 -37 -313 471 1335 -77 -624 1060 1695 409 -1194 945 1908 -119 -697
2789 -697 275 1243 -16 -954 613 501 -1091 -43 71 164 -93 648 721 -1010 114 1443 283 -659
2807 -659 -1479 1009 323 -1646 -453 200 828 -1314 -1118 29 -489 -718 -688 -122 112 -175 -283 -258 -840
2826 -840 -14 460 -455 -1100 214 1156 -300 -1479 301 1109 -540 -1144 529 847 -60 -695 329 791
2844 791 155 231 578 38 -125 987 285 -355 47 1181 789 -883 -381 1261 759 -892 -190 1217
2862 1217 841 -647 -268 765 317 -282 -41 158 -35 218 708 -517 -1013 549 444 -452 -1567 334
2880 334 999 -665 -1348 479 907 -591 -1132 -64 963 -248 -910 -185 121 -620 -122 -279 -574 -213
2898 -213 497 124 -1114 -641 962 366 -1566 -636 1147 558 -964 -911 981 656 -651 -195 555 289
2916 289 198 -126 98 -29 108 968 -200 -741 807 1373 -245 -729 373 1488 328 -1075 393 1571
2934 1571 93 -746 124 707 286 136 -4 -137 48 702 365 -449 -486 788 336 -1104 -1049 723 655
2953 655 -1050 -1028 820 522 -752 -930 187 440 -680 -717 -276 -456 -381 125 -331 -898 -314 513 -648
2972 -648 -1476 380 938 -238 -1310 -328 1539 -551 -1214 81 258 -17 -464 -119 366 -240 -69 285
2990 285 -144 -230 552 385 -695 -229 1102 576 -897 -552 1097 1095 -802 -247 708 1051 -59 -282 767
3009 767 876 -143 27 517 -264 435 630 370 -460 158 970 92 -828 -103 1066 61 -1033 61
3027 61 1005 -67 -987 245 899 164 -964 -153 -348 -748 -173 -252 -285 -574 693 38 -834 -515 371 116
3047 116 -1209 -974 792 457 -1281 -919 1042 394 -907 -756 561 116 -558 -75 457 232 -461 445
3065 445 -43 -741 550 1231 -5 -791 310 1516 232 -1334 351 1507 301 -617 200 987 352
3082 352 -317 393 607 262 458 386 -212 -186 923 420 -602 -422 945 746 -882 -844 793 452 -960
3101 -960 -837 761 888 -492 -987 306 150 -223 3 -298 -197 -232 329 -240 -1206 -1 999 -266
3119 -266 -1507 101 942 48 -1454 -599 959 -103 -1136 -86 310 -151 -420 -146 -142 -259 244 367
3137 367 -447 -196 656 639 -703 -608 1067 1109 -720 -814 889 1203 -475 -487 763 913 -206 -128 583 473
3157 473 309 442 353 -451 408 984 290 -749 -10 1398 692 -1615 -169 1636 489 -1039 -604 1010
3175 1010 589 -326 146 -159 -37 -190 89 -170 -636 164 54 -649 -841 285 519 -897 -1111 611 667
3194 667 -1134 -884 339 292 -522 -793 356 215 -594 -215 183 -411 -148 246 -11 -488 78 818 42
3213 42 -1010 103 1074 -17 -986 -176 1416 211 -889 53 615 345 -475 106 654 167 338 620
3231 620 228 -134 455 677 -393 -392 481 828 -207 -596 1020 1001 -556 -829 933 800 -898 -406 415
3250 415 -19 -269 -291 156 -41 -79 249 -324 -747 -179 296 -214 -891 -202 831 -100 -1330 -205 699 -147
3270 -147 -1283 -238 423 -113 -677 -173 289 -201 -210 154 -374 -235 335 326 -581 -645 681 808 -460 -933
3290 -933 816 1049 -660 -466 654 999 -216 -470 283 234 -27 197 139 -48 453 795 223 -387 170
3309 170 1266 277 -866 282 1449 218 -1003 -193 987 525 -782 -329 796 54 -171 -133 149
3326 149 -256 -151 -29 -334 -731 398 428 -924 -933 615 541 -918 -1288 537 819 -652 -1021 -138 676
3345 676 -336 -578 -288 -211 -303 -140 -220 -560 -277 540 -193 -842 -112 839 138 -1079 -371 1173 566 -967
3365 -967 -319 1017 391 -218 -288 769 288 -20 55 252 -138 280 766 -276 -259 727 837 -259 -586 360
3385 360 1317 -112 -719 659 766 38 -547 89 600 -196 -98 161 -6 8 268 232 -632 -172 635 65
3405 65 -864 -479 1009 -52 -1212 -433 498 48 -924 -576 620 244 -599 -350 305 -268 -421 -92 -228
3424 -228 -365 -239 247 -412 -760 284 776 -465 -959 430 946 -406 -487 368 854 -172 -733 114 816
3443 816 -627 191 133 -151 165 198 379 -475 211 508 194 -854 -311 634 399 -687 23 1474 435
3462 435 -1028 -774 659 99 -153 -88 774 851 38 306 -87 -175 -12 -382 -554 -688 506 494 -284 -968
3482 -968 374 495 -707 -1075 281 568 -525 -777 20 152 -248 -364 -175 -497 -228 138 -181 -946 -105
3501 -105 612 -16 -841 -549 813 201 -1117 -470 681 572 -686 -591 453 379 -283 119 151 256 308 372
3521 372 -224 -110 647 889 -148 -599 777 1079 -403 -849 571 1015 53 -455 683 762 -8 -254 267
3540 267 299 67 133 180 -81 110 451 55 -1000 -437 631 61 -636 -426 776 435 -977 -783 440
3559 440 536 -538 -397 358 40 -237 -322 -178 -455 212 254 -532 -784 20 415 -450 -862 279 811 -88
3579 -88 -1195 248 999 -367 -663 271 586 -191 -184 -138 207 -179 204 377 -508 -5 981 279 -391 1
3599 1 904 679 -742 -391 1119 605 -533 -224 578 798 -227 -51 400 244 55 244 -241 -167 331 344
3619 344 -236 -641 42 657 -154 -753 239 621 -354 -691 133 418 -253 -651 190 183 -317 36 -115 -87 -133
3640 -133 -104 -16 -718 -687 489 -17 -665 -540 501 342 -1143 -550 649 418 -1003 -609 451 287 -363
3659 -363 -194 190 212 -165 173 -61 -112 79 604 -250 -577 388 871 16 -635 321 1020 -87 -419 335
3679 335 1051 -83 -296 312 459 207 116 -54 55 219 502 316 -515 77 776 368 -547 -444 795 513
3699 513 -721 -412 732 287 -572 -622 360 411 -478 -434 -209 -456 -231 -57 -241 -482 -11 375 -544 -1118
3719 -1118 175 637 -574 -1038 112 620 30 -797 -229 497 93 -292 26 127 -9 61 -103 -180 7
3738 7 570 111 -547 -153 843 632 -707 -350 784 689 -576 -589 764 810 -325 -192 313 341 -145 -17
3758 -17 96 279 236 578 78 -219 412 971 43 -651 36 1119 -184 -842 -119 707 -58 -701 -82 650
3778 650 66 -338 -471 40 -486 190 118 -645 -388 445 279 -712 -589 422 227 -752 -889 431 413 -898
3798 -898 -840 91 211 -340 -454 -48 209 -230 -128 -391 -238 -96 697 -86 -480 66 843 -209 -479 337
3818 337 1206 375 -780 494 738 440 -397 236 744 71 -78 231 304 -129 277 377 70 -532 540
3837 540 486 -305 -439 603 708 -546 -483 394 442 -145 -708 690 475 -425 -31 -110 215 -347 -256 22 -559
3858 -559 27 736 -211 -872 176 331 -226 -623 103 653 -154 -796 -222 316 -15 -786 -404 265 -27 -561
3878 -561 -326 -146 79 -16 -54 -578 -775 1176 114 -514 59 881 792 -470 -275 582 688 -500 -543 597
3898 597 362 -166 -218 63 173 214 374 -55 -201 376 761 10 -418 180 1106 29 -548 152 818 107
3918 107 -744 -196 649 423 -364 -86 159 64 -302 35 -389 -147 433 221 -554 -548 446 288 -992 -782 445
3939 445 538 -495 -613 322 580 -558 -459 -196 279 -47 34 -45 -28 -102 154 -282 -666 -40 659 -169 -967
3960 -967 45 716 382 -915 -225 608 240 -298 -189 581 206 -236 -49 226 370 143 217 -178 -68 629
3980 629 447 -117 -627 522 633 -249 -474 549 586 -283 -398 208 437 24 -201 122 253 41 185 133
4000 133 -415 -230 502 -178 -530 -69 748 337 -767 -406 698 103 -975 -270 417 119 -739 -298 158
4019 158 50 -394 -139 125 -249 -35 226 -597 -493 252 633 -444 -562 464 512 -472 -213 309 552 -369
4039 -369 -423 295 174 -114 -129 290 289 70 75 160 -376 28 517 220 -322 10 736 443 -534 255 819 205
4061 205 -354 -99 688 363 -17 71 456 38 -120 -82 103 129 -11 262 -280 -279 318 570 -511 -586 273 653
4083 653 -457 -637 359 663 -604 -783 72 254 -445 -427 -37 47 -182 16 -131 -432 -73 562 -82 -558
4103 -558 -205 688 -183 -514 -268 640 -280 -239 -586 126 400 -279 -414 525 445 352 250 -309 -252 114 329
4124 329 -295 40 768 782 -211 -470 460 650 -296 -437 447 586 -95 -239 217 482 320 -221 69 159 -156
4145 -156 399 -11 -336 9 380 37 -788 -161 675 244 -847 -390 577 86 -192 -272 199 468 -666 437
4165 437 -420 -119 56 206 -27 -425 380 332 -554 -717 169 432 -459 -963 118 574 -317 -571 187 351
4185 351 -111 -362 -105 226 241 -166 232 -274 -27 529 176 -323 75 532 184 -601 -86 843 430 -322
4205 -322 -253 538 403 -270 -129 306 421 125 12 -17 138 164 208 -210 -268 320 708 -84 -521 206 776 -321
4227 -321 -561 268 516 -174 -254 -142 137 -81 -190 -124 -144 195 -246 -34 -263 87 335 -24 -776 -447 598
4248 598 174 -725 -491 510 -59 -796 -208 492 112 -315 -340 262 -18 -162 -87 166 -103 -12 484 -108 -249
4269 -249 207 838 -56 -681 554 896 67 -440 338 922 -27 -417 113 525 -173 -326 60 204 -50 123
4289 123 368 -129 156 346 233 -285 -166 574 214 -448 -226 588 477 -175 -380 462 -229 -636 -506 -71
4309 -71 -154 -227 -260 -771 -70 211 -19 -839 -866 223 617 -361 -656 32 388 -904 -464 -143 901 13 -764
4330 -764 -790 -101 -93 -275 64 -195 -84 132 20 -406 83 583 -117 -524 -194 537 442 -393 -337 533 516 -423
4352 -423 -131 592 283 -167 -104 122 281 65 378 -216 -76 130 413 -285 -307 169 578 -84 -375 209 573
4373 573 -141 -425 170 485 72 -240 63 195 18 -418 -129 -257 -70 147 83 -657 -418 635 314 -586
4393 -586 -450 498 314 -551 -278 275 291 -528 -175 7 175 -466 -125 47 -265 39 121 42 -337 179 295
4414 295 -293 -337 -26 592 129 -427 101 363 -24 -312 55 631 241 -24 365 235 46 68 322 -30 2
4435 2 675 230 -157 -166 374 146 -522 -258 702 580 -413 -164 842 171 -239 -165 228 101 -267 -74 99
4456 99 -389 189 154 -251 -585 -346 413 -222 -494 -30 535 -369 -761 79 423 -120 -579 -156 92 -11 -275
4477 -275 -235 176 -148 101 -54 -314 -353 201 216 -297 -239 305 309 -297 -271 591 531 -352 -348 483 448 -347 24 292
4501 292 12 -97 17 277 12 180 500 -25 -141 117 758 -52 -185 294 703 104 -365 269 588 213
4521 213 -298 -90 493 237 -16 115 -58 -214 65 -16 -362 -418 325 84 -271 -655 616 186 -683 -414
4541 -414 354 426 -328 -320 219 386 -344 -483 32 176 -160 -217 -103 -322 -242 391 -326 -239 -249 569 157 -808
4563 -808 64 505 122 -594 96 670 68 -240 -217 -51 1 76 129 209 152 537 364 -153 80 510 622 -261
4585 -261 -365 704 643 -159 -341 515 375 -119 -339 406 315 106 42 206 63 -43 413 -193 -204 -44 412
4606 412 -298 -579 3 532 -204 -526 -349 480 133 -510 10 138 -356 -313 -26 -60 -4 -203 142 -132 -324
4627 -324 -116 190 -477 -266 429 327 -264 -379 429 235 -440 -523 519 319 -343 -375 179 451 -119 -35 522
4648 522 -68 1 317 -31 -107 13 564 129 -163 103 567 164 -404 90 618 90 -408 -36 240 152 164
4669 164 157 214 37 50 233 -352 -79 287 -124 -270 -268 241 366 -417 -563 301 417 -318 -343 271 229 -136 -308
4692 -308 24 -18 -181 -28 -114 -147 -122 -46 -214 -594 47 109 -114 -448 -44 471 65 -778 -230 325 136 -424
4714 -424 -244 237 43 -165 -59 67 -13 142 230 -194 -151 444 441 -149 -90 540 381 -299 -478 434 604 -225
4736 -225 -221 312 476 88 -269 218 190 115 31 -100 -262 -18 373 39 -799 25 619 110 -584 -387 771
4757 771 71 -512 -311 520 -175 -286 -607 90 -90 -401 581 -116 -307 -574 184 242 -15 -412 544 -1112
4777 -1112 -609 189 580 -440 -550 43 523 -101 -305 198 81 136 -122 -1 53 11 190 55 -391 184
4797 184 552 310 -279 -217 521 488 -461 742 -243 -355 -430 -1034 -410 479 450 -173 -347 322 -863 3 39
4818 39 -272 391 353 -181 63 41 584 -575 -651 497 268 -586 -288 -459 831 550 -761 358 -18 -93
4838 -93 -395 76 -104 137 117 241 -293 -218 -115 125 -572 -229 19 30 -680 -275 323 -142 -316 -176 139
4859 139 94 -325 43 267 -26 -82 73 260 -134 -76 470 -240 -316 331 577 61 -255 144 646 20 -223
4880 -223 346 332 92 -176 305 229 86 -101 50 -63 171 217 52 32 204 456 247 -458 67 467 191
4901 191 -332 -417 265 91 -294 -238 -29 166 -245 -140 -43 -138 -116 -90 -247 -224 -85 90 -92 -470 97 447
4923 447 -386 -453 38 420 -227 -418 -123 330 -40 -228 191 176 -306 10 11 -62 162 288 132 -532 -146 487
4945 487 105 -561 -220 476 275 -281 -25 113 170 104 83 552 193 5 169 92 41 140 305 -100 -21 122
4967 122 715 118 -467 289 764 219 -414 -20 300 374 -562 8 524 97 -297 -93 -127 -52 233 6 -177
4988 -177 -86 256 -64 -276 -452 153 192 -971 -417 314 111 -195 -255 36 239 -362 -413 110 -274 -264 -102
5009 -102 14 69 195 596 -433 -282 -37 418 -208 -100 142 441 120 -966 -24 154 398 -380 135 193
5029 193 -69 -98 58 -110 189 242 49 40 -36 347 425 -347 -270 493 458 -293 -366 320 87 -191 -82 232 112
5052 112 46 -54 160 -152 77 -6 -301 -14 15 241 75 -279 -76 450 -287 -383 63 440 -171 -310 -92
5073 -92 82 35 -470 69 205 -21 -168 -84 0 -40 -170 -122 -143 -139 110 -71 -232 -484 194 63 -301 -436 327
5096 327 146 -334 -386 100 278 -180 -194 291 72 109 286 -101 -59 163 561 -86 -372 4 273 -26 -307
5117 -307 -18 339 -126 -290 306 365 127 -464 -226 102 -244 121 -203 -80 84 152 96 -260 -70 163 77
5138 77 -429 -517 34 310 18 -225 198 236 -46 -268 -139 279 -255 -233 -318 -262 318 -30 -43 -213 -38 351
5160 351 -282 -539 -59 597 -102 -341 107 386 380 -504 -99 285 146 -117 0 171 114 193 -16 -31 37 316
5182 316 659 -153 -68 235 603 -79 -412 362 293 -112 -433 116 306 176 -143 165 -142 -84 -107 46 -64
5203 -64 345 274 -217 -210 150 284 -83 -459 -246 289 0 -308 -217 197 104 -586 -168 105 -7 -388 -111 242
5225 242 -190 80 174 -347 -290 47 460 -380 -271 54 371 -305 -469 292 131 13 -330 166 221 122 -225
5246 -225 86 -13 -199 163 87 -208 -224 587 140 3 -182 487 132 -188 -34 544 -62 -336 -162 -288 18
5267 18 -299 474 225 40 -243 -117 266 -309 221 169 -41 -124 353 254 -365 -347 135 199 -101 -284 121 225
5289 225 -471 -432 148 364 -153 -27 -14 28 161 -72 3 -544 38 499 -190 -485 -25 194 -186 -653 -382
5310 -382 266 193 -476 -205 400 467 -277 -53 120 66 -110 -133 60 18 214 -72 -154 -133 367 238 -141 -378
5332 -378 355 443 -215 -391 417 499 -10 -198 133 332 99 -52 63 -165 294 372 202 -425 192 361 216
5353 216 -582 77 425 18 -981 -112 315 102 -144 -174 326 258 35 -141 -143 -26 -62 49 -372 -550 164 111
5375 111 -134 -17 -92 423 -320 -335 186 377 -464 -445 183 244 -160 -385 -191 -116 -145 -132 -151 -224 -144 119 100 -255
5399 -255 -377 309 171 -523 -76 480 256 -295 -203 511 183 -257 -179 207 -31 4 180 -61 139 193 168 -23
5421 -23 -84 146 312 -44 -258 87 463 64 -447 -185 222 -303 -241 183 307 -154 -250 -33 -57 -216 -225 -82
5443 -82 -304 -238 143 -31 -224 -269 333 10 -189 -321 113 336 -393 -297 119 -9 -243 -239 -65 -142 -164 78 -39
5466 -39 -130 -20 180 280 -297 80 426 -349 -71 -154 450 154 -367 141 391 -351 -173 92 451 32 -11
5487 -11 76 -32 136 304 300 27 -5 283 21 83 82 303 105 -288 129 331 116 -223 -187 122 339 -193 116
5510 116 -53 -146 -381 -61 39 13 21 133 -152 -499 -118 280 -179 -309 -155 -70 -463 -626 33 54 -257 -184
5532 -184 -93 21 38 15 -198 155 -35 79 -243 -258 -194 356 32 -652 -84 420 162 -217 -42 324 403 -288
5554 -288 -199 269 499 -72 21 -4 237 223 -111 -19 -355 68 369 -82 -161 -82 558 -36 -536 267 446 31
5576 31 -178 -76 223 55 -447 -255 178 155 161 36 119 -63 336 -59 -429 -172 38 82 -415 -307 207 402
5598 402 -139 -299 152 -75 -164 -80 133 19 104 -111 69 -58 -184 14 -148 -264 225 280 37 -229 108
5619 108 573 -133 -187 267 462 130 -163 -61 204 282 -114 41 -20 202 53 178 69 -71 365 308 -60
5640 -60 -91 313 439 -52 -152 292 33 -153 -34 291 143 -104 24 17 -117 -57 52 -5 -51 104 81 -343 -345
5663 -345 -3 452 -353 -402 444 232 29 -183 -199 158 -131 -23 -97 30 -270 -189 -69 -114 -205 203 85 -170
5685 -170 -221 -5 245 -88 -275 259 408 -235 -292 154 241 -202 -239 16 386 -11 -178 105 287 -265 -48
5706 -48 202 -253 153 128 269 -192 114 391 148 -221 102 404 96 -397 -7 392 43 -146 5 328 30
5727 30 -118 -185 222 25 2 233 -262 -35 184 91 -332 -111 13 482 -228 -263 40 150 -180 -221 138 134 -79
5750 -79 -38 -2 -129 -129 -107 -25 -9 12 254 -41 -257 19 174 -327 -282 -132 443 134 -464 -126 221 179 -261 -353
5774 -353 175 55 91 -257 -194 123 216 -150 -56 -151 472 245 -212 -311 207 1 -165 -117 34 444 206 128 46
5797 46 234 -86 45 -19 364 142 154 -205 -392 4 265 -122 -372 381 398 -52 -247 -78 633 -16 -331
5818 -331 -73 -99 -108 -179 -131 -145 132 157 -81 -205 -157 -288 52 -28 -233 232 -60 5 -200 -80 444 100 71 360
5842 360 410 -52 21 108 128 -286 64 153 99 73 76 35 -269 -129 270 18 -479 70 352 122 -309 226 292 134
5866 134 -158 -375 242 -60 -111 -110 -104 -83 51 202 30 -80 106 -73 -319 -181 256 404 204 -303 117 228
5888 228 -84 -191 -118 274 -133 -191 -136 -140 -48 -125 -54 -25 -37 27 2 -230 -65 170 -30 -162 -78 -190 -326 -186
5912 -186 -61 508 -54 -89 10 51 -55 191 -1 42 219 152 142 -92 -160 159 214 -101 -379 107 496 -132 -258
5935 -258 158 550 99 -268 276 525 -276 -191 38 344 106 173 422 -92 103 48 -87 -432 -2 165 25
5956 25 -66 -295 275 105 -92 -80 298 158 -396 -172 -38 44 132 -156 250 52 -228 233 -157 -528 535
5977 535 -284 -1081 -278 25 470 -296 -177 299 -159 -479 -323 -264 -119 146 56 74 -17 -152 -8 -51 -50 182
5999 182 293 300 -350 -109 407 -1 -234 -151 377 201 -65 -298 130 -5 -331 61 203 96 307 -18 -21 -205
6021 -205 302 391 -33 -194 42 383 -234 -58 148 354 228 -378 98 340 -42 -333 -150 100 -394 -22
6041 -22 15 -145 137 -23 -35 -337 277 -23 19 -142 65 306 59 -388 -232 -91 134 -285 32 156 113 -215
6063 -215 -89 9 -171 80 92 18 -256 216 217 143 -156 219 1351 -57 -42 82 220 -5 -96 -5 204 231 -352
6086 -352 92 198 135 496 -477 -161 -322 -220 125 -76 -129 122 555 -381 172 -4 393 -147 -80 18 -37 -411
6108 -411 -44 114 4 -225 16 -67 -69 -378 -65 0 -219 26 294 -181 -326 -30 158 -61 -403 87 346
6129 346 -207 -573 -230 280 -314 -226 -419 -163 93 -52 -92 -320 101 258 119 -394 -371 63 -110 -148 -18
6150 -18 324 338 -156 76 165 227 -156 -223 -18 185 199 -62 16 -28 300 298 -31 -350 186 324 -43 -82 71 554
6174 554 -10 -305 -75 252 215 -42 2 187 95 54 -178 -142 -158 38 -64 27 142 243 63 -315 -270 106 115
6197 115 -274 -316 346 173 -121 -165 -176 238 57 -189 -38 -1 -44 -21 -229 -221 -221 250 -283 -394 45 299 198
6220 198 -299 -97 363 164 -357 15 432 222 -362 -86 138 125 91 -86 92 81 54 158 -277 -331 56 -232
6242 -232 -342 125 136 -103 -677 -171 341 103 -48 -96 268 174 -66 61 69 -44 -127 144 -148 -98 197 215 47
6265 47 -235 -228 53 40 -336 -32 186 -31 -372 -101 122 176 -330 166 -87 141 39 -96 143 -11 -59 128
6287 128 -93 -314 345 1 -208 -116 500 438 -123 -338 -91 169 129 -223 242 50 130 -139 -68 138 -185 178
6309 178 38 95 109 194 91 39 -11 173 79 -126 -23 521 82 -279 84 297 24 18 -302 22 103 26 107 -85
6333 -85 -7 38 169 -227 35 283 -114 -352 -210 144 127 -29 -253 135 176 -216 -87 182 44 30 -91 -62
6355 -62 -412 199 26 -224 -198 -118 136 -19 -296 49 503 156 -220 128 454 42 -123 5 316 58 2
6376 2 72 140 2 100 209 -70 197 72 265 -109 -310 43 133 -134 -179 165 523 0 -135 0 203 -93
6398 -93 41 -122 162 105 -15 87 -62 259 177 -202 -32 184 361 -187 -67 162 395 193 -399 -222 122
6419 122 53 -286 106 8 192 56 -50 -70 -163 152 -26 -294 -189 22 -13 33 -234 147 108 -352 -465 -10
6441 -10 -10 -96 -258 94 -76 -161 -95 128 298 -205 -29 77 140 27 157 94 -150 -81 287 -8 -55 -285 45
6464 45 1 -11 -210 271 164 -102 -124 171 107 -20 130 194 -17 338 115 -3 -178 49 175 -157 -136 101
6486 101 112 -178 139 223 487 164 314 437 174 -402 -69 332 274 -105 194 -164 -315 226 322 593 -292
6507 -292 -303 -517 -608 191 255 49 586 -704 125 -172 -140 -778 -232 659 2 233 -179 179 -88 798 108
6528 108 230 -510 -149 203 -680 585 -414 425 47 481 404 -179 262 562 -763 -129 287 584 -249 195
6548 195 -757 -338 321 183 266 129 560 -707 188 772 -285 65 -10 127 49 -486 -266 272 649 76
6568 76 -37 32 -147 200 29 -415 50 62 -83 -171 -159 102 97 -218 -158 115 344 -84 -350 -32 123 -287 -327
6591 -327 30 -37 -68 -41 45 -5 175 243 247 -426 184 274 100 -102 -57 241 237 -256 -222 353 164 182 -155 268 -104
6616 -104 76 -22 18 -166 300 150 -34 28 151 -13 -162 -157 344 288 210 -142 212 355 27 -186 137 246
6638 246 -188 228 -41 -78 84 132 -142 13 -156 183 217 -246 -10 43 279 -260 -332 201 -69 -221 -354 77
6660 77 -80 -117 -90 383 -126 8 -13 42 -60 -31 183 -145 -153 53 416 61 13 110 233 -20 -155 6 513
6683 513 19 -171 132 288 -172 -139 210 -324 -46 211 255 -64 7 74 202 -170 -193 207 100 -236 -52 -1
6705 -1 -118 38 -68 492 43 -177 134 -76 -139 -89 -42 253 -345 -145 93 -75 -278 233 424 154 -550 -89
6727 -89 -192 -147 -234 -216 490 -96 -431 321 683 448 -291 215 -591 65 271 -83 -163 -173 301 236 -278 144
6749 144 337 156 -326 -758 -53 -88 12 -242 15 456 340 -273 37 514 263 431 472 280 -383 13 -9
6770 -9 -129 339 444 273 -329 322 118 -56 -441 147 -58 196 -296 249 90 -52 -163 75 -124 -184 -38
6791 -38 205 -366 20 248 574 -487 49 451 -263 -221 -437 175 276 -787 112 -9 27 158 -503 -180
6811 -180 663 -116 -35 201 608 276 223 366 642 -110 74 -578 893 -401 996 319 143 60 277 -164
6831 -164 393 287 419 74 -52 115 -173 736 369 404 -106 -115 -30 250 -182 -304 717 257 318 109 -80
6852 -80 594 574 -712 -315 62 -368 -48 146 67 29 345 443 -411 -40 459 -102 -446 130 138 -585 -181 -445
6874 -445 797 -175 30 -52 -32 -262 275 -366 225 -48 60 -118 -201 -171 106 -119 110 -410 235 -63 -9
6895 -9 -448 163 -511 -167 118 324 215 -35 -201 -105 -228 468 227 370 -144 -48 -224 61 -281 69 -191
6916 -191 -215 -253 52 -42 -227 -199 -114 314 94 -37 91 253 538 -9 -290 -35 231 550 116 -22 -292 40
6938 40 -292 -478 -58 263 502 -25 175 748 -18 -133 93 178 17 -349 -68 -235 -102 -55 42 -166 -223 -1
6960 -1 211 -89 -222 -184 -180 56 -202 -44 280 -10 -365 -57 135 -95 83 -246 87 -37 -113 197 -86 -248
6982 -248 326 189 -59 29 186 167 106 -62 206 427 5 -333 168 12 78 -133 -20 60 53 139 208 13 -140
7005 -140 -7 132 191 218 -31 -108 -158 140 193 -215 -199 -229 44 -41 -255 22 92 77 -65 -264 -193 -160 -187 160
7029 160 -75 -260 26 110 -263 -91 250 -96 -147 -156 91 433 -136 -107 327 256 121 -171 -74 183 -117 -83 115
7052 115 -95 55 239 18 -179 -82 127 221 -137 30 407 307 -235 -177 82 182 -176 147 134 32 118 -24
7074 -24 -141 0 121 98 143 -225 -43 146 -89 -74 -8 51 -238 -141 41 -1 -380 0 -164 174 -5 144 59
7097 59 -204 -171 -8 -56 -131 -167 141 -222 -71 81 9 -103 -197 -143 211 98 -212 -152 8 243 33 -103 63
7120 63 -73 168 124 -141 28 -23 321 -11 31 -1 170 60 -16 14 442 159 -97 300 157 47 15 -438 123
7143 123 156 -70 -42 -32 -328 74 -32 -66 78 324 -33 -244 -210 163 67 -213 -198 79 -158 -282 -54 224
7165 224 88 -242 -5 54 35 -242 114 -7 93 -28 120 -62 21 44 63 -282 -261 319 216 -136 -363 -91
7187 -91 33 134 -71 -106 -99 -30 -136 -242 -194 -26 67 -50 -111 -19 287 76 -82 -350 253 214 -24 -83 29 -71
7211 -71 -75 30 197 328 15 -95 -230 241 -112 210 127 78 -15 155 15 -280 168 1 84 -38 160 78 -162
7234 -162 -124 -61 287 -189 -218 -173 84 195 138 -6 -25 27 -26 -28 -263 9 -145 62 -371 -205 166 19 -117
7257 -117 -414 128 -12 -270 -55 -85 41 -15 -263 4 145 77 5 0 -219 244 29 303 -193 -1 315 -122
7279 -122 -291 -82 174 -169 -33 19 104 -60 2 75 49 -156 -55 49 -59 49 -17 121 -129 -11 106 198
7301 198 -291 199 312 267 -115 198 280 316 74 45 416 85 63 -67 -162 15 -45 47 -159 -53 -269 -72 127
7324 127 -130 -88 95 89 -338 -95 56 -19 -156 -53 318 -160 -318 -145 51 204 -66 -98 113 42 273 -13
7346 -13 -266 -171 420 185 44 19 92 187 90 92 153 178 125 31 38 184 10 -365 -173 250 211 273 153 -17 -95 338
7372 338 -51 -151 -14 461 105 -38 -76 -8 81 -125 84 318 -134 -32 -96 38 155 -214 13 -48 -126 -12
7394 -12 60 -67 -167 -91 -21 -79 -101 420 -108 52 -105 -125 27 128 -95 11 252 93 113 -10 -118 -13 241
7417 241 70 -181 218 216 -97 -353 -81 -15 52 -152 -132 96 -7 -104 -124 242 94 32 -141 18 25 -65 144 -90
7441 -90 19 171 315 -16 -133 167 173 -105 -245 125 400 -153 -189 126 116 2 -102 149 51 80 -288 -148
7463 -148 -71 -9 10 80 -364 -111 165 -43 -231 -109 -308 -27 -260 -73 -25 -101 207 -17 -103 -98 -136 124 -108
7486 -108 -255 -168 -122 81 -80 372 -4 -206 -430 117 90 -232 -305 77 50 -106 -167 -2 338 11 -214 -46
7508 -46 -45 138 63 -114 175 -156 223 -110 -223 235 248 -67 -167 138 295 356 -72 126 52 -127 59 8 52
7531 52 226 151 -24 -172 -236 27 205 77 -144 -128 165 -9 -143 -110 -207 35 -271 63 177 22 -284 127
7553 127 126 -165 -36 160 -59 -61 -306 19 -110 129 46 17 -263 -136 -41 -73 -261 -313 167 18 -427 -129 -45
7576 -45 -161 -8 -153 105 98 115 234 -98 -218 38 174 -124 100 58 190 -60 88 279 170 -127 13 49
7598 49 287 89 -181 102 -15 196 -228 -165 104 17 125 85 -50 122 185 -5 -25 -197 248 -1 -558 -167
7620 -167 -141 168 -274 61 25 50 -103 115 -84 -71 -35 -145 -113 3 301 -18 -76 -151 -151 61 -162 -210 -30 118
7644 118 75 156 122 90 -80 -57 -38 -104 125 186 -82 -23 100 183 59 -227 184 104 28 -97 -7 370 302 129 144
7669 144 -10 328 66 -45 302 -3 -82 -120 -79 -216 -66 144 -79 -241 174 76 -96 -160 20 37 27 -67 76
7692 76 143 184 -269 37 112 96 -107 51 56 -267 200 -154 -211 -165 33 143 -293 166 192 216 -157 12 37 -143
7716 -143 78 -193 73 22 212 49 248 -143 44 -108 93 -167 156 46 37 -355 -29 196 -191 -296 68
7737 68 339 -54 -50 60 374 113 -64 248 108 27 362 40 224 -285 63 25 430 -78 206 112 23 370
7759 370 363 159 -209 -45 89 195 -84 31 150 30 -124 -335 22 -34 313 211 -67 -114 -156 128 -189 -276
7781 -276 55 -32 -65 -114 241 212 -223 -85 -56 94 -55 -378 -21 52 136 -35 -142 -193 -72 -80 182 -40 -59 113
7805 113 79 -285 89 134 62 -50 -183 -172 179 -137 143 -76 -31 25 -108 51 -18 -9 131 116 90 51 238 -22
7829 -22 -194 -70 320 96 -272 107 221 -106 -118 -192 -278 -91 2 87 98 -87 50 8 -59 96 -88 19 -206
7852 -206 -176 248 212 -320 -98 298 -49 64 -74 287 262 -123 -101 54 -53 -56 163 -59 -36 -186 62 -103
7874 -103 -275 -66 173 -176 -11 109 101 -175 -133 154 43 -45 -73 139 80 263 149 59 301 -22 35 289 -135
7897 -135 -327 113 58 -62 95 128 -162 -146 -24 71 219 -230 -45 -28 299 160 -104 290 -142 62 -12 -1
7919 -1 -54 158 20 -148 -403 -62 -74 23 -319 173 134 -63 -213 -102 279 -78 -197 -195 -18 7 117 111 -22 28
7943 28 -58 -69 -180 -74 49 -169 -258 -86 62 464 50 5 60 -31 90 -203 80 106 -59 -162 -170 -66 142
7966 142 257 16 74 56 326 -186 -107 135 374 129 -23 38 254 72 -32 120 206 -126 -127 -15 23 173 -162
7989 -162 -188 -69 -42 158 51 -103 -21 188 -55 -78 -70 302 121 -66 -151 6 129 -382 -432 85 -187 31 20
8012 20 -64 -281 -56 193 -98 -193 -110 340 34 -61 -47 124 36 -285 116 49 1 -468 -87 317 -82 -479 196
8035 196 274 -152 -274 -265 -360 187 -295 -13 249 -305 1011 6 558 -145 243 218 106 745 376 -354 -20
8056 -20 -488 182 366 104 468 -294 300 301 105 -372 239 -43 278 -40 -187 -55 86 -127 100 51 202
8077 202 -69 -105 -42 257 -68 69 -92 -80 -75 -288 -118 -38 -36 239 -93 -54 -179 58 -96 -240 -197 44 338
8100 338 -200 103 -148 70 74 -180 5 111 114 116 -123 -58 39 36 88 -45 61 244 -40 -261 -83 250 83 -114
8124 -114 -106 222 -49 24 -89 146 26 -74 98 150 76 33 39 -343 -191 -103 -79 -131 -59 89 222 -366 -111 50
8148 50 243 -189 -264 -9 -122 -237 47 56 -61 -218 -263 -58 -290 62 100 -78 -43 28 265 -313 -250 -37 12
8171 12 24 -61 -336 269 -89 173 54 -214 -1 -95 261 130 -14 -198 123 -56 104 220 -30 -360
8191c60
##END NTUPLES=NMR FID
##END=
