##TITLE=1H_SAV-32-singlet-bat22
 CDCl3, 8 sc, 
 20.11.2020
##JCAMPDX= 6.0         $$ Bruker NMR JCAMP-DX V2.0
##DATA TYPE= NMR FID
##DATA CLASS= NTUPLES
##ORIGIN= UXNMR, Bruker Analytische Messtechnik GmbH
##OWNER= root
$$ XWIN-NMR		Version 3.5
$$ Fri Nov 20 10:52:07 2020 Russian Standard Time (UT+4h)  she@DPX200
##.OBSERVE FREQUENCY= 200.1315066352
##.OBSERVE NUCLEUS= ^1H
##.DELAY= (6, 6)
##.ACQUISITION MODE= SIMULTANEOUS
##.ACQUISITION SCHEME= undefined
##.AVERAGES= 8
##.DIGITISER RES= 18
##SPECTROMETER/DATA SYSTEM= spect
##.PULSE SEQUENCE= zg30
##.SOLVENT NAME= CDCl3
##.SHIFT REFERENCE= (INTERNAL, CDCl3, 0, 15.7039)
##AUDIT TRAIL= $$ (NUMBER, WHEN, WHO, WHERE, WHAT)
$$ ##TITLE= Audit trail, XWIN-NMR		Version 3.5
$$ ##JCAMPDX= 5.01
$$ ##ORIGIN= Bruker BioSpin GmbH
$$ ##OWNER= she
$$ F:/spectra/data/she/nmr/H-F/1/audita.txt
$$ ##AUDIT TRAIL=  $$ (NUMBER, WHEN, WHO, WHERE, WHAT)
(   1,<2020-11-20 10:51:03.29 +0400>,<she>,<DPX200>,
      <created by zg, POWCHK disabled, PULCHK disabled
       configuration hash MD5:
       00 E9 B6 7A A2 85 ED C7 34 08 36 98 17 FE 4E 26
       data hash MD5: 16K
       B2 EB 49 73 5B 06 BE 3B 1B A8 47 BE CB CD 57 DF>)
$$ ##END=
$$ 
$$ hash MD5
$$ 0F 5A 08 13 95 CC E0 50 64 79 2B 12 AA 7F 77 50
##$RELAX= 
##$RELAX= 
##$RELAX= 
##$RELAX= 
##$RELAX= 
##$RELAX= 
$$ Bruker specific parameters
$$ --------------------------
##$DU= <F:/spectra>
##$EXPNO= 1
##$NAME= <H-F>
##$PROCNO= 1
##$TYPE= <nmr>
##$USER= <she>
##$AMP= (0..31)
100 100 100 100 100 100 100 100 100 100 100 100 100 100 100 100 100 100 
100 100 100 100 100 100 100 100 100 100 100 100 100 100 
##$AQSEQ= 0
##$AQ_mod= 1
##$AUNM= <au_zg>
##$AUTOPOS= <>
##$BF1= 200.13
##$BF2= 200.13
##$BF3= 200.13
##$BF4= 200.13
##$BF5= 200.13
##$BF6= 200.13
##$BF7= 200.13
##$BF8= 200.13
##$BYTORDA= 1
##$CFDGTYP= 0
##$CFRGTYP= 5
##$CHEMSTR= <none>
##$CNST= (0..31)
1 1 145 1 1 1 1 1 1 1 1 1 1 1 1 1 1 1 1 1 1 1 1 1 1 1 1 1 1 1 1 1 
##$CPDPRG= <>
##$CPDPRG1= <>
##$CPDPRG2= <>
##$CPDPRG3= <>
##$CPDPRG4= <mlev>
##$CPDPRG5= <mlev>
##$CPDPRG6= <mlev>
##$CPDPRG7= <mlev>
##$CPDPRG8= <mlev>
##$CPDPRGB= <>
##$CPDPRGT= <>
##$D= (0..31)
0 1.2 0 0 0 0 0 0 0 0.06 0 0.03 0 0 0 0 0.0002 0 0 0 0 0 0 0 0 0 0 0 0 
0 0 0 
##$DATE= 1605855062
##$DBL= (0..7)
120 120 120 120 120 120 120 120 
##$DBP= (0..7)
150 150 150 150 150 150 150 150 
##$DBP07= 0
##$DBPNAM0= <>
##$DBPNAM1= <>
##$DBPNAM2= <>
##$DBPNAM3= <>
##$DBPNAM4= <>
##$DBPNAM5= <>
##$DBPNAM6= <>
##$DBPNAM7= <>
##$DBPOAL= (0..7)
0.5 0.5 0.5 0.5 0.5 0.5 0.5 0.5 
##$DBPOFFS= (0..7)
0 0 0 0 0 0 0 0 
##$DE= 6
##$DECBNUC= <off>
##$DECIM= 32
##$DECNUC= <off>
##$DECSTAT= 4
##$DIGMOD= 1
##$DIGTYP= 9
##$DL= (0..7)
0 120 120 120 120 120 120 120 
##$DP= (0..7)
150 150 150 150 150 150 150 150 
##$DP07= 0
##$DPNAME0= <>
##$DPNAME1= <>
##$DPNAME2= <>
##$DPNAME3= <>
##$DPNAME4= <>
##$DPNAME5= <>
##$DPNAME6= <>
##$DPNAME7= <>
##$DPOAL= (0..7)
0.5 0.5 0.5 0.5 0.5 0.5 0.5 0.5 
##$DPOFFS= (0..7)
0 0 0 0 0 0 0 0 
##$DQDMODE= 0
##$DR= 18
##$DS= 0
$$ [...]
##$SUBNAM2= <"">
##$SUBNAM3= <"">
##$SUBNAM4= <"">
##$SUBNAM5= <"">
##$SUBNAM6= <"">
##$SUBNAM7= <"">
##$SUBNAM8= <"">
##$SUBNAM9= <"">
##$SW= 16.9725356469052
##$SWIBOX= (0..15)
0 0 2 0 0 0 0 0 0 0 0 0 0 0 0 0 
##$SW_h= 3396.73913043478
##$TD= 16384
##$TD0= 1
##$TE= 0
##$TE2= 300
##$TE3= 300
##$TEG= 300
##$TL= (0..7)
0 120 120 120 120 120 120 120 
##$TP= (0..7)
150 150 150 150 150 150 150 150 
##$TP07= 0
##$TPNAME0= <>
##$TPNAME1= <>
##$TPNAME2= <>
##$TPNAME3= <>
##$TPNAME4= <>
##$TPNAME5= <>
##$TPNAME6= <>
##$TPNAME7= <>
##$TPOAL= (0..7)
0.5 0.5 0.5 0.5 0.5 0.5 0.5 0.5 
##$TPOFFS= (0..7)
0 0 0 0 0 0 0 0 
##$TUNHIN= 0
##$TUNHOUT= 0
##$TUNXOUT= 0
##$USERA1= <user>
##$USERA2= <user>
##$USERA3= <user>
##$USERA4= <user>
##$USERA5= <user>
##$V9= 5
##$VALIST= <valist>
##$VCLIST= <CCCCCCCCCCCCCCC>
##$VD= 0
##$VDLIST= <DDDDDDDDDDDDDDD>
##$VPLIST= <PPPPPPPPPPPPPPP>
##$VTLIST= <TTTTTTTTTTTTTTT>
##$WBST= 1024
##$WBSW= 4
##$XGAIN= (0..3)
0 0 0 0 
##$XL= 0
##$YL= 0
##$YMAX_a= 289827
##$YMIN_a= -259058
##$ZGOPTNS= <>
##$ZL1= 120
##$ZL2= 120
##$ZL3= 120
##$ZL4= 120
##$ABSF1= 10
##$ABSF2= 0
##$ABSG= 5
##$ABSL= 3
##$ALPHA= 0
##$AQORDER= 0
##$ASSFAC= 0
##$ASSFACI= 0
##$ASSFACX= 0
##$ASSWID= 0
##$AUNMP= <proc_1d>
##$AZFE= 0.1
##$AZFW= 0.1
##$BCFW= 1
##$BC_mod= 2
##$BYTORDP= 1
##$COROFFS= 0
##$CY= 11.3945322036743
##$DATMOD= 1
##$DC= 2
##$DFILT= <>
##$DTYPP= 0
##$F1P= 15.9154993809931
##$F2P= -4.1035820241983
##$FCOR= 0.5
##$FTSIZE= 0
##$FT_mod= 4
##$GAMMA= 1
##$GB= 0.15
##$INTBC= 1
##$INTSCL= 1
##$ISEN= 128
##$LB= 0.24
##$LEV0= 0
##$LPBIN= 0
##$MAXI= 10000
##$MC2= 0
##$MEAN= 0
##$ME_mod= 0
##$MI= 1.114404
##$NCOEF= 0
##$NC_proc= 0
##$NLEV= 6
##$NOISF1= 3.799351
##$NOISF2= 2.8
##$NSP= 1
##$NTH_PI= 0
##$NZP= 0
##$OFFSET= 15.70392
##$PC= 1
##$PHC0= -11053.27
##$PHC1= 18.60091
##$PH_mod= 1
##$PKNL= yes
##$PPARMOD= 0
##$PSCAL= 0
##$PSIGN= 0
##$REVERSE= no
##$SF= 200.130013532006
##$SI= 16384
##$SIGF1= 3
##$SIGF2= 2
##$SINO= 400
##$SIOLD= 16384
##$SREGLST= <1H.CDCl3>
##$SSB= 0
##$STSI= 0
##$STSR= 0
##$SW_p= 3612.71676300578
##$SYMM= 0
##$S_DEV= 0
##$TDeff= 0
##$TDoff= 0
##$TI= <>
##$TILT= no
##$TM1= 0
##$TM2= 0
##$TOPLEV= 0
##$USERP1= <user>
##$USERP2= <user>
##$USERP3= <user>
##$USERP4= <user>
##$USERP5= <user>
##$WDW= 1
##$XDIM= 8192
##$YMAX_p= 0
##$YMIN_p= 0
$$ End of Bruker specific parameters
$$ ---------------------------------
##NTUPLES= NMR FID
##VAR_NAME=  TIME,          FID/REAL,        FID/IMAG
##SYMBOL=    X,             R,               I
##VAR_TYPE=  INDEPENDENT,   DEPENDENT,       DEPENDENT
##VAR_FORM=  AFFN,          ASDF,            ASDF
##VAR_DIM=   8192,          8192,            8192
##UNITS=     SECONDS,       ARBITRARY UNITS, ARBITRARY UNITS
##FACTOR=    0.0002944,     1,               1
##FIRST=     0,             0,               0
##LAST=      2.4114304,     0,               0
##MIN=       0,             -259058,         0
##MAX=       2.4114304,     289827,          0
$$ Real data points
##PAGE= N=1
##DATA TABLE= (X++(R..R)), XYDATA
$$ [...]
2429D20j257J826K44j060j136K071M51k954J104J893j528j693J269J480j260k138
$$ 420 -837 989 1233 173 -963 1108 1559 -1395 -291 1602 74 -1619 -350 1130 -130 -2268
2445b268J819J868k232j616K713L17k016l74J776J98j731r7J709k78j902J938
$$ -2268 -449 1419 -813 -2429 284 601 -1415 -1789 -13 185 -1546 -1643 66 -212 -2114 -176
2461a76O29j748n01J817R64k637n34L431m57k857R26K163l79j678j11K264m96
$$ -176 453 -1295 -1796 21 985 -1652 -2186 1245 788 -2069 -1143 1020 641 -1037 -1148 1116 620
2478F20k016J589J265k096j47J940l9j800P09K071r47k470J923K152k140j820
$$ 620 -1396 193 1458 -638 -785 1155 1116 -684 25 2096 1149 -1321 602 2754 614 -1206
2494a206K018J744j805j552J390J612k296j284K377l04j071J151N53j159j087
$$ -1206 812 2556 751 -801 589 2201 -95 -1379 998 694 -377 774 1327 168 -919
2509i19J426J127k403r58K716P06l156r5K286M41k553l34K083K27k111N41J512
$$ -919 507 1634 -769 -1727 989 1695 -1461 -1556 730 1171 -1382 -1716 367 594 -1517 -976 536
2526E36j184q46J468j59r25l46J926J5l044J143K866j683k252J370K079r45k210
$$ 536 -648 -1494 -26 -185 -1110 -1456 470 485 -2559 -1416 1450 -233 -2485 -1115 964 19 -2191
2543b191J075K476j494j583J839N65j497K84J029M7j527Q31K110j957j067J752
$$ -2191 -1116 1360 -134 -1717 122 687 -810 -526 503 550 -977 -146 1964 7 -1060 692
2559F92J301j888j055J952J284k097j145K470O90k435J0J849m71j244L90J192
$$ 692 1993 105 -950 1002 2286 189 -956 1514 2204 -231 -221 1628 1157 -87 303 1495
2575A495j032r37J521O60k185j92K294j87k239O2K465l30k969P90K245j336j747
$$ 1495 463 -474 1047 1707 -478 -670 1624 1437 -802 -740 1725 1395 -1574 -784 1461 125 -1622
2592a622J345J364j633p75J420O32j939n57K191m42k223J445J682j681j230J371
$$ -1622 -277 1087 -546 -1321 99 731 -1208 -1765 426 -16 -2239 -794 888 -793 -2023 -652
2608f52J312j457j806K475J074k305n52J980J96j562j38K086k19j916J145J222
$$ -652 660 -797 -2603 -128 946 -1359 -1911 69 265 -1297 -1435 651 432 -1484 -339 883
2624H83j221o40J475M59j365l89J804P17k690M46K342n63k289J234J936r50k214
$$ 883 -338 -978 497 956 -409 -798 1006 1723 -967 -521 1821 1258 -1031 203 2139 1189 -1025
2641a025J619J870k081q49J486M65j377m41J582kj861M99J886j341j691J910J199
$$ -1025 594 2464 383 -466 1020 1485 108 -333 1249 1247 -614 -115 1771 430 -1261 649 1848
2658A848k069r47J887Q64j930j141K254L33k065k27J786j60j755K88J204m86j308
$$ 1848 -221 -1168 719 1583 -347 -1488 766 1099 -966 -1193 593 433 -1322 -1034 170 -316 -1624
2675a624J414N68j894k16J985J21k527P34K234o61k167O16K538j128k256J398
$$ -1624 -210 358 -1536 -1752 233 354 -2173 -1439 795 134 -2033 -1417 1121 -7 -2263 -865
2691h65J658j226q26J220M52p99n10J600l13j815J523J428j380j630J741J860
$$ -865 793 -433 -1259 -39 413 -386 -896 704 391 -1424 99 1527 147 -1483 258 2118
2707B118k057j513K435J199k340o28J602R43j756k28J600k31j316N45J284j295
$$ 2118 61 -1452 983 2182 -158 -786 816 1759 3 -225 1375 1144 -172 373 1657 362
2723C62o88J774K19k262q2K058L08k757R4K546j98k321O7K133k13k173Q02J120
$$ 362 -326 1448 1667 -595 -677 1381 1689 -1068 -974 1572 1374 -947 -880 1253 1040 -1133 -331 789
2741G89j022p95J097K70j442R9J579n65j824R83K010j273k447J620K162j884j475
$$ 789 -233 -1028 69 339 -1103 -1004 575 10 -1814 -831 1179 -94 -2541 -921 1241 -643 -2118
2758b118J704J017j218j301J745L97j477K99J278p50p79J049J080j241j115J760
$$ -2118 -414 603 -615 -1916 -171 226 -1251 -952 326 -424 -1203 -154 926 -315 -1430 330
2774C30J361k497n56K152O35j772n72K221O5j893R6J828n49j219Q44J094j482
$$ 330 1691 -806 -1362 790 1425 -347 -919 1302 1367 -526 -430 1398 849 -370 474 1568 86
2791H6o6J015P11k027m3K225m02k463J228J220r16j022M20K152j494j624J369
$$ 86 20 1035 1746 -281 -324 1901 1499 -964 264 1484 568 -454 -34 2118 624 -1000 369
2808C69J069j692m96J473J02j343k54J500p68j369J143J008j198j303J695R25
$$ 369 1438 -254 -750 723 825 -518 -772 728 -40 -1409 -266 742 -456 -1759 -64 861
2824H61j858q25K070N76k129m51K014j91j751L86J661n66j329P82J423j031j092
$$ 861 -997 -1822 248 824 -1305 -1756 258 67 -1684 -1298 363 -203 -1532 -750 673 -358 -1450
2841a450J479K82j610J90J795l05j757N46K282j154j965J535J658j345j389J434
$$ -1450 29 311 -1299 -1109 686 381 -1376 -830 1452 298 -1667 -132 1526 181 -1208 226
2857B26J396j663o80J457P78j669QJ539n72j246Q03J122j190q15J144J681k364
$$ 226 1622 -41 -721 736 1514 -155 -147 1392 820 -426 377 1499 309 -506 638 2319 -45
2874d5r33K266L39j817n19J975K76k392k3J984n47j504J087L51p02o25R76N59
$$ -45 -978 1288 1627 -190 -709 1266 1542 -850 -873 1111 564 -940 147 498 -204 -829 147 706
2892G06j758nJ720n00j886N83J965p25k266J145J878j004j761J036J477j470o00
$$ 706 -1052 -1057 663 163 -1723 -1140 825 100 -2166 -1021 857 -147 -1908 -872 605 -865 -1465
2909a465J099L10r69J26J370q77j193J200J431j686r29J725P90j484q47K078Q22
$$ -1465 -366 -56 -1025 -899 471 -406 -1599 -399 1032 -654 -1583 142 932 -552 -1399 679 1501
2926A501k023m77J781L37j394l94J701m27q11Q42M33q30m19J259M90k093L63J894
$$ 1501 -522 -999 782 1119 -275 -669 1032 605 -206 636 1069 239 -180 1079 1569 -524 -161 1733
2944A733l27k082K66K393n13k092P55J824j144j483R17P87p92p37J065L96j659
$$ 1733 1406 -676 -410 1983 1470 -622 133 1957 813 -670 247 1034 242 -495 570 966 -693
2961f93N11J269j102j469J290J369j217j799J536J801k190r73J431R15j546o36
$$ -693 -182 1087 -15 -1484 -194 1175 -42 -1841 -305 1496 -694 -1667 -236 679 -867 -1503
2977a503J210N94j186J7J198q04j210J817K22j548j47J115Q72j382r09K420J6
$$ -1503 -293 301 -885 -868 330 -474 -1684 133 355 -1193 -1340 -225 647 -735 -1644 776 792
2994G92k271L62J805M7j723K00J782n31j450J297P49j127l72J024N32j170k56
$$ 792 -1479 -1117 688 735 -988 -788 994 463 -987 310 1059 -68 -440 584 1116 -54 -310
3011c10J666k44j574M91J921j268j381J507J001j348j063J145J054j590o49J706
$$ -310 1356 1112 -462 29 1950 682 -699 808 1809 461 -602 543 1597 7 -642 1064
3027A064K61j791N74Q39r7j670Q13J462j536j230K106K11j926J91J183K66j743
$$ 1064 1325 -466 108 947 850 -820 -7 1455 -81 -1311 795 1006 -920 -729 454 720 -1023
3044a023J44J466J0k340P01J917r56j453J249N81j010o50J257N51j570Q7J583
$$ -1023 -879 587 597 -1743 -1042 875 -81 -1534 -285 296 -714 -1364 -107 444 -1126 -1039 544
3061E44q22j187P39J234n45j754J209J488j138j319J805M93j282m79J408K63j075
$$ 544 -278 -1465 -726 508 -37 -1791 -582 906 -232 -1551 254 747 -535 -1014 394 657 -418
3078d18k6J318m95r36Q39R21j165m53J307L96j574n06K311K58k100l0J781j21
$$ -418 -444 874 379 -557 282 1203 38 -415 892 1288 -286 -792 1519 1777 -323 -353 1428 1307
3096A307j576o2J797l56j605O92J103r36m37R15j63j165N22J005n37j490M34J705
$$ 1307 -269 -331 1466 1110 -495 197 1300 364 -73 842 679 -486 36 1041 504 -986 -552 1153
3114A153r77j746J258J540j338j285J137J251j524o87J061M74j255L03N88m18
$$ 1153 176 -1570 -312 1228 -110 -1395 -258 993 -531 -1218 -157 317 -938 -635 -47 -465
3130d65j005R33R03j037r50J610Q53k212m74K192K26j452o61J871K14j504M43
$$ -465 -1470 -537 366 -671 -1621 -11 842 -1370 -1844 348 574 -878 -1539 332 546 -958 -515
3147e15J241l70p27K76J008j125K77N19L72j284J16J868o88k167R76J772n43j753
$$ -515 726 356 -371 -95 913 -212 65 584 956 -328 -212 1656 968 -1199 -223 1549 1006 -747
3165g47N87J778j013j340J445P59j141l87J012J16j355K96J027m38j391J125Q60
$$ -747 -160 1618 605 -735 710 1469 328 -59 953 1069 -286 10 1037 599 -792 333 1193
3182A193q41j545J484J208j510r54J472M61j570l07J480l81j314L99R20l65r52
$$ 1193 352 -1193 291 1499 -11 -965 507 968 -602 -909 571 190 -1124 -725 195 -170 -1122
3199a122Q15M79j046m09J488L02j842K54J599m04j185j85J749n86j679J063J054
$$ -1122 -307 172 -874 -1283 205 507 -1335 -1081 518 114 -1071 -1256 493 -93 -1772 -709 345
3216C45n04j107J372J50p33p34J545J51j273O33J250o28j303P00J280q93q60J200
$$ 345 -159 -1266 106 256 -477 -1211 334 485 -788 -155 1095 467 -836 -136 1144 251 -609 591
3234E91Q83j430p40J556P38j296q25J572J25j270J13J199n70r57P01Q37j068o40
$$ 591 1474 44 -696 860 1598 302 -523 1049 1174 -96 17 1216 646 -311 390 1227 159 -481
3252d81J092O73j684R0J698n01j633L91J427l14j780O07J324p90j225P64J147
$$ -481 611 1284 -400 -310 1388 887 -746 -355 1072 758 -1022 -415 909 119 -1106 -342 805
3269H05j407k98Q25n0j225O54J178n46j424R72J325j490r26J596O66j334r34J271
$$ 805 -602 -900 -75 -125 -1350 -696 482 -64 -1488 -516 809 -681 -1607 -11 655 -679 -1613 -342
3287c42R91j653l89J602L01j204k1J091m20p13O23O71q41n30J420J19j147M4J315
$$ -342 649 -1004 -1393 209 510 -694 -715 376 -44 -757 -134 537 -304 -834 586 705 -442 -398 917
3306I17L12j956M02J597k63j673O56J289l99j220O61O21n94n14J098J06j212K62
$$ 917 1229 -727 -325 1272 1009 -664 -8 1281 882 -338 323 944 350 -164 934 1040 -172 90
3324I0J200p59r40O67J542j375j485J305J043j336p53J105P40j083r48J266K77
$$ 90 1290 531 -409 258 1800 425 -1060 245 1288 -48 -801 304 1044 -39 -987 279 556
3341E56j634P47N15k38p81M88P63j288p92J819L61j652m98J925J97j840J2J512
$$ 556 -1078 -331 184 -54 -835 -347 416 -872 -1664 155 516 -1136 -1634 291 488 -1352 -1340 172
3359A72J09j246K5J332o25p71Q49L52p42k10J370m84r01K47J403l88j495N88J733
$$ 172 281 -965 -940 392 -233 -1004 -155 197 -545 -755 615 131 -770 -523 880 492 -1003 -415 1318
3378A318j119j083J008J331j253p03Q70Q01r26m22J035m3r53M42P80o18q54J101
$$ 1318 199 -884 124 1455 202 -501 369 1170 244 -178 857 814 -139 303 1083 465 -389 712
3396G12N75j395n28J516N32j438l31J432P7j333l01J418j73j393K17J180m72r80
$$ 712 1287 -108 -636 880 1412 -26 -357 1075 1152 -181 -482 936 763 -630 -413 767 295 -685
3414f85Q13L74r11n85J361q3j232K40J060l61j182L41J759p05j619R24Q33r75
$$ -685 128 502 -409 -994 367 284 -948 -708 352 -9 -1191 -850 909 204 -1415 -491 342 -633
3432f33p39J028P76j492l1J196m9r64O0J133l45q52O46P14o23j022J470Q64j834
$$ -633 -1372 -344 432 -1060 -1091 105 56 -908 -848 285 -60 -912 -266 448 -175 -1197 273 1137 -697
3451f97l36J589L13j498R1J289K28j377K41J314m33j144R05Q32j375k67J287k2
$$ -697 -1033 556 869 -629 -538 751 979 -398 -157 1157 724 -420 485 1317 -58 -325 962 940
3469I40q75j37J208j69j509M79J514r64j089Q65J006o45j272R32O16j228m65J294
$$ 940 65 -72 1136 967 -542 -63 1451 487 -602 263 1269 624 -648 284 900 -328 -793 501
3487E01j82n94O1O75l84q31P75P30j224n94J216P08j547q22J571L56j352j36J186
$$ 501 319 -275 -214 461 77 -754 21 751 -473 -1067 149 857 -690 -1512 59 415 -937 -1073 113
3506A13j2j040J30J072p20n35P96N10r55k34J398j08j724O17J360l26j283K68
$$ 113 101 -939 -809 263 -457 -992 -196 314 -641 -875 523 415 -1309 -692 668 342 -941 -673
3524f73J415j56j522M49J507r13n47P44O47q92l74J203k54r36N94J066p19r34
$$ -673 742 586 -936 -487 1020 107 -440 304 951 59 -315 888 634 -302 292 1358 639 -295
3542b95R59O41j084o81Q85Q88j091r72J301J056j603k49P78Q5n75m13R13j81j015
$$ -295 664 1305 221 -460 425 1313 222 -750 551 1607 4 -245 533 618 43 -370 543 362 -653
3561f53R88M70j288k05R96J70j099m77J692j71j578N43J039k50j324O12P41Mr58
$$ -653 335 805 -483 -688 308 478 -621 -1098 594 423 -1155 -612 427 177 -1147 -535 206 210 -748
3580g48K91Q19j183J3J018m08j004N64J232o57j306R15J173r28j225J215R55o18
$$ -748 -457 362 -821 -808 210 -198 -1202 -638 594 -63 -1369 -454 719 -209 -1434 -219 736 118
3598A18q11O90N50q05k81J180k62q65P63N46q47l54P96P26r26l84J199K09j181
$$ 118 -693 -3 547 -258 -539 641 379 -486 277 823 -24 -378 418 1144 218 -166 1033 1242 61
3617F1o66J685j69j213K18J000N2j002N5P91l43n32J69O09p40m31Q47K09j338
$$ 61 -605 1080 911 -302 -84 916 968 -34 21 812 469 -63 106 715 -25 -456 391 600 -738
3636g38K08J538p34j460P39J154r14r26P01Q75o77j080J059P42j184J25N27k28
$$ -738 -530 1008 274 -1186 -447 707 -207 -1133 -432 443 -234 -1314 -255 487 -697 -572 -45 -273
3654b73m84j3J181q15p12O76P14q25l78J086N11j478n06J975j78j439J26J412
$$ -273 -757 -770 411 -404 -1116 -440 274 -551 -929 157 668 -810 -1316 659 481 -958 -832 580
3672E80l56j196O16R98l70q13O75P40r11k85J098k14n55qJ039m53r59P91J127
$$ 580 224 -972 -356 642 272 -541 134 874 -37 -322 776 562 7 -1 1038 585 -374 417 1544
3691A544j266p09O87J125j109p12R59O63o69r64Q67L90j203N38N46n48l24N81
$$ 1544 278 -431 256 1381 272 -440 519 1182 513 -451 416 806 -397 141 687 139 -185 396
3709C96M17j462k43J431M2j294j43J513j10j076l00J238j37r78O3Q72o04k20K38
$$ 396 813 -649 -892 539 581 -713 -856 657 547 -529 -829 409 272 -706 -643 229 -375 -595 -357
3728c57K07n70l10J271n65p95K84J600o97j436R14Q98o14j305J138J231p74j025
$$ -357 -150 -720 -1030 241 -324 -1119 -835 765 68 -1368 -454 444 -170 -1475 -337 894 120 -905
3746i05Q45P60j213N36NR1m65J98R84o79q89J230O49j572L5J344O72j659p31J363
$$ -905 -60 700 -513 23 28 119 -346 -148 836 157 -732 498 1147 -425 -390 954 1626 -33 -764 599
3766E99J81q49J21O56K32n00k63O77m26m68Q60K88j056k84J408o19j447N21J137
$$ 599 780 -69 52 708 940 440 177 854 428 -40 820 1108 52 -232 1176 557 -890 -369 768
3785G68m8j150L15P83n60j180O58P88l66p26P02n0m86O7K95j50j047P58R62m85
$$ 768 720 -430 -115 668 108 -1072 -414 374 8 -718 -16 -66 -552 -485 -190 -340 -1387 -629 333 -152
3805a52r73Q19N75q73q76R35J144j123o22J189M03r51q6J030l26p09N36Q16j067
$$ -152 -1125 -306 269 -604 -1480 -545 599 -524 -1146 43 446 -505 -591 439 113 -596 -60 756 -311
3824c11j81R15J7o55l10J023J04j064J57J069Oj126M07Q55j92j160N56R24p28
$$ -311 -492 423 440 -215 -525 498 602 -462 -305 764 770 -356 51 906 714 -446 110 1034 306
3843C06o51R66K86p73l24J023k3r82O10L73l77j062P99O06o77o14P31Q07j190
$$ 306 -345 621 907 134 -190 833 810 -172 438 811 434 -628 171 777 100 -514 217 1024 -166
3862a66p53J500j5j062k72J062k95n73K87L25k02p24O69N38r45l97J151J05j074
$$ -166 -919 581 566 -496 -768 294 -1 -574 -287 38 -164 -888 -219 319 -626 -1023 128 233 -841
3881h41j53J447k33j366K84J019M6j241J62J303k79j143R03L56o98q5Q96q9j002
$$ -841 -994 453 220 -1146 -862 157 203 -1038 -876 427 148 -995 -92 264 -434 -519 377 288 -714
3900g14Q53O54p45n59O54J000j289n89J090N76p89n98R93N35j127j13Q81q8m77
$$ -714 139 793 48 -511 143 1143 -146 -735 355 931 142 -456 537 1072 -55 -168 713 625 148
3919A48m2N04j65o77J261j67r07j47J116m2j242Q4J102P9j452L02R97j74j233
$$ 148 106 610 445 -232 1029 862 -45 -192 924 882 -360 -276 826 905 -547 -245 752 578 -655
3938f55N50O69o83l60K44N39j025J42J113p31q44O13Q35m97j231J031Q15p85q03
$$ -655 -105 564 -119 -479 -235 304 -721 -579 534 -197 -1041 -428 407 -90 -1321 -290 525 -260 -1063
3957a063O53J039r01p54O32P35j167N4O68j5n75K80R99o83m65P78M22j081r5Q86
$$ -1063 -410 629 -272 -1026 -394 341 -826 -772 -104 -119 -694 -414 585 -98 -563 215 637 -444 -539 347
3977C47M49j096k75J237N0j146J65Q38O8p16J41P09l65j67J62L57n61k30J120
$$ 347 796 -300 -575 662 712 -434 -269 569 637 -79 62 771 406 239 401 758 197 -33 1087
3996A087k57j396O92R74m40j451Q30Q40n28j046O23P98l93o05N02K85j007o7P02
$$ 1087 830 -566 126 1100 660 -791 39 879 351 -695 -72 726 333 -272 230 515 -492 -559 143
4015A43Q9r92N56N19m19q99Q75N90j156r1P02M75r00p08J156M15j132L6R31k67
$$ 143 232 -760 -204 315 -104 -1003 -128 462 -694 -785 -83 392 -508 -1216 -60 355 -777 -741 190 -77
4035g7p89L68Q47p44m17P06P11j175j35J139j48j341O26J130k23j152N79R95o51
$$ -77 -866 -498 349 -395 -812 -106 605 -570 -705 434 286 -1055 -429 701 478 -674 -95 900 249
4054B49q78O59P08m29o26O61L94q24Q8O42j02p48O95K40m81p24P70N56p10m41
$$ 249 -629 30 738 309 -317 344 738 -86 2 644 542 -206 489 729 248 -476 294 850 140 -301
4074c01J078J11j005n9N42M63n55m86Q86k24r41N84M85o17l69O17J04p34k72J029
$$ -301 777 888 -117 -176 366 829 274 -212 674 450 -491 93 578 -39 -408 209 313 -421 -693 336
4094C36n6j003l1J259m43q90K10J062m77j299R43Q33o53o73N65K17l26j21M50
$$ 336 280 -723 -754 505 62 -828 -618 444 -33 -1332 -389 444 -209 -882 -317 -100 -426 -547 -97
4113i7Mo90N03O69o79o17Q36P64j088l69Q53M62o56m87P62N74q96k87Q48K60p51
$$ -97 -93 -783 -280 389 -290 -907 -71 693 -395 -764 89 551 -105 -592 170 744 -152 -439 409 669 -82
4134h2K05L41j92m75J142k15q14K94Q06l57r70J88J106k61j164M13R02m02r28
$$ -82 123 464 272 -203 939 724 -90 204 1010 653 -317 -129 977 716 -448 -35 867 465 -463
4153d63M88N59j43n98M17j1m49J96L90m46k13r8R23o89p20O14R28q89p25P71P85
$$ -463 25 584 441 -157 260 249 -200 -4 386 -60 -273 -371 552 -137 -857 -243 685 -204 -929 -158 627
4174F27q04p59Q32L47o95k86O15o0o01M83P12q64k45R89j35j093L6J081J53r32
$$ 627 -177 -936 -104 243 -452 -738 -123 -183 -784 -301 411 -453 -698 291 156 -937 -901 180 333 -599
4194e99j0J270j86j035P6J097m18o38N74M46n65l71P30K95o73nO26qj016L69J041
$$ -599 -609 661 475 -560 -484 613 195 -443 131 577 12 -359 371 666 -7 -12 614 606 -410 -41 1000
4215A000m10j085P33Q67p44n96M63P79q28k48M57N6n69J71N29k81n70L20N61o07
$$ 1000 590 -495 238 1105 361 -235 228 1007 179 -69 388 444 -125 46 575 294 -276 44 605 -2
4235bo14J062J76p79o02J109K85j264JR69j82q27R6P99j74o11J69N30n80k31M18
$$ -2 -616 446 622 -157 -759 350 635 -629 -628 341 159 -668 -572 227 53 -558 -389 141 -439 -670 -252
4256b52M15n64k0N95k34q44K45J086m79q93N64P85l94p85O61N17o59m47P90M62
$$ -252 163 -401 -421 174 -60 -904 -659 427 -52 -945 -381 404 10 -775 -114 403 -256 -703 87 549
4276E49q83j44R09k39l68L91M16m18m05O03L61q00k28O84N44j065k14J054j02
$$ 549 -334 -478 431 192 -176 215 631 213 -192 411 772 -28 -256 428 972 -93 -307 747 645
4295F45q04K4J021l32o46K24N34n56k59N75K37p66r7R03l29q20N64Q43q57p87
$$ 645 -159 -135 886 554 -92 132 666 110 -149 426 663 -103 -200 703 374 -446 118 961 104 -683
4315f83M29N93k02p98O02P30q55q97J084K34r29K30R52n10o57M35K36l37n75Q60
$$ -683 -254 339 137 -661 -59 671 -184 -1081 3 237 -692 -462 490 -20 -677 -242 -6 -343 -918 -58
4335e8M11j061m03R56N42j031l59J116M24j025R7P43q7m49L8Q35q30J95K95J81
$$ -58 353 -708 -1111 -155 387 -644 -1003 113 537 -488 -391 352 265 -184 -146 689 -141 54 349 530
4355E30p69j43J312o05p66L95P78k41p05K78Q26m78p55O61L06n95L5K39J36k57
$$ 530 -239 -382 930 325 -441 -46 732 491 -214 64 890 412 -343 318 624 29 64 303 439 182
4375A82k33O90l21p68N74N65o95n38O09O90p50p75R23L64p34k53O16K29p90K5
$$ 182 -51 639 318 -450 124 689 -6 -544 65 755 5 -770 153 517 -217 -470 146 375 -415 -390
4395c90M70j72l45K36L4l00k41O92J94j066L59P06n0q05l03J193k12p09L01O26
$$ -390 80 -92 -437 -201 -167 -467 -708 -16 178 -888 -529 177 127 -678 -981 212 0 -709 -408 218
4415B18k62p33M46N75j94l15J61J85m01j13Q60N6p23J22Q73m99o91R95O90j137
$$ 218 -44 -777 -331 244 50 -265 -104 81 -320 -433 427 483 -240 -118 755 256 -435 560 1250 113
4435A13n15Q56J65o24j82O29Rm55j7Q05l38q84O54N45o98k08M33L66q38j43R17
$$ 113 -402 454 619 -5 -187 442 451 -4 -21 784 446 -438 216 761 63 -145 288 654 -184 -327 590
4456E90J5q19j54R44O7j219K63R63p29o65N38N56o69l47Q40j53o10J77O99m60
$$ 590 605 -214 -368 576 643 -576 -313 650 -79 -744 -206 350 -319 -666 174 21 -589 -412 287 -173
4476a73l28J78N28n41o91R63M67q16m18R01L59p36k94O25j31l27j89R23k49o18
$$ -173 -501 -323 205 -336 -1027 -64 403 -413 -831 70 429 -307 -601 24 -107 -434 -623 300 51 -567
4496e67M68L15l21l14O61pn98k1O33K80q23J23R20j32q97J04Q83n11n27K55O64
$$ -567 -99 216 -105 -419 242 235 -363 -384 249 529 -294 -171 749 617 -280 -176 707 196 -331 -76 588
4517E88l52l44P80L0r31M31L53k53n56K24O44m98o51O84Q21r54m06N25L39r53
$$ 588 236 -108 672 702 -229 202 555 302 -254 -30 614 116 -535 149 970 16 -390 135 474 -479
4537d79Q7N72N4l47m42O14k56k11O81k14m69j84P12J15r04l1O58M66j189j48R93
$$ -479 -392 180 234 -113 -555 59 -197 -408 273 59 -410 -594 118 233 -671 -702 -44 422 -767 -915 78
4558G8J60q36l80J251n81j96J03K06O3m40O21j66l90M69N23l3j171P52N88n94
$$ 78 238 -598 -978 273 -308 -504 -401 -195 -132 -572 49 -117 -507 -38 485 452 -719 33 621 27
4578B7m35o3J597q46n40K60P66q51J02J54O08j076k02J272m58l79M47N18n68o16
$$ 27 -408 -471 1126 280 -260 0 766 -85 17 171 779 -297 -499 773 315 -64 383 901 333 -283
4598b83R80p3m44m25M09O61q12j07N54J31r45o0R25m06k44n9N65n40m02N57M42
$$ -283 697 624 180 -245 164 825 13 -94 460 591 -354 -414 511 105 -139 -198 367 -173 -575 -18 424
4619D24j022l1J158m21o61L85L99o6q78o4R68o51l09O59P84j069k91M91J09l56
$$ 424 -598 -629 529 108 -553 -168 231 165 -713 -777 191 -460 -769 -110 674 -395 -686 -195 -86 -442
4639d42K73J87j4o74O01N57o54l82O99M08j194p4Q24J79n64k10R89m69k85J63
$$ -442 -169 18 4 -670 -69 488 -166 -548 151 559 -635 -709 115 294 -270 -480 509 40 -245 -82
4659h2N64l94k31K95M66p03j38O19N12j027nP68O0r53K89O96o09m41M20P44o24
$$ -82 482 88 -143 152 618 -85 -223 396 908 -119 -124 644 704 -249 40 736 127 -314 106 850 226
4680B26p14M73M69k34n03N36q6o23M0P34m76j38K32N10o43o83R60J37p53l77P68
$$ 226 -488 -15 454 220 -283 253 167 -456 -416 318 -158 -296 -64 446 -197 -880 80 217 -536 -913 -145
4701a45L93n60l10O17J38p90NQ09k71m34N94n9n22j2N38K06o82K8Q76Nj111J67
$$ -145 248 -312 -622 -5 133 -657 -652 157 -114 -548 46 -13 -535 -547 -9 197 -485 -457 419 424 -687 -520
4723e20R77j12j175N62O45q7l20J41L49l61j8L34l6m87J52O56k66p03L96P03p04
$$ -520 457 345 -830 -268 377 290 -30 111 460 99 81 415 379 -108 44 700 434 -269 127 830 126
4744A26l35N81M80o59m08M31N78n76k12K36K2k14O2J92l48k68N07M15r30L3O49
$$ 126 -209 372 852 193 -215 216 794 218 6 242 264 50 112 304 -44 -312 195 610 -320 -287 362
4765C62O9o84k88J001l29p23J41P41k10n98O7M51M0o13N80n9l31j80O95k18m54
$$ 362 431 -253 -541 460 131 -592 -451 290 80 -518 -451 0 40 -573 7 -52 -383 -563 132 -86 -540
4786e40K6O12j44m80K48O71n19n86M94N64o06k15M02L05j92l33O33j79l62J76
$$ -540 -514 98 -46 -526 -278 393 -126 -712 -218 346 -260 -475 -73 232 40 -293 340 161 -201 -25
4806b5N69k92n18N94M27q66l81Q92J70r53K86O82J06p08o2O38o5n13O5L75k15
$$ -25 544 252 -266 328 755 -111 -492 400 570 -383 -97 585 691 -17 -79 559 494 -19 46 421 206
4827B06l02J80K79j48j57L42J84q10K11M29j41p85K30O80l41o85M58N67p06m88
$$ 206 -96 84 363 215 58 400 584 -226 -15 414 273 -512 -282 398 57 -628 -170 397 -309 -797
4847g97M97N60n08m40P65j21l09n6J68j84k58N55L26m08o00P31M99p35r3N50o
$$ -797 -300 260 -248 -688 77 -44 -353 -409 -241 -425 -683 -128 198 -210 -810 -79 420 -315 -408 142 136
4868A36m23k09P78j3p35K85M57J02o69O58n7m70j08N82M8m23Q1N10j42m96k7O47
$$ 136 -287 -496 282 269 -466 -181 276 378 -291 367 310 -160 -268 314 362 -61 20 530 388 -108 -135 512
4890E12j21o15M52M22n32m54N45O25p69j96L68J77n04o3L08J45m47K45L61m11
$$ 512 391 -224 228 650 118 -336 209 834 65 -131 237 414 -90 -153 155 300 -147 98 459 48
4910D8n76P87L08q43l5P37j01p48q9M45M58j010K51O07j21n30lK04j14j51O17
$$ 48 -528 259 567 -276 -311 426 325 -423 -512 -67 391 -619 -368 239 118 -412 -415 -211 -325 -476 141
4931A41j9r61L75M76L1q91L19O09k44m32L23Q63m80o79N29K74k06m99N38J49n12
$$ 141 122 -839 -464 12 43 -848 -529 80 -164 -596 -273 590 110 -569 -40 234 28 -471 67 216 -296
4952b96M13L59m17n18M14O55n32p16Q60N57q86k00M11O31o98k45Q08q2m02o3L32
$$ -296 117 476 59 -459 -45 610 78 -638 222 779 -107 -307 104 735 37 -208 600 518 116 53 385
4973C85L8l27nL76n43k88O77J40o70j39Q81p4q68J04O47k66n09J84L11j03m19
$$ 385 423 96 91 467 -76 -364 313 453 -217 -356 525 451 -417 -313 334 68 -441 -257 54 -49 -468
4994d68K80J51j69q5K73qo28L17N70j64r23M06R45q00m17O65M40p07j21M97ol29
$$ -468 -188 -37 -206 -291 -18 -26 -654 -337 233 69 -854 -448 497 -303 -720 -55 385 -322 -443 54 48 -281
5016b81l12O62l9n05N38%k31j01O01l3m27o2M63K55p77o7O33K33q26K08N53j89
$$ -281 -593 69 30 -475 63 63 -168 -269 332 299 -128 -190 273 528 -249 -316 317 550 -276 -68 485 296
5038B96o88M84M82j07m27O8L79n06L3L36J67o62K01L88n2r34P00M75n75n06N83
$$ 296 -392 92 574 467 40 108 487 -19 14 350 517 -145 56 444 392 -542 158 633 58 -448 135
5059A35M43p75j68O02O6o28J74PJ94l72j4M66l44m00O32J31m38j77M40n6k50j71
$$ 135 578 -197 -365 237 303 -325 -151 -144 50 -322 -336 130 -214 -614 18 149 -289 -466 -26 -82 -332 -503
5081e03O27K4q09J90N23j79n21K59N59k68n03N27J23l12k48O71L0o37K48O12k91
$$ -503 124 148 -661 -471 52 -127 -648 -389 170 -98 -601 -74 49 -263 -511 160 190 -447 -199 413 122
5102A22o08M76P18p66m45Q10K38l35m18N49J32l63k05M97o7l91O1K81j8m61N23
$$ 122 -486 -10 708 -58 -503 307 545 210 -208 341 473 110 -95 402 335 -56 5 286 268 -193 330
5123C30J69n61O0M86R7q59J14N79J63q83pQ01j18p45N25o1n7j57K74J45n87k47
$$ 330 499 -62 -2 484 581 -278 -164 415 578 -305 -312 489 371 -374 151 90 33 -124 150 295 -292 -539
5145e39M80rm89K65M52k93o38M96P08q11k19L38L65j93o35L48M03j32l40M44K16
$$ -539 -59 -68 -557 -292 160 -133 -771 -275 433 -378 -597 -259 106 -87 -722 -374 29 -103 -443 1 217
5166B17n23M0O25l72m09L80J61j88m24O51O8j14j62L12J66n78k12Q26Nn75M06
$$ 217 -306 -266 359 -13 -422 -42 119 -69 -493 158 226 112 -50 262 428 -150 -362 464 469 -106 300
5187C00J90k62m90Q03l31j30J28N02k49q51K76M62N6l67j72O65l57k57M8O68n15
$$ 300 490 228 -262 541 210 80 208 710 461 -390 -114 348 404 37 -135 530 173 -84 -36 632 117
5208A17m80L92K66k03j23L72k13m21K35M30l42p19O93L97n83n47N59M80p31nL23
$$ 117 -363 29 295 92 -31 341 128 -293 -58 372 30 -689 4 401 -182 -729 -170 310 -421 -426 -103
5229a03L85o19j04K77L36o28P7M13l58l04N75L37o60j83P66j05l90o1O16M4n91
$$ -103 282 -337 -441 -164 172 -456 -379 34 -324 -628 -53 284 -376 -559 207 102 -288 -349 267 311 -280
5250b80K7P42q5o01N6M63m7m24K16J72l03K61N66n49j43j19N75k30m75P53N8m32
$$ -280 -253 489 404 -197 -141 322 275 -149 67 239 -64 197 763 214 71 -48 527 297 -178 575 633 201
5272B01n42L4O06k79M8M97Nj012M08L74k55j44k10P12m79k86N05M7n66K01O87
$$ 201 -341 -307 299 20 68 565 570 -442 -34 340 85 -59 -269 443 -36 -322 183 230 -336 -135 552
5293E52J28j386P36j60K30o79M08L46o9q42M15M00k44k02J59M38n87J39K19j71
$$ 552 680 -706 30 -130 100 -579 -171 175 106 -736 -321 79 -165 -367 -208 230 -357 -218 1 -170
5313a70m74N74K67n65J19K77J81l09l38M42J57m0l43N54j12n56K40L81L6m41K48
$$ -170 -644 -70 197 -368 -249 28 209 -100 -438 4 161 121 -222 332 220 -336 -96 285 321 -120 128
5334A28Jq8r9M36j45l49j07R21m29n65m5J232o17n03k83J031k0k77r26J070l96
$$ 128 129 41 -58 378 233 -116 -223 698 269 -296 -341 891 274 -229 -512 519 499 222 -704 366 -30
5355c0l78L65M20l53k1M21l31k96K19M69m90o12N04N38n73k23p6O48j50n38K25
$$ -30 -408 -43 377 24 3 424 93 -203 16 485 -5 -617 -113 425 -148 -371 -447 201 51 -487 -262
5376b62M99o56kL16K07l16j69L98j91n32P06J94n79m6K58M35n28q1P73N6k49n28
$$ -262 237 -419 -421 -105 102 -214 -383 15 -176 -708 -2 192 -387 -433 -175 260 -268 -349 424 480 231 -297
5398b97M81J65o70J27K95n8l32O31l08o9j4N02M7r98N98M35j94n22K98N84k91
$$ -297 184 349 -321 -194 101 43 -289 342 34 -35 -49 453 500 -498 100 535 341 -181 117 701 410
5419D10n91J98K53M4l88L64K31m63k64M80m2l35K29J13k48k88K37M42n95k73L23
$$ 410 -181 17 270 314 -74 290 521 58 -206 274 232 -103 126 239 -9 -297 -60 382 -213 -486 -163
5440a63M66p48P5M86j8m50j13M41N8l04J63L04k93l37K80L27j95m6J63Po02L97
$$ -163 303 -445 -370 116 98 -352 -465 -24 34 -270 -107 197 -96 -433 -153 174 -21 -67 96 103 -499 -102
5462a02P6j70m16P0O34r0n08L14M35k83n2J71L30n85k9O29j30l62J53L83l31l83
$$ -102 -26 -196 -612 -542 92 2 -506 -192 243 -40 -92 79 409 -176 -205 424 294 -68 85 468 137 -246
5484b46K82O15o03l34M25K61l74l63Q39J52n54m49O49R7p68N03M51l55j88J35
$$ -246 36 651 48 -286 139 400 26 -337 502 654 100 -349 300 397 -371 132 583 228 40 175
5504A75K65m75r7J10J95j34j56L95K41q94K8P94k02o60L48M53o10k61L08K00k99
$$ 175 440 -35 -132 -22 173 39 -117 278 519 -375 -347 447 245 -415 -67 386 -224 -485 -177 23 -276
5525b76L4J27J41l53J02N59p95m3L54L90m44l45N01K82m39l43N18J17n02J86K34
$$ -276 -242 -115 26 -327 -225 334 -461 -504 -150 240 -204 -549 -48 234 -205 -548 -30 87 -415 -229 5
5546EL68n93L1M88r6k12L20m1k89MK00J68n95j0Q39m9o76K17K62L16p74K48M11
$$ 5 373 -220 -189 299 203 -9 311 270 -19 -15 185 353 -242 -252 587 538 -138 79 341 657 -117 131 542
5569E42l14j71j54L98l01N4N57k82l20O9K71j58n14L19O73n74q01R67M6k48k32
$$ 542 228 57 -97 301 0 54 611 329 9 78 349 191 -323 -4 669 95 -706 261 307 59 -173
5590a73K81L65n42k20M80j83j24J0O5l71J91J30L75q97m6Q59j14o08J96O90l00
$$ -173 108 473 -69 -289 191 8 -116 -106 -41 -412 -221 -91 284 -613 -659 200 86 -522 -326 364 64
5611F4l34k34O39j67m89L89L40j04m66M37J00l45J65K16k2k27j89O33k82k74J17
$$ 64 -270 -504 135 -32 -521 -132 208 104 -362 75 175 -170 -5 211 189 -38 -227 406 124 -150 -33
5632c3O12m49k11J79N50m19m56O04J23p62O37J49k98j88J69K40k86k21L31K52
$$ -33 579 130 -81 98 648 229 -227 377 500 -262 375 524 226 38 207 447 161 -60 271 523
5652E23n09k68M75J00l24k47O62q2m70j76L96K71l27j43L85j11m07M39N8n57k65
$$ 523 14 -254 221 321 -3 -250 412 330 -140 -316 80 351 24 -119 266 155 -252 187 245 -312 -577
5673e77O21j54k93K53K28M4p93O15P0k58q6J03L12j76l34J84K84r2r8L24j09l80
$$ -577 44 -110 -403 -150 78 122 -671 -56 14 -244 -330 -227 85 -91 -425 -241 43 -49 -147 177 68 -312
5695c12j5L78L0m82M38L17m43l98N95K84m64l42M36L49o23L64J80J14n21K17N1
$$ -312 -327 51 81 -401 37 354 -89 -487 108 392 -72 -414 22 371 -252 112 292 406 -115 102 153
5716A53m2l31K11L88k45j29M32j70m67J61O40m44l68K98M31k94m37K61L20n30
$$ 153 111 -220 -9 379 134 5 437 267 -200 -39 601 157 -211 87 518 224 -213 48 368 -162
5736a62o2j28P23n04q3J19L4l01K81L60n51N0J97P8l49lL71%k17j71N26j07l41
$$ -162 -224 -352 371 -133 -216 -97 -63 -364 -83 277 -274 -224 -27 51 -298 -301 70 70 -147 -318 208 101 -240
5759b40j62N00j25l36L78j48q2n9K35n7m9j20M98n7l70J53O93n10k79j22M96J5
$$ -240 -402 98 -27 -363 15 -133 -215 -274 -39 -96 -145 -265 233 176 -194 -41 652 142 -137 -259 237 252
5781B52o34K75M06m67l0K44Q3p1n7J91r3k02M55J29j91l52K21N44n75l20J51O19
$$ 252 -382 -107 299 -168 -198 46 129 58 1 192 99 -103 352 481 290 -62 159 703 128 -192 -41 578
5803E78l42j24L21j66p3j18O2M4k76K01k3j43j26j39N12m61j27N83l51j39N6J94
$$ 578 236 112 433 267 194 76 138 182 -94 107 84 -59 -185 -324 188 -273 -400 183 -168 -307 -251 -57
5825e7J18m83m0N54j41m03L01L67m79k80N70J2j10m04N14Om66L15K47k42m50K73
$$ -57 61 -422 -462 92 -49 -452 -151 216 -263 -543 27 39 -71 -475 39 45 -421 -106 141 -101 -551 -278
5847b78M35l44j74K40m3N61m74j40L77k06j27L51M26o41M5K51k09j13M16O1k93
$$ -278 157 -187 -361 -121 -164 397 -77 -217 160 -46 -173 178 604 -37 8 259 50 -63 353 414 121
5868A21k95L64N2m43M0M36N4m61J00L92L1n83K61L61m73k84O00R4l42l19M13Q1
$$ 121 -174 190 242 -201 -161 275 329 -132 -32 360 391 -192 69 430 -43 -327 273 367 25 -294 119 200
5890B00n19j1L70l96n1N19j02N3l33l8M23l25l15N06J35m54K05j65K60j94rL51
$$ 200 -319 -330 40 -356 -407 112 10 63 -270 -308 115 -210 -525 -19 116 -338 -133 -298 -38 -232 -241 110
5912A10k48k32L45q8j06K81p3K96m48j89M90J64k10m40M94k43n5J44j07o9P3L40
$$ 110 -138 -370 -25 -113 -219 62 -11 285 -163 -352 138 302 92 -348 146 -97 -152 -8 -115 -184 -111 229
5934B29j89o4K9L7K87n81M35K31k67m41L41M97j40n38L22L66m15m26N50j0m59
$$ 229 40 -24 5 42 329 -252 183 414 147 -294 47 544 404 -134 188 554 139 -287 263 253 -206
5955b06J83j03O54o65M06n4j28k26K04J27m49N8K53K78j30m69K83Q7n03l39Q33
$$ -206 -23 -126 528 -137 269 215 87 -139 65 192 -257 -199 54 332 202 -267 16 103 -400 -739 94
5976I4j4l78J27J43l41R9J47o2j08Q8N27m30k72Q2L04j40n32K78P58n46k43L95
$$ 94 80 -298 -171 -28 -369 -270 -123 -185 -293 -205 322 -108 -380 -298 6 -134 -666 -388 370 -176 -419 -24
5998b4N40o12k8K99l68k4J74Q8J15l75J47L83l18j70O48rl66r7L82j1n42J21J97
$$ -24 516 -96 -124 175 -193 -217 -43 45 160 -215 -68 315 -3 -173 475 466 100 3 385 374 -168 -47 150
6021A50K36j67j16J51J63l23J01J66j98l19K91K18n53J40L76L7o01k4N70n19K2
$$ 150 386 219 103 254 417 94 195 361 163 -156 135 353 -200 -60 316 353 -248 -272 298 -221 -199
6042a99n3L21P5l97J58J16n71J46L32J84l92l1N50n38pl23Q66m54m77M98M15k79
$$ -199 -252 69 144 -253 -95 21 -550 -404 -72 112 -280 -311 239 -299 -306 -629 237 -217 -694 -196 219 -60
6064f0m86M0Q21p27m0O40k97k47L0K32J30k97K28M28m50m59J069m39j82l5L37
$$ -60 -546 -506 315 -412 -452 188 -109 -356 -326 -94 36 -261 -33 395 -55 -514 555 116 -66 -101 236
6085B36Q2l67k4L05J14o55K38M99l76k17J55M78l95j59K96O8l56O5K06N9j64m2
$$ 236 318 -49 -73 232 346 -309 -71 428 52 -165 -10 468 73 -86 210 278 -78 -13 193 252 88 46
6107D6K42k70j63NM16k71J78k19Q9m9l82M55J33n50P4K22K89p03L12J54m06J00
$$ 46 288 18 -145 -140 276 5 183 -36 53 4 -378 77 210 -340 -266 -44 245 -458 -146 8 -398 -298
6129b98K75o7k57m21N41K36j94k13O55j87m33K70L60l10m2lK55j39j93J73R9j81
$$ -298 -23 -90 -347 -768 -227 9 -185 -398 257 70 -363 -93 267 -43 -85 -88 167 28 -165 8 107 -74
6151g4L7K93k61j49K54K46k66m09M52M56m22k73L69J05k30k16J0M78n33K89K41
$$ -74 -37 256 -5 -154 100 346 80 -329 123 579 157 -116 253 358 128 -88 -78 400 -133 156 397
6172C97l83n9J07K17q0k28J74J97l53p6K00P1l98J01L07M7m39K56J27l38O6j38
$$ 397 14 -45 62 279 199 -29 145 342 -11 -87 113 184 -214 -113 194 241 -198 58 185 -153 -87 -225
6194b25K62j99Q3J8L9l47J40Q5K89n06L25K58k47m31P8P17l89k47M2K35j22j64
$$ -225 37 -162 -79 -61 -22 -369 -229 -144 145 -361 -36 222 -25 -456 -378 339 -50 -297 -255 -20 -142 -306
6216c06L52nQ4k95K53j49k54L31Q3l89O1M00L4m41J44K70J14k88N0M35l06k40
$$ -306 46 41 125 -170 83 -66 -320 11 94 -295 -234 166 200 -241 -97 173 287 -1 49 484 178 -62
6238f2J64J11p8K4j10K65k30k16M06K11m66qL66j8l13k23O56m13j99M0J43k48
$$ -62 102 213 135 159 49 314 84 -132 274 485 19 11 377 359 46 -177 479 66 -133 -93 50 -198
6260a98N8J78M0k2k36L03K03n74R8J91j23j77K58K78k34l88M15Jn38L38j0O17
$$ -198 -140 38 78 56 -180 123 326 -248 -150 41 -82 -259 -1 277 43 -345 70 71 -467 -129 -139 478
6282D78o01j55j18K23j43K8J71MM9j37p3Q1k27O97j08q50p4O05M13k15J37j33
$$ 478 -123 -278 -396 -173 -316 -288 -117 -113 -64 -201 -274 -193 -420 277 169 -681 -755 -150 263 48 185 52
6304E2P0l62M65J42o26K04k2K89l19K54K7j35R6l07J46J61j44L7K06k62J07K39
$$ 52 122 -240 225 367 -259 -55 -77 212 -107 147 174 39 135 -172 -26 135 -9 28 234 -28 79 318
6326C18q4j52n2J11qj29n1n8K07m14JL97j86j48J92K59j98m9J32K08m79lK23j90
$$ 318 234 82 30 141 133 4 -47 -105 102 -312 -311 86 -100 -248 -56 203 5 -44 88 296 -183 -186 37 -153
6350a53j87m4O69l30j39j41M28k58K4P7J49l35O4K50k11k57K92K48p7j96QL38
$$ -153 -340 -384 285 -45 -184 -325 103 -155 -131 -54 95 -240 -176 74 -137 -394 -102 146 69 -127 -119 219
6372B19l91j07K27L88Mo57K57L10l09l12N40j00k38j38N14K30m06nK79j63k29
$$ 219 -172 -279 -52 336 340 -317 -60 250 -59 -371 169 69 -169 -307 207 437 31 26 305 142 -87
6393h7K49R8k06j34M87r2l39R2M0knk09N11r7k14m24N68j87j47N35m78O9k90N89
$$ -87 162 260 54 -80 407 315 -24 68 108 106 101 -108 403 306 92 -332 236 49 -98 437 -41 28 -262 327
6417C27m68j69L59J23l16Mj77N56l27k80J20L38k27q9J94nQ6J9J5K2l82L65j34
$$ 327 -141 -310 49 172 -144 -140 -317 239 -88 -368 -248 90 -137 -226 -32 -37 49 68 83 105 -277 88 -46
6440d6Lm1K22km29L29j87J49k88k5M29K61m49J0K98n3j30J63j75Q6j93L92k07
$$ -46 -43 -84 138 136 -293 36 -151 -2 -290 -315 114 375 -74 -64 234 181 51 214 39 125 -68 324 117
6463A17k54J85L7J3k15J13L63k74p8O8J36j50k15M36j11l86M6K88q1j57P0L12
$$ 117 -137 48 85 98 -117 -4 359 85 7 75 211 61 -154 282 171 -215 -169 119 38 -119 -49 263
6485B63j02k05J10P2q3l16M75o5l01M9L88N1n05J69J47j32m09J23J48K9r3K18
$$ 263 161 -44 66 138 55 -261 214 149 -152 -103 285 336 -169 0 147 15 -394 -271 -123 -94 -187 31
6507C1l1m5j55j52M54m42L2M34K48n74J76J44p1j38N4K83l84n6R8L24k00r6Q7
$$ 31 0 -45 -200 -352 102 -340 -308 126 374 -200 -24 120 49 -89 -35 248 -136 -192 -94 230 30 -66 21
6530B1K10k24QJ7K29j81j30L14l61l1L14K48n32o6L62R0k92l20N43M3M1k38L48
$$ 21 231 7 15 32 261 80 -50 264 -97 -128 186 434 -98 -164 198 288 -4 -324 219 262 303 65 413
6553D13j57m47L12n2M4j25J92r1k87J23L85j61n05O8L77j92r0J45L72l79j29J34
$$ 413 256 -191 121 69 113 -12 180 89 -198 -75 310 149 -356 -288 89 -103 -193 -48 324 -55 -184 -50
6575e0LJ70l54Q2K8J68j57J70j07l10L38Q0K1l82K80P5k19j35J99J18j60k23K91
$$ -50 -47 123 -231 -149 -121 47 -110 60 -47 -357 -19 61 82 -300 -20 55 -164 -299 -100 18 -142 -365 -74
6598g4L98m92J38M36j66k54j48L92l08J53J98n16K10j4K95j47J0j17J87j69j82
$$ -74 324 -168 -30 406 240 -14 -162 230 -78 75 273 -243 -33 -47 248 101 111 -6 181 12 -170
6619a70L09J21k16L6J56j1k50M14r7m25N2J58L53k51k40O3J60k91l8K66j14k75
$$ -170 139 260 44 80 236 225 -25 389 292 -133 -81 77 430 179 -61 2 162 -129 -167 99 -15 -290
6641b90%K76L16m56J72j56N1j56j38N71m40Q2Q3N4j35O9J47J6k71k42N44lj44
$$ -290 -290 -14 302 -154 18 -138 -87 -243 -381 190 -250 -168 -85 -31 -166 -97 50 66 -205 -447 97 94 -50
6664e0mp7O4k09L58J84k25m38K36M28l73n5P1L01k34o4K85k54k55N55J08k19k56
$$ -50 -54 -131 -67 -276 82 266 41 -397 -161 267 -106 -161 -90 211 -23 -87 198 -56 -311 244 352 133 -123
6687a23L91J61l23j31ON56m16K8J36L9k70O6kM6m33N55k22m5nj05L33l83K2L58
$$ -123 268 429 106 -25 -19 537 121 149 285 324 54 120 118 164 -269 286 64 19 14 -91 242 -141 -119 239
6711B39o6l49k2M52n4m38J64K66k51L5P2j3k30l8J93q9K1q5J58Q7k84R6L30k58
$$ 239 173 -176 -198 254 200 -238 -74 192 -59 -24 48 35 -195 -233 -40 -129 -108 -193 -35 52 -232 -136 194 -64
6735f4j36j05L13j78j81K12K67m33p5N52o7k38k45L74n0P5l6N6l1k40K69K58k61
$$ -64 -200 -305 8 -170 -351 -139 128 -305 -380 172 105 -133 -378 -4 -54 21 -15 41 10 -230 39 297 36
6758C6j23K49k1l76J03M45j13j06k92L12j89J4K5K23n2n0K68p9j26p1K13j34j72
$$ 36 -87 162 141 -235 -132 313 200 94 -198 114 -75 -61 -36 187 135 85 353 274 148 77 290 156 -16
6781a6K61J60l10m00J65J08r1q6K08J99j22k97J72J33l21J93j24R8j07j5J90k26
$$ -16 245 405 95 -305 -140 -32 -123 -209 -1 198 76 -221 -49 84 -237 -44 -168 -70 -177 -192 -2 -228
6803b28j04K18J18q9r4J9J04K3l05L60k38M3j69K68j71J43J04K01j50p0m6J37
$$ -228 -332 -114 4 -85 -179 -160 -56 -33 -338 22 -216 -173 -342 -74 -245 -102 2 203 53 -17 -63 74
6825G4j51J96l2j9k97Q4K98J52p87M44K68O4o08N42k67l50N81J82o95J69L02J8
$$ 74 -77 119 87 68 -229 -145 153 305 -482 -38 230 294 -314 228 -39 -389 192 374 -321 -152 150 168
6847A68k38K16K03j14j78p4L43k71j1l97N71Kl27k14M34j4k20O6J61r3j17n1J71
$$ 168 -70 146 349 235 57 -17 326 55 44 -353 218 220 -107 -321 113 99 -121 -55 106 13 -104 -155 16
6870A6k29m3k3Q4o6J07L26l47j73M05J56j22j47j7M50k64q9j16K75l50k04L67
$$ 16 -213 -256 -279 -195 -261 -154 172 -175 -348 57 213 91 -56 -73 377 113 24 -92 183 -167 -371 -4
6892d%j6j01J81j04l79M90q3n1N4j01K30l27M95m36K71o30N23l2J80k33j70L02
$$ -4 -4 -20 -121 60 -44 -423 67 -16 -67 -13 -114 116 -211 284 -152 119 -511 12 -20 160 -73 -243 59
6915E9pj12M03r3k12L7P6N0m64M09Q8K1l58n1L79j88q9L1J46j59L9m6J94Pk57
$$ 59 52 -60 343 250 38 75 151 201 -263 146 234 255 -103 -154 225 37 -52 -21 125 -34 5 -41 153 160 -97
6940i7P9K01j87j36J89j55q6J74J65j97j71P1K91k34l29M83ll21n5J71M61m98
$$ -97 -18 183 -4 -140 49 -106 -192 -18 147 -50 -221 -150 141 -93 -422 61 58 -263 -318 -147 314 -184
6962a84J03J28j36j34P6L23j88k89J62O7j59P0K11M5k51J40K58j9k98J64J32j85
$$ -184 -81 47 -89 -223 -147 176 -12 -301 -139 -72 -231 -161 50 95 -156 -16 242 223 -75 89 221 36
6984C6k88K64L6J22k53M24r7l28K13J27l19J12O7J00l91J09J97J34j21n68O69
$$ 36 -252 12 48 170 -83 341 244 -84 129 256 -63 49 116 216 -175 -66 131 265 144 -424 245
7005B45o2n1K7R5j98M9nQ9Q1l08RL2J9l43L36l0J9k83L91l1l94K26J37o1j91R6
$$ 245 183 132 159 254 56 105 100 189 270 -38 -29 3 22 -321 15 -15 4 -279 112 81 -313 -87 50 -11 -202 -106
7031a06r9n9R4J44p4M7l51L94m9j41j40N00J3l62K33Q9kn34J84L30k01Q9L7l5
$$ -106 -205 -264 -170 -26 -100 -53 -404 -10 -59 -200 -340 160 173 -189 44 133 131 -403 -219 111 -90 -1 36 1
7055AL6k21K93j47R7rJ13j22k4k8K01j81k70M47K22m08J51Q4K23m56r7p3J79j86
$$ 1 37 -184 109 -38 59 50 163 41 17 -11 190 9 -261 186 408 0 151 235 458 2 -95 -168 11 -175
7079a75J63L68l4l51k65K68N9l38M39j30pQL0K43o10J98L1j73k12L52L11J60m73
$$ -175 -12 356 322 -29 -294 -26 33 -305 134 4 -3 5 35 278 -332 -134 -103 -276 -488 -136 175 335 -138
7102a38q8L09j96j26K77k30J54k9K36m11N3R0j02L38o77M60O0q8j9K70j60J89
$$ -138 -226 83 -113 -239 38 -192 -38 -67 169 -242 -189 -99 -201 137 -540 -80 -20 -108 -127 143 -17 172
7124A72m64K18K0M0l0j15K05r0R1O9j20k0J08j03R4J96k3L2j63j89K53J65n10
$$ 172 -292 -74 -54 -14 -44 -159 46 -44 47 116 -4 -24 84 -19 75 271 248 280 117 -72 181 346 -164
7147a64L0N33k39k61M09p5k39J38L0j97K28k53Q9J33o6k18L68l47p8L8K06J12
$$ -164 -134 399 160 -101 308 233 -6 132 162 -35 193 -60 29 162 96 -122 246 -101 -179 -141 65 177
7169A77k58J46K6k44j94N74q7j39k75K48p9N5k8n7o2J41K68k25k42J8M24Lm14
$$ 177 -81 65 91 -153 -347 227 140 1 -274 -26 -105 -50 -78 -135 -197 -56 212 -13 -255 -237 187 190 -224
7192b24J53Q9o3r0j09K33LJ36j09K98j58k99J05R3r0J19M6j31r9L27k39J47k27
$$ -224 -71 18 -45 -135 -244 -11 -8 128 19 317 159 -140 -35 58 -32 87 133 2 -97 230 -9 138 -89
7215h9J17K97j16m10M42K60n39r7K35m8j05K06j6k85K28O2n4r8j39J60l9l6M0
$$ -89 28 325 209 -201 241 501 -38 -135 100 52 -53 153 137 -148 80 142 88 -10 -149 11 -28 -64 -24
7238b4K10J58n40M1K95j03k22n7K29L6j42K0J83j04k72L21kq9m5J84K31l61K68
$$ -24 186 344 -196 -155 140 37 -185 -242 -13 23 -119 -99 84 -20 -292 29 27 -62 -107 77 308 -53 215
7261B15j27l86L2K63L04l08k70L6J50K1j95J65K39m71M37Q6J20m03J62o2J65l46
$$ 215 88 -298 -266 -3 301 -7 -277 -241 -91 -70 -265 -100 139 -332 105 191 311 -92 70 8 173 -173
7283a73M4P0L24m9k30N3p5j89M62K6l79J39J00j8J39j44R2k11R9J02R4l21N3K53
$$ -173 -129 -59 265 216 -14 39 -36 -225 237 263 -116 23 123 105 244 100 192 -19 80 182 276 -45 8 261
7307B61n4r2j91L44k79m5K26J36j89k99K82n6r3l05K18K94k77K2J64K1l39L96
$$ 261 207 115 -76 268 -11 -56 170 306 117 -182 100 44 -49 -354 -136 158 -119 -97 67 88 -251 145
7329A45l42r4J41J19j52L4l90L77K36j35O0m2R5l86M17j13K03l65O6K37P8m12
$$ 145 -197 -291 -150 -31 -183 -149 -539 -162 74 -61 -1 -43 52 -334 83 -30 173 -192 -126 111 189 -223
7351b23J15k5p9L33k19K71k43j06L06j8k68M26j25j96k22M10j56L93p1j53K80
$$ -223 -108 -133 -212 121 -98 173 -70 -176 130 112 -156 270 145 -51 -273 137 -19 374 303 150 430
7372D30l34K59j60j44l0KJ83l84J51J47O4k84K19N9K7m23M67m9j54r9p2L90m67
$$ 430 96 355 195 51 21 23 206 -178 -27 120 184 -100 119 178 205 -218 249 200 46 -53 -125 265 -202
7395b02J67L9Jk23L77j8j58j22m99R26j76m71QN50k8l43J11O2j98oJ21j00J61
$$ -202 -35 4 5 -218 159 141 -17 -139 -638 288 112 -359 -351 199 171 -172 -61 1 -197 -203 -82 -182 -21
7418b1j41R8Q7j06O8L0M5k13J76j07K07j26N7L00m73K21jJ69l54l3M04l90K04
$$ -21 -162 -64 23 -83 -15 15 60 -153 23 -84 123 -3 54 354 -119 102 101 270 -84 -117 287 -103 101
7441A01l71M03P9j99J44o5j73J17J66r1k84MK45J01l92J75J75r8R6K0p1l2j50
$$ 101 -270 133 212 13 157 92 -81 36 202 111 -173 -169 76 177 -215 -40 135 37 133 153 82 50 -100
7464a00P0J53Mk24M04k78k35J06J72K8l25M7L65m44n1K74No7n9j24L72j57r9K44
$$ -100 -30 123 127 -97 307 29 -206 -100 72 100 -225 -178 187 -257 -308 -34 -29 -96 -155 -279 93 -64 -163 81
7488H1J89m55K22J80l45qk73M66k94J83M1rN5j64N14l12j52q5N5K99j30l12N26
$$ 81 270 -185 37 217 -128 -136 -409 57 -237 -54 -13 -22 33 -131 383 71 -81 -166 -111 188 58 -254 272
7511B72J9p05M33J12M7k27J75L19l36l0N0m47J48J06R25j030J77J34m00M14K24
$$ 272 291 -414 19 131 178 -49 126 445 109 79 129 -318 -170 -64 861 -169 8 142 -258 156 380
7532C80q92P42k99p6K42l3mm8k74J16J22j6J6o7J43L1j3l16J11J82j28J09m66
$$ 380 -512 230 -69 -145 97 64 60 12 -262 -146 -24 -40 -24 -91 52 83 70 -246 -135 47 -81 28 -438
7555d38M96j90J35o2j61k2K41k33L27j97K23j10j00p4K2J95l5q7o4L85l49O6j09
$$ -438 58 -132 3 -59 -220 -242 -1 -234 93 -104 119 9 -91 -165 -143 52 17 -70 -134 251 -98 -32 -141
7578a41L53j0m02K97j58J10k9J72j59l02J81K02J3j5K2J09k93k47J30J44J62j12
$$ -141 212 202 -200 97 -61 49 20 192 33 -269 -88 114 127 112 134 243 -50 -297 -167 -23 139 27
7600B7K72k91L2J99j85r3J36K7J13k67J00q4K85l24K1J00O3k43J51M7M0k16K2
$$ 27 299 8 40 239 54 -39 97 124 237 -30 70 -14 271 -53 -32 68 131 -112 39 86 126 -90 -68
7623f8K77j88j88N1q8Q9o5P2M06n01J81p7mN7j51L13j93k40L72L1o0k49K81M4
$$ -68 209 21 -167 -116 -204 -115 -180 -108 298 -203 -22 -99 -103 -46 -197 116 -77 -317 55 86 26 -223 58 102
7647A02j33j65O9J88k16K30J48j57k88J89R5r1J1j27K35LR3k6J97m07K18L48o85
$$ 102 -31 -196 -127 61 -155 75 223 66 -222 -33 62 -29 -18 -145 90 93 186 160 357 -50 168 516 -169
7670a69j80N87R4n54J51O07l66L67n14K33m2k01m1J22j9k76K21J35k25P1J73j94
$$ -169 -349 238 332 -222 -71 536 170 537 23 256 214 13 -28 94 75 -201 20 155 -70 1 174 -20
7692b0J34j19R2k19J37qk4Q4m2n06P10J38l02R7k70j58J86R7l97L85o01J042k26
$$ -20 114 -5 87 -132 5 -3 -27 57 15 -491 219 357 55 152 -118 -276 -90 7 -390 -5 -606 436 210
7715B10l75Q06l14m68m01J051o62N28j30m26K59J80q24R52l95k74R7K54o6qM9
$$ 210 -165 641 327 -141 -542 509 -153 375 245 -181 78 258 -566 386 -9 -283 -186 68 2 -6 43
7736D3n27O45l41K20mJ42k22J22J39l58K0J33K29m78N6K57K37q79J036k49j53
$$ 43 -484 161 -180 40 36 178 -44 78 217 -141 -121 12 241 -237 -181 76 313 -566 470 221 68
7757F8j71j76K36k74K41L38k10J99l53M10n8l94J90K92k17l03K53k53J72j44N5
$$ 68 -103 -279 -43 -317 -76 262 52 251 -102 308 250 -144 46 338 121 -182 71 -182 -10 -154 -99
7778i9K30j43J71j20j2Q2j21Q7l70j27N29R1n70J04J31J54k75J81KP1M2jJ7K31
$$ -99 131 -12 159 39 27 109 -12 75 -295 -422 107 198 -372 -268 -137 17 -258 -77 -75 -4 38 37 54 285
7802B85n86J44J74K78m81K91P7j37L7K03q5j54k74L23R2l16J46J1L60m08J5K32
$$ 285 -301 -157 17 295 -186 105 182 45 82 285 200 46 -228 95 187 -129 17 28 388 -20 -5 227
7824B27k03kj32L28j84j63J32J0J09j52N6k62K68m8J87k86k00K55M18l44M8j65
$$ 227 24 22 -110 218 34 -129 3 13 122 -30 26 -236 32 -16 171 -115 -315 -60 358 14 62 -103
7846a03K94l63J13J01JJ94j35o2k0k42L47K0k55J0J38kk08Q6J36M5j06N5j50L44
$$ -103 191 -172 -59 42 43 237 102 40 20 -222 125 145 -110 -100 38 36 -172 -86 50 95 -11 44 -106 238
7870B38m71O8J03L4j04J45M4k16J17J7j17R0j50L79J11k26j70K92k77J28J89J5
$$ 238 -233 -165 -62 -28 -132 13 57 -159 -42 -25 -142 -52 -202 177 288 62 -108 184 -93 35 224 239
7892B39k84M3J32KJ75k14J17j26mJ54Rj46k1j42Rj99K39lJ95k78P0R2k79J17R3
$$ 239 -45 -2 130 132 307 93 210 84 80 234 243 97 76 -66 -57 -256 -17 -20 175 -103 -33 59 -220 -103 -10
7917a0M3j93O7J1K7J73k33q6M56n53K86J66k50j43J97J15k33MJ07J66m00J88q0
$$ -10 33 -160 -93 -82 -55 118 -115 -201 255 -298 -12 154 -96 -239 -42 73 -160 -156 -49 117 -283 -95 -175
7940a75L40m77NJ67P3q4K6K12k17J52J20m57M76j39J53j82J19j21L73P1o21K11
$$ -175 165 -312 -307 -140 -67 -151 -125 87 -130 22 142 -315 161 22 175 -7 112 -9 364 435 -186 25
7962B5p4L56m13N5P6rr7J49K98k85m5J39j96P6k28N40k85p8k5J46j0k36P5K01
$$ 25 -49 307 -106 -51 25 16 -81 68 366 81 36 175 -21 55 -173 367 82 4 -21 125 115 -121 -46 155
7986A55m07L82m4j74k1n7J31J26j41j15K69j22j95K31j5j47r5J08rM9j10N4K33
$$ 155 -252 130 86 -88 -109 -166 -35 91 -50 -165 104 -18 -213 18 3 -144 -239 -131 -140 -91 -201 -147 86
8009H6k18o4K06kk75j12L68NQ0k33N7K14N1k04M1K17n32L84lk82P8K68q1l15K38
$$ 86 -132 -196 10 8 -267 -379 -11 -6 74 -159 -102 112 163 -41 0 217 -315 69 66 -216 -138 130 49 -266 -28
8034b8M5p5N8j6J78r4j69O9J92J15n11M21j32j19K75l10J55l0k8j26K38j01n5
$$ -28 17 -58 0 -16 162 68 -101 -32 160 275 -236 185 53 -66 209 -101 54 24 -4 -130 108 7 -48
8057d8K89o6j44R6l0j59q3KJ28N8k0j26Q1j46r1K1m7nK61NQ1k22K19P1l40RN6
$$ -48 241 175 31 127 97 -62 -145 -143 -15 43 23 -103 -22 -168 -259 -238 -285 -290 -29 -24 57 -165 54 125 -215 -206 -150
8084a50K23j13J14k17J25K5Rj44L0l0Q2o2r8m5P6j6k74L90N73q48n39O48M18k00
$$ -150 73 -40 74 -143 -18 7 16 -128 -98 -128 -46 -108 -206 -251 -175 -191 -465 -75 498 -350 -889 -241 177 -23
8108b3P5J95j84J79k77J53k29J98J63j4l65o6K76R6j90j6J05K8J5q0o8J42K6k75
$$ -23 52 247 63 242 -35 118 -111 87 250 236 -129 -195 81 177 -13 -29 76 104 119 39 -29 113 139 -136
8132a36K62o6o9J8J86m76Q6K41O4J76l88L64q63N18J90l3k02J92J62m3r3k62K
$$ -136 126 60 -9 9 195 -281 -195 46 110 286 -102 262 -601 -83 107 74 -128 64 226 183 90 -172 -170
8155a70J22k26L11j1r6k99L52l16K69P5L4K43k32j3N2j31j53J41J13q8n8j36L05
$$ -170 -48 -274 37 26 -70 -369 -17 -333 -64 11 45 288 56 43 95 -36 -189 -48 65 -23 -81 -217 88
8178H8O5j62j83J74J83l61K78P7r3m54N03Q7k43
$$ 88 153 -9 -192 -18 165 -196 82 159 66 -388 115 202 -41
8191d1
$$ Imaginary data points
##PAGE= N=2
##DATA TABLE= (X++(I..I)), XYDATA
0@%%%%%%%%%Qj6J6j6K4l2M0m8N6p2Q8j04J20j44J76k08K40k75L17l68M23m82N50
$$ 0 0 0 0 0 0 0 0 0 0 8 -8 8 -8 16 -16 24 -24 32 -40 48 -56 64 -80 96 -112 128 -147 170 -198 225 -257 293
32B93o25P07p98R00j012J135j269J414j572J748j941K147k374K624k895L189l513
$$ 293 -332 375 -423 477 -535 600 -669 745 -827 921 -1020 1127 -1247 1377 -1518 1671 -1842
49a842L872m266M699n178N713o312O983p744Q620r635J0826j2252J3991j6164
$$ -1842 2030 -2236 2463 -2715 2998 -3314 3669 -4075 4545 -5090 5736 -6516 7475 -8689
63h689J8969k2741K8096l6318N0603q1995K61471r7252l71202M85980l04630J6187
$$ -8689 10280 -12461 15635 -20683 29920 -52075 209396 112144 -259058 226922 -77708 -61521
75f1521J83778k63192K19091L6640k28988J96922q7537j1485P4182j20578R8350
$$ -61521 122257 -140935 78156 114796 -114192 82730 -4807 -16292 57890 -62688 35662
86C5662N389j11967J17113k7506m8984P4234k3007m8478L2813j9215j0101L3875
$$ 35662 41051 -70916 46197 18691 -30293 43941 20934 -27544 5269 -13946 -24047 9828
98I828k5179K9716K5499q8882O0406J1372r3723O3696M944Q106J9159r3707R6973
$$ 9828 -15351 14365 39864 -49018 11388 22760 -70963 -7267 -2323 5783 24942 -68765 28208
111B8208J4552j21280O6819P273J5720n827r0469J25368j904j06324P7294j4013
$$ 28208 42760 -78520 -11701 -4428 11292 5465 -85004 40364 38460 -67864 9430 -4583
123d583J3553r097o8155J08940l4530n0524Q9372n8584J6768J0831n9693Q1334
$$ -4583 8970 -127 -68282 40658 6128 -44396 44976 -13608 3160 13991 -45702 35632
135C5632m9469j7471R0431p8651K4268L1105o5549O1818m0489j8761Q5602q4174
$$ 35632 -13837 -31308 59123 -19528 4740 35845 -29704 32114 -8375 -27136 58466 -25708
147b5708J6895P4193q4058K2636K3156m0143L5588m2195L588Q2655p3942k0182
$$ -25708 -8813 65380 -18678 3958 27114 -13029 22559 -19636 -16048 66607 -7335 -27517
159b7517P8286m2309k1088Q913j1200N8960m2225n3480J01559l1046o2811O4171
$$ -27517 50769 8460 -12628 -3715 -14915 44045 1820 -51660 49899 18853 -43958 20213
171B0213k4210J0880O079p0330Q1109m701p4771R0360k7191l0453M5743o5306
$$ 20213 -3997 6883 12962 -57368 23741 19040 -55731 34629 7438 -23015 22728 -42578
183d2578L8118J3526n8952Q2708k7237m2049O2405m7231L326J6000k3917N1061
$$ -42578 -4460 9066 -49886 32822 5585 -36464 25941 -21290 -17964 -1964 -25881 25180
195B5180m0177j1991N5988m8506Q267J7032j2954K8031n1491J4260N2618o3533
$$ 25180 -14997 -26988 29000 -19506 -11239 5793 -7161 20870 -30621 -16361 36257 -27276
207b7276J2905L8840j2766j340l8941K8881L5114o4806J6308M6406j7381p923
$$ -27276 -14371 24469 11703 10363 -28578 303 35417 -29389 -13081 33325 15944 8021
219H021k0936J5575K9582m9501K553M9930k9969o850J9348k3098J6704k475j9167
$$ 8021 -12915 2660 32242 -17259 -14706 35224 5255 -1595 17753 -5345 11359 8884 -10283
232a0283L8896l2706j1423N5737n2203k27M1179m0367K7694j8675k2625O7329
$$ -10283 28613 -4093 -15516 40221 -11982 -12209 28970 -11397 16297 -2378 -25003 42326
244D2326o2281m195O8048o8370K0250J9776m3027N1744m3679q923P9144p6936
$$ 42326 -19955 -24150 43898 -24472 -4222 15554 -27473 24271 -19408 -28331 50813 -26123
256b6123m992N7145l8792J3448k2006k203O6772o5918j7027O8581l5606o228Q726
$$ -26123 -31115 26030 -12762 686 -21320 -23523 43249 -22669 -39696 28885 -6721 -12949 -4223
269d223j6709L7652k2977k1750M8507k3864j3206K9502k4227L204J0485j1462
$$ -4223 -20932 16720 -6257 -28007 20500 -3364 -16570 12932 -11295 -8091 2394 -9068
281i068K5572k0175j5525M3315k3844j9408L1021l813K90j0494k568K4872k9814
$$ -9068 16504 -3671 -19196 24119 275 -19133 11888 8075 8365 -2129 -4697 20175 -9639
294i639L741L4353k8838J844O984p453J5053l1457J2945M3802m3204r758K1921
$$ -9639 -5898 28455 -383 1461 8445 992 16045 -15412 -2467 41335 -1869 -11627 10294
307A0294n39L304l5512K3499M3994n7358j660L0422k3397J1258q714O02L0803
$$ 10294 9755 13059 -22453 1046 45040 -12318 -13978 16444 -6953 4305 -4409 -3807 26996
320B6996l7828P24K5537l3324J2741J2142j1951J5141k4420O826K5337m5430J5727
$$ 26996 -10832 -10108 15429 -17895 -5154 6988 -4963 10178 -14242 -7416 17921 -27509 -11782
333a1782L2077l5551R163M608j1963J8968k1715Q177K8394l9001N966K2252k2161
$$ -11782 20295 -15256 -6093 -1485 -13448 5520 -16195 -8018 20376 -18625 -12659 9593 -12568
346a2568M006k155J5211J6176m6616J7096L3253m3310M164J8679j248J3900l0924
$$ -12568 -8562 -10717 4494 20670 -25946 -8850 24403 -18907 -14743 3936 2688 16588 -14336
359a4336N911L7182m0160l855L0897j2186K119q279J897K1629l0155O021K8333
$$ -14336 -8425 28757 -11403 -15258 15639 3453 5572 -2707 -810 20819 -9336 -3315 25018
372B5018k9813L816J2847j4481J0795r274N673J9400l1709O874K0235k5246M295
$$ 25018 -4795 -979 11868 -2613 8182 -1092 4581 23981 -7728 -854 19381 -5865 -1570
385a570L844K872J0817k8637J5949K0419l9639J0756J5444j4531O393j2221J6046
$$ -1570 2274 5146 15963 -12674 3275 23694 -15945 -5189 10255 -4276 2117 -10104 5942
398E942J3178m2107J9453K0551l1434O232J612R263R170l8569K2984K5410m1950
$$ 5942 19120 -22987 -3534 17017 -14417 -8185 -6573 2690 11860 -26709 -3725 21685 -20265
411b0265R544J3322r455J0674k0897J0366K1882l3216J4874J4537k8732J5395
$$ -20265 -10721 2601 -6854 3820 -17077 -6711 15171 -18045 -3171 11366 -17366 -1971
423a971n95p561J5447j9029J8022J7362m2127J4575J9427k5827Q229L518N702
$$ -1971 -2566 -10127 5320 -13709 4313 21675 -20452 -5877 13550 -12277 -4048 -530 5172
436E172J2607k7883R209J8319k9685P642J6522r976L387p236R658J0724l2121
$$ 5172 17779 -10104 -895 17424 -12261 -4619 11903 1927 5314 -1922 7736 18460 -13661
449a3661J1620K8532k7816p284J2164N133M144k1556J0307K4751k6473q035R579
$$ -13661 -2041 26491 -1325 -8609 3555 8688 12832 -8724 1583 26334 -139 -8174 1405
462A405k210N748j0461J1474J2239k5949J1541M242k4776J3398L796L384Q42j9074
$$ 1405 -805 4943 -5518 5956 18195 -7754 3787 8029 -16747 -3349 447 3831 4673 -14401
476a4401K4083m3k9982J7626K861k415J199j7582K4246K88k6644K8468j195k1158
$$ -14401 9682 9639 -20343 -2717 144 -2271 -1072 -18654 5592 5880 -20764 7704 6509 -14649
490a4649J1289l916M049k807j0558L0110j979l1068J5574R544j2008k805k517
$$ -14649 -3360 -7276 -3227 -6034 -16592 13518 11539 -19529 -3955 5589 -6419 -9224 -11741
503a1741K0453O543l1852J5321J7380k7103Q194O628q886J3679j3011O135J4602
$$ -11741 8712 15255 -16597 -1276 16104 -10999 -2805 3823 -5063 8616 -4395 1740 16342
516A6342k9219J8408J2926l0931J4695J335j717J2257k5545J9789J6998l8263
$$ 16342 -12877 5531 18457 -12474 2221 3556 1839 14096 -11449 8340 25338 -12925
528a2925J4007R881j4497Q278q555J2112N681k4380J8816M933k2952Q033L702
$$ -12925 1082 10963 -3534 4744 -3811 8301 13982 -10398 8418 13351 -9601 -1568 2134
541B134K942n129j1243K2970K158k4737O000J0527n525j1836J625J9562n507j3241
$$ 2134 5076 -53 -11296 11674 13832 -10905 -4905 5622 97 -11739 -10114 9448 3941 -9300
555i300J0287J752q745l465L000Q283p080m048J5317o213j1529J1029J989n892
$$ -9300 987 2739 -6006 -9471 -6471 1812 -5268 -9316 6001 -212 -11741 -712 1277 -4615
569d615l851o41J4589r233j2036K6574k292j9615J1441l034j180K239j2244K6169
$$ -4615 -8466 -9107 5482 -3751 -15787 10787 8495 -11120 321 -2713 -3893 -1654 -13898 12271
583A2271P04k8117K5517k048k1769J5264n283J0278M178k5943K9446R21l2735
$$ 12271 12975 -15142 10375 8327 -13442 1822 -3461 6817 10995 -14948 14498 15419 -17316
596a7316K5373N13p849P143j9723K2849L887l2483K8681N538k1857J1567p660
$$ -17316 8057 8570 721 7864 -11859 10990 14877 -17606 11075 16613 -5244 6323 -1337
609a337O37N433j2254J6795K389j7228J0783J664j2295j546O090Q225o365r201
$$ -1337 -700 4733 -7521 9274 11663 -5565 5218 6882 -5413 -6959 -869 7356 991 -8210
623h210J2132O050j9239j490J7006n736q329L565L917K433r765K772J2312j3119
$$ -8210 3922 9972 -9267 -10757 6249 513 -7816 -4251 -334 2099 -7666 -4894 7418 -5701
637e701m121R517m80n784m809J5885L715k0885O646R453l933p341l865K0950m722
$$ -5701 -9822 -305 -785 -6569 -11378 4507 8222 -12663 -6017 3436 -497 -7838 -11703 9247 4525
652D525j6837J6656l769l143L866r485J5812p820r138K5013j7271o720J8101r567
$$ 4525 -12312 4344 575 -2568 1298 -8187 7625 -195 -9333 15680 -1591 -8311 9790 223
666B23M799q551k474K7386k2386j0094K6282j1669l912L753n674J4736j0587r194
$$ 223 5022 -3529 -6003 21383 -1003 -11097 15185 3516 -396 3357 -2317 12419 1832 -7362
680g362K0401j0216r955J7074l562q069K963k181J0921r709j5213K7685M9k4978
$$ -7362 13039 2823 -7132 9942 6380 -1689 1274 -907 10014 305 -14908 12777 12826 -12152
694a2152J3921J265m796L597j4381J6611O804k4970J5829K764j5838J2728l579
$$ -12152 1769 3034 -1762 1835 -12546 4065 10869 -14101 1728 4492 -11346 1382 -2197
707b197Q04J476j2684J8057m060j9115K0128K788r377q74l536J2360n257j2961
$$ -2197 -1393 83 -12601 5456 1396 -17719 2409 5197 -4180 -5054 -8590 3770 -1487 -14448
721a4448J6777L679r871m20K679L554r178J533J4444r459n497R010J71l898n430
$$ -14448 2329 6008 -3863 -4283 -1604 1950 -7228 -5695 8749 -710 -6207 2803 2974 -924 -6354
736f354P732J1461j4279n592J2324K97p641j456J0383M680j3856P86J0171r033
$$ -6354 1378 12839 -1440 -7032 5292 5589 -2052 -3508 6875 11555 -2301 -1515 8656 -377
750c77k902R490r17j201k398J90O844j0942l137J7207p512j0298R626J41K37p054
$$ -377 -3279 6211 5294 4093 1695 1885 8729 -2213 -5350 11857 4345 -5953 3673 3814 4051 -3003
766c003j450J7945j3422j1572J9308q014n215O813m518J0206r507r375K1464j2651
$$ -3003 -4453 13492 70 -11502 7806 -208 -5423 1390 -3128 7078 -2429 -11804 9660 -2991
780b991r813J7472o411M09k373n205J7715j2613j1793K1883n340j1117O915J870
$$ -2991 -12804 4668 -1743 -1334 -3707 -8912 8803 -3810 -15603 6280 940 -10177 -3262 -1392
794a392M230o884l480J2491n989q329R378J758m450R9K671L396o114k846J0482
$$ -1392 2838 -4046 -7526 4965 -1024 -9353 25 1783 -2667 -2568 103 3499 -2615 -5461 5021
809E021p63j1534O805Q487o951n267N432Q311o047r791Q758M858q698k38P745
$$ 5021 4258 -7276 -471 8016 1065 -4202 1230 9541 3494 -6297 2461 7319 -1379 -1617 6128
824F128K548q305j555Q167o238m506P354K922q04p766L629R721j5706l358J5602
$$ 6128 8676 371 -1184 6983 745 -3761 3593 6515 5711 -2055 1574 11295 -4411 -7769 7833
839G833l345m137l326M181Q015j4902O96J2826j0410o96L825l300L652n390M115
$$ 7833 4488 351 -2975 1206 9221 -5681 -4985 7841 -2569 -3265 560 -2740 912 -4478 -363
854c63P996j5871K018J1386j0148k973M228O335K857j4790K868J3869j3615m526
$$ -363 7633 -8238 -6220 5166 -4982 -7955 -3727 2608 5465 -9325 -6457 7412 -6203 -10729
868a0729J1615j635N12k119j448P831r000j959J3941r103o156J0051M45j947n268
$$ -10729 886 -749 -237 -2356 -3804 4027 -4973 -6932 7009 -2094 -8250 1801 2246 299 -4969
883d969L853J3443j3884p800J5016l156m452J822J302P906p106n655J0517o085
$$ -4969 -1116 12327 -1557 -9357 5659 2503 -1949 -127 1175 9081 1975 -3680 6837 752
897G52m973R606r88l456ML887L734j0792j970J2983l932r090L868O966n73q736
$$ 752 -4221 5385 4397 941 945 4832 8566 -2226 -4196 8787 4855 -4235 -367 6599 6026 -2710
913b710J104R010o520o134O154K221k988k705N131J948j0712K952Q204p076l740
$$ -2710 -1606 7404 884 -5250 904 3125 137 -2568 2563 4511 -6201 -3249 4955 -2121 -5861
928e861K908O060o88j1993P747R026j2871j007N000Q1J016o584O619O406j3175
$$ -5861 -2953 3107 2419 -9574 -1827 7199 -5672 -6679 -1679 -1598 -582 -7166 -547 5859 -7316
943g316L705O838j0048J483M881J130K96p501P213N983j4303J430J1777n206k971
$$ -7316 -3611 3227 -6821 -5338 -457 673 969 -6532 681 6664 -7639 -6209 5568 362 -2609
958b609O78L236N280j0038M38J2646r677n389R497k176j779M55K698O257j0356
$$ -2609 -1931 1305 6585 -3453 -3015 9631 -46 -5435 4062 1886 107 562 3260 9517 -839
973h39k219J0815p804m542P246L140R87p941J072R306j0357m531J0213j48m167
$$ -839 -3058 7757 -47 -4589 2657 5797 6784 -1157 -85 9221 -1136 -5667 4546 4398 231
988B31j163L858K258p958J157O813n273l657L017K985k509m973P608L403j0598
$$ 231 -932 2926 5184 -2774 -1617 5196 -77 -3734 -717 2268 -241 -5214 2394 5797 -4801
1003d801m50N986r51n576j9J0208j159j0532N011M192o147j740K405N427k206
$$ -4801 -5251 735 -216 -5792 -5811 4397 3238 -7294 -2283 1909 -4238 -5978 -3573 1854 -352
1018c52n949P486J130r097L620M728k682l344P14P923k303r255P848O399r444
$$ -352 -6301 1185 2315 -6782 -3162 1566 -1116 -4460 -3746 4177 1874 -7381 467 6866 -2578
1033b578j760M918J771j342m866O503N382j0971K442P348r277J723M368j498K232
$$ -2578 -4338 580 2351 1009 -3857 2646 8028 -2943 -501 6847 -2430 -707 3661 2163 4395
1048D395o559N203P307j4562J273J0223m785k295k559O598N265j3850L221Q486
$$ 4395 -2164 3039 10346 -4216 -2943 7280 2495 200 -2359 4239 9504 -4346 -1125 7361
1062G361q276m68K492O88J28m632N159K108r511K500P033m112o514L568O798m165
$$ 7361 -915 -1383 1109 1797 1925 -2707 2452 4560 -4951 -2451 4582 470 -6044 -2476 4322 157
1078A57n688L343N508k752q279M573N956o647p10N743r94l870R63L526m327k847
$$ 157 -5531 -2188 3320 568 -7711 -3138 2818 -3829 -4539 1204 210 -3660 -2697 829 -3498 -6345
1094f345N668L296m292m506O523M709j0152o62P501P56l896m682Q466K423j0338
$$ -6345 -677 2619 -1673 -6179 344 5053 -5099 -5761 1740 2496 -1400 -6082 2384 4807 -5531
1109e531O542K829n501K730k107L129P8q060J2462P85j2722P169L247l070k587
$$ -5531 1011 3840 -1661 1069 -1038 2091 2169 -5891 6571 7356 -5366 1803 5050 1980 -607
1124f07l194J0905l77j1409P094L524n750j35N07L225j386m595N793M94p759M024
$$ -607 -3801 7104 6727 -4682 2412 5936 186 51 558 3783 2397 -2198 3595 4089 -3670 354
1140C54N898o638k883L941K383k528n789M554P469r451k933Q058j929l206j076
$$ 354 6252 -386 -3269 672 3055 527 -5262 -708 6761 -2690 -5623 2435 506 -2700 -3776
1155c776L126L995q212J253P612p545j809N562k00k422k812M558L524q256M01
$$ -3776 -650 3345 -4867 -3614 3998 -3547 -5356 206 6 -2416 -5228 -670 2854 -5402 -5001
1170e001P201j159n827L21P185k037o045M742K786k328k682J467N523n497l031
$$ -5001 2200 1041 -4786 -4465 2720 683 -5362 -620 2166 -162 -2844 -1377 4146 -1351 -4382
1185d382Q932k983m455M056J155M76m515J11Q441p030l750Q599o05l376j270J966
$$ -4382 4550 1567 -2888 1168 2323 2799 -1716 -1605 6836 -194 -3944 4655 4050 674 -596 1370
1201A370M640n889l544R335j519p049M267K652k876j964J213L499k499n229O552
$$ 1370 6010 121 -3423 5912 4393 -2656 1611 4263 1387 -577 636 4135 1636 -3593 2959
1216B959J568q768L134N117k682k731k592O654N69j0669O288N751p479J371J68
$$ 2959 4527 -4241 -1107 4010 1328 -1403 -3995 2659 3228 -7441 -1153 4598 -2881 -1510 -1342
1231a342O43N84o266O000K979q495M543L181m326j737J016O010l634p087Q060
$$ -1342 -699 -115 -6381 -381 2598 -5897 -1354 1827 -2499 -4236 -3220 2790 -844 -7931 129
1246A29K789o213p38L988L791n332l105N801j70l878J226M234n51m713M002J952
$$ 129 2918 -3295 -4033 -45 3746 -1586 -4691 1110 940 -2938 -1712 2522 1971 -2742 1260 3212
1262C212n849K79N020J139m526j239O772J8p602J332O426r70n660J274M814k419
$$ 3212 -2637 -2358 2662 3801 -725 -1964 4808 4826 -2776 -1444 4982 4012 -1648 -374 4440 2021
1278B021k768K391K929l668k293N478k237m526M188K064n92m471n58Q617o336
$$ 2021 -747 1644 4573 905 -1388 4090 1853 -2673 1515 3579 2987 -1484 -2042 6575 239
1293B39p131R128J105l826j008m75O265n151n109Q646k982m271N276j330r44j115
$$ 239 -6892 2236 3341 -485 -1493 -1968 4297 -854 -5963 2683 -299 -4570 706 -624 -1568 -2683
1309b683j33O345n781n372R392K26p003J212L748J970m536l050O799M81o881L560
$$ -2683 -2816 3529 -2252 -7624 1768 1994 -5009 -3797 -49 1921 -2615 -5665 1134 1615 -5266 -1706
1325a706L699l519n9J975N58j978k455N116J379p242L170O347l518m060J485M892
$$ -1706 1993 -1526 -1585 390 948 -1030 -3485 1631 3010 -4232 -1062 5285 1767 -2293 -808 4084
1341D084j763o166M097N224m111k225L197J373l698q53M223q31l247J822K879
$$ 4084 2321 -3845 252 5476 1365 -860 2337 3710 12 -841 3382 2551 -696 1126 4005
1356D005k013m046L005M896n855l003N597R47m232j708M458K619o374n34N199
$$ 4005 1992 -2054 951 5847 -8 -3011 2586 3533 -699 -2407 2051 4670 -1704 -2238 2961
1371B961l227k620K051J906Q9m239K199M261p258p31O718k523l190J421K644J095
$$ 2961 -266 -2886 -835 1071 1160 -3079 -880 3381 -3877 -4608 2110 -413 -3603 -2182 462 1557
1387A557o309P60P067m520l893M059J779j782k480K474M383n577k159O647k408
$$ 1557 -4752 -3992 3075 -1445 -5338 -1279 500 -1282 -3762 -1288 3095 -2482 -4641 2006 -402
1402d02l485L653J547m74k617J16N433l879n131P981J199n669J240K663J279l482
$$ -402 -3887 -234 1313 839 -1778 -1662 3771 -108 -5239 2742 3941 -1728 -488 2175 3454 -28
1418b8k588O964j385n425L574K454k541l51L09L183l526k443N199J56n455J350
$$ -28 -2616 4348 2963 -2462 1112 3566 1025 674 983 4166 640 -1803 3396 3552 -1903 -553
1434e53O126l007m905K773L526j926m657K086M465k980m515M392K028m625k37
$$ -553 5573 2566 -2339 434 3960 2034 -2623 -537 3928 948 -3567 825 2853 -1772 -2009
1449b009K382j08k499K08L649j564m564M146L266o197j602M823J253k949l264
$$ -2009 373 265 -2234 -2026 1623 59 -4505 -359 2907 -3290 -4892 -69 1184 -1765 -5029
1464e029N032L266p335k70O101k743j736J507Q04O54k972J826L598n613m29O104
$$ -5029 3 3269 -4066 -4336 1765 -978 -2714 -1207 -403 251 -2721 -895 2703 -2910 -3339 2765
1480B765k421l065J139M164J097o774Q46O680l553l884L344K393n27k420O38L468
$$ 2765 344 -2721 -1582 2582 3679 -3095 -2249 4431 878 -3006 338 2731 2204 -216 422 3890
1496C890l545j847N537k051l653L699J267j790l136K055N670m688n168N898K062
$$ 3890 345 -1502 4035 1984 -1669 2030 3297 1507 -1629 426 6096 1408 -3760 2138 4200
1511D200m700j347L016K939l862k375M306j496l207K514J964k555j201K819Q69
$$ 4200 -500 -1847 1169 4108 246 -2129 2177 681 -2526 -12 1952 -603 -1804 1015 1884
1526A884m241j109M269J246n340j124O485o13n718J614L288m20k990o6L973k039
$$ 1884 -2357 -3466 803 2049 -3291 -4415 2070 1457 -4261 -2647 641 221 -2769 -2835 1138 -901
1542i01k931L996N40l848J407K354r91k540K17N239q90o150L614M782n334j527
$$ -901 -3832 164 704 -3144 -1737 617 -374 -2914 -2697 2542 1652 -4498 -884 3898 -1436 -2963
1558b963L582J135n94l269K452L733n454J79M695k762j557J982J212j63l972L143
$$ -2963 619 1754 1160 -2109 343 4076 -1378 -1199 3496 734 -823 1159 2371 2208 -1764 1379
1574A379M069o291p04N239r42k894m23K791J798n296L1N354k360l841K825J710
$$ 1379 5448 -843 -1547 3692 2750 -144 -567 2224 4022 -1274 -1243 4111 1751 -2090 735 2445
1590B445k152j788K028K132l837j121M210j036l870J377L583j239l925J709L891
$$ 2445 293 -1495 533 2665 -1172 -2293 1917 881 -2989 -1612 1971 732 -3193 -1484 2407
1605B407l460l568L919K435l489j556L167R22l166o59L540j38l827J214L733k822
$$ 2407 -1053 -4621 -702 1733 -1756 -3312 -145 777 -2389 -3048 492 354 -3473 -2259 1474 -1348
1621a348k212L758J396l248j344L618J381m521n62N622n7n028J108L992j561k291
$$ -1348 -3560 198 1594 -1654 -2998 620 2001 -2520 -3082 2540 2483 -2545 -1437 2555 994 -1297
1637a297K95L603j016l822M069J197m214J674K147j377j016j179M471m37o346
$$ -1297 -1002 2601 1585 -2237 1832 3029 -1185 489 2636 1259 243 -936 3535 3098 -3248
1652c248M485M098m686j248J398K600j954m198M449K150m746R37K180j533j406
$$ -3248 1237 5335 649 -599 799 3399 1445 -2753 1696 3846 -900 37 2217 684 -722
1667g22O14J735j391k779K681L072m986j785N773l11m476k18K812J853m325j516
$$ -722 -108 1627 236 -2543 138 3210 -1776 -3561 2212 1901 -2575 -2793 19 1872 -2453 -3969
1683c969N417m72m427J918K002j658j251J368J934l480j46M253j508l740J560
$$ -3969 1448 976 -3451 -1533 469 -1189 -2440 -1072 862 -2618 -2764 1489 -19 -3759 -2199
1698b199M109j273m445K158M023j577l702J374M576l262k655L989K28k099J112
$$ -2199 1910 637 -3808 -1650 2373 796 -2906 -1532 3044 -218 -2873 1116 1344 -755 357
1713C57R32J66k477P50M007l176l057N005J228l290j792K569L504m356k572M832
$$ 357 1289 1455 -1022 -272 3735 559 -2498 2507 3735 445 -1347 1222 4726 370 -2202 2630
1729B630J80l152M41K103l7k067R9K231j824k583L777J125m500M43L855r19l549
$$ 2630 2810 -342 99 2202 2165 98 197 2428 604 -1979 1798 2923 -1577 -1134 2721 1802 -1747
1746a747o32L997M67n586J809M287k691j898O22J918p15l436L351J625m840J659
$$ -1747 -2379 1618 2085 -3501 -1692 2595 -96 -1994 -1372 546 -169 -3605 -254 1371 -3469 -1810
1762a810L297k478j787J143K408j084m297L103M268l888k285L393J495k760j720
$$ -1810 1487 -991 -2778 -1635 773 -311 -4608 -1505 2763 -1125 -3410 -17 1478 -1282 -3002
1777c002L346J370l366J48L543j279k557J918K072k296j484K220J896k579j743
$$ -3002 344 1714 -1652 -1504 2039 760 -1797 121 2193 -103 -1587 633 2529 -50 -1793
1792a793M346O70m672R52L563j549k267R68K969p83l450J733K457k766j482L083
$$ -1793 2553 3223 -1449 -497 3066 1517 -750 218 3187 2404 -1046 687 3144 378 -1104 1979
1808A979K96k591m5K861n04l283R76L210k225l515L478J866k857j098J294K338
$$ 1979 2275 -316 -361 2500 1996 -1287 -311 2899 674 -2841 637 2503 -354 -1452 -158 2180
1824B180k987l202N305J48m708K273J384l13j620n15K840j379l096L779O81l512
$$ 2180 -807 -4009 1296 1444 -3264 -991 393 80 -1540 -2055 785 -594 -3690 89 770 -2742
1840b742N13K288P86l425r15M774m08m602K062L689j878k574J457K074j088j957
$$ -2742 -2229 59 845 -2580 -3495 1279 871 -3731 -1669 2020 142 -2432 -975 1099 11 -1946
1856a946J921J982k988j04L381j462k086J455K134q67l597K362L865l731j963
$$ -1946 -25 1957 -1031 -1135 2246 784 -1302 153 2287 1420 -2177 185 4050 319 -1644
1871a644L257J597k211k472K628K169l441k6K781q14k225J004K184k687j173K837
$$ -1644 1613 3210 999 -1473 1155 3324 -117 -143 2638 1824 -401 603 2787 100 -1073 1764
1887A764M60k435j020K972J347m820m68M534q62l194J77K479L02l555J016K938
$$ 1764 2224 -211 -1231 1741 3088 -1732 -2200 2334 1472 -1722 -1545 934 1236 -2319 -1303 1635
1903A635k820o55J931l33j650rK185L71m063J183M527k763l689L064K324j640
$$ 1635 -1185 -1840 91 -242 -1892 -1901 284 655 -3408 -2225 2302 -461 -4150 -1086 1238 -402
1919d02k491J348L135k193k562L592M34k798J179J219m11j358N06L132k396k867
$$ -402 -2893 -1545 1590 -603 -3165 427 861 -1937 -758 461 50 -1308 -802 2330 -66 -2933
1935b933M443J140l918p4K880J403k841j811L589R30m096J107K731j043j632J214
$$ -2933 1510 2650 -1268 -1342 1538 2941 100 -1711 1878 2808 -1288 -181 2550 1507 -125 1089
1951A089J204j785j331K851L80l210L43L156o89l174N19L328r20l530J279K744
$$ 1089 2293 508 -823 2028 2408 -802 -459 2697 2008 -1166 -647 2681 1761 -1769 -490 2254
1967B254j361k771K131J737k539p75J815K94j907n11K609o25l197K073K378k741
$$ 2254 893 -1878 253 1990 -549 -1324 491 785 -1122 -1633 976 351 -2846 -773 1605 -1136
1983a136j946K638J648k220k279L300J548l811n37L080j73k003K74K048l32k463
$$ -1136 -3082 -444 1204 -1016 -3295 5 1553 -2258 -2795 285 112 -1891 -1617 431 99 -2364
1999b364J214K870k788j517L325K28k377J20K094J169l519K61L934j434l449K456
$$ -2364 -1150 1720 -1068 -2585 740 968 -1409 -1289 805 1974 -1545 -1284 2650 1216 -2233 223
2015B23K185j368k256J607K528k411j549K835L54k481N72J707j6k307O00K618
$$ 223 2408 1040 -1216 391 2919 508 -1041 1794 2148 -333 239 1946 1930 -377 223 2841
2031B841j554l178L336J424k989j170K991O79k742j183K962P24l590J17L003j386
$$ 2841 1287 -1891 1445 2869 -120 -1290 1701 2380 -362 -1545 1417 2141 -1449 -1332 1671 285
2047B85j763Q81J489j098j678J925J068l057m87L658q26l075J037K742j196k663
$$ 285 -1478 -597 892 -206 -1884 41 1109 -1948 -2435 1223 397 -2678 -1641 1101 -95 -2758
2063b758M58L604j160l701K496K260k503p14J629N35j354l25K077m20k462J973
$$ -2758 -2300 1304 144 -3557 -1061 1199 -1304 -2018 -389 146 -1208 -1533 544 124 -2338 -365
2079c65K367k121k057K582J689k173k511L025K448l403j263L708k09k161M04J411
$$ -365 2002 -119 -2176 406 2095 -78 -2589 436 2884 -519 -1782 1926 1717 -444 -40 1371
2095A371N31j961N68K291k440j078K829k4k722j06L337L39l952P8L512p77l004
$$ 1371 1902 -59 509 2800 360 -718 2111 2087 -635 -741 2596 2935 -1017 -939 2573 1796 -1208
2112a208P35K386k68k993J310J648j529j270J796K40k473P05K422j344k432J396
$$ -1208 -473 1913 1645 -1348 -38 1610 81 -1189 607 847 -1626 -921 1501 157 -2275 -879
2128h79K855k090l223K647K423k474k228K084K217k186j986K794K55j968K05J676
$$ -879 1976 -114 -3337 -690 1733 -741 -2969 -885 1332 -854 -2840 -46 209 -1759 -1554 122
2144A22o43j629J630J601k084j313K652J035k790j362L890Q99l707J99K916l01
$$ 122 -521 -2150 -520 1081 -1003 -2316 336 1371 -1419 -2781 1109 2008 -1699 -1500 1416 1115
2160A115k119L1K465l05k519K063J552k328l69K176j31j933m71L191k75l482J387
$$ 1115 -1004 -973 1492 1187 -1332 731 2283 -45 -414 1762 1631 -302 -773 2418 2143 -1339 48
2177D8L061k007k071J329K207j319k556K116J812k651q82K744n84k116O56J754
$$ 48 3109 1102 -969 360 2567 1248 -1308 808 2620 -31 -913 1831 1247 -869 -213 1541
2193A541j370j394J075K406k669j553K407J098k751r48K239P70k653m65L161n06
$$ 1541 171 -1223 -148 2258 -411 -1964 443 1541 -1210 -2158 81 851 -1802 -2267 894 388
2209C88k989J055K095j200j922J779J409j662j190J951Q32k476k7K794m31k891
$$ 388 -2601 -1546 549 -651 -2573 -794 615 -1047 -2237 -286 546 -1930 -1957 837 406 -2485
2225b485J388K443j026k674J905K174k024j899K518J328j929o89J789R36j988
$$ -2485 -1097 1346 320 -2354 -449 1725 -299 -2198 320 1648 -281 -970 819 1755 -233
2240b33o75K952q08k427J954J455j663j059J885J397k939j113L084P71l029j87
$$ -233 -908 2044 1236 -1191 763 2218 555 -504 1381 2778 -161 -1274 1810 2581 -448 -635
2256f35K803J37l062K85K670j210k091J714R63j615m23J267L15j913j74K176p
$$ -635 2168 2305 -757 -472 2198 988 -1103 611 1574 -41 -464 803 1118 -795 -969 1207 1200
2273A200l699J576L135k169k458J572K032j164k762J711K281k242q83J907k41
$$ 1200 -2499 -923 2212 43 -2415 -843 1189 25 -2737 -1026 1255 -987 -1870 37 -204
2288b04j219k11J834o71k074J758J957k497j252K816Q46k394j239K788J627k837
$$ -204 -1423 -1634 200 -471 -2545 -787 1170 -1327 -2579 237 1083 -1311 -2550 238 1865 -972
2304i72j073K993M38k779N90K027o32j281R92J358j781m16K190P9k823O69K762
$$ -972 -2045 948 1386 -1393 -803 1224 592 -689 303 1661 -120 -536 1654 1733 -1090 -421 2341
2321B341l42l083O45L174q11k979J073K397j355j510J199R09j334n16J494J03
$$ 2341 1999 -1084 -439 2735 1924 -1055 18 2415 1060 -450 749 1658 324 -192 1302 1405
2337A405k045L16K498j412k412J891J820k078j912K115K112k762j812K515J079
$$ 1405 -640 -324 2174 762 -1650 241 2061 -17 -1929 186 2298 -464 -2276 239 1318
2352A318k291n30J699K42j791o0J666n72k078K191Q84k369k94K044L02k022p42
$$ 1318 -973 -1503 196 438 -1353 -1413 253 -319 -2397 -206 678 -1691 -1985 59 361 -1661 -2403
2369b403L090J16l044O43K644o46k129M74K312o43k024J612J662k590m7K052k57
$$ -2403 687 803 -2241 -1598 1046 400 -1729 -1255 1057 414 -1610 2 1664 -926 -973 1079 822
2386H22j897Q29J864k37k587J055K620j695j993K093J596j960j260J573J402k064
$$ 822 -1075 -246 1618 1381 -1206 -151 2469 774 -1219 874 2470 510 -750 823 2225 161
2402A61r99K637j05k309P45J683p85j684J262J288j721j176K210O62k547l60K544
$$ 161 -838 1799 1694 -615 130 1813 1028 -656 606 1894 173 -1003 1207 1869 -678 -1038 1506
2419A506l79k461J43J961J59k659O51K357j699j556J828P88j560q27J489Q43k407
$$ 1506 1127 -1334 -1191 770 929 -1730 -1079 1278 -421 -1977 -149 639 -921 -1748 -259 584 -1823
2436a823K37K539j550j467P74K136j547j651J710J872j927j861K458J433k698
$$ -1823 -1586 953 -597 -2064 -1290 846 -701 -2352 -642 1230 -697 -2558 -100 1333 -1365
2451a365l9K047j54j217n6J778k91k318J823J521k283m26K179N34k029p83L118
$$ -1365 -1404 643 489 -728 -784 994 703 -1615 208 1729 -554 -980 1199 1733 -296 -1079 2039
2468B039Kl063O43K548r62j744K75K209l65k106J117J412j681l36J418j17j670
$$ 2039 2041 -1022 -379 2169 1207 -537 -262 1947 1582 -524 593 2005 324 -12 1406 1289 -381
2485c81K13K020j030k187J353K503k078k223K272J260j869j446J267J662j650
$$ -381 -168 1852 822 -1365 -12 2491 413 -1810 462 1722 -147 -1593 -326 1336 -314
2500c14j426K138J15k048R88Q02r45j032J385R01j803j300K720R63k982m56K777
$$ -314 -1740 398 513 -1535 -547 255 -690 -1722 -337 564 -1239 -2539 181 1144 -1838 -2294 483
2517D83m8k323R1K463l5k317N54J940j023q24R35O50j322j92J751M18k513M57
$$ 483 435 -1888 -1797 666 631 -1686 -1132 808 -215 -1039 -104 546 -776 -968 783 1201 -1312 -855
2535h55K885j049k713J575K083q50j991Q15K656j407k090J935Q74j689k53J335
$$ -855 2030 981 -1732 -157 1926 1076 -915 -100 2556 1149 -941 994 1868 179 -74 1261
2551A261k71j000P3K288j522k060K246J300k323j132J917J250j910j475K154Q56
$$ 1261 990 -10 63 2351 829 -1231 1015 2315 -8 -1140 777 2027 117 -1358 796 1652
2567A652k605k49J979j51j683P93R54r13j173J285Q73j879q13K458m7k391N50
$$ 1652 -953 -1202 777 626 -1057 -264 690 -223 -1396 -111 762 -1117 -1930 528 481 -1910 -1360
2584a360K167m89k575P24K339j213j834J549J152j048j244J554P87j240o89J862
$$ -1360 807 318 -2257 -1533 806 -407 -2241 -692 460 -588 -1832 -278 509 -731 -1420 442
2600D42n5k180R14K067j233j522J695J191j397j195J737J522k192p09J887Q22
$$ 442 387 -1793 -879 1188 -45 -1567 128 1319 -78 -1273 464 1986 -206 -915 972 1794
2616A794j951l09J952O8j997M91J714j263j362K117K88j486l73J791K70k147J73
$$ 1794 -157 -466 1486 1554 -443 48 1762 499 -863 1254 1542 56 -317 1474 1744 -403 -230
2633b30J887l73k286R09J625m94k155P61K186j910j401J936M01j478l26J248J25
$$ -230 1657 1284 -1002 -93 1532 1038 -1117 -356 1830 -80 -1481 455 856 -622 -948 300 425
2650D25j602M08J475j085j726J584J432j832j173K044Q73j786j130J719J199k370
$$ 425 -1177 -769 706 -379 -2105 -521 911 -921 -2094 -50 823 -963 -2093 -374 825 -1545
2666a545n20K357q8j384M34J097o68j119J164J015j751j94K123p8j826j9K256
$$ -1545 -2065 292 204 -1180 -746 351 -317 -1436 -272 743 -1008 -1202 921 843 -983 -1002 1254
2683A254l09k247M59K648l61l004J315J800j187q64R29J006p19r62J369K52j862
$$ 1254 945 -1302 -843 1805 1444 -1560 -245 1555 368 -496 433 1439 720 -242 1127 1379 -483
2700d83P60J553j148j504J237J753j668j962K289J586k515j067J893Q23j538p43
$$ -483 277 1830 682 -822 415 2168 500 -1462 827 2413 -102 -1169 724 1547 9 -734
2716g34J351J77j525L15J225r53j119J660O09j994n81K119K75k571j03K520J7
$$ -734 617 794 -731 -416 809 -144 -1263 397 1006 -988 -1569 550 825 -1746 -1849 671 688
2733F88k551L14J634K22k150M11K004j242q54J295J50j221L02J386m56j583J063
$$ 688 -1863 -1549 85 307 -1843 -1432 572 -670 -1524 -229 -79 -1300 -998 388 -68 -1651 -588
2750e88J773j064j917J361J811j458j852J901J621j276j165J329J122j574l93
$$ -588 1185 121 -1796 -435 1376 -82 -1934 -33 1588 312 -853 476 1598 24 -369
2765c69J552l29r50P77Q00r31r45J347Q65j783r74K314P22k509k24K253k55j647
$$ -369 1183 854 -96 681 1481 550 -395 952 1817 34 -940 1374 2096 -413 -637 1616 1361 -286
2783b86l52K039l43j726P37J275j191r13J295L08j505q8J851m15k026M45K318
$$ -286 -638 1401 1058 -668 69 1344 153 -760 535 843 -662 -750 1101 686 -1340 -895 1423
2800A423j563j484J173R81p67j826J401J790k345o35J773mj039l98J623p9j677
$$ 1423 -140 -1624 -451 530 -237 -2063 -662 1128 -1217 -1852 -79 -83 -1122 -1520 103 24 -1653
2817a653Q26J635j744p43J500R27j408q49J734Q68k023l90K216l61j411M24J471
$$ -1653 -827 808 -936 -1679 -179 748 -660 -1509 225 1093 -930 -1320 896 535 -876 -452 1019
2834A019n07j707Q15J484q06j102J193J230j788j61J678k47j412K09K096p75k009
$$ 1019 512 -1195 -380 1104 298 -804 389 1619 -169 -330 1348 1101 -311 -102 1994 1219 -790
2851g90J260J385j106j402J139J265j331j321J611N97j546j70J491n60j098L33
$$ -790 470 1855 749 -653 486 1751 420 -901 710 1307 -239 -409 1082 522 -576 -243
2867b43J254r90r47J286O97j425j265K190N17k294j59J618M94k190k42K225m88
$$ -243 1011 21 -926 360 1057 -368 -1633 557 1074 -1220 -1379 239 733 -1457 -1699 526 38
2884C8j471P96R99j007j76K06P65j111m58J805l74j622O67K165j041k003P88K169
$$ 38 -1433 -637 362 -645 -821 -615 150 -961 -1419 386 12 -1610 -943 1222 181 -1822 -1034 1135
2902A135q30j916J498J360j274q61J198P03j127l50J229p4j419J023J657j912
$$ 1135 305 -1611 -113 1247 -27 -888 310 1013 -114 -464 765 691 -728 295 1952 40
2918D0r59K116N69j477j054J705J327k432p52K053O09j930j44J527l12j151L90
$$ 40 -919 1197 1766 289 -765 940 2267 -165 -917 1136 1745 -185 -329 1198 886 -265 125
2935A25Q37q27k84R94M57k112r6K048n6k550O30J777j28k496M99K044r0j870L33
$$ 125 962 135 -149 845 1302 -810 -906 1142 1086 -1464 -834 943 815 -1681 -1182 862 772 -1098 -765
2954g65J221j014n16L65J110j404l19J595m13j625J153J117j081j250J287J643
$$ -765 456 -558 -1074 -709 401 -1003 -1322 273 -140 -1765 -612 505 -576 -1826 -539 1104
2970A104j753j293J940J168j571o96R50R29j113m59J614m26j457J229J005j767
$$ 1104 -649 -1942 -2 1166 -405 -1101 -151 778 -335 -794 820 394 -1063 166 1171 -596
2986e96j27J334N97j141r40K010N27k327M07K019p33j235N4J535k03j520P93R49
$$ -596 -723 611 1208 67 -873 1137 1664 -663 -256 1763 1030 -205 -151 1384 1181 -339 454 1403
3004A403j085k30R42K8r20n80J362j27j597O84J576j019j580J365J128j509j226
$$ 1403 318 88 1030 1058 138 -442 920 793 -804 -120 1456 437 -1143 222 1350 -159 -1385
3021a385J407P82j256j044J634O18j470j79J085Rj113L2J328p77j408J572P42
$$ -1385 22 804 -452 -1496 138 756 -714 -893 192 201 -912 -880 448 -329 -1737 -165 577
3038E77j934k51J812j06j239m55K037J70k040L59J915r08j341J109J080q24r55
$$ 577 -1357 -1608 204 98 -1141 -1596 441 611 -1429 -1070 845 -63 -1404 -295 785 -39 -994
3055i94J111Q11j553l6J636m38j230Q07J005m27j383J263J369j522j399J679R86
$$ -994 117 928 -625 -661 975 537 -693 114 1119 692 -691 572 1941 419 -980 699 1685
3072A685j518o05J244P46j402m58J607k68j170L48J162q92j036J297K65j142n11
$$ 1685 167 -438 806 1552 150 -308 1299 1031 -139 209 1371 479 -557 740 1005 -137 -648
3089f48J515J97k161K86J702k84j493L9J639k85j694M01J259r43n35O90L03j191
$$ -648 867 1064 -1097 -811 891 607 -886 -847 792 507 -1187 -786 473 -470 -1005 -315 -12 -1203
3107a203L61J216l35j482P88J299j063j092Q89J359r83j554J468J166j125j073
$$ -1203 -842 374 39 -1443 -655 644 -419 -1511 -622 737 -246 -1800 -332 834 -291 -1364
3123a364J229N15j025N2R58l12p78Q30R40j323n42J554P94j966m98J733O51j941
$$ -1364 -135 380 -645 -593 365 53 -725 105 1045 -278 -820 734 1528 -438 -936 797 1448 -493
3141d93l19J763O41j700K69J053k99j082N59Q16n83o32N05N42j341J28K097j076
$$ -493 -812 951 1592 -108 161 1214 915 -167 392 1208 625 -7 498 1040 -301 -173 1924 848
3159H48j689O61J927r47j558M59J654p04j881J170J063j248m89R71k3q19k1J271
$$ 848 -841 -180 1747 800 -758 -299 1355 651 -1230 -60 1003 -245 -734 237 214 -605 -626 645
3177F45n69j354J027Q88j067j295J284J383j445j280J756M62j481m86J597P3r45
$$ 645 76 -1278 -251 637 -430 -1725 -441 942 -503 -1783 -27 435 -1046 -1532 65 138 -807
3194h07m1Q52k90p34O41R51j094n78J588J82j237k6J369l7j145j17J639k98j271
$$ -807 -848 4 -286 -1020 -379 572 -522 -1100 488 670 -567 -593 776 739 -406 -523 1116 818 -453
3213d53P73J109r03q77N68J201r56o91J127M27j615M58J137n20j213N00J123p17
$$ -453 320 1429 526 -351 217 1418 462 -229 898 1325 -290 168 1305 785 -428 72 1195 478
3231D78r95J126R23j634o52J546O77j511p97J445K14j475K00J099n94q53M86R74
$$ 478 -517 609 1532 -102 -754 792 1469 -42 -839 606 820 -655 -455 644 50 -803 -317 657
3249F57q29p22Q53P88j793k42J718Oj681M20J425o84j409O29J642r75j217Q77
$$ 657 -172 -894 -41 747 -1046 -1288 430 436 -1245 -825 600 -84 -1493 -864 778 -197 -1414 -537
3267e37Q78j079l25R05M46r57k62J692q03j224J235R38j014j015J449O58j236
$$ -537 341 -738 -1063 -158 288 -669 -931 761 -42 -1266 -31 907 -107 -1122 327 985 -251
3284b51o45J320R42j355r38J588N37j611K77J178k90p56L77O01p49k08J076K31
$$ -251 -896 424 1366 11 -927 661 1198 -413 -136 1042 752 -4 373 974 225 17 1093 1324
3302A324j405j75J543o0j673J9J702j43j843J48J773n75j400O14J017o73o69P30
$$ 1324 -81 -256 1287 1227 -446 -427 1275 1132 -711 -563 1210 635 -765 -151 866 193 -476 254
3320B54L8r96Q4J150m28j182P00Q97p45j649J757R77j401r90J299Q75j197o42
$$ 254 292 -704 -620 530 102 -1080 -380 517 -228 -1877 -120 857 -544 -1534 -235 640 -557 -1199
3338a199Q93N96j218J57R89n20q02Q44P34j178o48J602M85j438l34J620M05j545
$$ -1199 -306 290 -928 -771 218 -302 -1104 -260 474 -704 -1352 250 735 -703 -1037 583 988 -557
3356e57k44J341L08j454J59J302j27j186N79P23p82K64N25N9j170Q5J574l98j551
$$ -557 -801 540 848 -606 -447 855 728 -458 121 844 62 326 851 910 -260 -175 1399 1001 -550
3375e50N87J814j086j707J176J008q78j095R64Q90j285m00J090J82j091K96R44
$$ -550 37 1851 765 -942 234 1242 364 -731 233 1123 -162 -562 528 710 -381 -85 859
3392H59o85r82P47J180j403r28J474K93j246m88J401L96j464l48J474Pj268K4
$$ 859 174 -808 -61 1119 -284 -1212 262 555 -691 -1179 222 618 -846 -1194 280 287 -981 -957
3410i57J258o18q92P15P61o70p21J158L41j512O1J305j68j137M34J131k04j633
$$ -957 301 -317 -1209 -494 267 -403 -1124 34 375 -1137 -1076 229 61 -1076 -642 489 285 -1348
3428a348P11J459r26q13J335M50q70k95Q53N6r32K20J172k76j398R23O91q66k29
$$ -1348 -637 822 -104 -917 418 868 -2 -297 556 612 -320 -100 1072 796 -602 321 1012 146 -83
3447h3P05P64j251o76J517L84j340l37J525k40j301L07R68j51j274O21O83p34
$$ -83 622 1386 135 -541 976 1360 20 -317 1208 968 -333 -26 942 791 -483 138 821 87
3465H7o74J129q5j130K26J321n14j421L73J312o74j052M81J373n69j511Q82J024
$$ 87 -587 542 457 -673 -447 874 360 -1061 -688 624 -50 -1102 -621 752 183 -1328 -446 578
3483E78j166o10Q92L62n86j47Q15k11j210Q30Q34q56q55R81J211j503o10J408
$$ 578 -588 -1198 -306 56 -530 -677 138 -73 -1283 -453 381 -475 -1330 -349 862 -641 -1251 157
3501A57N99j340l04J130K99j142j9J114k0p34O0Q47p18k3Q15M56j552K5J431m5
$$ 157 756 -584 -888 242 541 -601 -620 494 474 -260 -200 647 -71 -94 721 1177 -375 -350 1081 1036
3521A036j492K69J429l87j333O53J259o36j364J040N51o61n88Q18K36j069K57
$$ 1036 -456 -187 1242 855 -478 175 1434 798 -566 474 1025 364 -224 594 830 -239 18
3538A8P48l81j208Q68P86p37j086J194Q00j130j257J574O50j276m39R00K0p81
$$ 18 766 385 -823 45 831 94 -992 202 1002 -128 -1385 189 839 -437 -876 24 44 -737
3556g37J88L94P1q19L40J040j117n01J126O04j693J91J294j53j458N03J009L0
$$ -737 -549 -155 -84 -903 -563 477 -640 -1141 -15 589 -1104 -913 381 228 -1230 -727 282 312
3574C12j494M27J322m98o32M99P65p42m54J034J21j223L68J250o30q81N61J220
$$ 312 -1182 -755 567 69 -563 -64 701 -41 -495 539 660 -563 -195 1055 425 -456 105 1325
3592A325r59j286J499J111j387l54M53P74j278l41J151L3n84K55O91o80n71M59
$$ 1325 366 -920 579 1690 303 -51 402 1176 -102 -443 708 741 157 412 1103 423 -148 311
3610C11O17l28q77M16J018j386m39J386l5j321J52J204j78j408K64J108n83p63
$$ 311 928 600 -277 139 1157 -229 -668 718 683 -638 -486 718 540 -868 -604 504 -79 -842
3628h42P02R3k12p26R01K12j033J98J108m81j212P94J321r35j170Q10P93m52r11
$$ -842 -140 -47 -259 -985 -84 128 -905 -707 401 -80 -1292 -498 823 -112 -1282 -472 321 -131 -1042
3647a042J036M40q69l09J154J65j142J26J223o80p50Q16R34j509l25R60Q31j471
$$ -1042 -6 434 -435 -744 410 575 -567 -441 782 102 -648 168 1102 -407 -732 228 1059 -412
3665d12l39J905m11j067P2R49K07r01j28J312n73o64L44N60o43k87P43M5q13J25
$$ -412 -751 1154 743 -324 -252 697 904 3 -125 1187 614 -50 294 854 211 -76 667 712 -101 24
3685B4Q33k94j088L48J176p82j271J116M98q11o04P77R31q15p54O71P2o72m7R52
$$ 24 857 563 -525 -177 999 217 -1054 62 560 -251 -855 -78 853 38 -716 -45 27 -645 -692 260
3705B60n86m69L78N85q71n31J409L73j642j67J319J59j178o95J772qj174J4J794
$$ 260 -326 -795 -417 168 -703 -1234 175 548 -1094 -1261 58 217 -961 -1656 116 108 -1066 -1052 742
3724G42o79o98O20Q5m77J6P57N4j071L59J053q0j345O43J362r83j140J011M54
$$ 742 63 -635 -15 70 -407 -391 366 420 -651 -292 761 681 -664 -21 1341 358 -782 229 683
3743F83l35p90J354R3q47j43N39M60j001L26P56q08q60J385L19j382m79J350P03
$$ 683 348 -442 912 1005 158 15 554 1014 13 339 1095 287 -573 812 1131 -251 -730 620 1323
3762A323j736k53P41P78j276k64Q48N83j341lQ83l01n86M72L04j044J45J288o76
$$ 1323 -413 -666 75 853 -423 -687 161 744 -597 -600 283 -18 -604 -132 172 -872 -727 561 -115
3781a15n56j47O81L20j210J19J475n16j134L23J069n05q20P84N70o13k93R81n98
$$ -115 -671 -818 -137 183 -1027 -908 567 51 -1083 -760 309 -196 -1016 -232 338 -275 -568 413 -185
3800a85m33M95P66n39q93O18J063q51r34R66R55j006m77O14Q45r03j60Q63K6j119
$$ -185 -618 -123 643 104 -789 -171 892 41 -893 73 1028 22 -455 159 1004 101 -59 804 830 -289
3820b89K35P81j5n34K68O02j033k74J097J86j014j47Q59r8j097L65J020m05j064
$$ -289 -54 727 712 178 446 1048 15 -259 838 1024 10 -137 722 624 -473 -108 912 507 -557
3839e57N32Q21p53p52R42J20q22l7R17m28q93N95O21l79q20O31P47p22j107Q90
$$ -557 -25 796 43 -709 233 353 -469 -506 411 -17 -910 -315 306 -73 -893 -262 485 -237 -1344 -454
3859d54J131j229m78J064K06r25N2P88k20n92K44M26k58o84P12L62k23p61J031
$$ -454 677 -552 -1030 34 240 -685 -633 155 -65 -657 -413 13 -245 -929 -217 145 -78 -839 192
3878A92op59j6J342L8j635M23J029q2o69K6J117o03o98O72O58q97l41Q09k9q42
$$ 192 186 -573 -589 753 791 -844 -421 608 526 -143 -117 1000 397 -301 371 1029 132 -209 600 571 -271
3899b71K27R83o78m84L01J233q42r31Q66Q12j031o95Q25K91n67m87Q03o4n36k0
$$ -271 -44 939 261 -223 78 1311 469 -462 404 1216 185 -510 315 606 39 -448 355 291 -245 -265
3919b65O09l10p69P07N92j051k99P92N06j165k38J151j27j117J37J294k70j143
$$ -265 344 34 -735 -28 564 -487 -786 6 512 -653 -891 260 133 -984 -847 447 177 -966
3937i66J26P10q8p39L68P18p89J59O17j67p92L66Q70k56j128Q56R07q95p26N86
$$ -966 -840 -130 -218 -957 -589 129 -660 -501 116 -51 -843 -477 393 137 -991 -135 772 -123 -849 -263
3957b63J145p43p61N65J104j156P9O88j51o43M36M08m24n86P83O88j230m90J183
$$ -263 882 139 -622 -57 1047 -109 -30 658 507 -136 300 708 284 -302 481 1169 -61 -551 632
3976F32M98j249k92J012O50j426JP93n4o06n1N60m45m57P89K44q39j7N74J64j082
$$ 632 1130 -119 -411 601 1251 -175 -174 619 565 -41 -92 468 23 -434 355 599 -240 -257 317 481 -601
3997f01J17J138l35j163M79J062o72j163Q38Q58r76o22N71O86o16m08Q13J37j000
$$ -601 -484 654 319 -844 -365 697 25 -1138 -300 558 -418 -1040 -469 217 -399 -807 6 143 -857
4016h57N27P56n95p39M44R68j083m11J069K76o23n57Q75N98j096O8J046m69o39
$$ -857 -330 426 -169 -908 -464 504 -579 -990 79 355 -268 -825 50 648 -448 -380 666 197 -442
4035d42L11O46m85j07N17K65o93l2Q62n23n96K79P35k01p33L50Q84p33m98L62
$$ -442 -131 515 30 -77 440 705 12 -20 842 319 -277 2 737 536 -197 153 1037 304 -194 168
4055A68Q68q03k41K30M75q56l9Q51j55q02L46N98p76k89N03N38o87o12J015L5
$$ 168 1036 233 -8 222 697 -159 -198 653 498 -304 42 640 -136 -425 78 616 -71 -683 332 367
4075C67o27m54Q92K42j133l80J299p0r62O49M47o46n08O57L00m12j90N91P7r67
$$ 367 -260 -714 178 420 -713 -1093 206 136 -826 -177 270 -376 -884 -227 73 -339 -529 62 139 -828
4095h28K6J041M9j241N58R83m50r98N33J120q07q11P64P16o76j97M45J13m79J00
$$ -828 -802 239 288 -953 -395 588 138 -860 -327 793 -14 -825 -61 655 -21 -218 227 340 -139 -39
4115c9P74m23q37Q00Q56q69o84R79L18q61n67R94N20j058O3P48o6p22N7P41m05
$$ -39 735 312 -525 275 1131 262 -422 557 875 14 -553 441 961 -97 -34 714 648 -74 -17 724 319
4136C19o27N22N71j145j99J198n0j135K09P12q4j019K86Q26m21p08L40P52m55
$$ 319 -308 214 785 -360 -559 639 589 -546 -337 375 291 -728 -442 384 -37 -745 -405 347 -108
4155a08n16M22J07o52K10N33M8r66Q38M14p43m81O53Q18p40q89R30P16r50p76
$$ -108 -624 -202 -95 -747 -537 -4 44 -922 -84 330 -413 -894 -241 577 -163 -1052 -122 594 -356 -1132
4175a132J053N47p28k60J002m43m04M39K77m39l60P54M14r98j16J158J77j233
$$ -1132 -79 468 -260 -520 482 39 -365 74 351 -88 -448 306 720 -278 -394 764 941 -292
4193b92J47J128k40j022P6R23l29n92P0P57j46p31O41L57q86M8P69k83q80N56
$$ -292 -145 983 743 -279 -203 720 391 -201 -131 626 480 -251 390 747 -139 -91 678 395 -485 71
4213G1Q34n68r85O78P69p65o52O08M69o67n34N95N62r33Q4N93k0p82J58O76m16
$$ 71 905 337 -648 30 799 34 -618 -10 459 -208 -742 -147 415 -518 -434 159 139 -643 -485 191 -225
4234b25n74O09M59j006N4Q26K59j298p9J268j97r09J49J025k26p49M94L42k37
$$ -225 -799 -190 269 -737 -683 143 402 -896 -975 293 96 -813 -664 361 135 -614 -120 222 -15
4253a5n10M39M43n43l22J121p7j035M71Q36m57p04J81J050o62o78O14O22m77l91
$$ -15 -525 -86 357 -186 -508 613 536 -499 -28 808 351 -353 -172 878 216 -462 152 774 297 -94
4273i4Q35L10j028j10N29J00o23K79O49p44j30L07K51o68l29R96K15j192j0R03
$$ -94 741 1051 23 -87 442 542 -81 198 847 103 -27 280 531 -137 -466 530 745 -447 -457 446
4293D46l5r04l7Q99l51o33K21N80j58o46O01k00j02m28P83j26p04M66M28k82q61
$$ 446 411 -493 -530 369 18 -615 -394 186 28 -618 -17 -217 -319 -747 36 -90 -794 -328 100 -182 -1043
4314a043P33P75q20o53Q62Q21o58q61P65K06m71j21O10p8m40L29N74m56n10P54
$$ -1043 -310 465 -355 -1008 -146 675 17 -844 -79 127 -344 -465 145 67 -373 -44 530 74 -436 318
4334C18N4o99K7O80M40j020k15R20L33r67Q7N57R8p66O15J19l91k3L41J27p74
$$ 318 372 -327 -300 380 820 -200 -415 505 838 -129 -42 515 613 -153 462 581 190 167 508 635 -139
4355a39J9P87J3j016J64R71k82j137N27R84m64r57M59K37j79m26L39K81l15m21
$$ -139 -120 667 680 -336 -172 799 517 -620 -93 891 427 -530 -71 166 -13 -439 -100 181 -134 -555
4375e55O05j61n35M35L76k73p82Q39N50j179k25O74N78p87n23R80J08n69l63Q35
$$ -555 50 -111 -646 -211 165 -108 -890 -51 499 -680 -905 -231 347 -440 -963 17 125 -444 -807 28
4395B8o7l51j02O29n33l72Q35J82q24L54N41K19j051J30J106k91j080O36Q43p12
$$ 28 -39 -390 -492 137 -396 -768 67 249 -575 -221 320 539 -512 -382 724 433 -647 -11 832 120
4415A20n79O03N28l30l10M04M58r33m8R51l81o83J95P30m63o16M09R32q00o23
$$ 120 -459 144 672 342 32 436 894 -39 -87 864 483 -200 -5 725 262 -354 55 987 187 -436
4435d36Q38J66n13m69N05L75o89J1N50j41p19K99M16l12o31O12K18p02m2L46M16
$$ -436 402 568 55 -414 91 466 -223 -212 338 197 -522 -223 193 -119 -750 -138 80 -622 -664 -318 98
4456I8o64j11J053m58o23j1P34k1o51L85M73n78m36O80M02p52j1O55j36n75J93
$$ 98 -566 -677 376 -82 -705 -716 18 -3 -654 -269 204 -374 -810 -130 272 -480 -491 164 28 -547 -354
4477c54Q08n94m20L65J156q90m37L60P07p64r2N29K54o01n6N61Jp24J64P91q57
$$ -354 454 -140 -560 -195 961 71 -366 -6 701 -63 -155 374 628 27 -29 532 533 -191 -27 764 -93
4498i3j06N17K02n79J7M29L95j051m3J089j88q83MO25M2q61M74M89k41p14M64
$$ -93 -199 318 520 -59 -42 387 782 -269 -312 777 589 -294 -290 335 377 -484 -10 479 238 -476 -12
4519a2M86o90p7P72m77p24M41P12o34o53O08O06p35n16P90M40o22m78O58K89p33
$$ -12 474 -216 -293 479 2 -722 -281 431 -203 -856 -248 358 -377 -893 -103 337 -285 -763 -105 184 -549
4540e49L50J49k09j21J99K88l87n22R41R4p78j43Q67K67j087L05P03P7q50P1R90
$$ -549 -199 -50 -259 -380 -181 107 -280 -802 139 233 -545 -688 179 446 -641 -336 367 444 -406 -335 655
4561F55j32p90L71K99l24l04Q14j07p96L72O74k57p03L60N68m55m68M7J007n62
$$ 655 523 -267 104 403 79 -225 589 482 -314 58 732 475 -228 132 700 245 -223 -176 831 269
4581B69n21L60O64k60o63P58j45r06O17n6j37j85k40J357r20p29Q54K79n37p12
$$ 269 -252 108 772 512 -151 607 462 -444 173 117 -20 -205 -445 912 -8 -737 117 396 -141 -853
4601h53R14M93j264J11O95K75j001O0O96m40l92OJ071q83L9N02L08q29j62Q01
$$ -853 61 554 -710 -599 96 371 -630 -570 126 -314 -706 -700 371 -512 -473 29 337 -492 -654 147
4621A47k57n28J41P55p4n63O2M35J45n53P28j81k07j5l9N74r24M92L28J6p70O01
$$ 147 -110 -638 -497 258 184 -379 -317 118 263 -290 438 257 50 35 -4 570 -354 138 466 482 -288 313
4643C13K70l00n13N56O92q95n15P36N47j003j81Q64M9o31J27K19J84o39J42O00
$$ 313 583 283 -230 326 1018 123 -392 344 891 -112 -293 571 620 -11 116 335 519 -120 22 622
4663F22p34j98L47O94j013P3N46kq97K30R15o99p68N64N89j53o56q7Q83n61k60
$$ 622 -112 -310 37 731 -282 -209 337 335 -562 -332 583 -116 -884 -320 269 116 -540 -627 256 -305 -565
4684e65L32K53k82m06O63j37o22P57J52l75n18M34O95o48m91Q72L18p39j12M47
$$ -565 -233 20 -262 -668 -5 -142 -764 -7 145 -230 -748 -314 381 -267 -758 114 432 -307 -419 28
4704B8M06q63J68P01l02m78J99N48l90j29K98N18p60j51Q50K33j165K27Q52j62
$$ 28 434 -429 -261 440 138 -340 -141 407 17 -112 186 704 -56 -207 643 876 -289 -62 790 628
4724F28q19%Q67k53p63L96N50l31m33L55K45n89M0M97m15j67J82M85m20o76R64
$$ 628 -191 -191 676 423 -340 56 606 275 -158 197 442 -147 -107 390 -25 -192 -10 475 55 -621 343
4745C43O7p03n05P56O40j099l40P71L30m45l23P62j92m42J54J22k63PL46M84j016
$$ 343 410 -293 -798 -42 598 -501 -841 -70 260 -185 -508 254 62 -380 -226 -104 -367 -360 -14 470 -546
4766e46l87R91J35q98k08J177q9q24L8Q31L0r15O41L95o11J88PK13n65L22M63
$$ -546 -933 58 193 -705 -913 264 175 -649 -611 220 250 -665 -24 371 -240 -52 -45 168 -397 -75 388
4787C88j84o03L77J001q30o25O12Q61j009k96O66J68j49n68N49J19m53K4K74n9
$$ 388 204 -399 -22 979 149 -476 136 997 -12 -308 358 526 377 -191 358 477 24 48 322 263
4807B63j95R9M87m96m34L86O54o52m35O06K79r17p6O60k22l52k07R82l54n31J79
$$ 263 68 167 654 158 -276 110 764 112 -323 283 562 -355 -431 229 7 -345 -552 430 76 -455 -276
4828b76M89n85r5J92L83n53j76Q44J28j242M07R86o44m17M23K91j76o74O48L52
$$ -276 213 -372 -467 -275 108 -445 -621 223 351 -891 -484 502 -142 -559 -136 155 -21 -695 -47 305
4848C05n17j60N41j05l21K81N00k67m17K00N75o46m82P35L88o89l54R44m2n95
$$ 305 -212 -372 169 64 -257 24 524 257 -160 40 615 -31 -513 222 610 -79 -433 511 469 -126
4868a26J54P56o2o30r5P12m49l71M54J86l49k52M46k68o2k98P49l36l74J77M71
$$ -126 28 784 722 92 -3 709 260 -111 343 529 180 -72 374 106 44 -254 495 159 -215 -38 433
$$ [...]
8191a0
##END NTUPLES=NMR FID
##END=
