##TITLE=1H_SAV-32-singlet-bat2
 CDCl3, 8 sc, 
 30.10.2020
##JCAMPDX= 6.0         $$ Bruker NMR JCAMP-DX V2.0
##DATA TYPE= NMR FID
##DATA CLASS= NTUPLES
##ORIGIN= UXNMR, Bruker Analytische Messtechnik GmbH
##OWNER= root
$$ XWIN-NMR		Version 3.5
$$ Fri Oct 30 10:27:03 2020 Russian Standard Time (UT+4h)  she@DPX200
##.OBSERVE FREQUENCY= 200.1315066352
##.OBSERVE NUCLEUS= ^1H
##.DELAY= (6, 6)
##.ACQUISITION MODE= SIMULTANEOUS
##.ACQUISITION SCHEME= undefined
##.AVERAGES= 8
##.DIGITISER RES= 18
##SPECTROMETER/DATA SYSTEM= spect
##.PULSE SEQUENCE= zg30
##.SOLVENT NAME= CDCl3
##.SHIFT REFERENCE= (INTERNAL, CDCl3, 0, 15.7039)
##AUDIT TRAIL= $$ (NUMBER, WHEN, WHO, WHERE, WHAT)
$$ ##TITLE= Audit trail, XWIN-NMR		Version 3.5
$$ ##JCAMPDX= 5.01
$$ ##ORIGIN= Bruker BioSpin GmbH
$$ ##OWNER= she
$$ F:/spectra/data/she/nmr/H-F/1/audita.txt
$$ ##AUDIT TRAIL=  $$ (NUMBER, WHEN, WHO, WHERE, WHAT)
(   1,<2020-10-30 10:26:02.48 +0400>,<she>,<DPX200>,
      <created by zg, POWCHK disabled, PULCHK disabled
       configuration hash MD5:
       00 E9 B6 7A A2 85 ED C7 34 08 36 98 17 FE 4E 26
       data hash MD5: 16K
       D2 4B FA 9B 25 8C 70 09 F5 E0 E7 70 94 C8 A5 50>)
$$ ##END=
$$ 
$$ hash MD5
$$ D2 F7 79 7A 85 4E A1 52 9F 8C E4 91 54 ED 6D 6C
##$RELAX= 
##$RELAX= 
##$RELAX= 
##$RELAX= 
##$RELAX= 
##$RELAX= 
$$ Bruker specific parameters
$$ --------------------------
##$DU= <F:/spectra>
##$EXPNO= 1
##$NAME= <H-F>
##$PROCNO= 1
##$TYPE= <nmr>
##$USER= <she>
##$AMP= (0..31)
100 100 100 100 100 100 100 100 100 100 100 100 100 100 100 100 100 100 
100 100 100 100 100 100 100 100 100 100 100 100 100 100 
##$AQSEQ= 0
##$AQ_mod= 1
##$AUNM= <au_zg>
##$AUTOPOS= <>
##$BF1= 200.13
##$BF2= 200.13
##$BF3= 200.13
##$BF4= 200.13
##$BF5= 200.13
##$BF6= 200.13
##$BF7= 200.13
##$BF8= 200.13
##$BYTORDA= 1
##$CFDGTYP= 0
##$CFRGTYP= 5
##$CHEMSTR= <none>
##$CNST= (0..31)
1 1 145 1 1 1 1 1 1 1 1 1 1 1 1 1 1 1 1 1 1 1 1 1 1 1 1 1 1 1 1 1 
##$CPDPRG= <>
##$CPDPRG1= <>
##$CPDPRG2= <>
##$CPDPRG3= <>
##$CPDPRG4= <mlev>
##$CPDPRG5= <mlev>
##$CPDPRG6= <mlev>
##$CPDPRG7= <mlev>
##$CPDPRG8= <mlev>
##$CPDPRGB= <>
##$CPDPRGT= <>
##$D= (0..31)
0 1.2 0 0 0 0 0 0 0 0.06 0 0.03 0 0 0 0 0.0002 0 0 0 0 0 0 0 0 0 0 0 0 
0 0 0 
##$DATE= 1604039161
##$DBL= (0..7)
120 120 120 120 120 120 120 120 
##$DBP= (0..7)
150 150 150 150 150 150 150 150 
##$DBP07= 0
##$DBPNAM0= <>
##$DBPNAM1= <>
##$DBPNAM2= <>
##$DBPNAM3= <>
##$DBPNAM4= <>
##$DBPNAM5= <>
##$DBPNAM6= <>
##$DBPNAM7= <>
##$DBPOAL= (0..7)
0.5 0.5 0.5 0.5 0.5 0.5 0.5 0.5 
##$DBPOFFS= (0..7)
0 0 0 0 0 0 0 0 
##$DE= 6
##$DECBNUC= <off>
##$DECIM= 32
##$DECNUC= <off>
##$DECSTAT= 4
##$DIGMOD= 1
##$DIGTYP= 9
##$DL= (0..7)
0 120 120 120 120 120 120 120 
##$DP= (0..7)
150 150 150 150 150 150 150 150 
##$DP07= 0
##$DPNAME0= <>
##$DPNAME1= <>
##$DPNAME2= <>
##$DPNAME3= <>
##$DPNAME4= <>
##$DPNAME5= <>
##$DPNAME6= <>
##$DPNAME7= <>
##$DPOAL= (0..7)
0.5 0.5 0.5 0.5 0.5 0.5 0.5 0.5 
##$DPOFFS= (0..7)
0 0 0 0 0 0 0 0 
##$DQDMODE= 0
##$DR= 18
##$DS= 0
$$ [...]
##$SUBNAM2= <"">
##$SUBNAM3= <"">
##$SUBNAM4= <"">
##$SUBNAM5= <"">
##$SUBNAM6= <"">
##$SUBNAM7= <"">
##$SUBNAM8= <"">
##$SUBNAM9= <"">
##$SW= 16.880792210976
##$SWIBOX= (0..15)
0 0 2 0 0 0 0 0 0 0 0 0 0 0 0 0 
##$SW_h= 3378.37837837838
##$TD= 16384
##$TD0= 1
##$TE= 0
##$TE2= 300
##$TE3= 300
##$TEG= 300
##$TL= (0..7)
0 120 120 120 120 120 120 120 
##$TP= (0..7)
150 150 150 150 150 150 150 150 
##$TP07= 0
##$TPNAME0= <>
##$TPNAME1= <>
##$TPNAME2= <>
##$TPNAME3= <>
##$TPNAME4= <>
##$TPNAME5= <>
##$TPNAME6= <>
##$TPNAME7= <>
##$TPOAL= (0..7)
0.5 0.5 0.5 0.5 0.5 0.5 0.5 0.5 
##$TPOFFS= (0..7)
0 0 0 0 0 0 0 0 
##$TUNHIN= 0
##$TUNHOUT= 0
##$TUNXOUT= 0
##$USERA1= <user>
##$USERA2= <user>
##$USERA3= <user>
##$USERA4= <user>
##$USERA5= <user>
##$V9= 5
##$VALIST= <valist>
##$VCLIST= <CCCCCCCCCCCCCCC>
##$VD= 0
##$VDLIST= <DDDDDDDDDDDDDDD>
##$VPLIST= <PPPPPPPPPPPPPPP>
##$VTLIST= <TTTTTTTTTTTTTTT>
##$WBST= 1024
##$WBSW= 4
##$XGAIN= (0..3)
0 0 0 0 
##$XL= 0
##$YL= 0
##$YMAX_a= 391377
##$YMIN_a= -359072
##$ZGOPTNS= <>
##$ZL1= 120
##$ZL2= 120
##$ZL3= 120
##$ZL4= 120
##$ABSF1= 10
##$ABSF2= 0
##$ABSG= 5
##$ABSL= 3
##$ALPHA= 0
##$AQORDER= 0
##$ASSFAC= 0
##$ASSFACI= 0
##$ASSFACX= 0
##$ASSWID= 0
##$AUNMP= <proc_1d>
##$AZFE= 0.1
##$AZFW= 0.1
##$BCFW= 1
##$BC_mod= 2
##$BYTORDP= 1
##$COROFFS= 0
##$CY= 11.3945322036743
##$DATMOD= 1
##$DC= 2
##$DFILT= <>
##$DTYPP= 0
##$F1P= 15.9154993809931
##$F2P= -4.1035820241983
##$FCOR= 0.5
##$FTSIZE= 0
##$FT_mod= 4
##$GAMMA= 1
##$GB= 0.15
##$INTBC= 1
##$INTSCL= 1
##$ISEN= 128
##$LB= 0.24
##$LEV0= 0
##$LPBIN= 0
##$MAXI= 10000
##$MC2= 0
##$MEAN= 0
##$ME_mod= 0
##$MI= 1.114404
##$NCOEF= 0
##$NC_proc= 0
##$NLEV= 6
##$NOISF1= 3.799351
##$NOISF2= 2.8
##$NSP= 1
##$NTH_PI= 0
##$NZP= 0
##$OFFSET= 15.70392
##$PC= 1
##$PHC0= -10693.08
##$PHC1= 16.60088
##$PH_mod= 1
##$PKNL= yes
##$PPARMOD= 0
##$PSCAL= 0
##$PSIGN= 0
##$REVERSE= no
##$SF= 200.130013532006
##$SI= 16384
##$SIGF1= 3
##$SIGF2= 2
##$SINO= 400
##$SIOLD= 16384
##$SREGLST= <1H.CDCl3>
##$SSB= 0
##$STSI= 0
##$STSR= 0
##$SW_p= 3612.71676300578
##$SYMM= 0
##$S_DEV= 0
##$TDeff= 0
##$TDoff= 0
##$TI= <>
##$TILT= no
##$TM1= 0
##$TM2= 0
##$TOPLEV= 0
##$USERP1= <user>
##$USERP2= <user>
##$USERP3= <user>
##$USERP4= <user>
##$USERP5= <user>
##$WDW= 1
##$XDIM= 8192
##$YMAX_p= 0
##$YMIN_p= 0
$$ End of Bruker specific parameters
$$ ---------------------------------
##NTUPLES= NMR FID
##VAR_NAME=  TIME,          FID/REAL,        FID/IMAG
##SYMBOL=    X,             R,               I
##VAR_TYPE=  INDEPENDENT,   DEPENDENT,       DEPENDENT
##VAR_FORM=  AFFN,          ASDF,            ASDF
##VAR_DIM=   8192,          8192,            8192
##UNITS=     SECONDS,       ARBITRARY UNITS, ARBITRARY UNITS
##FACTOR=    0.000296,      1,               1
##FIRST=     0,             0,               0
##LAST=      2.424536,      0,               0
##MIN=       0,             -359072,         0
##MAX=       2.424536,      391377,          0
$$ Real data points
##PAGE= N=1
##DATA TABLE= (X++(R..R)), XYDATA
0 0 0 0 0 0 0 0 0 0 0 0 0 -8 8 -8 8 -14 16 -18 24 -32 36 -42 51 -62 72 -86 100 -116 134 -156 180 -205 235
33 235 -267 303 -341 386 -433 484 -544 606 -673 752 -833 924 -1021 1130 -1246 1374 -1513
50 -1513 1668 -1835 2023 -2227 2454 -2711 2995 -3319 3686 -4109 4603 -5187 5892 -6755 7843
65 7843 -9254 11152 -13783 17429 -37151 391377 -79922 -164885 197272 -130625 126184
76 126184 -45439 -179118 205365 -35059 -98985 116887 -38333 28325 -23869 -25254 97081
87 97081 -78259 -35328 114980 -41969 -45919 52561 41024 -547 -37608 1137 65206 -35587
99 -35587 -52280 77609 11884 -41930 37122 4166 -2566 -34048 -3665 88759 -66390 -40851
111 -40851 112848 -16985 -50872 -17875 37176 62280 -116115 -10720 115977 -49996 -38949
122 -38949 -323 35227 22920 -111716 43377 66404 -103662 25498 41613 -18993 -9043
133 -9043 -52763 67839 4006 -127405 66394 53896 -62340 -10104 -6178 59265 -10737 -110607
145 -110607 71740 46887 -83840 19544 25809 -1818 3039 -30878 35924 -3014 -58751 59368
157 59368 12996 -59151 32146 28865 220 -24917 -30023 77112 8436 -86519 57056 53820
169 53820 -48377 -7808 11022 31183 -3682 -49925 58435 20071 -72007 39269 37298 -27426
181 -27426 -8886 1312 52736 -21439 -76484 74032 42193 -65230 -5443 32571 25549 -48306
193 -48306 -44295 70608 772 -50644 21807 13351 -653 -30971 -2462 48417 -49587 -23404
205 -23404 57918 -24400 -35716 4805 28279 13845 -67524 6707 61262 -54920 -32834 32854
217 32854 11899 382 -31157 12300 37139 -53706 -8394 48104 -33308 -14694 32279 3583
229 3583 -11003 -30297 27219 46423 -67923 -10889 75496 -17118 -31004 3860 28570 32017
241 32017 -60901 4 73134 -42959 -19495 39724 -2132 2939 -19749 18585 35347 -62118
253 -62118 13567 64412 -38880 -15869 24075 22249 -1052 -58514 26990 55984 -56440 -13605
265 -13605 42047 849 -13460 -21169 20546 16296 -47930 14567 31074 -37663 8 24701
277 24701 -1145 -20597 -26870 35648 10950 -65217 11813 46089 -22378 -29554 2107 33988
289 33988 -9678 -49234 28613 19420 -38083 3877 16049 2927 -15294 -15009 36541 -15029 -49254
302 -49254 41548 25070 -32532 -11561 19652 34382 -35479 -40139 62832 13100 -45913 15672
314 15672 21770 3451 -18604 -13938 40886 -7796 -31216 41942 6944 -27894 10727 18365 12163
327 12163 -29821 -8567 57830 -18664 -44475 40009 21949 -15105 -17673 1954 34300 -25170
339 -25170 -30155 41935 1572 -22895 13017 8957 -2859 -25625 5825 34224 -38488 -20259
351 -20259 45810 -3148 -32942 -8743 24163 16716 -49435 -9119 49270 -17812 -32674 12918
363 12918 16424 -3364 -29960 9481 26469 -38927 -5534 36628 -18142 -19471 8697 16321 -2059
376 -2059 -41122 16668 45881 -36656 -19312 33810 10389 -14674 -24450 22072 27518 -40060 3182
389 3182 36617 -18631 -5217 12358 5472 -2781 -21429 27490 22674 -42142 10160 40191 -9898
402 -9898 -21346 -2872 34726 3670 -48014 22318 36187 -27567 -7717 14606 11475 -6944
414 -6944 -22582 25098 6599 -35446 20814 21364 -21649 -9609 7021 20842 -22034 -37921 41838
427 41838 16427 -44750 1182 21209 1822 -22689 -18356 34467 909 -37274 18920 11202
439 11202 -22624 -4206 5489 10480 -17727 -16772 35979 -6444 -40345 22017 22613 -14172 -19468
452 -19468 2584 32247 -16180 -32017 34134 13401 -22007 1215 7303 7878 -17707 -6151 36414
465 36414 -15388 -19057 36504 2924 -19917 -5756 18702 25308 -36160 -9807 49878 -8475
477 -8475 -26273 8188 19295 11138 -31212 -76 36299 -22164 -11510 25899 -1019 -7536 -1447
490 -1447 11615 2644 -29613 11388 30034 -25387 -17658 21654 12485 -18546 -24871 22135 23169
503 23169 -35906 -10230 30559 -6526 -19670 -544 12410 111 -26586 10243 19485 -31228
515 -31228 -3690 22400 -6125 -15757 -10340 23852 7131 -42204 12949 31884 -20899 -12955 5670
528 5670 16146 -5027 -26994 23232 11771 -27668 11983 13945 -7839 -7427 313 24647 -11531
541 -11531 -28616 34628 18643 -28609 -3681 22742 13892 -23618 -15803 34838 6842 -27427
553 -27427 8190 18970 -2489 -11660 3771 17227 -10818 -10121 23068 -1449 -21200 9583 18386
566 18386 -5847 -22980 7213 28434 -20850 -26248 25999 14822 -19078 -12814 11293 14455 -22295
579 -22295 -14642 26979 -2553 -21564 11130 6357 -12692 -13005 6824 16332 -22836 -13115 31565
592 31565 -3399 -26602 3023 15493 3475 -25248 -3073 30124 -13561 -19972 18405 6751
604 6751 -10006 -8052 9658 8017 -22570 3936 26649 -11417 -14857 15039 17584 -12631 -22164
617 -22164 21390 22550 -22846 -10591 24393 10407 -18616 -6515 21268 4763 -17158 4654
629 4654 16267 -8411 -8075 15719 5656 -13917 -1477 17933 2429 -25568 3689 30078 -12184
642 -12184 -23069 12266 17238 -8823 -22936 11728 22018 -20963 -9996 16867 -644 -12410
654 -12410 -5100 12584 -1839 -21622 12844 13762 -21437 -9149 14333 8265 -20954 -14347 27211
667 27211 3816 -27411 2742 16730 -2374 -17474 -2396 18546 -7466 -16930 15681 6036
679 6036 -16157 1490 13795 -146 -15720 1821 23778 -8898 -24132 20330 19424 -16974 -10345
692 -10345 12279 15492 -11796 -16789 22827 10338 -19781 6723 12644 -4707 -5418 4170 14841
705 14841 -9404 -13053 24537 3680 -23466 4680 17919 2036 -19361 -3206 27289 -5705
717 -5705 -24356 12139 14714 -8448 -12277 5392 12513 -14365 -7716 18111 -4691 -14430 6791
730 6791 7818 -8652 -16130 9098 17753 -19455 -13866 20571 5471 -19227 -9515 14866 8084
743 8084 -21657 -3511 19259 -6838 -12921 7450 6284 -7371 -8753 9876 7031 -18877 -13
756 -13 22426 -5448 -17165 6768 17212 -5116 -21497 10998 22624 -14428 -10585 15167 7401
769 7401 -7867 -7878 12847 8184 -15541 7066 15941 -11238 -5538 10370 8112 -8813 -12651 21129
783 21129 11232 -25481 1418 20568 -2694 -14228 -2603 17729 1377 -19573 8092 13707
795 13707 -12248 -5640 7968 1828 -10644 -4780 14586 -2302 -19039 9666 15177 -14495 -14617
808 -14617 9467 11719 -13414 -15839 16326 11145 -19466 -5618 12299 -762 -12626 -2331 11810
821 11810 -3212 -12790 10659 6290 -14644 -3071 13154 3521 -16903 -2687 22322 -3569 -19933
834 -19933 8304 15128 -3835 -14533 4648 18175 -9561 -10447 15397 3893 -8652 1119 8707
847 8707 1654 -11166 6584 16974 -12134 -10282 16216 7151 -12696 -7894 16235 11628 -18173
860 -18173 -4173 20198 -1503 -13810 2695 10141 -715 -11063 5010 10909 -13302 -4092 14939
873 14939 -4205 -12547 1701 11912 -1481 -19505 6435 19765 -14963 -14154 10360 7327 -8162
886 -8162 -13331 9054 10554 -16883 -3727 11743 -5995 -7648 3341 6227 -5093 -11397 11949
899 11949 8243 -19604 -2833 17336 -228 -14552 -1862 17012 1817 -19109 3839 16344
911 16344 -7029 -9626 7484 9010 -4999 -6322 11138 3721 -12269 4597 12480 -4895 -9483
924 -9483 7064 14326 -9001 -12592 16030 10141 -12452 -5471 11365 8225 -11893 -4739 16535
937 16535 -1031 -11602 6578 6147 -6007 -6014 7181 7798 -13923 -4757 17107 -2391 -16221 3306
951 3306 13594 -2552 -16951 1363 16384 -8973 -14636 9366 7157 -8772 -6474 5215 3368
964 3368 -10776 -1568 11090 -7472 -9666 9208 5011 -10250 -7742 11682 9012 -17406 -6655
977 -6655 17400 867 -15048 -168 13852 1831 -13758 1650 12645 -6040 -7682 8939
989 8939 5175 -7074 -1967 10014 1253 -11575 4150 14985 -5792 -11720 9377 11349 -8753
1002 -8753 -9165 11772 10341 -10352 -5096 11778 2924 -10158 491 10632 -2613 -8933 7422
1015 7422 7764 -9328 -6224 11689 5262 -14812 -3707 15489 -12 -14985 347 13253 -1215
1028 -1215 -14800 1560 11531 -6682 -9124 6059 3316 -7691 -2896 7084 -1796 -10038 3475
1041 3475 9301 -8143 -11297 9954 8844 -13937 -8225 12260 6342 -12817 -8049 14148 4979
1054 4979 -15293 215 10908 -2480 -6673 2318 7935 -3594 -6255 10119 3299 -11596 2175
1067 2175 11939 -1751 -10236 3367 13819 -3758 -12592 8819 12401 -8658 -7246 9087 6063
1080 6063 -6827 -3312 9823 2917 -10374 3465 9653 -7508 -6088 8347 6474 -8081 -8362
1093 -8362 12564 6506 -16012 -2151 13103 -33 -10939 -2602 10679 -996 -12140 4442
1105 4442 6415 -7008 -3831 4916 1287 -8958 -1202 10550 -4847 -12434 5579 8990 -8006
1118 -8006 -11558 7726 10950 -11154 -9888 10086 5085 -10136 -4969 9445 3675 -9653 273
1131 273 8617 -5158 -5482 7119 4023 -6603 -3545 10103 3922 -12942 1154 14633 -2723
1144 -2723 -10470 3414 10917 -913 -10807 5683 12052 -7696 -4500 9050 1261 -5005 -201 7014
1158 7014 1060 -9772 4954 11108 -9030 -6699 10061 5222 -8275 -7196 10054 7311 -13246
1171 -13246 -3212 11871 -780 -8454 -90 6632 -1426 -8230 4382 4956 -8952 -2226 7876
1184 7876 -1139 -9628 -272 10280 -3623 -13225 4545 9826 -7081 -10164 5435 8739 -7934
1197 -7934 -7976 7984 3395 -7994 -1754 6018 -146 -6710 2813 7494 -6650 -5713 8997 3619 -9334
1212 -9334 -2520 10464 3810 -11209 -1550 13729 -215 -10642 3866 8832 -1820 -6103 3149
1225 3149 7784 -5365 -3791 9796 -130 -7123 3846 6883 -2056 -8109 4774 11469 -8285 -8420
1239 -8420 10578 5654 -7605 -5578 8044 5908 -10101 -3064 9281 -1762 -6880 2745 4493
1252 4493 -3707 -5082 5168 3524 -9810 -2366 10104 -1230 -11323 1173 9421 -2671 -11140
1265 -11140 1990 10236 -5505 -9696 5338 4916 -6263 -4083 5023 2330 -6769 -13 7171 -4362
1279 -4362 -6858 5546 5896 -6900 -6019 9239 5536 -10215 -2970 10281 3097 -8657 -1908 10384
1293 10384 770 -7992 3889 6375 -2818 -2558 4376 4255 -5558 -1713 9855 -804 -9050 4813
1307 4813 8677 -3645 -7774 4391 9683 -5445 -8568 8538 6065 -7613 -3296 5910 2578 -5522
1321 -5522 -1727 6492 -1784 -7031 4908 3749 -7519 -2867 6700 2569 -8724 -3317 9999 342
1335 342 -11330 614 8312 -2567 -8773 1421 7495 -4040 -6461 4637 2680 -6223 -1910 5092
1349 5092 -937 -6999 2622 7730 -5049 -7456 6031 6103 -6840 -6291 7618 6047 -7842 -3327
1363 -3327 8248 2527 -6540 -383 6873 -104 -5525 3676 5051 -4872 -1624 6915 1672 -6698 -138
1378 -138 9312 -419 -9353 3271 9693 -3271 -7546 3780 7916 -3911 -6709 6044 5064 -5817
1392 -5817 -1995 5321 281 -5035 882 5380 -3582 -5567 5420 4212 -7578 -3874 7764 1938
1406 1938 -8676 -2854 7873 1061 -9343 -185 7463 -3039 -6936 2214 3890 -3879 -4062 4503
1420 4503 2103 -7166 -531 7094 -2713 -8006 3121 6877 -4206 -7232 4691 7140 -5548 -6270
1434 -6270 6611 4260 -6144 -1793 5543 1230 -4473 758 5478 -2616 -3899 6077 3023 -6077
1448 -6077 -1106 7695 2345 -7935 -197 10177 86 -8613 2131 8609 -1745 -6925 3141
1461 3141 6714 -3546 -3785 4640 2594 -4274 -447 5180 -1315 -5470 3491 4772 -5241 -4713 5826
1476 5826 4438 -6829 -4513 7347 2473 -8710 -2085 6438 -171 -6346 -85 5374 -2708 -6077
1490 -6077 3806 2890 -6394 -1638 4937 403 -6513 -854 7851 -1791 -8830 3456 6299 -3886 -5676
1505 -5676 2914 6477 -3996 -5093 5619 1956 -4585 494 3846 -647 -3772 2617 5349 -4861
1519 -4861 -3817 7833 2894 -6890 -1677 7570 3009 -7749 -1199 9105 104 -6947 1676 6265
1533 6265 -742 -4221 2489 4485 -3542 -2106 5273 -321 -4441 1680 4904 -2454 -6175 4194 5681
1548 5681 -6270 -4609 5422 3928 -5402 -4871 5911 2945 -7600 -682 5125 -1757 -4443 219
1562 219 3565 -3094 -4733 5056 2161 -7508 -729 5549 -602 -6410 -1070 7176 -968 -8013 2770
1577 2770 5627 -3566 -4034 2500 4015 -3074 -3143 5169 931 -5475 2748 4648 -3087 -3267 3481 5335
1593 5335 -4631 -4596 7536 3696 -6728 -1497 6478 2605 -5713 -1697 7076 268 -5317 2160 3837
1608 3837 -1667 -2282 3481 2447 -4507 -293 5996 -1633 -5666 2228 5605 -2569 -6412 3429 6445
1623 6445 -5005 -5193 4863 3159 -4857 -3123 4004 1846 -5096 -393 4329 -2668 -3712 2786 2219
1638 2219 -4329 -3482 5029 2096 -7346 -1273 6594 -700 -6465 -487 5595 -705 -6731 2189 4775
1653 4775 -3261 -2956 3032 1559 -3283 -891 4367 -391 -5216 2774 5310 -3546 -4335 4512 5026 -4292
1669 -4292 -4043 6175 3737 -5400 -1847 5894 1714 -4297 -67 4834 -404 -3389 2989 3007 -3797
1684 -3797 -1320 4640 686 -4979 118 6611 -856 -6202 2166 5900 -2410 -5629 2469 5350 -3294
1699 -3294 -4267 3828 1964 -4337 -1118 3197 -738 -4230 1319 3549 -3719 -3685 4261 2370 -5680 -3025
1715 -3025 5352 1688 -6515 -1909 6116 272 -6280 330 4293 -1450 -4122 1604 2778 -2953 -1948
1730 -1948 4048 280 -4680 942 4765 -1327 -4782 2686 5652 -3328 -5112 4451 4506 -3660 -3416 4414
1746 4414 3199 -4231 -1235 4534 458 -3213 1486 3557 -1941 -2471 4284 2411 -4555 -954 5717
1761 5717 596 -5533 240 6141 -364 -5837 1681 5569 -2117 -4362 1863 3090 -2621 -2607 3219
1776 3219 990 -4085 366 3695 -2133 -4022 2378 3222 -3872 -4339 4144 3013 -5536 -2956 4801
1791 4801 1493 -5251 -1803 4603 424 -4720 601 3167 -2281 -2586 2573 1127 -3499 -685 4068
1806 4068 66 -5230 980 5265 -1788 -4889 2703 4986 -2315 -4400 3385 4310 -3451 -2288 3946
1821 3946 1802 -3189 83 3767 -558 -2922 2622 3171 -3064 -1944 4533 2432 -4639 -1301 5600
1836 5600 1198 -5240 -452 5338 -13 -4745 1077 3806 -1499 -2773 1976 1814 -3142 -1182 3596
1851 3596 -657 -3956 1270 3731 -2562 -4663 2632 3773 -4248 -4165 3462 3025 -4549 -3040 4145 1356
1867 1356 -4398 -761 2882 -526 -3008 1034 2340 -2986 -2440 3590 284 -4384 -183 4551 164
1882 164 -4947 938 5556 -1752 -4984 2261 4102 -1892 -2977 2341 3341 -2833 -1612 4083 287
1897 287 -3096 2076 3032 -1585 -2404 2638 3766 -3375 -2564 5247 2183 -4091 -718 4082 1634 -3894
1913 -3894 -452 4435 -658 -3572 1613 2080 -1920 -1575 2516 1147 -3957 138 4214 -1246 -4596
1928 -4596 1240 4153 -2154 -5184 2246 4047 -3684 -3682 2814 2297 -3096 -2597 2752 471 -3407 535
1944 535 2058 -2093 -1962 1875 1515 -3023 -1880 4394 891 -5468 97 4433 -444 -3961 48 5146
1960 5146 -625 -4676 2503 3183 -2086 -1317 1842 1801 -2412 -664 4001 -258 -3418 2555 3316 -2063
1976 -2063 -2544 2619 3597 -2923 -2664 4539 1981 -3753 -473 3169 1050 -2552 -250 3443 -1556 -2607
1992 -2607 2773 1117 -2982 -743 3114 587 -4504 -32 4911 -1303 -4650 1016 3796 -1312 -4505
2007 -4505 1324 3514 -2644 -2620 1835 1217 -2142 -1226 2213 -631 -2989 1559 1895 -3149 -1911 2899
2023 2899 1564 -3539 -2446 4192 1493 -4953 -595 4202 -106 -3590 -191 3548 -346 -3137 1975
2038 1975 2398 -2582 -690 2541 474 -2144 328 3894 -686 -3641 2512 3603 -2280 -2205 2534 3445
2054 3445 -2477 -2521 3540 1628 -3069 -38 2803 185 -2163 802 2673 -1818 -1753 3143 1329 -3434
2070 -3434 -779 3993 725 -4336 -358 4435 -627 -4273 639 3179 -1300 -3039 1045 2409 -2123
2085 -2123 -1314 1865 -137 -2633 154 1782 -1481 -2878 1941 2541 -3566 -2574 3018 1621 -3440 -2382
2101 -2382 3355 1720 -3910 -664 3240 67 -2761 351 2223 -550 -1868 2153 1111 -2847 230
2116 230 3066 -322 -2809 834 3882 -757 -3711 2011 3568 -1921 -2392 2249 2429 -1632 -1484 2472
2132 2472 991 -2231 293 2688 -1087 -1786 1824 1726 -2160 -1809 3458 1825 -3868 -914 3498 535
2148 535 -3808 -549 3638 -253 -3457 739 2503 -1413 -1959 1350 1016 -2388 -820 2175 -588 -2888
2164 -2888 660 2717 -1885 -3397 1907 2857 -2609 -2720 2520 2131 -2835 -1961 2527 1103 -2813 -82
2180 -82 2533 -907 -1901 1126 1465 -1741 -1018 2541 969 -3161 -200 3836 -52 -3423 823 3808
2196 3808 -491 -3179 1404 3088 -1336 -2011 2012 1375 -1743 -543 2113 196 -2037 923 2292
2211 2292 -1526 -1826 2620 1931 -2662 -1720 3015 1506 -3160 -1212 3510 479 -3152 -17 2523 -737
2227 -737 -2334 582 1641 -1663 -1560 2033 228 -2715 206 2410 -839 -3203 1040 3032 -1688
2242 -1688 -3290 1440 2553 -2334 -2511 1789 1611 -2417 -1336 2149 189 -2247 496 1598 -1153
2257 -1153 -1619 1701 1536 -2469 -1068 3382 1088 -3307 -178 3585 344 -2979 471 3140 -598
2272 -598 -2325 1471 2089 -1057 -1222 1681 881 -1833 414 2278 -654 -2122 1648 2684 -1902 -2171
2288 -2171 2561 2343 -2563 -1957 2590 1596 -2882 -1048 2546 511 -2445 40 1703 -1079 -1458 1265
2304 1265 783 -2129 -913 2195 246 -3112 69 2691 -897 -3008 641 2489 -1380 -2797 1241
2319 1241 2076 -1768 -1549 1560 582 -1899 -576 1814 -509 -2014 1316 1919 -2025 -1472 2194 1519
2335 1519 -2494 -1269 3166 1165 -3162 -232 2760 154 -1970 65 2173 -446 -1416 1394 1056
2350 1056 -1438 -48 1803 178 -1886 672 2694 -1307 -2614 1869 2528 -1426 -2007 1909 2296 -2186
2366 -2186 -1617 2441 813 -2267 -226 1630 -128 -1642 664 1537 -1594 -1352 1830 456 -2396 -729
2382 -729 2382 132 -3194 63 2562 -974 -2504 624 2241 -1027 -2196 1285 1142 -1794 -665
2397 -665 1280 -367 -1572 308 1521 -1045 -2070 1453 2002 -2471 -1559 2317 1320 -2076 -1428 2593
2413 2593 1393 -2336 -195 2122 -148 -1250 588 1356 -659 -916 1741 642 -1947 361 2208
2428 2208 -275 -1961 741 2795 -1264 -2630 1629 2459 -1568 -1790 1791 1667 -1615 -1109 1931 291
2444 291 -1809 163 1317 -432 -1192 920 1491 -2040 -1106 2151 277 -2317 -444 2073 239 -2787
2460 -2787 -287 2222 -813 -1886 612 1226 -844 -1392 788 727 -2104 -76 2012 -1051 -1679 843
2476 843 1587 -1185 -2371 1595 1967 -2110 -1610 1762 1336 -1601 -1104 1769 565 -1839 462 1395 -769
2493 -769 -672 1153 731 -1229 -325 2313 574 -2289 347 2604 82 -2323 758 2708 -701 -2272
2509 -2272 1309 2027 -1218 -900 1142 974 -1148 -546 1719 -131 -1149 981 1697 -1105 -1172 1403 1174
2526 1174 -2207 -952 2215 570 -2144 -436 2192 -30 -2370 -57 1807 -934 -1543 715 537
2541 537 -1194 -869 1388 193 -2060 187 2082 -1012 -1908 1016 1756 -1130 -2148 1469 1856 -1546
2557 -1546 -1290 1641 1093 -1299 -434 1042 28 -1226 813 1226 -965 -851 1646 624 -1680 -448
2573 -448 2573 540 -2139 539 2480 108 -2052 400 2111 -662 -1487 1087 1257 -938 -599 1254
2589 1254 474 -1435 281 1602 -1026 -1229 1500 1330 -1500 -1229 1845 1312 -1828 -1066 2075 459
2605 459 -1910 -322 1482 -24 -1946 224 892 -1004 -1047 1044 33 -1694 -341 1506 -234 -1944
2621 -1944 527 2222 -867 -2146 936 1412 -1080 -1676 880 1019 -1226 -832 1480 459 -1319 186
2637 186 1338 -634 -961 1318 1032 -1365 -776 1902 685 -1816 -276 2404 490 -2009 169 2339
2653 2339 -166 -1490 586 1518 -816 -779 1070 537 -1235 5 1490 -293 -1395 529 1919 -1185
2669 -1185 -1368 1582 1341 -1289 -1357 1450 1144 -1833 -808 1340 320 -1333 -52 1249 -548 -907
2685 -907 654 640 -1450 -745 1461 19 -1947 -55 1613 -562 -2151 338 1888 -647 -2033 904
2701 904 1398 -1228 -1218 992 821 -853 -241 1120 -353 -1086 977 1319 -963 -1068 1536 1168 -1615
2718 -1615 -540 1877 959 -1885 -282 1906 477 -1519 186 1778 -311 -633 480 1072 -764 -154
2734 -154 1294 103 -1361 615 1748 -731 -1652 875 1701 -882 -1558 1249 1448 -1409 -949 1250
2750 1250 805 -1381 -283 1096 69 -1189 405 711 -1021 -1010 1111 386 -1714 -472 1648 97
2766 97 -1929 -119 1685 -225 -1961 178 1358 -834 -1149 604 911 -840 -785 1007 173 -1159 657
2783 657 1302 -851 -1004 1016 1524 -1302 -1247 1455 1309 -1480 -547 1666 858 -1469 -493 1671 77
2800 77 -1165 327 1013 -568 -319 1101 339 -1257 -308 1974 143 -1764 491 1830 -586 -1732
2816 -1732 473 1781 -927 -1398 1035 973 -1013 -533 1110 355 -1210 99 794 -826 -1109 784 493
2833 493 -1615 -570 1412 399 -2043 -432 2120 322 -1876 -27 1343 -20 -1537 382 1140
2848 1140 -831 -942 864 286 -969 -376 1056 -403 -1071 553 1551 -950 -1236 1227 1491 -1044 -1127
2865 -1127 1600 1254 -1425 -348 1312 519 -1079 -48 1121 -306 -803 883 829 -1101 -101 1531
2881 1531 519 -1379 -43 1856 82 -1502 442 1455 -684 -1462 361 1128 -643 -788 964 655
2897 655 -704 -406 773 -292 -1015 502 1145 -1316 -889 1280 706 -1615 -556 1361 817 -2002 -686
2914 -686 1519 38 -1502 -141 961 -55 -1055 259 756 -1148 -199 1019 -350 -1275 220 1389
2930 1389 -305 -1605 816 1452 -778 -1043 1085 1083 -1005 -907 1329 763 -1190 -13 1206 124 -653
2947 -653 370 1062 -682 -709 1256 823 -1362 -71 1434 172 -1198 -208 1581 -185 -1524 509
2963 509 1395 -210 -876 434 1010 -745 -459 940 5 -1168 239 776 -624 -1264 814 1413 -1371
2980 -1371 -1302 1421 987 -1389 -966 1202 544 -1677 -644 1211 -164 -881 130 869 -471 -637 842
2997 842 261 -1258 -21 1191 -335 -1217 575 1511 -509 -1477 733 1301 -850 -976 1034 861 -652
3014 -652 -499 961 516 -1098 272 909 -342 -633 794 935 -870 -1041 1322 803 -1238 -87 1554
3031 1554 340 -1722 -281 1430 109 -1038 281 821 -422 -669 458 418 -1122 -173 981 -558
3047 -558 -1248 611 974 -864 -1386 697 1380 -1362 -1384 1264 783 -1107 -736 967 390 -1152 -227 950
3065 950 -119 -922 219 426 -947 -553 823 338 -1412 -361 1745 -514 -1586 238 1427 -531
3081 -531 -1448 562 1186 -687 -519 746 488 -840 -268 684 7 -937 738 849 -751 -762 1215 1125
3099 1125 -1105 -777 1361 717 -1156 -342 1636 394 -1285 -60 1304 -277 -932 548 507 -689
3115 -689 -449 931 158 -1414 73 1486 -453 -1572 620 1180 -845 -1462 684 1007 -1245 -780 933
3132 933 376 -944 -612 906 108 -954 206 606 -804 -642 1256 269 -1062 -401 1017 232 -1326
3149 -1326 -106 1404 -271 -1318 148 1293 -263 -1307 591 606 -673 -577 886 327 -565 366 1121
3166 1121 -580 -1018 865 980 -748 -889 1043 1075 -1119 -657 1418 671 -1046 -21 1000 200 -831
3183 -831 216 755 -514 -494 913 466 -996 -32 1004 -179 -1312 390 1214 -516 -1260 503 1163
3200 1163 -753 -1196 568 838 -799 -632 813 510 -888 -99 444 -423 -851 332 568 -917 -765
3217 -765 976 310 -1441 -299 1207 217 -1228 -55 1260 -74 -1159 284 860 -346 -803 577
3233 577 460 -920 -25 937 149 -1047 489 1035 -504 -930 951 925 -685 -722 1196 819 -997 -717
3251 -717 1237 187 -593 -238 794 63 -599 466 755 -558 -342 1128 40 -1266 172 1143 -397
3268 -397 -1374 107 1441 -787 -1129 296 813 -409 -812 495 472 -785 -555 657 -73 -696 427
3285 427 573 -633 -851 667 610 -1204 -812 1197 305 -1296 -345 1046 330 -1191 95 959 -433
3302 -433 -828 376 630 -709 -253 990 268 -1070 398 1215 -129 -1114 508 1358 -624 -1041 1022
3319 1022 1246 -721 -779 938 778 -489 -251 1016 -22 -615 283 484 -428 -696 691 495 -914 -324
3337 -324 1410 132 -1238 64 1183 56 -1328 -24 1270 -389 -881 427 392 -567 -627 590 259
3354 259 -741 153 733 -793 -980 454 685 -865 -988 718 609 -1148 -667 833 211 -1002 -284
3371 -284 619 27 -1048 -45 638 -551 -519 561 299 -755 47 1289 281 -1190 470 1288 -353
3388 -353 -1043 604 1330 -421 -903 560 708 -695 -197 623 390 -568 -106 973 -235 -520 885 927
3406 927 -633 -473 1132 508 -1079 -464 1626 279 -1194 -143 916 337 -992 103 856 -411
3422 -411 -562 467 45 -494 -48 397 -199 -962 301 900 -861 -960 778 727 -882 -998 869 799 -1006
3441 -1006 -507 769 424 -742 -78 466 -27 -510 578 714 -796 -152 943 243 -1030 5 1164
3458 1164 -27 -1186 60 1197 -222 -940 358 918 -393 -561 667 689 -203 -84 797 54 -491
3475 -491 331 983 -462 -831 1151 556 -1026 -527 885 534 -971 -764 1343 -34 -1162 -24 727
3492 727 104 -998 209 755 -452 -620 775 -10 -840 -66 721 -132 -1174 348 1124 -550 -1212 535
3510 535 959 -843 -920 558 316 -993 -349 639 -169 -753 24 312 -312 -877 691 362 -1051 -482 1150
3529 1150 325 -1104 -347 1304 125 -1366 76 990 -219 -463 386 465 -241 -169 832 178 -673 142
3547 142 910 -233 -963 416 948 -652 -977 1019 841 -991 -625 938 544 -869 -231 913 23
3564 23 -968 38 572 -304 -592 284 253 -851 -6 996 48 -966 1 878 -299 -1175 481 1048 -451
3583 -451 -999 425 710 -475 -608 478 239 -842 -11 536 -383 -719 400 523 -917 -548 845 402
3601 402 -1010 -629 1007 379 -1260 -458 1007 1 -739 -85 628 -244 -493 442 414 -570 -140 957
3619 957 24 -954 328 1153 -567 -812 414 1221 -422 -713 1015 867 -716 -559 642 475 -712
3636 -712 -296 675 105 -665 391 533 -495 -515 819 213 -776 29 1000 -125 -1189 231 1094 -228
3654 -228 -1051 141 760 -529 -655 485 590 -634 -210 574 -99 -743 155 674 -484 -676 737 767
3672 767 -843 -756 932 460 -809 -379 905 255 -806 -205 584 74 -629 400 616 -349 -241 650
3690 650 142 -631 31 1016 -296 -957 467 1133 -172 -1041 359 1072 -469 -697 536 658 -612 -210
3708 -210 765 103 -616 240 527 -569 -252 739 542 -1043 -351 836 332 -932 -402 910 -74 -1418
3726 -1418 -251 912 -70 -577 27 612 -256 -713 303 183 -853 27 472 -127 -1043 217 924 -723
3744 -723 -1143 609 604 -787 -691 726 853 -1005 -393 637 90 -372 -90 586 -130 -409 186 318 -770
3763 -770 -63 1077 103 -803 77 1041 -47 -852 501 1094 -33 -920 458 817 -261 -403 570 388
3781 388 -659 -3 710 -239 -548 205 833 -562 -742 839 707 -643 -430 973 430 -903 -566 675
3799 675 61 -984 -181 574 -276 -656 131 292 -533 -192 600 -19 -1024 27 953 -411 -764 346
3817 346 760 -648 -594 580 620 -653 -517 771 456 -714 168 697 70 -491 265 260 -124 -472 718
3836 718 201 -999 60 871 -2 -722 103 1004 -114 -938 342 902 -334 -416 365 336 -317 -301 710
3855 710 -17 -368 268 913 -409 -504 412 787 -810 -625 859 421 -649 -518 601 473 -703 -165
3873 -165 710 -384 -423 348 319 -394 -331 441 24 -771 16 750 -439 -745 52 1135 -220 -944 438
3892 438 875 -635 -661 624 328 -499 -310 610 269 -533 193 547 -268 -250 359 425 -392 -387 715 207 -898
3913 -898 -211 1114 304 -766 28 905 137 -670 180 598 -306 -147 429 179 -217 68 835 47 -551
3932 -551 196 1015 -353 -751 400 683 -670 -783 617 381 -732 -242 330 230 -678 -68 389 -259
3950 -259 -203 198 334 -602 -343 803 61 -867 -175 764 -189 -993 122 1012 -216 -862 333 759 -592
3969 -592 -698 328 183 -128 31 407 -34 -733 60 562 -612 -509 524 381 -648 -427 1201 423
3987 423 -918 -20 892 226 -671 -67 618 -40 -335 164 369 -550 -385 351 53 -510 113 806 -278
4006 -278 -865 129 625 -176 -497 446 761 -539 -456 819 338 -417 -321 512 -193 -282 297 556 -576 -668
4026 -668 593 108 -744 -144 831 87 -556 -145 746 193 -757 -24 607 92 -595 26 403 -344 -97 418
4046 418 -173 -614 22 635 -128 -349 413 494 -393 -365 743 632 -808 -308 588 236 -751 -83 595 224
4066 224 -254 69 592 -319 -172 742 19 -389 277 789 -136 -643 287 972 -344 -952 231 768 -615
4085 -615 -461 297 358 -374 -339 214 250 -383 205 260 -447 -618 321 521 -467 -486 511 253 -806 -353 622
4106 622 180 -915 -73 507 -205 -590 103 655 -169 -398 378 -49 -414 -155 474 -86 -599 363 904 -535
4126 -535 -615 370 786 -603 -417 553 296 -514 -395 708 225 -422 71 347 -224 -426 332 225 -470 -32
4146 -32 785 178 -671 80 848 149 -692 126 596 -49 -559 337 658 -384 -487 424 159 -369 -258 159
4166 159 18 -349 491 516 -806 -516 557 492 -652 -470 619 174 -810 -313 514 137 -668 30 461
4185 461 -354 -379 88 360 -361 -150 378 -152 -773 -2 723 29 -752 313 603 -226 -573 435 444 -428
4205 -428 -477 361 367 -505 63 233 92 -396 317 684 -295 -52 360 377 -546 -307 889 191 -664 63 667
4226 667 106 -792 122 709 5 -606 263 455 -224 -99 533 166 -504 104 439 -206 -592 361 499 -783
4246 -783 -610 652 656 -616 -716 838 325 -611 -119 291 -109 -386 -111 278 -399 -272 300 305 -700 -57
4266 -57 495 225 -354 305 720 -192 -610 331 557 -351 -399 388 506 -85 -365 241 173 -94 68 340 0
4287 0 -346 243 554 -423 -332 751 614 -478 -293 796 296 -565 -93 588 -116 -286 -22 565 -125 -316
4307 -316 177 385 -359 153 612 -168 -758 118 500 -143 -662 385 231 -256 -598 298 768 -613 -320
4326 -320 376 105 -669 -77 242 -226 -321 214 369 -458 -249 673 258 -510 -147 667 46 -800 161 967
4346 967 -302 -768 208 548 -71 -318 388 111 -288 27 461 56 -551 288 325 -520 -477 674 559 -369
4366 -369 -234 413 533 -710 -244 536 244 -703 161 682 -107 -284 352 547 -268 -195 328 -61 -768 258
4386 258 485 -51 -586 93 652 -607 -668 504 149 -317 -402 544 691 -581 -572 261 -22 -444 163 200 -209
4407 -209 -258 395 306 -548 -121 374 101 -684 -148 582 167 -702 56 512 -383 -504 -10 463 -256 -228 570
4428 570 327 -445 183 633 -391 -542 335 816 -354 -712 478 583 -408 -327 682 493 -507 -175 530
4447 530 182 -238 68 457 -78 -184 178 55 -387 -264 798 -19 -663 203 154 -84 -855 312 550 -221
4467 -221 -599 403 439 -449 -232 241 1 -523 -36 499 -276 -260 216 323 -398 -472 368 155 -651 -354 586
4488 586 166 -446 -156 464 22 -701 69 701 -172 -372 378 134 -340 -59 427 80 -628 70 829 39
4508 39 -383 548 577 -185 -323 666 637 -212 -78 439 360 -300 -250 365 -188 -232 258 229 -426 -85 700 49
4530 49 -512 159 599 37 -536 253 620 -52 -775 89 464 -368 -452 118 251 -468 -120 388 -43 -459 40
4551 40 397 -127 -534 440 333 -355 -252 422 282 -641 -253 525 297 -559 -81 362 97 -544 53 193
4571 193 -219 -74 376 90 -300 40 399 -78 -516 250 500 -178 -523 432 529 -270 -390 431 396 -164 -118
4592 -118 589 -124 -179 67 298 -156 -112 609 343 -214 -431 672 264 -529 -297 800 150 -522 -147 524
4612 524 48 -371 185 357 -404 -237 460 310 -466 -58 423 -25 -471 212 354 -314 -661 160 421 -269
4632 -269 -557 89 400 -290 -102 223 -75 -226 -138 426 -377 -292 65 147 -407 -189 470 9 -537 -154 787
4653 787 -47 -499 143 587 -58 -314 481 583 -179 -443 451 119 -480 184 639 -202 -109 526 297 -238
4673 -238 -305 367 552 -587 -399 527 378 -190 -381 408 74 -405 66 370 -65 -282 111 325 -252 48
4693 48 477 -183 -606 -342 429 -36 -685 253 247 -475 -513 292 262 -334 -406 360 205 -359 -128 301 -197 -403
4715 -403 -28 411 -291 -427 351 143 -645 154 661 132 -498 -19 461 -24 -488 237 633 -170 -359 196
4735 196 172 -184 -307 272 125 -293 -24 628 -216 -210 344 209 -67 -268 497 262 -472 -163 317 155 -327
4756 -327 -67 408 23 -401 -15 415 -235 -357 266 189 -440 51 447 -106 -754 -62 487 -229 -650 33
4776 33 433 -470 -325 199 108 -144 -205 279 56 -444 31 150 -258 -210 379 161 -89 -220 449 348 -435
4797 -435 -243 562 82 -461 -80 339 33 -467 198 379 -383 -255 317 375 -303 11 518 -258 -206 117 308
4818 308 -256 -655 193 171 -325 -270 433 184 -349 -49 477 53 -404 68 607 -279 -56 296 234 -275 -445
4839 -445 331 129 -379 -175 543 -74 -586 69 425 -24 -599 110 397 -129 -539 210 55 -254 -191 282
4859 282 -60 -458 199 269 -297 -425 504 317 -455 -433 640 388 -694 -42 496 -59 -418 73 383 60
4879 60 -85 95 381 -66 -84 374 144 -328 133 358 -161 -329 345 506 -483 -314 171 710 -270 -489 185
4900 185 224 -302 -108 168 -93 -120 70 198 -408 -232 279 210 -821 -138 652 149 -378 -458 398 -31 -316
4921 -316 258 280 117 -442 188 46 -103 -258 325 58 -185 286 56 127 -494 105 498 -424 -469 388 414
4942 414 -349 -470 334 273 -424 -352 523 -146 -33 52 90 -21 -251 163 313 -306 -57 527 -136 -444 -24
4963 -24 800 98 -387 306 476 -32 -408 170 215 -265 54 193 269 -397 262 272 -172 -348 341 -37 -619
4984 -619 -458 639 451 -480 39 194 81 -616 -341 474 -100 -165 -11 206 -131 -322 -74 -99 -386 -48
5004 -48 285 -341 -743 36 228 -187 -566 194 327 -85 -433 379 257 -35 -253 -84 -44 -469 132 513 121
5025 121 -165 350 290 -352 -291 414 279 -418 -138 465 80 -258 207 370 149 -349 -136 214 -178 -110 249
5046 249 -98 -285 154 572 -183 -296 126 293 -190 -143 478 307 -120 -287 437 382 -481 -178 190 55 -93
5067 -93 -57 190 -304 -557 20 18 -277 -7 398 61 -287 -89 378 -290 -267 -12 289 -200 -448 324 281 -119
5089 -119 -297 259 105 -240 -338 128 254 -484 -31 256 -81 -213 386 343 -365 -286 555 53 -592 -207 394
5110 394 219 -602 85 618 138 -332 78 345 -208 -195 31 -9 -206 -58 380 -122 -261 -40 422 -373 -377
5131 -377 269 473 -324 -488 477 244 -515 -70 275 93 -217 124 84 -434 -121 368 148 -297 -146 414
5151 414 107 -658 207 365 36 -190 -1 228 -105 -411 102 102 -243 -261 227 47 -237 -224 75 -203 -357
5172 -357 243 149 -400 -260 384 137 -420 -141 426 336 -489 -394 440 119 -115 132 288 -15 -308 225 105
5193 105 -155 -169 570 278 -323 151 277 -214 -358 291 365 -329 -559 143 268 -259 -463 264 167 -271 213
5214 213 300 -66 -295 139 70 -209 -275 360 13 -657 -272 238 158 -564 -158 342 111 -490 -84 509 -331
5235 -331 -359 -43 163 -361 119 405 -48 -236 136 390 -51 -298 112 325 -525 -64 396 267 -301 -448
5255 -448 273 116 -165 -158 280 -60 115 69 115 -282 -201 428 8 -193 42 329 130 -166 166 455 -236 -426
5277 -426 315 226 -376 -287 140 185 -198 -204 211 23 -247 2 237 -354 -463 4 90 -244 -61 376 82 -437
5299 -437 32 322 30 -663 150 405 -149 -48 223 153 -320 -257 264 54 -322 -187 187 30 -275 342 140
5320 140 -223 -236 55 379 -36 -351 244 268 -147 -33 98 211 -328 131 309 -83 -267 -7 206 -338 -97
5341 -97 268 50 -403 112 550 -92 -295 81 348 34 -401 341 428 -213 -145 162 285 -40 -8 281 -157
5362 -157 -235 250 254 -108 -316 323 455 -305 -370 328 77 -305 -34 191 -214 -296 113 182 -81 -259 192 21
5384 21 -131 -17 -120 -242 -501 -11 438 -337 -574 -43 343 -199 -538 383 197 -117 -168 270 170 12 -110
5405 -110 178 32 -262 230 319 -80 -265 310 124 -294 35 461 205 -376 -111 588 -105 -296 227 57
5425 57 4 -172 22 303 -101 -121 17 92 -215 98 295 -18 -313 378 175 -159 -258 -13 114 -248 -392 268
5447 268 -164 -171 -218 136 19 -98 21 109 -205 -198 282 6 -279 -270 210 185 -282 -77 360 -145 -415 -3 323
5470 323 -404 -342 212 26 -85 -7 349 -327 -52 -97 97 -114 -326 273 382 -136 -290 230 372 -195 -168
5491 -168 320 239 -219 -78 310 41 -337 27 251 9 -117 167 -37 -187 -47 113 -102 -274 74 410
5511 410 48 -368 151 412 -332 -374 132 165 -149 -84 186 -218 -362 234 237 -241 -68 -39 122 -363 9 317
5533 317 58 -144 -5 148 -50 -418 -162 416 -22 -386 -42 328 -133 -143 131 109 -61 109 230 115 -69
5554 -69 179 235 -164 -112 141 244 -136 -151 553 -89 -307 19 294 -48 -185 -41 118 38 -19 115 72 -57
5576 -57 -36 118 171 -261 -50 -60 -37 -230 139 315 -278 -126 -25 189 -11 -158 90 45 -485 -101 93 126
5598 126 -285 -228 135 -205 -279 52 278 -344 -383 339 145 -483 -126 163 -35 -441 -220 104 131 -228 102
5619 102 249 26 82 151 51 -322 -52 317 -164 -178 222 297 -237 -168 270 105 -76 -170 592 51 -216 -106
5641 -106 287 -52 -152 377 376 50 -52 72 170 -300 -178 460 -43 -142 -45 399 -89 -188 -13 578 -298 -146
5663 -146 277 -80 -253 -240 29 -55 -99 -75 163 -74 -228 165 40 -146 -377 395 220 -316 -299 320 -136 -404
5685 -404 -137 332 -27 -290 -200 -4 -90 4 131 -89 -298 0 141 -119 -194 -13 106 -205 -295 -87 292 -227
5707 -227 -186 17 424 4 -246 331 182 -189 40 155 -288 7 223 46 -231 -250 467 77 -344 8 120
5728 120 137 -99 28 361 24 -207 71 339 -151 -371 76 66 -396 177 223 40 -95 -120 266 -333 -531
5749 -531 6 270 -152 -294 119 116 -245 -96 178 -90 -169 -147 116 62 -192 141 13 -119 -7 183 68 -249
5771 -249 210 135 261 -210 87 352 83 -287 137 287 -108 -234 130 238 -302 -89 26 77 -131 -28 292
5792 292 62 77 375 36 -163 -248 263 123 -308 -177 301 264 -299 -56 244 -244 -63 53 -42 -150 38
5813 38 307 -70 -554 312 266 -192 -380 -131 376 -259 -48 260 416 -293 -310 39 203 -176 27 359 10
5834 10 -250 95 107 -57 50 197 23 -136 161 65 -15 -203 -103 198 67 -248 134 350 -388 -296 165 165
5856 165 72 -183 27 142 -351 15 398 -221 -217 159 207 -7 -325 251 158 -157 -452 111 162 -291 6 248
5878 248 233 -212 15 333 -51 -219 137 268 -186 -38 324 -36 55 -59 185 -95 -72 79 156 -196 -161 104
5900 104 -67 -273 -165 216 307 -133 -170 279 -125 -32 78 234 49 -151 189 -2 -274 74 314 58 -493
5921 -493 9 172 82 -34 264 397 -21 -107 94 15 -78 193 76 177 -104 63 231 -83 21 309 308 -84
5943 -84 -399 -19 230 -106 -56 282 -57 -78 -136 302 42 -271 -63 169 -15 -246 -56 -34 -110 -269 263 246
5965 246 -89 124 58 -204 -452 -181 98 -124 -175 311 198 -364 -45 -19 221 -347 -49 177 -343 -47 -103
5986 -103 22 -132 -110 224 40 -496 -74 285 230 -85 90 250 -48 -18 73 147 215 -133 -26 -99 -244 194
6008 194 199 -156 -79 81 429 -168 -525 226 258 -63 -71 158 -148 -57 82 362 -18 -102 101 59 -109 29 92
6031 92 -205 -181 19 147 38 -217 10 268 32 -165 12 277 -196 -241 -220 475 -197 136 272 337 -143 19
6053 19 211 -185 -225 3 238 -157 -74 217 205 -396 -136 177 226 -298 93 37 58 -184 -275 181 -74 1 163
6076 163 293 -123 -1 240 -70 -114 121 42 -282 -424 94 499 -184 -129 423 -21 118 -204 222 -20 39
6097 39 -142 125 74 -54 -78 -19 -128 -210 382 281 -164 -196 2 18 -98 -219 94 14 -323 61 185 -153 -123
6120 -123 -192 -181 -63 -90 44 -83 -30 39 -17 -82 -112 206 90 -11 -406 43 -16 -68 -117 173 148 -330 -183 151
6144 151 -94 -48 141 -23 -110 -201 137 -59 -139 4 42 -142 -200 -65 275 -54 -214 -113 -32 -134 -136 -145 105 -93
6168 -93 94 91 -85 56 94 95 -122 -197 213 45 -85 129 258 -25 -30 109 164 -9 -233 -191 0 43 -109 -262
6192 -262 -27 91 -129 -28 -80 -38 -107 149 -21 -161 -2 338 -143 -114 97 62 -326 -178 265 251 -163 -141
6214 -141 152 105 -3 -178 179 116 28 8 240 -59 -149 175 210 -268 -34 -8 -7 -78 -41 477 59 -276 196 99
6238 99 -37 262 228 79 26 49 185 115 -233 132 223 -219 -109 68 57 -237 -199 33 134 -305 -51 148 -28
6261 -28 -165 -110 434 -149 120 -40 19 -90 -64 182 -10 -133 -79 121 104 -47 22 206 -178 -22 103 369
6283 369 -102 228 227 -137 -202 -149 -27 -131 -99 7 221 -115 -61 189 -19 -177 -51 209 -39 -98 136 161 -107
6306 -107 -388 74 290 -225 -194 -76 142 164 27 156 -28 -177 -179 113 -168 -222 304 95 -355 -315 196 142
6328 142 5 -2 56 270 -36 -190 246 -152 -18 102 68 -33 -104 116 82 29 161 150 -94 -289 19 125 57
6351 57 -108 -3 185 -51 -141 145 120 -233 -158 103 -63 25 47 23 158 -140 88 148 -142 36 -110 -24 -121
6374 -121 -188 367 184 -29 101 353 -198 -195 -9 -15 158 62 85 52 101 -33 28 -80 162 2 297 -328 22
6397 22 222 259 -240 -372 9 116 -17 -219 40 -52 -167 138 246 -20 -177 184 161 -79 -229 245 104
6418 104 -246 -302 -74 -274 -238 -50 112 -102 -195 -22 -123 18 106 -96 211 -56 -355 120 -109 -10 -66 144
6440 144 -121 -232 63 255 -178 17 -90 15 -297 -294 196 227 -86 18 206 -120 -115 -41 -192 -56 -177 312
6462 312 26 13 111 369 6 -277 126 296 -134 -368 88 101 -168 5 -37 57 165 69 178 116 -22 241
6484 241 202 -143 -86 25 52 -208 2 -114 174 -369 -151 152 18 -86 -302 136 -199 -189 122 -17 53 -67
6506 -67 66 -115 -267 192 33 -138 -69 7 -27 -339 -264 177 243 15 109 50 -27 -183 -292 237 115 -215 386
6529 386 152 -71 -79 164 -8 -308 -12 -164 -36 -178 57 158 -204 -73 -36 144 -147 -143 133 76 1 -31 266
6552 266 127 -109 -88 229 -231 -213 19 -104 -157 21 309 -59 -244 -128 272 6 -36 -354 23 -64 -402 -100
6574 -100 61 -43 -84 4 -26 -172 -17 4 14 -12 14 318 -188 -111 -48 113 -241 -10 -56 161 -355 -224 103
6597 103 58 71 21 142 -212 106 -103 -223 -103 -93 408 167 -43 -165 220 -67 23 -40 -88 96 -174 -345
6619 -345 -87 228 -191 166 -23 -235 95 -90 74 11 -114 -111 -84 -293 -56 -88 -241 -116 96 110 -143 -99
6641 -99 224 -83 318 -11 -17 -75 -62 41 38 -199 -261 102 -51 -398 119 139 -50 -123 66 257 58 -270 133
6664 133 90 -231 -107 67 162 -84 -38 100 14 -339 85 -197 127 -176 36 -112 54 -136 15 288 221 -6
6686 -6 210 -5 -21 13 229 -72 -49 76 65 -226 -23 -59 33 -14 108 160 20 -152 183 240 -206 -520 94 422
6710 422 160 30 174 293 -181 -69 -72 -98 -132 82 36 -66 7 -18 88 -215 204 267 85 -111 136 148 -208
6733 -208 -260 -71 320 -139 129 274 -67 66 101 -43 -189 -277 -76 36 77 -279 227 169 -77 -48 218 259
6755 259 -112 -108 151 1 14 164 202 28 75 43 55 -81 154 136 71 -31 -37 202 -130 0 110 -50 -89 -149
6779 -149 -246 336 103 120 -119 185 -47 -23 -61 148 -17 144 214 -6 -86 -59 -21 -160 -234 75 121 -103 71
6802 71 187 -26 -245 -154 45 -166 -75 31 144 -257 -77 29 -166 20 -66 47 -194 62 -46 94 35 -71
6824 -71 52 202 113 -37 57 122 119 -273 185 10 -38 -217 -162 -39 -92 130 31 -145 -151 219 -89 -296 18 293
6848 293 -171 -444 252 152 -135 -237 -233 114 -81 -244 246 71 -229 68 -144 -71 -70 -46 86 -142 -78 20 53
6871 53 -414 335 -133 62 -427 -70 118 7 25 -141 183 -78 -118 290 246 166 -166 18 -145 -145 40 -6 -74
6894 -74 -90 260 174 -99 -39 336 113 30 -223 16 5 -191 -7 189 -52 -136 -112 161 30 -189 -11 92 -72
6917 -72 -30 212 34 -257 -139 166 87 -116 -40 209 -71 13 -129 179 52 7 -109 51 38 42 11 59 -235 140
6941 140 307 0 118 265 -4 -80 -158 21 -35 -329 157 268 -44 31 56 -43 71 129 307 32 35 -141 338
6964 338 6 -22 -139 215 137 -173 358 109 -25 -74 90 -62 72 -62 -151 -14 -2 -4 -23 90 -134 65 222
6987 222 81 78 48 -100 -23 165 171 33 -193 -67 -119 -23 -54 18 -8 -6 -193 133 -55 17 -80 69 -59 -442 73
7012 73 29 -27 -172 3 -72 -65 -115 166 80 -191 61 123 55 -59 82 -133 -1 -16 87 314 -56 56 551 27
7036 27 -187 -50 173 13 -229 229 117 -139 -164 92 148 -129 -158 130 188 145 64 61 -86 216 709 47 -100
7059 -100 -38 -32 68 -281 -113 -311 -164 -116 25 201 9 -493 -187 176 90 -236 -59 30 -273 -86 198 167
7081 167 -134 43 143 -5 -158 74 79 -249 -138 300 -7 -285 -283 58 -133 -89 -14 68 159 -130 -79 397 -386
7104 -386 -141 152 7 27 3 99 -22 -176 40 80 -148 -264 -29 218 80 -288 -3 284 -129 -10 -61 -77
7126 -77 167 104 129 -249 39 -52 -2 -234 -142 -73 40 -296 -83 239 -122 21 132 -19 243 -35 -110 137 -117
7149 -117 -92 -85 -8 17 -118 97 -154 -103 47 242 46 -162 -55 80 174 -28 238 56 84 -96 144 -92 -282
7172 -282 -92 75 -147 129 37 -128 38 79 284 -204 -185 -63 218 32 -158 100 67 -152 -22 91 168 36
7194 36 117 -58 121 -75 30 -59 -123 -61 -134 188 52 -104 117 301 69 -288 -71 -129 -61 181 13 236 -71
7217 -71 -130 115 -64 44 246 19 -93 39 87 46 -185 -60 -5 -59 -287 -4 308 -265 -256 175 119 -32 91
7240 91 16 93 -39 150 150 -61 -14 144 -59 -88 -88 -6 101 127 90 77 -46 -37 -83 203 196 33 65 126 -2 -94 97
7267 97 -172 17 -136 6 83 -28 268 189 33 23 47 122 -281 38 216 158 -20 -298 85 130 -124 -4 6
7290 6 9 -112 -21 127 -205 -73 39 -212 20 124 261 -10 -227 121 149 63 -196 156 86 -15 -78 -130 59
7313 59 -239 -200 27 19 100 -102 66 -38 10 164 140 -125 65 58 -177 -191 -88 -62 303 -48 -222 35 85 -264
7337 -264 112 269 -123 0 -47 8 -158 274 10 101 -168 269 196 -108 -185 -163 -10 -53 -54 74 150 -42 78
7360 78 243 81 270 86 127 40 -199 27 184 -118 -99 121 42 -153 -16 270 112 -45 -194 -70 -12 -83
7382 -83 -118 72 -273 4 -194 -16 -14 67 182 -189 -7 170 340 61 75 -93 149 -125 -166 62 109 -109 227
7405 227 -103 -170 245 -38 109 6 24 44 153 71 101 5 -82 -120 -112 96 48 -244 163 83 17 -199 222 -137
7429 -137 -226 107 61 15 73 -26 150 72 141 114 229 -20 -49 -174 94 196 -87 253 -340 -26 -144 171 -43
7452 -43 -186 70 51 -269 -233 196 -25 -159 -110 8 65 61 66 -81 -292 42 -53 157 0 -158 98 125 -112 142
7476 142 32 51 21 -124 -95 89 68 52 -160 101 43 146 -136 -67 -87 15 67 -159 187 269 132 57 53 12 196
7501 196 -93 1 68 -126 123 174 127 -79 -27 125 -16 -25 34 158 39 -183 219 508 -19 -81 -101 -235 -195 140
7525 140 127 -134 -28 101 53 77 -58 -315 -73 -115 -85 108 -75 46 66 48 -76 84 -135 9 -242 143
7547 143 149 -289 -234 -121 -41 -129 -116 -75 -133 -20 -107 245 37 174 137 127 53 -113 6 221 -27 -262 -18 117
7571 117 92 -82 -173 120 126 -217 101 -22 138 32 222 -134 134 49 186 -92 29 10 143 -207 -257 149
7593 149 1 -151 103 -41 -191 -64 -28 54 40 51 54 146 -82 -100 132 -212 -216 6 50 -12 -277 -145 5 -179
7617 -179 -38 172 85 97 -186 305 79 -273 7 59 -255 0 209 -116 -206 69 183 180 -140 -108 273 9
7639 9 -42 -118 115 -37 -225 102 163 -138 -36 -107 240 73 -79 -45 37 -164 11 45 32 -10 259 223 -89 -264
7663 -264 58 179 136 145 86 -51 -69 106 -58 -110 25 140 205 -122 -1 168 344 12 -183 320 140 -20
7685 -20 -29 53 -56 -43 205 -152 -191 139 -56 -110 -109 -258 -137 -234 -278 161 101 163 -174 -184 122 -120 -159 -120 131
7710 131 -45 -146 -24 6 19 -88 63 182 60 82 124 -136 -91 67 57 -185 -204 72 70 -291 26 -94 -35
7733 -35 65 288 -42 -145 -218 -143 214 -191 72 97 37 30 160 40 -20 -98 53 152 -199 -92 214 32 -281
7756 -281 135 157 60 68 -256 102 189 -211 144 -101 -182 27 -130 286 93 148 199 8 -226 -32 162 -50 59
7779 59 6 118 -20 -280 74 -9 -159 -180 -72 48 -187 -75 94 -221 -271 268 248 -321 42 171 3 -130
7801 -130 35 73 -183 -87 -65 388 82 -70 185 185 -29 -178 168 -103 130 62 198 128 -272 184 -95 125
7823 125 -52 1 14 -63 -19 378 10 -167 154 8 145 -48 -13 243 -111 4 -78 38 2 -191 28 67 -68
7846 -68 142 152 -386 -35 226 -81 19 -223 210 -2 -137 -347 319 237 -135 -74 -26 -83 204 -92 22 100
7868 100 -157 104 160 -55 152 5 130 97 -10 -15 181 -259 -163 119 -120 22 -56 66 -236 63 -107 -74
7890 -74 31 113 37 -246 166 42 62 114 -193 132 149 -103 -21 125 -118 -56 -283 -28 -37 -13 6 -262 -141 -104
7914 -104 -16 138 -119 -27 275 9 -21 115 -38 -146 -8 -8 91 22 -139 83 -37 -119 28 67 172 -24 20
7937 20 211 -55 98 -16 90 23 46 80 278 -235 2 -27 -52 50 5 128 28 -26 214 238 -64 -210 -134
7960 -134 -134 -39 33 -76 58 -142 72 240 87 0 125 142 -40 -247 131 156 -154 -108 -95 76 -34 150 98
7983 98 -102 -168 -13 90 124 -177 -11 -97 -114 -156 87 33 -256 -92 146 205 -227 -212 37 -321 26 -27 52 42
8007 42 19 132 -194 3 35 60 72 -216 276 354 -268 62 -30 181 -114 268 202 -119 -99 -50 32 -37 62 48 -70
8032 -70 37 18 32 -7 -128 -67 207 305 -176 -33 126 -37 -247 131 7 -152 -43 -68 105 -39 23 36 71
8055 71 -97 154 26 117 -33 79 -69 -323 75 186 -150 -207 32 218 -49 -232 145 93 26 -219 -136 341
8077 341 -45 -60 -98 84 71 29 47 178 155 62 208 -169 -241 43 40 -46 9 306 52 -190 18 78 55 117 26
8102 26 17 -65 -38 72 17 -200 -17 111 86 -233 -182 385 -2 -45 153 -180 -200 -107 55 -88 -34 -193 -56 31
8126 31 -143 11 337 25 -173 89 -50 -176 -163 183 75 -271 59 -55 5 -251 180 -168 32 -116 94
8147 94 183 -450 298 -118 -139 -235 -59 284 96 -47 268 -75 -253 -202 -273 388 78 -47 4 152 -415 -179
8169 -179 -38 65 -48 21 259 -59 179 66 19 -46 -71 -188 39 -103 85 56 137 -123 37 230 78 -234
8191b34
$$ Imaginary data points
##PAGE= N=2
##DATA TABLE= (X++(I..I)), XYDATA
0 0 0 0 0 0 0 0 0 0 -8 8 -8 8 -16 16 -24 24 -32 40 -48 59 -72 88 -103 120 -139 160 -187 216 -251 287 -327
31 -327 371 -421 477 -538 604 -680 760 -848 946 -1053 1168 -1295 1434 -1583 1749 -1929
47 -1929 2126 -2343 2580 -2840 3129 -3449 3808 -4209 4660 -5179 5775 -6467 7288 -8277
61 -8277 9495 -11035 13055 -15819 19844 -26248 37963 -66086 265559 143405 -359072 239203
73 239203 -48133 -25138 74140 -192121 152489 92089 -184423 124569 7310 -38560 25735
84 25735 -46004 73849 -20530 -79760 120089 -9049 -75975 57504 39675 -28426 -37234 -8543
96 -8543 51955 -16410 -64451 59513 34776 -71483 18380 14155 -28727 -11929 -13813 65095
108 65095 -27626 -80379 100300 -990 -92636 5702 23675 45133 -78232 -51331 129245
119 129245 -34680 -81341 30599 17417 22211 -79067 -296 105569 -87885 -15863 81246
130 81246 -39914 -12916 -23806 28025 42728 -110576 38164 102676 -76045 -17223 27049
141 27049 26853 12925 -93127 45737 93509 -85929 -2353 60935 -16984 1263 -16522 14999
153 14999 25369 -53198 37419 45391 -63724 20345 47009 -20197 -16777 -18134 51734 30152
165 30152 -87775 28685 75851 -62328 -25251 29033 12568 1121 -46313 28454 41803
176 41803 -75450 12146 57156 -43949 -17772 8595 22588 -5734 -74902 47658 61904
187 61904 -81787 -21538 42467 6729 -36759 -44509 60621 24092 -69192 15750 26099 -15751
199 -15751 -17972 -10746 41685 -24042 -43959 60338 -5658 -48628 20759 24619 8356 -47511
211 -47511 -9518 72603 -33538 -46529 53069 19241 -10614 -16971 1341 41103 -33010 -25527
223 -25527 59873 -12924 -29110 41674 6459 -17324 -11940 15545 46565 -45082 -30213 82354
235 82354 -5277 -52537 18410 23486 19591 -41674 -22797 76151 -24722 -49785 49678 762
247 762 -15752 -5086 -1123 34353 -43163 -16059 71250 -33884 -40851 34049 7806 -10644 -43826
260 -43826 6745 62751 -47934 -37709 52409 -1728 -27711 -12678 9151 21986 -38766 -4424
272 -4424 43661 -32125 -15321 31904 -8361 -21705 -16002 23265 23385 -54040 811 60305 -21612
285 -21612 -34869 13134 29209 -617 -43785 20019 39216 -36325 -2443 30342 -2250 -9274
297 -9274 -10879 26069 5888 -45214 35054 42555 -37998 -10985 25755 22868 -21641 -39838 54569
310 54569 31908 -57563 6940 33388 -9338 -14526 -11552 31311 8314 -40075 28773 19830 -39319
323 -39319 6486 20189 -1387 -21199 -16353 44669 -4675 -57344 32896 30434 -32736 -17821
335 -17821 1416 24060 -12330 -38466 35985 14796 -37508 7616 10106 -11103 -16968 -2188
347 -2188 31112 -23313 -31952 45131 4584 -42153 -905 23472 14120 -36156 -16248 53547 -5510
360 -5510 -42061 19386 21727 -6087 -21057 3113 32549 -24233 -17034 43762 -7476 -26271 18411
373 18411 15162 -1019 -25789 8443 50570 -25757 -31520 40838 12085 -21591 -14410 16089 31905
386 31905 -30219 -12310 44182 -13311 -19412 18890 1630 -3564 -12944 12908 27278 -37352 -6363
399 -6363 43858 -15402 -29893 2193 23288 5980 -45226 7770 45238 -29964 -21544 20577
411 20577 3733 -9460 -20808 12293 16652 -35099 6729 29059 -26929 -15037 10981 10138 -13030
424 -13030 -33854 31741 29738 -48380 -6073 32287 -3732 -18761 -12285 28108 12975 -39732
436 -39732 10308 25303 -23962 -3970 13710 6939 -7410 -15340 29096 8723 -39897 18967
448 18967 33502 -19106 -16436 7909 26907 -4292 -32838 29464 25479 -30200 -1797 14240
460 14240 3712 -7224 -8534 30593 -1323 -29920 30592 10116 -29471 -62 15620 17205
472 17205 -25686 -21768 47166 -1042 -40561 11104 17778 1483 -24983 -10638 36299 -13135
484 -13135 -26792 26292 688 -18105 -845 4130 1860 -22694 1167 30849 -21777 -25753 23369
497 23369 11142 -20317 -19434 17578 25437 -30807 -18800 34734 -726 -25845 4178 13464 1951
510 1951 -19648 2554 26177 -22337 -11644 30522 -3961 -16640 -303 17782 13933 -33105
522 -33105 3900 41943 -19217 -19596 15314 12748 -207 -21346 15522 24565 -27308 3534 23141
535 23141 -11224 -5874 3579 16272 -1877 -28655 25539 26068 -33909 -8443 24819 6925 -21432
548 -21432 -16892 29758 12852 -33017 1671 22368 -7565 -14424 958 13449 -7107 -16662 16577
561 16577 2779 -25030 5570 17581 -9924 -21443 3316 24769 -15062 -30376 23653 19355
573 19355 -24748 -13757 12827 12374 -16267 -17308 24950 6147 -26515 8037 12768 -13791 -7985
586 -7985 8085 15631 -12745 -16082 29861 5235 -30143 6424 20271 1247 -17396 -4345 31067
599 31067 -4019 -25510 19978 13180 -13129 -4517 8876 10664 -14217 -1391 28525 -7376 -19368
612 -19368 15245 15031 -12207 -19663 17026 24871 -22187 -15849 24586 9768 -21166 -8801 19897
625 19897 6024 -19737 -413 16356 -7513 -13149 11720 5410 -16454 -4349 13666 731
637 731 -22802 -1833 27722 -9811 -29107 12388 17529 -11421 -20803 7405 23175 -18412 -18036
650 -18036 19220 1819 -14819 -2536 10545 2854 -18633 6895 18903 -19212 -10551 18153
662 18153 7392 -16084 -11676 25345 11200 -28403 1115 22303 -3115 -15046 106 19628
674 19628 -382 -18034 13924 13155 -15390 380 15929 -114 -12634 1150 21089 -3200
686 -3200 -23950 16460 23317 -18923 -13139 14708 12318 -9878 -16702 17768 15283 -23046 -608
699 -608 16458 -7590 -7578 3361 9158 -5735 -16541 16681 7904 -26949 1371 19217 -3255
712 -3255 -18247 -5522 22847 -1472 -28860 8783 18336 -12486 -13885 4448 11552 -10368 -12416
725 -12416 16431 306 -18089 5926 9097 -8160 -11605 7547 18237 -14509 -16831 21206 8525
738 8525 -20012 -6490 16667 10300 -17688 -6045 22529 -1301 -15653 9472 10007 -6365 -5894
751 -5894 8734 10036 -13277 -2540 23185 -2184 -18840 7654 16894 -4671 -18181 8352 24374
764 24374 -12340 -16317 16331 8112 -10710 -6653 9537 9711 -14204 -1296 16925 -10857 -10811 11239
778 11239 4774 -8683 -11632 13357 12730 -25274 -5827 23197 -4452 -17508 -885 14087 2522
791 2522 -20538 1966 16385 -13147 -10510 9093 1379 -9212 -4442 11834 1382 -18325 5344
804 5344 16745 -13809 -15330 11740 12455 -10731 -14034 14974 14191 -18665 -8263 16341 2281
817 2281 -11013 154 12705 1427 -11957 8062 11031 -12958 -3010 14824 3898 -13180 -2952
830 -2952 20962 955 -20995 8214 18384 -5677 -12967 4020 17833 -5764 -14709 14323 7353
843 7353 -12263 -64 8282 799 -9102 1594 14601 -9971 -14560 14503 7653 -14841 -7336
856 -7336 13422 9773 -18118 -9550 19090 -224 -18488 1847 10387 -2445 -11049 425 10776
869 10776 -10241 -9125 13833 -1803 -14566 2867 10307 -1473 -16252 2264 20556 -11850
881 -11850 -17612 13373 8973 -8735 -10182 7454 13156 -13547 -7612 15714 -1780 -8697 6205
894 6205 6408 -2527 -8444 8545 11684 -15455 -4517 20363 1338 -14818 180 16200 3777
907 3777 -17357 1781 19895 -5179 -11950 8483 9777 -4715 -7236 8349 6273 -11810 955
920 955 13105 -5026 -10031 5847 11605 -7585 -14468 12718 11497 -15602 -7822 11202 6063 -11998
934 -11998 -7983 14077 1495 -15713 3801 7318 -7813 -6266 4689 6086 -11115 -7956 15464
947 15464 410 -17942 2805 13625 -3438 -15592 697 16488 -5726 -16448 9566 10649
959 10649 -9304 -6508 6400 5142 -7664 -2769 11757 -2627 -10373 9716 7451 -9528 -5257
972 -5257 10937 9392 -13481 -7484 18906 4517 -15474 1209 15123 2179 -12770 192 14639
985 14639 -3521 -9399 8909 6988 -6925 -2884 8814 2056 -10388 1548 14053 -5089 -13723
998 -13723 7824 11301 -9242 -10302 9926 9688 -11117 -8535 10694 3344 -11972 -2199 9775
1011 9775 -2489 -10448 4576 7545 -9245 -7616 9549 4898 -14046 -5393 14756 945 -16138
1024 -16138 -118 12955 -1171 -14744 316 12690 -4769 -10768 6309 5871 -6765 -3048 7028
1037 7028 991 -8377 2886 9927 -5729 -10058 9754 10932 -11417 -8009 14072 7839 -11447
1050 -11447 -6422 13884 7990 -14370 -1485 14160 -990 -7397 3365 7957 -1760 -7207 7401
1063 7401 6225 -11076 337 12560 -1949 -10211 2691 12436 -3110 -13584 6181 12803 -9004
1076 -9004 -9810 8779 6077 -8278 -5011 7547 3068 -10679 -346 9878 -6802 -8413 7586
1089 7586 5320 -8249 -8245 8913 7274 -15572 -5164 14239 -529 -12721 -1982 9525 750
1102 750 -12448 2343 9296 -6835 -5330 5537 1895 -6491 -1468 10120 -1771 -11680 5696
1115 5696 10743 -6717 -9701 7967 11882 -9047 -10047 11394 7978 -9364 -4047 10401 5451
1128 5451 -8835 -1479 9870 -2379 -6336 7046 5188 -5902 -2862 8747 4908 -11148 -1251
1141 -1251 15092 -1886 -12589 3997 10299 -1457 -10632 3057 12070 -7189 -8805 8545 1935
1154 1935 -7246 -621 5268 1001 -8875 1027 10524 -8304 -9502 9518 4608 -9268 -6828 7960
1168 7960 7043 -12535 -6204 12257 -101 -10938 28 6422 -837 -8001 2029 6940 -7519
1181 -7519 -3922 8592 -214 -8431 277 9843 -1378 -12120 4187 11852 -5933 -9517 6815
1194 6815 10124 -6130 -8069 8839 6063 -7646 -1626 7693 1540 -5576 2048 8235 -4196 -6240
1208 -6240 8531 4909 -8797 -2258 10574 3890 -10270 -2665 12913 1265 -12381 3224 9926
1221 9926 -2908 -6801 2205 7249 -3956 -6581 7880 1740 -9203 2211 6071 -3350 -7528 2441
1235 2441 9888 -7212 -10998 9317 6150 -9922 -6073 6473 5354 -9333 -5577 9639 -305
1248 -305 -8605 2123 4806 -3581 -5426 4006 4197 -7951 -3253 10106 95 -10990 1408 10035
1262 10035 -1573 -10044 2298 10780 -3673 -9936 5975 7542 -5719 -3732 6114 3585 -5416
1275 -5416 -948 7514 -1385 -6399 5891 6956 -5391 -5108 8633 6829 -9289 -3693 10734 3149
1289 3149 -8863 -1826 10060 1881 -9465 2309 7711 -3717 -4367 3427 3490 -4551 -3441 7854
1303 7854 383 -9909 3110 8417 -5021 -8453 3143 8347 -5181 -10092 6786 7106 -8912
1316 -8912 -5073 5883 1870 -5984 -2783 5494 -321 -7720 3018 5040 -7237 -3704 6588 2223
1330 2223 -8073 -3449 9305 1714 -11469 330 10026 -1541 -8261 1660 8419 -1930 -6999
1343 -6999 4689 4972 -5629 -1651 5868 1062 -5070 2309 8210 -3204 -7236 6253 6993 -5814
1357 -5814 -5484 8117 6808 -7506 -4429 8777 3312 -7083 -1013 6880 501 -6070 2076 5790
1371 5790 -4112 -3120 6287 1677 -6418 -1127 7916 125 -9697 1713 9701 -3852 -9007 3276
1385 3276 7309 -4231 -8115 4460 5560 -6446 -3606 4887 115 -5549 -126 4602 -2684 -6240
1399 -6240 4197 4738 -7266 -4515 7158 2450 -8473 -2589 8105 2000 -8993 -743 8667 -1387
1413 -1387 -7085 2593 5147 -2733 -3631 4368 3356 -5659 -1269 7615 -1050 -7208 3569 7852 -3056
1428 -3056 -6292 4821 7916 -4646 -6525 6493 5950 -6295 -2312 6256 1767 -4403 -2 5140
1442 5140 -1381 -4776 4573 4028 -6364 -1756 7187 1414 -7688 -1402 8862 -222 -9784 1100
1456 1100 8287 -2173 -8313 2072 6731 -3801 -5697 3341 2634 -4764 -1967 4292 -803 -6009
1470 -6009 1929 4836 -4854 -4960 5088 3940 -6853 -4836 6580 3533 -8310 -2431 7600 495
1484 495 -6512 -217 6081 -891 -6043 3094 4599 -5188 -1789 5602 1069 -4864 -450 7683 -120
1499 -120 -8562 3167 8260 -3306 -5007 3625 6617 -2558 -5604 5715 3917 -5224 237 4495
1513 4495 -440 -3140 1863 5011 -3268 -4630 6730 3652 -7356 -1936 7395 2484 -7715 -2281
1527 -2281 8623 653 -8658 695 6447 -1564 -5658 1056 4077 -3064 -4000 4322 474 -5257 716
1542 716 4245 -2422 -6101 2569 5860 -5766 -5777 5431 3557 -5617 -4736 5314 3943 -7304 -1904
1557 -1904 6226 -1127 -4955 1003 3742 -1448 -4293 4030 3656 -6239 -1088 6779 -49 -5649 -229
1572 -229 6811 513 -7559 2415 7590 -3078 -4633 3513 4259 -2104 -3100 4710 2530 -5297 1571
1587 1571 5275 -2943 -3056 3454 4574 -3440 -5066 6575 4683 -7569 -2206 6375 2196 -5761 -2352
1602 -2352 6578 916 -6708 1070 4462 -2360 -3203 1933 2114 -3999 -1908 4908 -957 -6190 1480
1617 1480 4776 -2931 -6380 2486 5960 -4522 -6229 4603 3567 -5379 -3371 4017 2155 -4856
1631 -4856 -1301 4759 -1238 -4303 2895 2679 -3504 -2597 4541 2991 -6261 -1297 7384 113 -6412
1646 -6412 306 6276 531 -5688 1648 6417 -2380 -3358 3438 2267 -2304 -874 4566 892 -4714
1661 -4714 1775 5492 -2958 -4460 4537 4798 -4187 -4622 5453 4340 -5839 -2911 5639 1928 -5068
1676 -5068 -1103 4303 -93 -4404 1359 3222 -3784 -2331 4141 651 -5003 -893 5659 -800 -7215
1691 -7215 1395 5885 -2737 -5979 2099 4942 -3135 -5182 3245 3041 -4555 -1945 3369 129 -3714
1706 -3714 721 3793 -2338 -3809 3853 3071 -5074 -2717 5526 2456 -5701 -1800 6786 1287 -6013
1721 -6013 319 5484 -725 -3986 1813 3998 -1738 -2250 3653 1662 -3929 710 4849 -598 -4137
1736 -4137 2406 5590 -2657 -4791 4248 4877 -3929 -3391 4280 3457 -4196 -2124 4273 726 -3764 507
1752 507 3454 -1871 -2935 2793 2468 -4451 -2011 4677 684 -5983 -745 5348 -302 -6320 301
1767 301 5489 -2228 -5663 1765 3595 -2384 -3415 2571 1772 -4019 -629 3498 -1787 -3816 2189
1782 2189 3436 -3138 -3913 3914 3700 -5270 -2927 5208 2455 -4777 -1489 4873 1138 -4405 263
1797 263 4423 -1099 -2687 2580 2415 -2946 -663 4193 945 -4121 452 5665 -1033 -4967 2543
1812 2543 5300 -2190 -4343 2885 4472 -2935 -3123 3747 2257 -3136 -659 3295 -242 -3456 1767
1827 1767 2793 -3035 -2760 3594 2137 -4648 -2296 4894 920 -5865 -1002 4750 -182 -5357 321
1842 321 4003 -1493 -3761 1498 1910 -2906 -2017 3096 -115 -4331 867 3769 -2189 -4534 2523 3958
1858 3958 -3633 -4256 3840 3521 -4008 -2936 4162 2426 -4046 -862 3619 289 -2607 880 3025
1873 3025 -1667 -2173 3809 1272 -3781 53 4657 340 -4442 559 5646 -874 -5162 2590 4694
1888 4694 -1656 -3206 2299 3438 -2370 -2429 3283 1058 -3673 1257 3021 -1695 -2620 1951 3152 -3004
1904 -3004 -3647 4285 2227 -5018 -1572 4001 989 -4352 -1688 4246 -372 -4307 1084 2667 -2218
1919 -2218 -2156 1976 1145 -3842 -1023 3839 -1152 -4637 1063 4187 -1747 -5097 2031 4786 -3083 -4129
1935 -4129 2856 2767 -2878 -2431 2735 1962 -3184 42 3023 -1148 -1572 1923 1747 -2226 -1666 4134 2003
1952 2003 -4778 82 5298 116 -3814 125 4868 266 -4708 1784 4027 -2532 -2044 2290 1678
1967 1678 -1696 -1160 3309 208 -3820 1489 3332 -2525 -2621 2378 3082 -2821 -3570 3723 2237 -4308
1983 -4308 -1451 2991 332 -3095 -635 2849 -847 -3612 1717 1686 -3242 -1251 2836 559 -4057
1998 -4057 -772 4391 -762 -4976 993 3861 -1394 -4089 1211 3919 -2135 -3261 2370 1849 -2165
2013 -2165 -1043 2010 368 -2569 1081 2892 -2543 -1763 3258 1643 -3138 -1852 4315 1868 -4752
2028 -4752 -546 4883 326 -3487 169 3966 487 -3342 1310 3367 -2004 -1150 2685 521 -1922
2043 -1922 -47 3208 -81 -3816 1572 3968 -2453 -3118 2516 2824 -2567 -3177 3043 2211 -3536 -714
2059 -714 2797 -419 -2548 200 2303 -1326 -2758 2370 1421 -3735 -1118 3285 748 -4118 -777
2074 -777 4317 -281 -4608 626 3703 -923 -3304 1262 2718 -1720 -2081 2280 535 -2142 327
2089 327 2370 -755 -2494 1712 2839 -2729 -2303 3345 2327 -3028 -1866 3693 2222 -3514 -915
2104 -915 3878 448 -2727 738 2332 -247 -1988 1598 1958 -2460 -138 3120 228 -2993 713
2119 713 3516 -465 -3850 1553 3837 -2178 -3031 2288 2379 -2151 -2140 1922 1462 -2490 -731 2400 -636
2136 -636 -2505 1363 1453 -2339 -1969 2341 1572 -3739 -1425 3457 564 -3878 -526 3236 -118 -3642
2152 -3642 229 2574 -1135 -2178 1430 1500 -1870 -812 2421 -62 -2727 696 2572 -1307 -3028
2167 -3028 1890 2887 -2467 -2656 2859 2301 -2512 -1693 3334 1662 -2533 -541 2792 7 -1822 1226
2183 1226 2027 -1410 -1317 2429 1144 -2570 -324 3664 387 -3679 502 3747 -552 -3224 854 3126
2199 3126 -1312 -2575 1572 1884 -1914 -1045 1791 15 -2266 46 2189 -1400 -2464 1785 1934 -2535
2215 -2535 -1963 2719 1161 -3312 -1652 2857 785 -3435 -534 2634 -215 -2640 333 1615 -1456
2230 -1456 -1717 1854 728 -2666 -33 2641 -469 -3093 797 3136 -1149 -2853 1907 2846 -1902
2245 -1902 -2364 2228 2321 -1868 -1205 2177 901 -1867 382 2270 -701 -1363 1905 1544 -1781 -796 2967
2262 2967 941 -2800 -218 3508 279 -3205 236 3581 -312 -2783 941 2279 -1154 -1618 1422
2277 1422 1023 -1799 -191 1817 -640 -2334 904 2214 -2002 -2493 1951 2112 -2540 -2363 2519 1546
2293 1546 -2721 -1646 2431 632 -2762 -228 1877 -545 -1771 1151 862 -1691 -987 1916 208
2308 208 -2793 -158 2964 -631 -2998 968 3026 -1023 -2783 1122 2683 -1537 -1923 1933 1071 -1445
2324 -1445 -391 1920 189 -1864 905 2206 -1462 -1107 2257 1456 -2186 -1222 3131 1399 -3006 -488
2340 -488 3124 319 -2444 116 2306 -336 -1823 929 1409 -1658 -930 1661 35 -2241 201 2146
2356 2146 -1142 -2565 1378 2543 -1736 -2362 1736 1897 -2414 -2165 1899 1153 -2498 -700 1586 -24
2372 -24 -1845 16 1377 -1322 -1707 1663 531 -2311 -589 2595 494 -2841 -123 2994 -485 -2659
2388 -2659 1009 2115 -698 -2275 1069 1921 -1546 -1021 1922 55 -1466 734 1575 -302 -1886 1376
2404 1376 2556 -1846 -1510 2531 1578 -1812 -1038 2269 1705 -2374 -518 2586 88 -1717 339 1309
2420 1309 -347 -1242 1234 920 -1892 -2 2066 -512 -2283 430 2188 -922 -3128 1189 2378
2435 2378 -1944 -2006 1550 1698 -1778 -1880 1626 621 -1983 -423 1510 -752 -1414 583 1364 -1698
2451 -1698 -1370 1985 580 -2438 -431 2118 254 -2544 -402 2694 -398 -2210 1047 1957 -724
2466 -724 -1113 956 1144 -1889 -181 2294 -396 -1742 1190 2072 -488 -1971 1514 2384 -1686 -1676 2265
2483 2265 1681 -1599 -940 1947 1165 -1438 -294 1712 -288 -1252 1174 627 -980 -900 1631 416 -2106
2500 -2106 198 2652 -357 -2510 137 2568 -772 -2800 1052 2046 -1518 -1718 1142 985 -1503 -909
2516 -909 1253 142 -1683 567 928 -1332 -1068 1221 887 -2245 -1267 2090 723 -2536 -670 1774
2532 1774 177 -2090 -410 1975 -179 -1616 737 1173 -1038 -717 1164 661 -1798 97 2411 -928
2548 -928 -2021 1332 1827 -949 -1666 1269 2041 -1197 -1279 1785 1040 -1328 -406 1375 225 -1280 796
2565 796 1505 -996 -958 1462 615 -1845 -594 2109 357 -2423 -14 2389 -125 -2258 -106 2143
2581 2143 -576 -2067 765 1439 -1069 -785 746 138 -1135 2 1454 -714 -1553 966 1279 -1535
2597 -1535 -1487 1632 1021 -2015 -1118 1997 814 -1930 -492 1573 114 -1766 3 1383 -513 -1144
2613 -1144 1416 400 -1164 -145 1415 191 -1767 426 2336 -584 -1868 929 1956 -1003 -1609
2628 -1609 1272 1661 -1074 -826 1478 879 -1136 124 1169 -530 -961 1075 1120 -1319 -922 1569 883
2645 883 -1643 -544 2099 229 -2518 -170 2122 29 -1873 146 1526 -652 -1438 686 817 -1045
2661 -1045 -364 1127 -262 -1664 213 1733 -1051 -1666 1319 1512 -1612 -1517 1396 1182 -1799 -1090 1607
2678 1607 571 -1504 -182 1131 -117 -1004 547 902 -1027 -554 1329 357 -1725 37 2167 -189
2694 -189 -1852 349 2066 -395 -1905 1029 1721 -681 -1493 1232 1175 -994 -399 1237 141 -1101
2710 -1101 490 1243 -608 -1104 1569 1051 -1388 -847 1951 913 -1951 -745 2024 143 -1957 87
2726 87 1437 -417 -1155 406 850 -763 -561 929 144 -1564 -90 1378 -557 -1806 498 1520
2742 1520 -951 -1954 860 1396 -1536 -1502 1195 882 -1393 -647 1025 72 -1223 144 1273 -692
2758 -692 -770 1417 580 -1414 -508 1620 243 -1831 -20 1824 178 -1838 316 1656 -303 -1224
2774 -1224 1033 1187 -482 -907 1133 756 -1209 2 1163 -593 -1037 1156 1355 -1051 -1029 1540 1145
2791 1145 -1684 -795 1474 445 -1516 -355 1646 239 -1084 107 1108 -616 -760 739 636 -1133
2807 -1133 -637 1590 116 -1889 133 1569 -861 -1882 425 1524 -917 -1410 789 1078 -1013 -883
2823 -883 865 424 -1103 -191 1193 -485 -1169 729 649 -1203 -714 1551 573 -1732 -461 1687 427
2840 427 -1691 -153 1755 254 -1550 357 1432 -410 -923 549 806 -666 -249 872 130 -1055
2856 -1055 561 1409 -991 -797 1363 1271 -923 -1403 1374 1199 -1500 -745 1427 434 -1063 -10 1129
2873 1129 -21 -1302 516 902 -975 -436 1318 189 -1494 -498 1573 -15 -2118 243 1444 -536
2889 -536 -1665 342 1404 -539 -1369 843 411 -1065 -96 629 -229 -1160 361 973 -988 -1046 1466
2906 1466 829 -1648 -508 1433 997 -1884 -610 1824 489 -1289 -81 1496 42 -1051 339
2921 339 1114 -735 -394 986 164 -1031 204 1106 -2 -1417 521 1680 -889 -1132 1058 1314 -859
2938 -859 -820 1261 837 -1246 -198 1109 176 -742 260 1028 -628 -599 919 740 -1379 -471 1726 171
2956 171 -1517 -314 1783 -55 -1826 162 1214 -489 -1313 423 856 -586 -947 778 -118 -1179
2972 -1179 301 679 -448 -1240 619 987 -1113 -1163 1395 988 -1426 -831 1389 782 -1480 -648 1365
2989 1365 301 -930 226 947 -334 -649 735 599 -1048 -105 1410 -277 -926 341 1010 -284
3005 -284 -1295 597 1797 -929 -1146 1128 1226 -1023 -914 1001 585 -984 129 1149 -299 -756 842
3022 842 713 -1042 -965 1195 616 -1477 -329 1352 286 -1383 -472 1351 -369 -1513 319 697 -403
3039 -403 -930 255 425 -834 -496 921 -557 -1291 125 839 -631 -1349 656 1156 -1335 -1033 1290
3056 1290 734 -1132 -931 674 540 -968 -230 1038 -96 -820 585 340 -678 -421 1227 366 -1273
3073 -1273 -159 1496 167 -1502 408 1582 -139 -1307 490 1350 -691 -1060 885 690 -970 -449
3089 -449 1020 82 -639 213 935 -862 -1022 781 789 -1196 -800 1264 790 -1543 -392 1536 411 -1274
3107 -1274 -343 1043 -312 -1060 473 675 -979 -494 567 187 -1034 -245 1026 -79 -1571 422
3123 422 1127 -890 -1370 611 1195 -958 -1076 924 681 -728 -585 864 79 -552 -133 678 -535 -555
3141 -555 767 442 -916 -213 1294 359 -1136 31 1647 193 -1363 399 1503 -291 -837 361
3157 361 951 -452 -424 737 590 -855 245 1171 -440 -864 686 995 -848 -807 967 853 -1072 -997
3175 -997 1190 419 -1183 -512 985 142 -885 -103 839 -327 -800 347 383 -905 -482 848 -295
3192 -295 -1331 -178 1342 -719 -1360 552 1269 -711 -1124 565 814 -794 -710 681 626 -1018 -127
3209 -127 850 -212 -808 633 1027 -557 -793 990 609 -1137 -455 1418 230 -1356 -334 1330 -45
3226 -45 -1108 427 829 -291 -778 666 521 -661 -83 483 77 -648 170 1078 -488 -1165 757 1146
3244 1146 -884 -1014 949 726 -1045 -732 1196 477 -820 -73 739 -224 -854 283 609 -474 -785
3261 -785 860 189 -1243 -312 1082 -98 -1323 195 1327 -324 -1349 290 863 -660 -844 579
3277 579 697 -456 -496 947 -95 -1052 186 791 -507 -709 890 1019 -944 -470 1316 702 -1058
3294 -1058 -347 1219 539 -814 23 1168 162 -623 227 692 -491 -303 979 254 -844 111 1297
3311 1297 -270 -1138 464 800 -556 -1310 1006 1145 -993 -830 820 718 -626 -707 710 98 -879
3328 -879 72 549 -637 -593 704 443 -982 -605 1043 279 -1355 151 1309 -101 -1239 106 1038
3345 1038 -360 -1387 379 821 -834 -518 621 367 -923 98 893 -282 -761 727 931 -880
3361 -880 -1071 1010 932 -923 -635 1275 870 -842 -198 1060 296 -692 384 939 -426 -509 822 315
3379 315 -666 82 1057 217 -1170 247 1363 -301 -998 334 1356 -356 -1252 662 839 -636 -457
3396 -457 575 708 -444 -134 489 -118 -774 446 358 -798 -571 853 408 -986 -669 1184 196 -1464
3414 -1464 -11 1134 -229 -1054 -44 921 -274 -989 670 367 -589 -217 594 32 -974 -156 1245
3431 1245 -479 -1099 694 854 -714 -922 931 938 -908 -655 935 483 -523 81 748 -86 -575 247
3449 247 585 -416 -416 1037 424 -892 -429 1344 192 -1106 -62 1285 -107 -1095 157 1054 -393
3466 -393 -920 558 752 -541 -395 649 -138 -664 254 575 -433 -932 849 514 -863 -631 869 716
3484 716 -1228 -625 1217 326 -1379 -25 924 -130 -843 -75 790 -429 -221 668 -75 -713 -14 933
3502 933 -306 -1003 169 868 -386 -1162 647 929 -906 -763 464 1073 -722 -288 704 -108 -418 83
3520 83 642 -101 -433 471 595 -1027 -511 1027 458 -735 -197 1113 207 -1047 93 1238 -133 -629
3538 -629 507 896 -60 -462 520 240 -946 162 509 -406 -852 483 825 -427 -891 745 763 -982
3556 -982 -684 844 547 -768 -454 965 182 -789 68 681 -156 -542 194 205 -877 -369 763 202 -1024
3575 -1024 -189 1106 -258 -887 7 1068 -253 -1119 257 632 -457 -542 427 619 -489 -61 594 -192
3593 -192 -865 511 485 -754 -686 1129 618 -882 -181 1041 449 -1152 -327 1123 74 -680 -158 796
3611 796 19 -358 756 615 -446 -294 662 72 -480 481 927 -323 -948 486 997 -790 -726 759
3629 759 962 -806 -705 785 424 -714 -630 531 -44 -1019 45 308 -612 -348 754 147 -937 -274
3647 -274 1016 6 -1512 8 943 -324 -1200 191 1120 -374 -840 380 556 -395 -494 508 34
3664 34 -374 138 733 -314 -563 652 772 -828 -633 995 713 -878 -726 941 396 -833 -380 940
3682 940 146 -470 366 977 -36 -432 700 471 -565 -57 905 -102 -998 39 949 -115 -961 403
3700 403 790 -431 -877 565 744 -619 -539 529 -18 -686 -144 322 -280 -652 239 212 -677 -592 664
3719 664 167 -793 -331 963 161 -1078 -25 865 -119 -780 203 853 -162 -654 288 316 -466 -108 803
3738 803 -77 -415 422 823 -188 -689 592 838 -738 -522 678 751 -613 -646 877 486 -599 221
3756 221 624 27 -634 483 468 -552 -133 912 140 -600 49 930 -101 -697 224 1079 -278 -880 347
3775 347 631 -305 -780 558 198 -641 8 339 -174 -289 187 811 -664 -736 385 286 -830 -368 588
3794 588 408 -1160 -287 841 128 -1020 105 710 -38 -388 404 405 -375 -419 574 262 -836 196 700
3813 700 -44 -766 357 1044 -693 -654 846 527 -678 -451 664 735 -487 -259 705 162 -339 224 282
3832 282 -431 -240 471 456 -802 -36 958 -70 -881 -33 900 120 -985 188 794 -282 -531 381 447
3851 447 -345 -376 555 -8 -947 212 626 -254 -580 315 545 -641 -859 730 578 -937 -390 754 315
3870 315 -614 -319 660 62 -832 37 534 -131 -414 286 206 -687 -201 731 -169 -786 418 800 -406 -770
3890 -770 340 1154 -238 -879 505 606 -352 -274 526 597 -568 -4 497 -159 -242 391 424 -337 -363 915
3910 915 642 -969 -16 1074 238 -748 -117 949 -177 -875 241 330 -233 -511 377 188 -656 -247 749
3929 749 -159 -602 271 637 -250 -641 248 682 -731 -762 424 680 -588 -648 749 347 -822 -210 521
3948 521 -4 -503 145 198 -568 -141 627 214 -824 -14 747 -10 -898 217 856 -201 -737 -11 931
3967 931 -371 -730 361 497 -515 -196 434 99 -418 178 706 -363 -309 565 747 -536 -380 721
3985 721 409 -863 -278 871 -1 -749 189 517 98 -349 220 367 -231 -30 653 12 -583 -12 372
4004 372 -373 -978 311 687 -531 -747 371 1058 -622 -833 431 493 -339 -644 506 61 -621 167
4022 167 308 -415 -515 623 184 -636 -246 687 52 -914 -57 913 -67 -1048 166 848 -210 -564 366
4041 366 589 -423 -486 692 101 -312 112 657 -337 -472 269 531 -484 -672 858 432 -519 -560 686
4060 686 518 -697 -174 585 105 -463 155 473 10 -167 321 269 -380 -220 741 -43 -1063 21 564
4079 564 -285 -1123 230 495 -467 -862 160 745 -456 -543 750 198 -703 5 332 -99 -474 361 323
4098 323 -320 -309 557 112 -851 -231 707 -107 -922 -253 757 37 -524 357 638 58 -279 212 501 -380
4118 -380 -27 525 114 -598 -2 709 -276 -450 362 921 -612 -684 878 789 -713 -369 527 242 -537 -308
4138 -308 497 22 -260 -43 315 -366 -303 523 125 -577 33 381 -230 -674 -182 505 -205 -1002 7 778
4158 778 -334 -401 168 243 -224 -287 385 -22 -840 252 691 -402 -505 393 432 -695 -157 338 164 -614
4178 -614 -390 615 249 -469 -24 803 -99 -420 7 394 -120 -63 513 144 -572 -163 774 -281 -510 278
4198 278 810 -127 -609 332 795 -337 -565 311 297 -317 -472 520 92 -428 76 745 -215 -481 390 234
4218 234 -500 -598 610 64 -503 -129 723 145 -770 8 455 -364 -505 194 510 -187 -313 125 -113 -284
4238 -284 -104 509 -189 -568 470 648 -369 -549 335 463 -630 -820 651 425 -730 -85 485 182
4256 182 -617 66 312 -302 -488 322 212 -432 -212 435 312 -388 -61 663 7 -684 192 802 -180 -594
4276 -594 394 476 -359 -261 267 315 -348 88 155 -196 -544 223 530 -506 -228 637 397 -529 -430 626 375
4297 375 -577 -32 657 -95 -511 -151 488 28 -539 80 251 -291 148 238 -161 -394 268 680 -344 -688
4317 -688 512 363 -436 -746 387 481 -632 -323 54 298 -578 -253 324 170 -375 126 511 -374 -337 530
4337 530 447 -494 -176 471 266 -630 159 777 -36 -423 232 493 -196 -338 207 469 -377 -47 296 -133
4357 -133 -417 57 403 -363 -420 420 429 -825 -528 785 341 -458 -451 548 543 -593 75 553 137 -411 193
4378 193 111 -298 -470 171 39 -820 116 733 -253 -578 183 427 -260 -684 311 822 -425 -413 322 225 -492
4399 -492 -287 250 -101 -464 -129 518 -258 -540 450 608 -483 -309 579 302 -568 -96 644 201 -304 -156
4419 -156 744 -239 -478 392 714 -107 -82 362 139 -497 -30 808 -111 -561 378 626 -229 -852 666 448
4439 448 -343 -390 593 459 -650 -456 443 347 -443 85 442 -181 -281 192 261 -352 -277 429 -294 -530 40
4460 40 627 -143 -531 218 512 -312 -653 210 444 -432 -337 90 122 -477 -207 508 -54 -424 315 400 -466
4481 -466 -555 448 312 -405 -291 862 320 -630 -68 715 139 -569 -61 900 -190 -179 214 270 -337 -168
4501 -168 425 167 -520 -48 612 26 -643 419 534 -333 -696 350 668 -390 -283 261 152 -590 -227
4520 -227 518 -13 -577 -87 86 -390 -252 417 174 -616 -82 507 210 -694 37 557 -90 -348 73 620
4540 620 -307 -279 115 375 -340 -378 282 -12 -393 1 337 -212 -494 335 453 -208 -294 355 390 -228 17
4561 17 718 400 -470 -154 520 104 -508 287 380 -276 -211 231 109 -491 153 637 -32 -354 83 548 -330
4582 -330 -399 309 600 -147 -735 295 415 -313 -53 271 154 -181 -48 586 -60 -490 365 461 -759 -389
4602 -389 420 302 -567 -183 481 198 -537 -127 607 180 -528 -51 156 -135 -277 166 -100 -280 293 464
4622 464 -237 -648 371 157 -447 -493 240 619 -378 -450 192 269 -541 -242 563 202 -277 -45 436 187 -342
4643 -342 272 274 -247 -39 645 178 -574 122 535 285 -725 9 959 13 -350 202 371 -83 -487 357
4663 357 279 -345 -90 228 -39 -281 186 498 -600 -417 540 281 -488 -353 678 338 -540 -151 481 46
4683 46 -591 -25 290 20 -374 93 194 -535 -325 326 -259 -335 25 504 -257 -622 29 335 -484 -627 419
4704 419 428 -287 -246 383 336 -443 -223 423 133 -184 52 363 -257 29 429 429 -194 -39 599 67 -552 192
4726 192 487 -32 -403 -60 366 108 -499 15 238 -170 -94 107 228 -244 291 403 -160 -286 181 84 -181
4747 -181 -337 363 525 -457 -429 544 292 -605 -196 99 26 -389 29 98 -358 -298 393 -57 -447 -282 496
4768 496 44 -427 -192 311 -64 -633 115 430 -263 -647 90 402 -183 -279 592 54 -300 -3 322 -203
4788 -203 -351 498 318 -238 -355 491 219 -452 -27 755 374 -470 44 256 206 -485 31 406 61 -220
4808 -220 167 -261 -224 75 243 -205 -471 271 617 -205 -527 155 410 -375 -338 375 179 -506 -203 290 -74
4829 -74 -366 -210 330 -215 -413 271 220 -490 -166 535 48 -605 -200 905 111 -709 26 95 -158 -415 -38
4850 -38 143 -213 -275 156 388 -119 -55 323 -173 -213 41 552 -319 -207 465 312 -592 -299 276 129 -321
4871 -321 -311 501 148 -338 -25 584 201 -114 -42 212 6 -190 350 17 -390 -22 462 -74 -721 280
4891 280 444 -118 -290 215 539 -442 -375 168 130 -469 -312 335 79 -514 -16 188 -129 -345 248 164 -516
4912 -516 -383 293 262 -454 -250 256 228 -535 91 475 -191 -565 132 352 105 -100 108 224 -87 -11 228
4933 228 55 -392 240 469 -16 -278 396 333 -326 -254 439 448 -367 -168 404 -7 -278 209 590 -150 -212 386
4955 386 40 -288 -109 506 233 -466 101 330 -6 -427 174 600 -132 -468 62 139 -190 -312 294 117
4975 117 -660 -166 220 -219 -446 167 118 -425 -223 278 257 -569 -194 509 547 -441 -4 423 221 -487 -41
4996 -41 336 -333 -226 81 222 -183 -196 531 31 -458 158 581 226 -657 334 383 -61 -317 138 476 -113
5017 -113 -171 185 386 63 -148 204 -85 -122 243 279 -216 85 271 246 -468 -250 315 289 -346 -62 552 128
5039 128 -492 114 288 -228 -331 569 86 -241 -181 -33 331 -463 12 211 -163 -436 115 365 -315 -274 348
5060 348 234 -365 -212 547 218 -327 -82 603 82 -477 3 279 -263 -50 237 -105 -290 9 340 -13
5080 -13 -470 90 477 -110 -368 224 436 -26 -373 92 412 -135 -212 386 -38 -29 170 130 -332 -157 415 -40
5102 -40 -295 -265 410 -20 -428 -244 585 17 -410 -153 480 -45 -205 162 334 -169 -7 383 -93 -322 -26
5123 -26 197 15 -401 348 166 -395 -541 -50 445 -243 -379 319 368 -340 -150 259 16 -534 75 109 -232
5144 -232 -389 112 107 -352 -31 288 228 -464 64 519 79 -500 -21 442 6 -477 -33 137 -64 -241 152
5165 152 349 -48 -113 357 -209 43 66 305 -95 -271 254 546 -361 -66 331 135 -62 -70 482 23 -374
5186 -374 125 281 -10 -404 101 265 -253 -13 279 127 -379 -114 9 98 -398 225 393 -168 -265 231 351
5207 351 -324 -162 196 231 -272 14 385 90 -181 118 313 -309 -301 324 325 -376 141 380 65 -533 29 417
5229 417 154 -372 19 422 -141 -279 195 284 -79 -46 207 -55 0 225 298 -132 -380 327 316 -50 -214 197
5251 197 391 -557 -277 528 224 -299 -267 272 -15 -72 45 471 -181 -399 318 79 -120 -56 390 139 -536
5272 -536 -147 347 -83 -398 218 200 -396 -38 254 70 -417 -27 21 233 -379 152 18 19 -285 312 386 -588
5294 -588 -157 342 127 -456 -59 529 34 -179 -77 198 58 -173 -33 359 -84 26 48 141 -366 12 234
5315 234 58 -135 170 276 -72 -174 302 511 -126 -371 241 241 -91 -51 167 231 -445 -49 215 -236 32
5336 32 83 -107 -105 -103 352 -297 -57 -174 477 42 -328 57 414 21 -276 80 202 -107 -140 127 167 -451 -123
5359 -123 141 -176 -201 154 321 -283 -155 247 456 -346 -419 449 -5 -324 46 281 48 -242 -10 435 15
5380 15 -174 81 330 -239 -142 350 -97 -318 228 337 -45 -437 -6 559 -34 -371 161 441 -227 43 25
5401 25 150 -155 97 139 -176 -289 202 141 -313 -195 247 184 -214 -56 397 34 -477 -170 363 90 -318
5422 -318 -54 78 133 -319 -82 81 235 -139 275 -69 -214 -245 400 -175 -423 -139 -25 -177 10 148 136
5443 136 -211 -308 188 229 -258 -177 148 -55 -131 -165 288 -338 -301 69 221 -335 -227 392 -66 -190 -69 616
5465 616 -10 -223 63 484 -96 -210 74 313 -54 -249 278 256 -178 109 486 -28 -152 128 227 -422 67
5486 67 500 217 -152 89 192 65 -427 -374 490 101 -347 -42 243 3 -114 31 344 -369 -183 116 -97
5507 -97 -341 -6 539 -171 -257 141 73 -104 -118 278 194 -148 -135 309 244 -328 14 231 -187 -329 249 240 -317
5530 -317 22 430 -52 -285 -23 587 229 -242 -163 243 53 -216 -48 272 -92 -79 93 306 1 77 144
5551 144 -43 -164 335 389 -180 -325 179 195 -518 -194 308 107 -384 -95 271 117 -303 -16 174 71 -293
5572 -293 96 120 -114 64 117 -174 -225 -49 408 187 -281 18 454 78 -514 132 332 -168 -304 195 193 -208
5594 -208 -66 132 136 -2 265 307 -217 -12 124 81 -417 123 211 113 -420 -213 258 124 -260 68 310 28
5616 28 -7 295 347 -8 -32 177 52 -175 41 76 43 -180 213 222 50 -364 197 208 -291 -226 370 200 -79
5639 -79 -75 195 261 -108 67 132 -187 -273 120 563 -137 -16 174 -33 -257 20 78 -18 -349 12 422 -121 -336
5662 -336 92 401 0 179 140 261 -55 -40 107 -159 -223 -57 331 -444 -138 296 208 7 -96 311 82
5683 82 -205 -169 181 319 -61 102 276 118 -340 129 228 -302 218 246 -61 -186 34 231 -87 -345 221
5704 221 290 -239 -370 -164 170 -186 -427 53 108 -174 -211 96 -9 -130 63 99 -79 -216 215 158 -379 -216
5726 -216 112 87 -363 113 484 -118 -271 83 -156 -82 -205 -45 -26 -39 -68 183 20 -265 161 228 -278 -316
5748 -316 52 173 -449 -240 294 220 -380 -8 401 10 -291 0 188 12 -63 90 325 -121 108 424 135
5769 135 -195 47 460 236 -298 70 516 -57 -311 255 322 -201 -220 105 289 -134 -182 110 -34 -52 317
5790 317 -193 -100 -170 33 172 -263 -94 351 66 -206 -10 -51 81 -217 -83 260 -250 -308 -42 231 -297
5811 -297 -329 43 -134 -290 13 410 -70 -15 106 245 -67 -107 5 376 -172 -328 375 149 -115 -99 51
5832 51 80 -322 18 34 163 168 192 -16 -21 52 374 -258 -53 -109 422 -30 -75 -20 213 -63 -205 -79 206 -99
5856 -99 -90 44 49 -319 -39 182 9 111 -46 249 -23 -19 157 247 -256 -209 95 303 6 -309 175 10 -446
5879 -446 -128 57 -167 -263 146 112 -161 -195 32 172 -535 186 62 -341 -59 123 175 -172 -244 13 -124 -323
5901 -323 -73 111 233 -161 -238 160 -6 43 37 -18 -108 34 239 233 -224 38 220 -15 -273 -188 280 -140 71
5924 71 186 245 -24 -435 -95 326 -149 -119 115 138 -355 95 132 -406 -107 142 93 -94 -30 391 131 -379
5946 -379 -144 -9 -23 -250 2 8 -375 -324 124 182 -218 -119 243 163 -176 -170 354 185 -186 -105 358 -322 -271 5
5970 5 165 -152 -422 160 59 -237 -118 24 -156 16 42 184 62 -111 283 231 -194 -237 291 74 -143 -251
5992 -251 506 58 -443 55 252 118 -86 226 364 84 -140 177 107 -91 216 169 143 -157 37 313 -184
6013 -184 -306 347 403 -192 -162 269 196 -271 -116 360 20 -198 -104 -44 -265 -105 88 148 -317 -177 358 50
6035 50 -121 -7 364 -3 -121 -363 207 50 -208 229 139 -273 -325 -2 285 -108 57 275 -61 -297 116
6056 116 263 1 102 517 230 -232 -453 331 196 -315 -61 161 135 -295 -65 478 108 -260 273 27
6076 27 -17 -136 94 111 -182 203 438 26 -364 -200 296 -419 -416 328 -70 -67 52 284 -82 -218 -179 -18 -203
6099 -203 -280 156 -5 -253 -324 61 184 -241 -144 192 -96 -219 -348 203 269 -118 -84 245 167 -152 250 201
6121 201 94 -195 149 -178 -252 146 212 -215 -300 -78 322 -70 -173 310 224 -191 80 165 147 -224 -80 203
6143 203 -139 114 114 91 49 -173 250 -26 75 11 199 107 -85 -68 74 -103 40 64 308 -170 7 -137 152
6166 152 219 -67 252 -171 57 -54 27 -108 93 32 -165 -255 -185 -2 182 -345 67 70 2 -130 -155 134 83
6189 83 -83 -37 81 -58 -155 200 450 -202 59 260 -82 -108 129 189 43 -337 49 89 28 -306 157 62 -103
6212 -103 -73 -9 115 7 257 186 -77 181 -27 140 -157 272 435 297 -159 120 266 -14 -62 123 269
6233 269 -159 71 420 128 -208 139 230 -75 -232 22 93 35 -101 5 -59 143 -117 86 158 -206 -277 89
6255 89 246 -184 196 180 137 -74 175 77 -2 -175 -170 -6 -175 -77 213 -80 -83 -25 192 33 -148 153 146 -296
6279 -296 -280 6 223 -281 40 114 86 183 -300 105 45 -165 -58 188 -145 -135 296 217 -222 -140 289 221 -233
6302 -233 -12 314 192 -160 231 115 4 -46 -30 65 4 -272 319 -117 -161 14 205 -4 -157 22 445 -206
6324 -206 -236 270 -120 -78 -88 13 18 -295 -286 119 246 103 155 372 47 -152 -71 -86 -312 -187 236 110 -343
6347 -343 -44 410 -106 -328 92 280 -46 -144 66 117 -201 -18 89 265 -72 -1 398 128 -193 -34 345
6368 345 -335 -60 210 257 -177 -45 474 155 -132 16 120 218 -272 13 178 287 40 287 -40 -29 28
6389 28 239 59 -230 1 108 149 -37 -30 235 -77 -461 91 166 -150 -216 19 123 -201 8 3 -173 -121 161
6412 161 71 118 -85 118 -25 -201 -186 140 159 -88 33 315 261 -256 -4 249 216 -143 43 232 153 -25
6434 -25 89 -131 23 38 95 -148 5 227 254 12 -81 241 122 -101 128 8 178 -50 80 12 127 88
6456 88 40 -215 -143 -95 223 -62 -150 62 309 -102 -248 198 379 -62 105 156 133 -71 -125 277 66 -124 -228
6479 -228 125 -195 -230 -22 -91 17 132 -102 -125 -195 -58 134 -22 -122 -51 143 163 -64 -79 73 106 -132 59
6502 59 202 66 -78 84 -229 -287 -147 187 -226 -11 231 78 -53 -113 409 130 -120 -173 2 313 -145
6523 -145 78 51 -68 -190 105 200 99 38 438 20 -496 119 -55 378 -193 -186 175 70 46 -40 4 -146 -250
6546 -250 -19 182 -149 219 140 -96 -187 -84 -167 77 -68 187 -22 -305 -36 241 10 -140 11 80 7 -122
6568 -122 -77 314 -24 -137 10 -159 -221 -80 44 83 30 -86 309 230 -181 -123 -84 -53 -280 14 221 -5 40
6591 40 67 94 -86 -208 111 118 -128 -16 29 76 15 -147 111 -148 -13 112 162 -130 -114 237 179 -267 55 168
6615 168 -95 15 78 63 -72 -71 -55 -61 -95 -5 28 63 -79 214 285 -140 -223 55 186 -41 -76 371 -104 -119 -222
6640 -222 150 -98 -75 3 181 -27 -197 103 -36 -186 133 184 -60 42 244 92 34 -62 240 19 2 -167
6662 -167 103 252 -146 -190 72 96 1 60 44 239 -154 230 247 -8 -7 161 166 24 4 171 102 -233 -143 247
6686 247 53 13 36 -63 -68 -388 171 230 -322 -70 48 11 -32 -64 208 40 -13 76 57 5 -51 29 122 -107 46
6711 46 62 41 83 -147 44 -69 48 169 0 -120 0 99 377 -96 -124 187 53 -220 60 51 26 -469 -9
6734 -9 309 -87 -96 210 224 -35 4 -106 79 -202 72 -8 -102 -271 15 100 -214 -130 98 78 -222 5 258 16
6758 16 104 -125 207 164 -152 197 76 -272 44 279 59 1 -27 56 -8 -218 195 59 -307 -2 25 172 136
6781 136 -133 56 285 -57 -163 -216 -41 -72 37 139 -283 -84 -166 103 102 -151 -86 21 -265 -144 246 54
6803 54 -488 -81 187 30 -408 -209 40 -365 -43 217 145 -28 55 -8 45 -302 93 233 -51 -248 255 -105
6825 -105 -13 -150 46 145 42 -269 -16 -131 -11 -47 301 212 -225 -21 -28 93 -47 -44 -85 -24 -108 156 -198 -208
6849 -208 76 4 26 -19 51 73 -25 -283 81 112 -71 36 49 -83 -228 243 101 144 -317 304 45 21 -91
6872 -91 -6 108 -143 -251 103 -149 -8 -93 121 -54 -51 38 93 -159 -198 -29 -81 -415 -59 133 -50 -336 -1
6895 -1 132 41 -230 116 314 -69 -140 -202 228 -331 -98 3 96 -127 58 162 -179 -105 -71 135 -29 -69 306
6918 306 -135 -141 -50 170 -44 -415 20 245 -69 -83 198 157 -168 -247 106 -92 53 -64 205 -226 106 28
6940 28 237 -254 -90 32 -3 -184 94 12 70 -40 68 194 113 -335 -105 7 -205 13 -57 108 133 74 140
6963 140 -44 -58 26 -54 108 -359 186 60 107 -71 105 56 -144 -39 66 137 -227 -5 142 -104 -128 -90 -24
6986 -24 -123 -41 386 82 -87 -221 149 -87 -59 -8 154 -85 -76 168 90 -103 -32 -131 -5 -129 -136 -54 -149 -34 -60
7011 -60 -84 -324 -242 165 94 4 -53 264 233 -171 -203 -162 321 -20 -207 122 20 -9 -127 293 -2 -131 21
7034 21 -34 -200 23 -60 1 -184 195 94 118 -105 47 -56 24 -129 196 -81 -216 -158 223 -16 43 7 145
7057 145 -141 -93 236 -169 -173 -91 259 -72 -201 -191 2 -100 -78 -157 130 91 -320 125 151 -147 -216 181 -211
7080 -211 -53 87 -75 90 -54 169 52 -201 -19 28 99 -131 -216 129 6 -18 -261 103 107 -338 186 105
7102 105 -11 -100 19 -114 -40 -256 75 -64 -298 45 31 -23 -146 -22 143 225 -79 83 116 -197 119 140
7124 140 63 -274 90 150 -3 -110 46 272 70 7 330 82 -144 -130 -2 6 -112 12 28 -118 -193 83 -174
7147 -174 -311 -419 192 2 -210 -232 238 115 -98 155 -182 -6 -43 20 -56 66 -31 22 68 -91 -28 182 96
7170 96 -58 -83 -28 -263 49 353 -173 -297 180 138 227 -58 -60 -27 111 -315 18 212 -268 -92 -57 5 -169
7193 -169 -42 35 81 -85 -181 48 -125 221 -187 -51 -98 -15 93 168 -198 -156 249 115 109 -18 -5 238 86
7216 86 -183 123 -197 -115 -85 19 -136 -312 -102 150 49 -102 363 -4 -132 166 150 -157 -174 -57 124 64
7238 64 151 -101 -50 84 99 77 197 42 -159 352 116 -42 -69 68 -174 119 147 -67 -108 -52 86 191 -117
7261 -117 -39 156 -291 -346 -150 81 0 -101 -29 100 -129 -91 222 -84 -233 -156 274 42 -77 70 101 -196
7283 -196 206 42 7 158 -8 30 113 16 129 0 -197 -118 -235 37 -194 30 -292 -29 -359 28 271 17
7305 17 -311 122 279 180 -99 75 -34 -162 -14 11 82 214 150 19 172 59 221 -125 -164 -280 8 200
7327 200 -277 -11 378 -244 -138 188 61 90 -311 -130 17 212 -63 -4 -23 -112 -54 246 13 -89 10 261
7349 261 -201 -78 1 102 104 -170 -23 92 -454 -354 13 18 -70 38 142 -51 10 75 107 79 138 252 62 -57
7373 -57 -117 42 -41 -283 267 40 -160 -21 59 -99 -40 -138 73 233 -21 -261 93 -81 -320 -144 160 -151
7395 -151 23 199 215 -152 -226 181 137 -322 163 182 82 45 -29 -28 171 -120 19 122 179 -178 36 -13 -181
7418 -181 -11 200 -137 -23 158 62 92 -528 5 37 52 76 52 54 -119 163 109 -48 49 159 -50 -59 148 -231
7442 -231 21 -226 -196 -7 -276 -189 44 128 66 132 6 228 65 -15 -18 84 83 -101 -80 29 -243 -42 122 170
7466 170 -161 260 29 -45 -38 44 162 6 -263 52 125 -121 -35 392 81 -26 -249 30 142 -44 126 22
7488 22 71 -19 -5 -22 -365 189 -228 -152 71 -39 43 75 -120 -137 107 96 81 50 88 -178 -119 33 -27 -86 -218
7513 -218 128 -20 19 -11 81 13 -382 361 28 -99 147 91 -83 51 -43 -103 -118 -124 -8 -19 -102 218 -7 -173
7537 -173 144 24 -43 -126 -72 237 240 -50 -23 -114 -63 -31 -19 -47 116 239 -100 50 66 27 -94 -4 -97 -140 292
7562 292 189 -198 -167 364 -239 -194 101 21 85 -68 272 88 -64 -92 293 97 -52 101 -12 32 148 56
7584 56 202 83 -38 -38 -65 -337 -72 25 362 18 -205 373 5 -53 -124 100 83 -273 15 -19 -109 212 59
7607 59 41 -146 -49 83 109 -124 57 304 -46 -332 -179 -71 308 -203 92 15 -140 212 99 10 -213 -61
7629 -61 -238 -279 -16 -132 247 -207 -211 144 252 -43 -123 64 196 -6 104 153 -125 65 184 25 133 -199
7651 -199 23 33 -196 205 266 -94 -165 -87 -112 -171 -314 -180 -242 -247 125 43 140 -139 355 121 9 141 149 306
7675 306 99 -199 121 -223 14 85 100 -261 70 80 195 6 -139 21 -53 81 21 249 146 108 -60 -11
7697 -11 -83 -97 -209 248 -236 13 35 -59 -114 90 228 -376 -267 -144 -47 -235 -70 81 321 59 -105 61
7719 61 469 17 -40 126 262 219 -181 182 31 -84 172 121 -64 -217 114 348 228 -41 205 236 -336 57
7741 57 -129 34 8 -203 26 293 -184 186 69 -262 190 -77 299 -85 108 158 -100 62 -163 27 -194
7762 -194 -199 22 185 258 185 -52 57 275 -292 258 78 77 60 274 -24 -51 241 108 -26 -22 176 130 14 24
7786 24 198 92 -186 80 82 -194 140 -81 102 -13 78 32 -143 81 -116 -132 -110 -12 47 67 -133 -210 149 -47
7810 -47 -57 -296 107 -193 -77 -146 -37 41 -152 71 108 59 8 51 171 -78 -20 146 287 -263 -179 108 292
7833 292 -38 57 223 14 -53 17 129 66 -33 -126 59 24 96 120 43 -118 106 226 -302 24 -6 178 -134 74
7857 74 150 253 -274 -105 10 -49 -58 294 51 189 126 -4 126 -399 83 -84 23 24 46 147 -28 -209 63
7880 63 -3 173 17 44 271 -154 -207 185 -51 -43 87 249 -28 263 -71 -127 -18 -209 94 42 -530 53 167
7903 167 88 -291 -125 114 -62 67 -184 253 45 -104 -71 240 -1 117 248 57 -249 67 113 108 -218 147
7925 147 303 -3 135 207 236 -2 -434 12 -63 -212 -31 133 67 -147 188 36 138 3 -37 -208 -433 -40
7947 -40 321 115 -293 6 -40 -90 -86 -73 117 -59 -128 -186 98 -34 19 113 40 -112 138 -59 -346 -173 253 179
7971 179 -239 -59 -3 19 -229 -220 90 -97 -97 -220 -148 119 -14 193 -11 -63 -26 155 -158 165 169 262 203 -246
7995 -246 -28 49 61 11 -99 94 -208 -109 86 -181 -141 11 189 150 90 92 213 134 -251 98 259 -228 153
8018 153 13 56 -201 -183 188 -19 -73 35 176 -71 -43 86 -5 -50 -132 -176 -119 -149 -322 107 281 -1 -106
8041 -106 -52 124 -25 284 129 -48 -260 112 28 169 -66 82 51 -40 -249 11 96 -9 90 114 -243 -202 -329
8064 -329 103 -10 -88 143 -74 -41 177 7 -231 -125 31 11 158 93 91 82 -23 -30 -126 70 -179 351 95 -117
8088 -117 -9 17 -42 143 -15 66 252 -6 152 -99 69 -126 50 -64 22 4 113 -140 -81 10 -130 81
8110 81 80 259 66 222 -300 0 53 -200 -181 61 76 40 -91 134 1 -204 -10 123 65 45 -4 -73 -139 -3
8134 -3 86 208 -227 24 103 26 -67 -81 312 130 99 360 -184 206 -287 -217 109 -119 -49 62 9 115 190 11
8158 11 -37 -142 172 35 -12 60 38 33 -306 34 136 -91 -171 -52 -72 31 -24 -82 -18 -11 36 100 23 -166 61 80
8184 80 -144 -64 122 131 -134 -198 33
8191C3
##END NTUPLES=NMR FID
##END=
