##TITLE=1H_SAV-32-singlet-bat19(7H)
 CDCl3, 8 sc, 
 25.11.2020
##JCAMPDX= 6.0         $$ Bruker NMR JCAMP-DX V2.0
##DATA TYPE= NMR SPECTRUM
##DATA CLASS= XYDATA
##ORIGIN= UXNMR, Bruker Analytische Messtechnik GmbH
##OWNER= root
$$ XWIN-NMR		Version 3.5
$$ Wed Nov 25 11:47:26 2020 Russian Standard Time (UT+4h)  she@DPX200
##.OBSERVE FREQUENCY= 200.1315066352
##.OBSERVE NUCLEUS= ^1H
##.ACQUISITION MODE= SIMULTANEOUS
##.ACQUISITION SCHEME= undefined
##.AVERAGES= 8
##.DIGITISER RES= 18
##SPECTROMETER/DATA SYSTEM= spect
##.PULSE SEQUENCE= zg30
##.SOLVENT NAME= CDCl3
##.SHIFT REFERENCE= (INTERNAL, CDCl3, 0, 15.9077)
##AUDIT TRAIL= $$ (NUMBER, WHEN, WHO, WHERE, WHAT)
$$ ##TITLE= Audit trail, XWIN-NMR		Version 3.5
$$ ##JCAMPDX= 5.01
$$ ##ORIGIN= Bruker BioSpin GmbH
$$ ##OWNER= she
$$ F:/spectra/data/she/nmr/H-F/1/pdata/1/auditp.txt
$$ ##AUDIT TRAIL=  $$ (NUMBER, WHEN, WHO, WHERE, WHAT)
(   1,<2020-11-25 11:45:41.34 +0400>,<she>,<DPX200>,
      <created by zg, POWCHK disabled, PULCHK disabled
       configuration hash MD5:
       00 E9 B6 7A A2 85 ED C7 34 08 36 98 17 FE 4E 26
       data hash MD5: 16K
       13 A8 55 53 71 4F AF A4 52 B8 2F 98 D8 88 2D 52>)
(   2,<2020-11-25 11:45:45.31 +0400>,<she>,<DPX200>,
      <Start of raw data processing
       efp BC_mod = 2 LB = 0.24 FT_mod = 6 PKNL = 1 PHC0 = -11052.51 PHC1 = 14.20089 SI = 16K 
       data hash MD5: 16K
       23 E3 67 29 7E E7 6C 0B A1 20 9D 47 A2 AE 45 EF>)
(   3,<2020-11-25 11:46:07.37 +0400>,<she>,<DPX200>,
      <pk PHC0 = 4.429426 PHC1 = -1.8 
       data hash MD5: 16K
       B0 B9 9A 09 05 74 66 48 BB 0A 4D B4 EF 59 F3 AF>)
(   4,<2020-11-25 11:46:11.37 +0400>,<she>,<DPX200>,
      <abs ABSG = 5 
       data hash MD5: 16K
       88 84 49 2D 15 EC E1 F1 BD B5 05 22 C7 D7 34 EC>)
(   5,<2020-11-25 11:46:29.75 +0400>,<she>,<DPX200>,
      <abs ABSG = 5 
       data hash MD5: 16K
       77 96 3B E0 D5 B5 B8 B4 97 B7 2D 26 F7 BE A1 E6>)
$$ ##END=
$$ 
$$ hash MD5
$$ D1 B1 9C D6 26 E8 78 9A DA 2B 55 26 DC 1F 6C 5B
##$RELAX= 
##$RELAX= 
##$RELAX= 
##$RELAX= 
##$RELAX= 
##$RELAX= 
$$ Bruker specific parameters
$$ --------------------------
##$DU= <F:/spectra>
##$EXPNO= 1
##$NAME= <H-F>
##$PROCNO= 1
##$TYPE= <nmr>
##$USER= <she>
##$AMP= (0..31)
100 100 100 100 100 100 100 100 100 100 100 100 100 100 100 100 100 100 
100 100 100 100 100 100 100 100 100 100 100 100 100 100 
##$AQSEQ= 0
##$AQ_mod= 1
##$AUNM= <au_zg>
##$AUTOPOS= <>
##$BF1= 200.13
##$BF2= 200.13
##$BF3= 200.13
##$BF4= 200.13
##$BF5= 200.13
##$BF6= 200.13
##$BF7= 200.13
##$BF8= 200.13
##$BYTORDA= 1
##$CFDGTYP= 0
##$CFRGTYP= 5
##$CHEMSTR= <none>
##$CNST= (0..31)
1 1 145 1 1 1 1 1 1 1 1 1 1 1 1 1 1 1 1 1 1 1 1 1 1 1 1 1 1 1 1 1 
##$CPDPRG= <>
##$CPDPRG1= <>
##$CPDPRG2= <>
##$CPDPRG3= <>
##$CPDPRG4= <mlev>
##$CPDPRG5= <mlev>
##$CPDPRG6= <mlev>
##$CPDPRG7= <mlev>
##$CPDPRG8= <mlev>
##$CPDPRGB= <>
##$CPDPRGT= <>
##$D= (0..31)
0 1.2 0 0 0 0 0 0 0 0.06 0 0.03 0 0 0 0 0.0002 0 0 0 0 0 0 0 0 0 0 0 0 
0 0 0 
##$DATE= 1606290340
##$DBL= (0..7)
$$ [...]
##$SPNAM4= <gauss>
##$SPNAM5= <gauss>
##$SPNAM6= <Gaus1.1000>
##$SPNAM7= <>
##$SPNAM8= <gauss>
##$SPNAM9= <gauss>
##$SPOAL= (0..31)
0.5 0.5 0.5 0.5 0.5 0.5 0.5 0.5 0.5 0.5 0.5 0.5 0.5 0.5 0.5 0.5 0.5 0.5 
0.5 0.5 0.5 0.5 0.5 0.5 0.5 0.5 0.5 0.5 0.5 0.5 0.5 0.5 
##$SPOFFS= (0..31)
0 0 0 0 0 0 0 0 0 0 0 0 0 0 0 0 0 0 0 0 0 0 0 0 0 0 0 0 0 0 0 0 
##$SUBNAM0= <"">
##$SUBNAM1= <"">
##$SUBNAM2= <"">
##$SUBNAM3= <"">
##$SUBNAM4= <"">
##$SUBNAM5= <"">
##$SUBNAM6= <"">
##$SUBNAM7= <"">
##$SUBNAM8= <"">
##$SUBNAM9= <"">
##$SW= 16.9725356469052
##$SWIBOX= (0..15)
0 0 2 0 0 0 0 0 0 0 0 0 0 0 0 0 
##$SW_h= 3396.73913043478
##$TD= 16384
##$TD0= 1
##$TE= 0
##$TE2= 300
##$TE3= 300
##$TEG= 300
##$TL= (0..7)
0 120 120 120 120 120 120 120 
##$TP= (0..7)
150 150 150 150 150 150 150 150 
##$TP07= 0
##$TPNAME0= <>
##$TPNAME1= <>
##$TPNAME2= <>
##$TPNAME3= <>
##$TPNAME4= <>
##$TPNAME5= <>
##$TPNAME6= <>
##$TPNAME7= <>
##$TPOAL= (0..7)
0.5 0.5 0.5 0.5 0.5 0.5 0.5 0.5 
##$TPOFFS= (0..7)
0 0 0 0 0 0 0 0 
##$TUNHIN= 0
##$TUNHOUT= 0
##$TUNXOUT= 0
##$USERA1= <user>
##$USERA2= <user>
##$USERA3= <user>
##$USERA4= <user>
##$USERA5= <user>
##$V9= 5
##$VALIST= <valist>
##$VCLIST= <CCCCCCCCCCCCCCC>
##$VD= 0
##$VDLIST= <DDDDDDDDDDDDDDD>
##$VPLIST= <PPPPPPPPPPPPPPP>
##$VTLIST= <TTTTTTTTTTTTTTT>
##$WBST= 1024
##$WBSW= 4
##$XGAIN= (0..3)
0 0 0 0 
##$XL= 0
##$YL= 0
##$YMAX_a= 498824
##$YMIN_a= -427433
##$ZGOPTNS= <>
##$ZL1= 120
##$ZL2= 120
##$ZL3= 120
##$ZL4= 120
##$ABSF1= 15.90773
##$ABSF2= -1.064932
##$ABSG= 5
##$ABSL= 3
##$ALPHA= 0
##$AQORDER= 0
##$ASSFAC= 0
##$ASSFACI= 0
##$ASSFACX= 0
##$ASSWID= 0
##$AUNMP= <proc_1d>
##$AZFE= 0.1
##$AZFW= 0.1
##$BCFW= 0
##$BC_mod= 2
##$BYTORDP= 0
##$COROFFS= 0
##$CY= -3
##$DATMOD= 1
##$DC= 0
##$DFILT= <>
##$DTYPP= 0
##$F1P= 0
##$F2P= 0
##$FCOR= 1
##$FTSIZE= 16384
##$FT_mod= 6
##$GAMMA= 0
##$GB= 0
##$INTBC= 1
##$INTSCL= 2.992141e-10
##$ISEN= 128
##$LB= 0.24
##$LEV0= 0
##$LPBIN= 0
##$MAXI= 10000
##$MC2= 0
##$MEAN= 0
##$ME_mod= 0
##$MI= 1.114404
##$NCOEF= 0
##$NC_proc= -7
##$NLEV= 6
##$NOISF1= 3.799351
##$NOISF2= 2.8
##$NSP= 0
##$NTH_PI= 0
##$NZP= 0
##$OFFSET= 15.90773
##$PC= 1
##$PHC0= -11048.08
##$PHC1= 12.40089
##$PH_mod= 1
##$PKNL= yes
##$PPARMOD= 0
##$PSCAL= 0
##$PSIGN= 0
##$REVERSE= no
##$SF= 200.130021390504
##$SI= 16384
##$SIGF1= 3
##$SIGF2= 2
##$SINO= 5.538805
##$SIOLD= 16384
##$SREGLST= <1H.CDCl3>
##$SSB= 0
##$STSI= 16384
##$STSR= 0
##$SW_p= 3396.73913043478
##$SYMM= 0
##$S_DEV= 0
##$TDeff= 16384
##$TDoff= 0
##$TI= <>
##$TILT= no
##$TM1= 0
##$TM2= 0
##$TOPLEV= 0
##$USERP1= <user>
##$USERP2= <user>
##$USERP3= <user>
##$USERP4= <user>
##$USERP5= <user>
##$WDW= 1
##$XDIM= 16384
##$YMAX_p= 467827457
##$YMIN_p= -1406863
$$ End of Bruker specific parameters
$$ ---------------------------------
##XUNITS= HZ
##YUNITS= ARBITRARY UNITS
##XFACTOR= 0.207333158178281
##YFACTOR= 1
##DELTAX= -0.207333158178281
##NPOINTS= 16384
##FIRSTX= 3183.61436569551
##FIRSTY= 0
##LASTX= -213.124764739273
##MAXY= 467827457
##MINY= -1406863
##XYDATA= (X++(Y..Y))
$$ [...]
10266 1331312 846920 559994 700899 1085008 1033682 920895 1003838 845705 412326 690093
10256 690093 793227 630058 551795 665695 928277 847924 1014359 980380 886776 683460
10246 683460 768411 983783 1308566 1000649 744676 659263 698083 809363 464396 450081
10236 450081 674871 849816 1215606 943785 438903 500229 681048 835624 700364 764214
10226 764214 914960 940525 903438 850103 891169 840743 811796 588061 693457 396758 474523
10215 474523 831761 954818 512189 528314 946953 855096 831948 1072965 971461 922312
10205 922312 1100417 1255723 1231886 763144 695336 1103297 1087235 889609 427634 237902
10195 237902 327021 355760 898528 1023560 866444 762819 875611 1109770 814431 698663
10185 698663 687693 603985 636786 393513 124192 414967 666113 530510 406700 387002
10175 387002 362707 214465 546702 1047067 1097494 1086544 1147077 990155 910241 622881
10165 622881 212510 150436 385438 815102 944079 915517 502230 -5345 138959 539155
10155 539155 463866 764946 1541329 1383208 1048867 748599 310435 165620 519454 694424
10145 694424 863813 764465 980889 1014991 926233 867625 834371 767229 762940 844706 1256179
10134 1256179 1000658 995513 1142882 688389 612495 208587 735076 921120 537835 308278
10124 308278 182081 189975 -23833 220162 576712 496500 376347 677868 746638 511449
10114 511449 56948 300000 759824 778815 532065 285756 388841 737817 441959 -7436
10104 -7436 114379 71910 190267 500784 825489 749405 489646 432957 515896 491184 490250
10093 490250 608812 907735 396666 -127424 -103591 415704 721035 386952 -120267 -112467
10083 -112467 270712 540034 439068 298850 92255 499778 712846 822869 568531 77166
10073 77166 -65267 261777 597842 444992 423834 62956 263649 105325 166462 461503
10063 461503 245531 280382 389764 892917 1009980 416933 129074 9069 135966 642682
10053 642682 598681 519959 276821 347056 554051 574720 582201 335495 877470 1261585 666576
10042 666576 349512 346298 286985 496312 648621 424513 532339 493411 132966 -121702
10032 -121702 -171952 -22982 214868 292825 202116 291886 459770 392220 135487 248485
10022 248485 164815 359663 645572 853981 433875 -191361 -167635 66228 222860 433808
10012 433808 345181 354167 -206494 -175971 323170 347738 549571 769434 455925 437999 487773
10001 487773 430172 551671 516186 191194 219284 497762 634896 564129 354559 122913
9991 122913 -129821 -207853 461817 1099456 795387 655930 657757 741674 462603 307624
9981 307624 631604 515940 419148 153516 89482 191164 196701 -130370 48197 470592
9971 470592 386247 42306 181234 557807 474979 319527 -165480 130200 129339 -19737 209061
9960 209061 343561 159595 -328637 -49628 541580 150942 110493 439053 306372 235477
9950 235477 163930 422135 717130 551675 357699 267280 526877 229933 256056 309527
9940 309527 152101 85821 258280 455881 397077 106910 -97618 128434 498751 427056
9930 427056 221671 285085 247691 730751 1154189 826931 281759 67010 212800 304575
9920 304575 388937 459962 319401 517853 614578 371373 684033 1116484 1550340 1735775
9910 1735775 2207342 2316282 2071617 1492028 965910 1124821 874877 608087 740766 429800
9900 429800 270547 719443 717095 240332 419394 545379 596684 1119175 1338643 1115928
9890 1115928 510739 280829 534362 695430 327849 53383 -172689 83216 330826 -133565
9880 -133565 -63617 120034 125427 292951 552718 496643 533502 459713 211803 186170 91579
9869 91579 41154 66116 156450 555591 839053 474542 -277515 -517290 -345673 -276914 -5001
9858 -5001 220524 233653 336657 158680 -81791 -21130 74076 321649 484847 566988 532249
9847 532249 898344 996304 612541 91357 -313672 -208407 300186 383916 566504 394749
9837 394749 -94382 47248 215673 272104 168739 356429 791069 537909 339549 -26102
9827 -26102 -36153 138599 325855 225754 -104739 -24904 352190 258348 231105 59907 -13663
9816 -13663 68426 128620 233379 -19126 -83271 -42610 -115029 116620 58903 -27896 79211
9805 79211 151815 -104543 -235665 102973 537089 519523 294055 -82687 -266880 -199804
9795 -199804 -145324 76021 304750 548682 418978 258696 76622 -244940 -311648 52001
9785 52001 200841 156941 242104 -318 -409354 -546549 -88846 -127360 -259163 -127084
9775 -127084 14054 441434 220698 -68413 -139984 -213928 -441535 -262442 -33983 -101931
9765 -101931 -52216 88050 -151520 -134101 -23428 164951 170231 519417 119731 -271809
9755 -271809 -237556 -27436 350880 353103 311711 231422 -128293 -98273 -18518 94318 85308
9744 85308 -111960 -12679 134888 187432 674503 450906 286023 216065 -158570 -156799 -121847
9733 -121847 154503 338988 166964 69482 -179634 -432192 -621327 -434208 -60967 162640
9723 162640 240261 -2105 -51588 34358 47559 -33363 12553 875 -52703 57502 -85311
9712 -85311 -63550 90579 -67423 248009 335099 31815 -128941 68489 225759 -48626
9702 -48626 -237886 -225219 193967 419095 404482 333220 33157 -359131 -513614 -344328
9692 -344328 -200527 -408907 -535908 -184791 -366369 -401330 -160294 163806 162957 -13343
9682 -13343 -147554 -116713 58892 276195 168923 263430 256905 -154682 -110351 117757 131243
9671 131243 -87712 -98551 41264 -138058 -8597 69616 89866 284241 352695 -55728
9661 -55728 17544 -57616 84332 77289 300915 153356 -425359 -346798 41703 175637 146708
9650 146708 90630 138488 281434 -133738 -56627 188162 556326 470337 69733 -35925
9640 -35925 -74005 -317788 -21447 68506 -182605 -59859 -132833 -437468 -828927 -689144
9630 -689144 -63824 175362 -28550 -36313 221783 501531 460199 262787 151021 177657
9620 177657 174700 148393 221623 174782 192556 19982 130278 195789 187675 309698 639794
9609 639794 339188 17207 346205 379967 518181 457096 540919 538026 294639 16998 -75306
9598 -75306 51407 403039 217878 182616 409491 340025 529402 648287 490791 399174
9588 399174 170634 185731 581728 645951 838636 914582 864074 888439 1249085 1090263 662982
9577 662982 1062447 1113751 1231067 1408483 1459741 1260202 1233792 1463128 1604397 1694023
9567 1694023 1713239 1923524 2001250 2093697 2010403 1703475 1355509 1269404 1027289 1267192
9557 1267192 1374248 1417549 1359213 1426265 1464085 1732826 1866362 1637008 1710697 1520118
9547 1520118 1485625 1582689 1202229 1116652 1019198 849408 1150672 1206049 847921 787540 881464
9536 881464 981361 775935 564940 447247 441278 608703 389599 332907 514140 413854
9526 413854 338435 743201 798430 449970 366811 143230 -70590 -255225 253866 489214
9516 489214 327338 87090 285143 680716 719855 718236 812240 608652 505256 66231
9506 66231 53784 290014 254506 335556 -8490 -89933 43227 13314 54650 247303 9461
9495 9461 -48175 118227 175030 -252365 -218977 -436532 -310669 -322982 -438681 -336963 -333095
9484 -333095 -232217 44219 -422172 -530128 -417008 65394 289673 281174 19917 -119248
9474 -119248 -9380 227872 -13744 12503 -65329 -109891 -97605 -70319 -178776 -347637 -24862
9463 -24862 -58977 -231962 92531 382298 216129 227331 -6173 -85193 180929 148713 -32681
9452 -32681 71688 139826 466309 213396 -272054 -408956 -336786 -126560 -252851 -322099
9442 -322099 78164 -234578 -273402 -506508 -323429 74131 -133076 -74003 -38554 -541949
9432 -541949 -666171 -572814 -324855 74552 -165885 -485646 -425782 -676426 -557887 -510544
9422 -510544 -177388 -227203 -266056 -357508 -397377 -194501 -305468 -393827 -42188 202402 87090
9411 87090 -12751 117723 179044 -75606 -210450 -258899 28169 414175 304615 -179427
9401 -179427 -115796 10821 -14300 131737 359200 309796 94463 -98200 -713701 -516807
9391 -516807 -220018 111518 -20685 -506077 -398919 -321548 104676 -40776 -231947 -320808
9381 -320808 -469847 -392198 -479146 -395351 -313188 -875843 -987071 -794089 -541221 -260374
9371 -260374 -406054 -676806 -525031 -101663 203891 -220681 -436667 -419486 -234600 -196109
9361 -196109 -188221 -381177 -371105 -172327 -196615 128713 -247132 -538685 -533122 -269645 -349977
9350 -349977 -185024 13331 -102296 -71727 -73569 -148447 -461213 -68923 93744 -137306
9340 -137306 -262340 -508796 -491147 -325960 -364350 -31707 -208751 -131594 -208601 -711515
9330 -711515 -389201 77606 -242551 -267256 -532901 -139007 -193692 -70808 81961 -143846
9320 -143846 -57695 -368938 -596366 -607529 -451660 -389791 -404962 -956702 -825673 -149568
9310 -149568 301578 -80169 -746519 -962745 -636864 -95828 506040 356148 -360970 -382012
9300 -382012 -509976 -169826 17783 -411066 -262329 -111149 24092 161375 83744 -11914
9290 -11914 -257110 -201758 107259 208960 349157 110564 -128557 -506173 -618367 -524141
9280 -524141 -236468 -266399 -236324 -265987 -256284 -320483 -663841 -462695 -475692 -500969 -234513
9269 -234513 -54593 -15486 -513752 -832273 -677029 -392319 -404646 -289934 38722 40904
9259 40904 -32592 -271390 -758970 -912768 -811445 -557014 -273678 -50750 -76632 -121887
9249 -121887 -233012 -314338 -405960 -422149 -587308 -415581 -335662 -3266 229059 -181550
9239 -181550 -566852 -426546 46827 -52632 -447633 -318206 -368573 -254792 -132802 -141301
9229 -141301 -485745 -758793 -654527 -404483 28794 -54634 248430 73142 -317005 -581278
9219 -581278 -814506 -562174 -466101 -486452 -290489 -466920 -60929 -31054 -203647 -468209
9209 -468209 -586188 -501560 -414367 -171636 10138 -217867 -466317 -347407 -57911 -186244
9199 -186244 -276099 -26221 58498 127218 -85686 -41746 58693 -233654 -58996 173072
9189 173072 48066 -88916 -179253 -55458 115771 -288893 -415312 -23649 156626 211598
9179 211598 -146828 -259712 64921 618483 302884 -144987 -303620 -542609 -17345 511206
9169 511206 426011 97409 -35497 -41429 143782 -135771 -76942 -216875 -230136 157608 108403
9158 108403 -132960 -220364 -28963 638335 673738 232828 155555 199646 709869 406365
9148 406365 193034 264839 547749 680396 448764 169958 199037 250045 460236 598624
9138 598624 665676 634664 434010 646771 460349 29042 11019 862269 890543 363333
9128 363333 200691 201851 569531 713913 485923 885652 965838 515659 469782 334640
9118 334640 287704 404907 328595 339292 774228 723206 273823 224308 343034 356577 445436
9107 445436 315539 108553 -105870 -67402 259348 326419 117837 35182 25167 196936
9097 196936 139497 -134893 -59463 -15898 98357 -5938 -235854 -112126 200183 185539
9087 185539 -19495 -344767 -404344 70187 611292 488028 -119118 -356016 -231260 -450495
9077 -450495 -272887 9663 290243 144369 -264697 -383848 -564928 -851507 -601288 -89913
9067 -89913 -8078 29697 -194833 -139361 -248430 -145414 -97875 140307 245670 103477 244256
9056 244256 353270 103012 -455294 -762545 -323732 -22108 90389 108033 176562 -320712
9046 -320712 -550202 -588686 -384166 295947 412286 126363 -312261 -502597 -444718 -452883
9036 -452883 -430258 -356994 -533172 -475155 -306300 -324351 -848618 -1078568 -934328 -385265
9026 -385265 -151930 -526917 -627873 -588874 -497483 -474418 -188549 -111958 -191025 -263369 -99509
9015 -99509 255935 165919 -336340 -449900 -39373 -311844 -282263 28751 146261 -390798
9005 -390798 -405000 -60535 55044 176480 55404 111789 -104691 -52425 -108355 -48726 -173991
8994 -173991 -21066 -125705 -741034 -1082146 -1024500 -751711 -155974 100003 -119901 -308399
8984 -308399 -505944 -78507 91681 67242 165345 -118864 -456413 -594976 -681397 -278426
8974 -278426 -121123 -275523 -581807 -588108 -319423 -294559 -498430 -820887 -772739 -816459 -690979
8963 -690979 -20917 74069 -333075 -642148 -429184 -472051 -639902 -635279 -519834 54024
8953 54024 -245444 -591345 -541526 -606831 -411815 -319988 -575751 -588617 88023 371496 536033
8942 536033 62315 -188800 -300621 -327691 73471 145142 -240256 -516606 -490523 -537960
8932 -537960 -638486 -705277 -651135 -432163 -64131 -13282 -42559 -396909 -524839 -834876
8922 -834876 -877652 -731270 -160284 14159 -127597 -518144 -476987 -310737 -679609 -466029
8912 -466029 -396561 -321952 -197312 240362 406531 109421 -359997 -697898 -563096 -153337
8902 -153337 -4022 -262539 -260287 -9415 -66137 -322716 -386228 -452653 -316099 250367 106988
8891 106988 -610920 -563151 -296653 -170076 217118 -49297 -355877 -53519 13618 -114312
8881 -114312 -135527 -117376 -347475 -281432 -209758 -285885 94431 -92365 -565421 -587321 -322123
8870 -322123 -32209 409516 174302 9038 -335479 -643014 -240726 -34119 178916 -7482
8860 -7482 -102825 -59392 -306712 -129820 92935 -99432 -161215 277388 694928 123918 -693243
8849 -693243 -738896 -327929 108406 292870 457633 247757 -87454 -498179 -372400 -344796
8839 -344796 -327640 4970 146487 401233 228485 104989 345719 225101 256906 278769
8829 278769 435653 699576 527172 682117 284536 406809 214402 315151 520560 437378
8819 437378 552425 689009 716253 793816 346376 731210 946905 725628 463351 173258
8809 173258 366937 188126 440659 502724 211511 173590 -3047 121797 651845 443644
8799 443644 322132 358654 453998 395945 393477 395844 407660 476628 450721 582428 825664
8788 825664 285246 -73148 -109078 -52057 212216 417600 473702 234914 272303 365678 192556
8777 192556 233141 406634 220672 374156 185609 157768 329629 411008 487970 -86608
8767 -86608 -225841 109312 592444 721368 552905 299853 481064 376484 477539 585887
8757 585887 216207 91881 442638 718397 895166 1027636 607317 635647 695544 391812
8747 391812 240557 555974 546278 404850 493319 468876 302889 325014 626370 641902 504645
8736 504645 1194311 1156308 683080 439138 53846 365975 1137159 1164488 889150 1024277
8726 1024277 1157028 545514 539428 714975 626074 637922 1146401 1312156 1221125 1416200
8716 1416200 1340183 1590559 1905344 2436611 3165673 3717569 3000967 1983673 1933841 2201139
8706 2201139 2028946 1613415 1291967 1414923 1619674 1597198 1355256 1082333 1270674 1460690
8696 1460690 1857027 1978136 1140074 820506 814031 1284525 1382215 1191352 1183402 1101629 1084510
8685 1084510 1475984 1176307 1179310 1107611 1319745 1955998 1386719 863940 671301 884193
8675 884193 1413902 1564878 1553862 1699850 1611106 1265096 1265481 1186398 1317885 1368961 1842814
8664 1842814 1884357 1262478 1095047 1218331 1545355 1332737 1033503 1066564 1133312 1468800
8654 1468800 1283954 1234905 1351055 1241182 1332974 1396394 1094891 1376716 1267085 1167479
8644 1167479 1037757 867672 1142360 1436255 1578041 1375343 1120819 1374431 1616053 1548341
8634 1548341 1638928 1675214 2162407 1890185 1960976 1693010 1487239 1229631 1698800 1777658
8624 1777658 1820878 1550224 1486799 1501453 1609254 1638879 1136403 1096799 1392365 1220630
8614 1220630 1361727 1439370 1366592 1365441 1007148 1476677 1634305 1730791 1888839 1850088 1970837
8603 1970837 1764607 2046905 2225674 2372181 2470555 2298763 2454319 3134351 3242413 3167117
8593 3167117 2742155 2732229 3664439 3515947 3741463 4006736 3920547 4357602 4430610 4366054
8583 4366054 4379878 4129804 4754155 5643917 6146659 6128708 6128498 6668705 7585553 8281479
8573 8281479 9070478 9906144 10655277 11665838 12910599 14601555 16250856 18205755 20539192
8564 20539192 23993543 28753572 34187894 41196740 49250624 55963047 57158551 54370102
8556 54370102 53999275 55324764 52907177 45566903 37007939 30743985 25711996 22029430
8548 22029430 19670694 17162025 15025656 13638365 12117826 11239186 10156696 9285161
8540 9285161 9007860 8297694 7678826 7667859 7124921 6406218 6043335 6206436 5804237 5349448
8530 5349448 5414296 4998076 4801576 4235961 3777245 3869651 3381419 3107321 3455895 3307660
8520 3307660 2965544 2860562 3076789 3099042 2310122 1738201 1861520 2183058 2515687 2226476
8510 2226476 1889797 1832976 1528618 1574898 1784841 1420912 918132 1072415 1387512 1579572
8500 1579572 1758418 1470732 1393984 1124077 915953 723486 862955 927442 1154131 815746
8490 815746 645108 772458 465860 432973 589731 771480 908869 590088 632417 703123
8480 703123 674966 849113 589426 656081 613390 744334 1025358 688899 187083 -182464
8470 -182464 267063 357157 375507 523807 421786 32074 -5347 117600 234019 316490
8460 316490 254184 366534 365266 600031 378144 177532 -69619 -75142 -96598 303380 440981
8449 440981 162972 -88735 -127070 43861 459223 403897 389509 204842 -134487 -78763
8439 -78763 75663 195407 81470 -66503 45212 110499 75556 -140703 -321643 -577005
8429 -577005 -335690 -182038 -29100 17734 15781 -326229 -340740 -305821 -530123 -74243 225320
8418 225320 197430 -339771 -927172 -1168472 -1006632 -531200 -255330 -336543 -47591 255079
8408 255079 343606 38989 -373203 -328543 306 48437 288716 156338 -49664 -188918
8398 -188918 -18531 -12907 -439071 -256475 276611 296679 -79067 -554173 -312679 -266059
8388 -266059 -391818 -366283 -358453 -403806 -183981 81963 45322 -487545 -566396 -147524 -115933
8377 -115933 -403499 -379765 -314623 -749793 -1004403 -855352 -609083 -531899 -456317 -344568
8367 -344568 -56887 -396070 -443980 91636 -128039 -316795 -278201 -244758 -503033 -374335
8357 -374335 -83357 -3224 -416673 -261859 -171091 -341131 -608711 -693297 -384015 -125745
8347 -125745 361906 437649 132106 -197701 104446 379697 509055 123439 -187331 -629019
8337 -629019 -486697 -471235 -337636 -226263 -852537 -828816 -431164 -354607 -548053 -387261
8327 -387261 99776 -270137 -705396 -710133 -241576 -61212 -98746 -666355 -849815 -1177142
8317 -1177142 -1406863 -901192 -512763 -524723 -736093 -640426 -473652 -684936 -364059 45324
8307 45324 -148437 -112438 -71203 -67377 138113 -29506 -233913 -430344 -855997 -665243 -595967
8296 -595967 -286165 -272636 -507570 -351509 -248096 -265351 -61982 -331581 -142730 -83219
8286 -83219 -361343 -355354 -224956 -535505 -718093 -800423 -444124 -324233 -559627 -807354
8276 -807354 -771814 -289741 -213115 -341173 -575868 -641204 -657175 -473161 -337760 -428071 -1023742
8265 -1023742 -1047220 -825084 -1028521 -1200332 -1182114 -680530 -547493 -424543 -595515 -545866
8255 -545866 -334010 -401442 -133904 -133511 -576452 -364269 4358 -83064 -127621 -673632 -740080
8244 -740080 -774598 -699589 -635339 -730101 -483007 -695587 -799840 -646277 -514967 -136401
8234 -136401 296479 495667 284040 -158762 -215251 -633930 -566892 -351556 -550918 -795596
8224 -795596 -564651 -499339 -628380 -877040 -1021707 -469600 -503066 -174835 -123351 -49008
8214 -49008 -246638 -324090 -569434 -279939 -661881 -703416 -262322 3624 -335633 -552603
8204 -552603 -885311 -1140527 -1314828 -1031807 -539854 -366552 -680973 -204188 71488 62869
8194 62869 334 1578252 2722795 166134 -330917 -841858 -1075622 -1037337 -560504 -693638
8184 -693638 -753368 -853987 -326209 51790 -51038 -660843 -1166141 -732148 -23205 329939
8174 329939 180173 -130377 -310636 -180277 -246983 -841192 -1312705 -885129 -259114 -853427
8164 -853427 -1249042 -957061 -730596 -377953 -648826 -769426 -1114069 -757582 -292900 -589038
8154 -589038 -893733 -606232 -240747 -275568 -691658 -1202826 -1362092 -1153900 -1007386 -998206
8144 -998206 -662206 -259844 -348472 -302257 -432418 -832429 -800857 -660403 -425211 -222204
8134 -222204 -234610 -265899 -457715 -804131 -918119 -667058 -64504 -372448 -524040 -417122
8124 -417122 -490456 -460025 -325847 -699207 -711595 -355011 -69190 -98822 -658913 -696759 -698176
8113 -698176 -704014 -762637 -775658 -1123947 -920925 -941652 -714663 -841442 -680672 -311687 -495252
8102 -495252 -552994 -573865 -913233 -580258 -392749 -689587 -635075 -638681 -644421 -466179 -662560
8091 -662560 -763427 -865358 -850810 -729127 -739039 -436784 -48735 19693 -367743 -749816
8081 -749816 -601942 63956 206866 -46791 -448242 -1143691 -1089087 -538215 -27160 74022
8071 74022 -276586 -366968 -548728 -499992 -474066 -117779 376556 357009 -125030 -235486 -304212
8060 -304212 -169168 -453938 -776378 -773470 -323999 -79642 -58487 -91789 103309 -18878
8050 -18878 -518997 -593814 -300404 110283 299625 475013 309407 166329 255802 197037
8040 197037 38242 -234256 -288977 -265057 32879 -9775 -144262 85874 75493 538070
8030 538070 757601 860100 987026 966429 1047190 986206 935182 1506277 1470525 1472695 1383222
8019 1383222 1365912 1650506 2166579 2431979 2320711 2637643 2684532 2330734 2371131 2263835
8009 2263835 1573008 1822994 2049655 2118563 2104785 1947267 2263250 2581777 2654739 2504790
7999 2504790 2232177 2543566 2747309 2892865 3114386 2926223 3614651 4064622 4353566 4972905
7989 4972905 5198284 5486112 5865302 6429789 7196750 7873510 8642532 9901652 11495205
7980 11495205 13741425 16095270 19315685 23275063 28092681 34802211 43539871 47388828
7972 47388828 40111791 30014721 23177607 18767587 16164786 13758005 12065311 10688757
7964 10688757 9069572 7409465 6732643 6071214 5477717 5192855 4596009 4313431 3982612
7955 3982612 3774733 3501062 3076017 2918942 2614667 2538956 2568741 2160940 1787600 1757868
7945 1757868 2046464 1885154 1508439 1420956 1236337 1071622 1406397 1554257 1741610 1416851
7935 1416851 1006490 1030438 815724 1137983 1399924 994105 884949 479686 453560 419371
7925 419371 672609 715974 612141 604612 598172 426230 867628 721382 469038 369596 352215
7914 352215 524063 288588 312029 508800 433490 397646 385847 81924 -286043 -366907 -83916
7903 -83916 -105094 -389560 -212088 78215 407883 163448 127533 250290 -151502 -57275
7893 -57275 97036 361265 404787 501983 385973 99822 82730 122865 -224666 -196220 -197198
7882 -197198 -316609 -368666 -468463 -228462 -201479 -478822 -462047 -450417 45968 198607 -195802
7871 -195802 -228040 -251061 -526685 -497596 -408571 -452296 -485953 -628671 -366870 -448820 -282931
7860 -282931 73805 150451 -8486 -282673 -83163 -44682 -394213 -761148 -751529 -368576
7850 -368576 -34565 -391857 -397346 -854273 -466919 -629244 -584045 -159747 -21847 -38065
7840 -38065 -125136 -318392 -398777 -546370 -560654 79830 216477 228190 -369018 -768871 -347522
7829 -347522 -645987 -762402 -555581 -272823 -313717 -460329 -326433 -599647 -789474 -514805
7819 -514805 -312172 -174424 -339608 -363044 85240 97688 -625608 -920419 -505312 -479667
7809 -479667 -534554 -654552 -707984 -201928 117790 22855 155746 -200774 -388164 -344552
7799 -344552 -267656 -272933 -467159 -453188 -130195 -462481 -705436 -864825 -652023 -490829
7789 -490829 -538708 -581864 -526500 -559275 -611947 -378385 -161450 -350037 -374915 343569 755756
7778 755756 587613 68999 -153454 112098 10921 -88377 -394486 -552228 -319998 -340516
7768 -340516 -408827 -253480 -207727 -89173 52735 -202602 -622724 -546198 -564504 -54054
7758 -54054 -70795 -257563 -602574 -711475 -852784 -889512 -675891 -667907 -685430 -543436 -826601
7747 -826601 -609429 -599003 -691795 -654744 -699466 -807427 -795915 -581246 -596301 -904637 -1246429
7736 -1246429 -1110726 -872156 -520455 -363437 -790368 -1125997 -702002 -485353 -537411 -752595
7726 -752595 -531472 -673377 -252028 -264996 -370631 -459320 -627980 -611849 -418589 -418336 -219907
7715 -219907 -165915 -62048 -272919 -501621 -439735 -905099 -767437 -378764 -479613 -668629
7705 -668629 -403822 -243962 -374658 -506361 -917003 -807356 -528636 -409745 -861944 -765468
7695 -765468 -758496 -767747 -494596 -828854 -917735 -701161 -292261 -246837 -390360 -785681 -684568
7684 -684568 -210293 -21728 101508 -328594 -540954 -296585 -79155 25830 -691732 -804918
7674 -804918 -533413 -506302 -723960 -515326 -121811 -243492 -370146 -637671 -548502 -350124
7664 -350124 -279448 -190061 -106989 -127020 -191554 6752 222959 -446619 -427179 -233392 74823
7653 74823 -38620 -170852 -214073 -297559 -151494 -105886 -158946 -362342 -421757 -533983 -239804
7642 -239804 28539 10079 -196383 -447537 -408062 -619183 -879573 -688746 -428417 -286737
7632 -286737 -374839 -777710 -660321 -416942 -550563 -647726 -815634 -740512 -731108 -479303 -246226
7621 -246226 -302881 -842784 -1067639 -677704 -426333 -691059 -578604 -629781 -580990 -676648
7611 -676648 -854145 -944034 -664186 -197363 -112057 -93335 -680645 -1114944 -1048148 -570651
7601 -570651 -738834 -900724 -969365 -395346 -162770 -245483 -426936 -966762 -724708 -778331
7591 -778331 -663700 -501103 -415975 -149377 169039 -439796 -735821 -1032011 -961127 -438124
7581 -438124 -535848 -400592 -616685 -407512 -71998 -456293 -831977 -1026982 -945508 -531061
7571 -531061 -523698 -453959 -627592 -630986 -265955 -837902 -1008501 -1097063 -913645 -413367 -383133
7560 -383133 -460728 -657213 -942249 -953243 -828116 -783459 16959 164981 -127283 -175169
7550 -175169 -264035 -342588 -411449 -167530 -84425 -401189 -409388 -360327 -359043 -351791 -582927 -218566
7538 -218566 -230773 -271235 -146522 159965 -242642 -694544 -1048409 -1133331 -695288 -392193
7528 -392193 -206985 -179240 -661750 -911080 -937062 -810260 -754057 -899704 -529722 -191613
7518 -191613 -34812 -318698 -643944 -690516 -457523 -823331 -1173394 -679188 -519516 -461715
7508 -461715 -294187 -399370 -476030 -813165 -728690 -268598 -645683 -727666 -375129 61633
7498 61633 -141593 -809561 -611484 -635800 -448417 -386880 -517430 -465768 -386719 -616328 -571879
7487 -571879 -499461 -460689 -817826 -761885 -272389 -355937 -458504 -661320 -531471 -757981
7477 -757981 -1352556 -1393695 -674653 -291998 -153788 359028 246926 -668458 -969995 -548765
7467 -548765 -218187 -392031 -534647 -526529 -494748 -352586 -607194 -815600 -1102539 -882797
7457 -882797 -537823 -51850 109552 -467558 -496868 -326019 -524557 -1143756 -1210904 -686958
7447 -686958 -436830 -342569 -784827 -1074702 -994446 -936879 -1020965 -781109 -658822 -559539 -318737
7436 -318737 -323012 -402479 -528606 -990495 -877940 -663490 -820109 -738347 -645223 -667529 -487149
7425 -487149 -800649 -990300 -867140 -562187 -390351 -210044 -428901 -762801 -571950 -467010
7415 -467010 -512543 -710097 -796601 -876690 -258633 -97255 -460142 -666459 -429685 -384697
7405 -384697 -557334 -426471 -459699 -360812 -432512 -428783 -469791 -739108 -643478 -458508 -521502
7394 -521502 -493127 -341953 -38351 11592 -351745 -527088 -719186 -664020 -590995 -651286 -641343
7383 -641343 -432233 -406816 -454819 -690986 -426606 -279688 -519344 -618259 -545322 -557486 -448309
7372 -448309 -469957 -217112 -217471 -121545 5067 110833 -91865 -123903 31942 -268625 -272115
7361 -272115 -566862 -578642 -140975 390689 51186 -263709 -15289 100720 282717 254714
7351 254714 110421 -218171 86585 489826 535399 52034 -386260 -355803 -317130 -62035
7341 -62035 1898 288592 53571 -15503 -8972 -443084 -582267 -469878 59052 435415 263761
7330 263761 35196 -7919 76324 109873 -251815 -338148 37088 739284 989386 761336
7320 761336 332208 127599 409334 936592 1142547 676090 595036 961612 1325663 1354132
7310 1354132 778692 411325 832577 1362624 1604675 1630552 1633233 1735133 1952408 2072611
7300 2072611 2119390 2026273 2252346 2868230 3050841 3015474 3208442 3326031 3921352 4140351
7290 4140351 4697498 5637713 6575161 7946825 8633122 9010150 8899156 8780032 8981037
7281 8981037 8970236 8865156 8585018 7699251 6650680 5983920 5278068 4908296 4364220 4129222
7271 4129222 4298364 4405995 4534773 4459441 3879865 4065915 4546828 4438103 3994520 4324038
7261 4324038 5115722 5363861 5476277 5391228 5007139 5046711 5373953 6129441 6450695 6437765
7251 6437765 7066358 7942517 8299702 8604788 8938396 9920563 11326751 12416131 13755445
7242 13755445 14606193 16303044 18609485 20951114 23859509 27182310 32020225 38019722
7234 38019722 44102712 49844965 53394242 55297143 56155449 55502748 54234099 51597821
7226 51597821 46955067 41638092 35690065 30195629 25606335 22239331 19843231 18227016
7218 18227016 16636031 15247331 13771358 12454128 11572213 10769135 9708654 8981628 8258137
7209 8258137 7921608 7552178 7192271 6626896 5890899 5334824 5112045 5330174 5213663 4710157
7199 4710157 4491633 4654836 4351642 4069018 3439459 3301040 3288117 3268217 2935181 2973136
7189 2973136 2656682 2461370 2241195 1758512 1871642 1980986 2510552 2739074 2220646 2181304
7179 2181304 1972251 1871357 2301709 1948549 1524802 1463749 1892585 1626278 1594328 1288020
7169 1288020 1084457 1342480 1280448 881727 708985 774683 765668 907610 570552 378632
7159 378632 122927 293509 475214 629201 402912 426125 427951 522517 755903 604433
7149 604433 326796 118145 219907 442205 137918 24734 -84596 35158 170839 357250
7139 357250 365607 336027 175353 554171 520327 367013 -185757 -412172 217307 358237
7129 358237 51322 -435368 61907 419834 659407 275607 277980 115410 169846 475790
7119 475790 451891 251275 4494 256795 266689 -189591 -503954 -296936 -67001 173561
7109 173561 389449 297672 -11656 -254490 -350017 -522585 -398655 -78465 -77992 -130633 -164863
7098 -164863 -488216 -598452 -441292 -376574 -97394 -456782 -488031 -304135 -603358 -606499
7088 -606499 -791395 -428308 -205300 -200721 -170221 -155887 -112745 -488213 -429140 211630 47400
7077 47400 204952 39424 -52044 541572 574925 482886 269765 111047 768084 1163688
7067 1163688 1144269 936713 463628 -18273 72744 289452 311384 42453 234617 452087
7057 452087 240465 -79881 -387334 -444736 -394790 -50978 -3586 -235159 -229477 -113325 -67585
7046 -67585 -473666 -873361 -702134 -159672 -232037 -359677 -317643 -502453 -523329 -556974 -660068
7035 -660068 -787696 -571263 -274319 -212215 -247420 -207432 -179100 93883 -5666 -352964 -588741
7024 -588741 -245338 44719 111052 -108238 -550692 -722069 -439325 1847 162018 198164
7014 198164 -233424 -230113 -213439 101468 185724 -346376 59748 514175 771350 427550
7004 427550 328443 -2132 -464756 -434683 -292813 -345701 -71962 -135597 -190806 -224869 -176057
6993 -176057 38794 3924 272462 71216 -7962 291635 730166 436961 -230120 -133939
6983 -133939 -72028 143911 -86490 -297239 -468616 -318769 -32448 -579567 -1024232 -749568
6973 -749568 -44466 601708 552927 194416 -203493 -127170 323186 172818 -194781 -241223
6963 -241223 12128 93593 318020 355908 423977 346234 -135950 316208 583881 741813
6953 741813 907383 1045452 1160343 819225 592638 808946 1052181 1154560 826437 687730
6943 687730 1161463 1405852 1019537 858962 284013 341101 1383423 1611815 1751276 1523376
6933 1523376 2057393 2337064 2531686 2724443 3441290 4347248 5134614 5238568 5284605 5201892
6923 5201892 5425133 6245606 6816813 6910305 6360420 6341477 6685285 6439083 6423319 6707218
6913 6707218 6454379 5880230 5134991 4475850 3825739 3813793 3795247 3157465 2502853 2182929
6903 2182929 1956167 1620044 1484237 1290316 1644138 1583821 1441918 1252462 696597 533110
6893 533110 660752 952795 706021 343746 564151 312070 210066 282845 -100533 29557
6883 29557 62801 24518 215682 513598 399196 252830 328464 318602 -79339 58957 580129
6872 580129 668996 124968 -131816 109545 224800 44367 -43810 144595 304034 544001
6862 544001 399685 58651 -5907 23752 232109 81140 -24191 35837 418956 267256
6852 267256 126941 165483 -336295 110042 333506 228226 534365 380948 429929 19586
6842 19586 -19837 392044 837449 1005331 770832 802825 997630 1166129 1240219 1377721
6832 1377721 1239416 1291133 1482906 1815347 1961336 2008832 2034394 2327840 2509872 2701932
6822 2701932 2386157 2313652 2537053 2411545 2518618 2489082 2539506 2551705 2211718 2171810
6812 2171810 1500966 1201775 1128308 1263151 1026655 433907 698760 1049245 950836 779198
6802 779198 788898 400787 594552 789373 867141 1016317 696763 594287 760638 1084160
6792 1084160 857032 671965 585643 679733 787834 1016015 806842 443658 815272 804895
6782 804895 737591 883321 779186 1048503 1348807 1237576 1362533 1040713 1058966 1152347
6772 1152347 1150902 804779 1021578 1039254 1178736 1063267 857759 1081105 1369229 1409813
6762 1409813 1191688 1240473 1288572 1414013 1287850 1596594 1540987 1795868 2287921 2329015
6752 2329015 2539280 2205141 2448595 2685166 3007704 3418083 3969302 4647289 4897597 5212164
6742 5212164 5982141 6605894 7370652 8618772 9698023 11547638 12686485 12767586 12474940
6733 12474940 11901634 11170204 10211751 9844130 10022729 9682574 9866654 10251223 10432555
6724 10432555 10818194 10977159 10428988 9538712 8611384 7986407 7101657 6334102 5934918
6715 5934918 5455934 5603882 5405386 4913342 4724964 4498846 4701870 4695288 4499444 4720022
6705 4720022 4815977 5167991 5004358 4549729 4378321 4643402 4992142 4878457 4561379 4703848
6695 4703848 4726074 4785908 5022069 5004262 5097078 5418447 5846183 6077675 6061228 6060208 6278342
6684 6278342 6622107 6992742 7717181 8133680 8474167 9106803 8910661 9037975 9725348 10810556
6674 10810556 12097057 12736901 13043107 13674483 14993812 16720593 18224893 19684537 22225382
6665 22225382 25036711 28463562 32121123 36307382 41966600 48408777 55498462 62173879
6657 62173879 67459222 70164303 69271301 65343002 58982146 51205005 44622351 39065993
6649 39065993 34613013 31155260 27819438 25009304 23051260 21374253 20132544 18497043
6641 18497043 17382593 16161580 14946230 14086728 13073581 12638924 12258640 11623004 11099029
6632 11099029 10738460 10467011 10530419 9907528 9358064 9002401 8568641 8498138 8474507 8356319
6622 8356319 8042276 7704936 7772851 7780054 7671682 7120369 6657506 7095255 7545875 7441131
6612 7441131 7461778 7762040 7846200 7841103 8057355 8353479 8787976 8627021 8541467 8804237
6602 8804237 8695224 8712693 8747402 9011490 9302442 8895821 8834002 9242569 9560856 9656643
6592 9656643 9785569 9907738 9972094 10200605 10823609 11130418 11088379 11512890 11950466 12799587
6582 12799587 13150357 13504510 14320487 15380496 16423713 16801381 17448591 19008361 20671539
6573 20671539 22458512 24482754 26945269 30043337 33878894 38409912 43640608 49835448
6565 49835448 56619779 62732395 67881406 71133254 71534446 69681039 66599106 61937072
6557 61937072 55980433 50008145 44830438 40558238 36628472 34182356 32699997 31470236
6549 31470236 30365253 29120296 28291560 27543361 26572524 25459772 24450331 23644641 23323387
6540 23323387 22797347 21865088 21455476 21225054 21422913 22233536 22516028 22620893 23452708
6531 23452708 24203616 24340054 24713075 25538694 26687287 28244183 30137626 32443954 34927680
6522 34927680 37511376 41207388 45439065 50179620 55810834 60466480 64222201 65493980
6514 65493980 64152426 61439145 57168499 52540591 49219961 46897568 45686967 45171552
6506 45171552 45307988 47297656 49996008 53092245 55947014 58314806 60119690 60378206
6498 60378206 59380329 56463346 52658492 48408335 43622036 39245222 35550926 32547931
6490 32547931 30319657 28196475 26661870 25267169 24056236 23217256 22501997 21507173 20542235
6481 20542235 19834038 19575528 19317874 18744017 17782242 16852303 16112476 15169381 14412169
6472 14412169 13351778 12905241 12416576 12101613 12148375 11316087 10740403 10818013 10824438 10487143
6462 10487143 10515918 10537209 10569910 10446326 10277266 10010699 9674430 9656676 9563491 9686407
6452 9686407 9567109 9456905 9428073 9334350 8923411 8396342 8582669 9190419 9297123 9119763
6442 9119763 8669324 8763835 9248746 9595200 9769819 9982092 9956649 10145527 11123893 11878315
6432 11878315 12203634 12256060 12554517 13119764 13461572 13572854 13171562 12655944 12123141 11872040
6422 11872040 11644565 11107163 10355695 9775135 9179179 8608372 8166257 7877025 7732890
6413 7732890 7995857 7841804 7931923 7895511 8258772 8424274 8722919 9841758 10563059 11207279
6403 11207279 11573721 11448525 11422121 10957202 10082056 9301603 8385105 7612084 7016866 6670785
6393 6670785 6601600 6310682 5727265 5603732 5708195 5557221 5112238 5020559 5331371 5564396
6383 5564396 4983958 4719150 5034937 5098406 4862148 4456822 4309948 4523796 4369286 4379862
6373 4379862 4296634 3954293 3718223 3898553 4308471 4381407 4387374 4508026 4726350 4698969
6363 4698969 4337132 4392299 4560284 4653273 4820196 5346223 5446097 5565140 5767959 6312243
6353 6312243 6599453 6482519 7003032 7239823 7711394 8163192 8052251 8944315 9862061 10426473
6343 10426473 10924640 10854911 11095178 10724751 10619998 10400585 9641788 9010198 8180836 7761529
6333 7761529 7467927 7051157 7108725 7133349 7242382 7282782 6979139 6902606 7121030 7475065
6323 7475065 7846795 8297133 8380220 8603551 8950392 9540996 10416103 10939717 11233675 11338213
6313 11338213 11652673 12127359 12503810 12956627 14316665 15357801 16983571 18747490 20888648
6304 20888648 23136363 25419506 26932579 27666664 28306946 28061783 27679663 26736955 24777602
6295 24777602 22347842 19783488 17302448 15100966 13430517 12423747 11442761 10665815
6287 10665815 9606073 8897431 8391967 8081709 7697868 7613817 7044506 6685408 6625574 6810854
6277 6810854 7319369 7498900 7412718 7420590 7557919 7703539 7489934 7060234 6679434 5997678
6267 5997678 5949762 5959358 5519221 5179453 4726176 4208687 4061252 4226081 4383969 3929647
6257 3929647 3776045 4057119 4022179 4048599 3546054 3536846 3576671 3535895 4030275 3901588 3296381
6246 3296381 3087857 2859726 3017639 3277781 3731619 3746806 3574620 3356371 3330106 3358287
6236 3358287 2917132 3011665 3400027 3484947 3360205 3890835 4180171 3969956 3877120 4062666
6226 4062666 4747308 5022679 5110578 5390033 5370193 5286837 4757975 4770792 4849207 4373567
6216 4373567 4328203 4387915 4422617 4398873 3718823 3867237 4093122 3948791 3893837 3823068 4190629
6205 4190629 4259101 4339797 4663942 4766525 5086698 5095711 5090773 5108136 4870928 4718064 4821576
6194 4821576 4988910 4911196 4120221 4123345 4833610 4911004 5461501 5459533 5310795 5228031 5375592
6183 5375592 5460516 5410082 5332821 4840827 4701088 4993779 5461750 5515183 5215887 5164563
6173 5164563 5647238 6072234 6611930 6899299 6777961 7199307 7501563 7585205 7466400 7189341
6163 7189341 7586395 7783168 7898559 7749947 7528097 8208132 8680662 8915848 8924192 8916701
6153 8916701 8867632 8224828 7501498 7100205 6665997 6188771 5853795 5326745 5286722 5005889
6143 5005889 5091534 4675860 3995853 4254995 4621450 4620499 4653098 4246059 3951575 3960542 4151942
6132 4151942 4692577 4685487 4370249 4280361 4274790 4706130 4678619 4374195 4497760 4607755 4807158
6121 4807158 5104877 5286391 5381996 5170090 5580507 5982261 6239351 6419169 6162883 6286544
6111 6286544 6831927 6923388 7120628 7205469 7815065 8206724 8379717 8923404 9053168 9485999
6101 9485999 9998838 10712483 11470781 11986109 12143379 13057349 13583380 14199495 15001632 16280774
6091 16280774 17619929 19406273 21569818 24271982 27277732 30438199 34528948 39256991
6083 39256991 43576985 47187946 49908652 52011018 51731897 49256302 46422226 43199545
6075 43199545 38740917 34137401 30370325 27132291 24814244 22935295 21298445 19662046
6067 19662046 18795443 18282171 17648734 17473296 16842779 16199163 16294935 15898395 16003840 16160867
6057 16160867 16287999 16494768 16237440 16674029 17181294 17199002 17539722 18355817 19083651 19767994
6047 19767994 20840675 22512646 24179902 25927437 27810927 29894403 32710609 35189035
6039 35189035 37136186 38879417 39994359 40837004 41381059 42227608 43307032 44518480 46808718
6030 46808718 50536111 55155402 60613736 65029230 68618872 71048248 72253233 71285628
6022 71285628 68249720 64482266 59689280 53907165 47802881 42994492 38961919 35440663
6014 35440663 32607420 30035856 28168071 26313383 24998882 24186051 23105740 21869976
6006 21869976 20727611 19838028 19094334 18506479 17830417 17401641 16960782 16725016 16641404
5997 16641404 16687749 16076099 16033313 16253582 16757321 17109534 16925617 16536834 16388849 16315112
5987 16315112 16209359 16164900 15588033 15672345 16288760 16288947 16299196 16410543 16393176 16537698 16855717
5976 16855717 16990574 17730802 18535490 19401283 20409745 21171915 22371984 24107219 27086336
5967 27086336 30011965 32990807 36959843 40903077 45728005 50247413 53522814 56303864
5959 56303864 57183484 56149961 53768590 50488856 46927293 42968980 38898150 35706698
5951 35706698 33110034 31470270 30141314 29480886 29098218 28719605 28522808 28862728 29855755
5942 29855755 31371283 33002388 34407614 36558397 39594635 44018430 48648634 54158875
5934 54158875 59472122 64196436 68015791 70481261 71225067 70247544 67076857 63563719
5926 63563719 59293409 54026954 48421492 43706357 39976477 36747151 33299015 30345510
5918 30345510 27600842 25522161 23526205 21452005 19991098 18849614 17896047 16849829
5910 16849829 16251071 14938056 14264173 13650145 12866963 12209077 11573032 11116069 10728446
5901 10728446 10778002 10330925 9892681 9673418 9506808 8939022 8719026 8818328 8419009 8223924
5891 8223924 7715474 7475462 7390062 7113119 6995692 7321548 6773839 6362729 5814203 5656961
5881 5656961 5577467 5548564 5737741 5733565 5537751 5823595 5605052 5381030 5243567 5000506
5871 5000506 5304823 5219593 5479585 5026871 4390037 4349673 3795673 3495293 3523212 3343533
5861 3343533 3572407 3506248 3334730 3620192 3297363 3167807 2809337 3116744 3254981 3319982
5851 3319982 2932412 2886888 2739310 2886116 2750357 2301688 2502825 2794562 3122943 2938196
5841 2938196 2782607 2920509 2920611 3012457 2816551 2518068 2662621 2787907 2910403 2578988
5831 2578988 2298155 2657454 2836861 3007791 2980239 2759976 2529480 2494168 2793366 3077570
5821 3077570 3372890 3178605 3009792 2890591 2697688 2597977 2618277 2560781 2422348 2382733
5811 2382733 2846682 2893140 2598245 2623102 2557645 2825866 2844503 2750676 2921193 2786182
5801 2786182 2780325 2985846 3046383 2716925 2977386 3086296 3284177 2867692 2817088 2704804
5791 2704804 2502772 2690566 2587846 2621876 2901578 2635785 2687681 2889550 3157944 3205303
5781 3205303 3452618 3790952 3919511 4099403 4549174 4571894 4784838 5014339 5178517 5309976
5771 5309976 4857432 4463474 3552300 3016151 3000289 2767832 2553020 2305817 1763199 1873303
5761 1873303 2154951 2337131 2289276 2087999 1972340 2024588 2161095 2320643 2210133 1691695
5751 1691695 1339787 1304770 1692714 1897524 1730817 1829706 1533786 1522219 1345498 1275980
5741 1275980 1335088 1652643 1615949 1458434 1460626 1772034 1979584 1813261 1754673 1621628
5731 1621628 1739999 1912716 2274618 2107104 1571428 1588087 2150517 2425533 2271605 2073100
5721 2073100 1935194 1955218 2133697 2301414 2428652 2045935 2250334 2308586 2236784 1874923
5711 1874923 1671951 1412317 1326377 1017363 736366 953389 1230591 1373282 987044 601713
5701 601713 883727 1060620 1246496 1040259 904829 893673 817313 1288719 1056865 1143134
5691 1143134 840310 446362 517743 966947 1322657 1094069 622619 773482 797078 798621
5681 798621 1246474 1411956 1010493 809841 802096 790601 773870 654923 702282 660537 614705
5670 614705 391795 382922 613400 863301 1288185 1200496 839018 794107 888817 560285 765640
5659 765640 1134724 872667 1257929 1358179 1262607 1058763 896841 1211134 1319043 1251885
5649 1251885 1232921 1278465 1290286 1445286 1329825 1614691 1344755 1162879 1209010 1209376 1346925
5638 1346925 1376490 1379418 912395 233187 312924 813441 813582 770316 280954 -3604 403377
5627 403377 832027 916128 904325 690328 421622 37449 51418 626337 896651 1148107
5617 1148107 1199269 1013910 955227 837082 1165941 1019602 934496 1069612 1099623 1549363
5607 1549363 1557858 1017239 739950 639171 881311 771313 746488 788703 883842 1000432
5597 1000432 624397 207707 25178 473315 737514 1146100 700339 1068804 1277975 1028257
5587 1028257 789957 455243 724392 1652536 1634787 1550082 1065168 918621 1059473 911590
5577 911590 1119725 1145211 942912 764638 805000 943312 1045744 883040 902119 949878
5567 949878 998818 1377966 1589616 1485766 1268349 882715 857832 930608 770660 560475
5557 560475 235034 168485 215547 169524 332109 657347 574196 355284 541700 443526 610641
5546 610641 569893 341891 253854 254244 -227245 -150702 182960 246413 -296935 -475387 -523636
5535 -523636 -256964 -263154 -191916 -99463 -88112 -531431 -473259 -152406 -155557 -259019 -174048
5524 -174048 -175921 -621979 -871529 -813335 -536980 -250595 -726278 -613947 -71440 -141788
5514 -141788 -272273 -501237 -559310 -252584 -103617 152986 -218887 -644691 -561306 -306681
5504 -306681 -87483 -644715 -885794 -588403 -488819 -650325 -638779 -691344 -469182 -442776
5494 -442776 -548251 -468376 -121535 -36420 -510803 -970212 -909240 -908970 -812130 -569628 -490548
5483 -490548 -379051 -577465 -570526 -248566 -444165 -400056 -553909 -553126 -542720 -307348 -381715
5472 -381715 -523711 -371320 -595667 -431142 -331455 -564854 -757737 -669611 -767764 -721954
5462 -721954 -1294481 -1158454 -537733 -467473 -868365 -1091992 -1062305 -895639 -533941 -348109
5452 -348109 -476480 -829518 -630684 -540489 -325237 -818954 -1055708 -764028 -823784 -1036749
5442 -1036749 -929546 -1278019 -1346742 -1255796 -988929 -785878 -621303 -858078 -1182004 -1131230
5432 -1131230 -967724 -1041655 -797247 -154019 -201270 -577631 -931117 -956357 -656683 -550719
5422 -550719 -778450 -814779 -238601 -281432 -482773 -721918 -646925 -755178 -1001924 -800016
5412 -800016 -418602 -166980 -145263 -494374 -630045 -889738 -1102410 -866813 -804349 -507390
5402 -507390 -595103 -522374 -581825 -586021 -624107 -584857 -677771 -1053097 -979362 -581039 -715614
5391 -715614 -839368 -1155354 -1001009 -935395 -382519 -231193 -531214 -838752 -1003560 -512139
5381 -512139 -106738 -433562 -722797 -694212 -626023 -291103 -563813 -682226 -286560 -242930
5371 -242930 -77000 -338945 -635724 -426317 -576563 -261083 -154767 -301893 -230817 -401835
5361 -401835 -278644 -410574 -683504 -325702 -231805 -119474 -362690 -426422 -447427 -312097
5351 -312097 -363006 -619030 -692636 -505258 -299435 -233892 -290588 -314829 -199606 -238939 -177048
5340 -177048 -161036 203688 269599 -255535 -388806 -377025 -274896 -206732 -266207 -188342 276328
5329 276328 137899 -63316 -34581 -264335 -204811 -27613 -58928 262936 291341 270356 313378
5318 313378 -189890 -82310 -393467 -299448 -128306 129804 39676 -102014 -105137 -387169
5308 -387169 -312223 -40182 -70409 669 18084 152261 -67871 -441609 -506268 -235199 -239069
5297 -239069 -160585 -115550 -318324 -137627 -168707 -137361 181020 198442 -106190 -47025 -207671
5286 -207671 16041 455570 225116 291082 359361 357032 443484 602044 736298 688176 312101
5275 312101 293639 410810 208531 438883 667199 817488 264434 148529 394103 844690
5265 844690 1016360 696958 420971 515183 307297 372288 434407 256300 182254 149083 516677
5254 516677 462546 369695 103074 215620 234998 -298902 -514372 -127745 368377 214134
5244 214134 -268805 -562515 -307059 131027 -155320 -180009 85344 152212 -18484 -241466
5234 -241466 -292843 -338149 -194045 -111555 -56233 -289130 -796216 -542570 -26912 -133280
5224 -133280 -465401 -544936 -313347 -36774 -198673 -418577 -393657 -313 -90800 -318322
5214 -318322 -546857 -410031 40101 22710 253074 53498 -604688 -1020340 -361008 -113381
5204 -113381 -390281 -369871 -308329 -297632 -319782 -428370 -414667 -448025 -279461 -527039 -457722
5193 -457722 -424781 -612463 -474402 -462873 -625816 -1029553 -1060850 -692504 -482670 -553973
5183 -553973 -687763 -712771 -610303 -669445 -512946 -199489 -214166 -234065 -220159 -262010 -9909
5172 -9909 130838 -40115 -198118 -298367 -263246 -18082 341485 653405 222730 115141
5162 115141 -31206 -204076 69775 11487 25529 32354 -15189 -73629 -144048 -70918 -307602
5151 -307602 -385098 -273039 -208940 -214588 -337598 -497690 -173143 -369054 -357554 185141 670
5140 670 -247665 -457964 -191836 164623 29032 -642806 -785568 -798203 -583054 -196942
5130 -196942 247411 57325 -286424 -111029 69527 140392 279685 331898 233721 410491
5120 410491 219758 -23135 -89397 -10316 36809 -148764 -200597 -385397 -275787 6645
5110 6645 -270663 -465016 -724430 -687928 -178945 380377 173122 -400594 -368611 -17465
5100 -17465 -286823 -683977 -407648 -127622 296521 75100 -254454 -359819 -167143 -280512
5090 -280512 -96625 136296 50279 390947 549945 440423 194341 -157302 -345383 -111586
5080 -111586 -27626 156270 -158618 147108 291639 225872 78820 -70680 54441 382289
5070 382289 250403 442499 173176 27273 273736 259004 372402 -206895 -398592 -40473
5060 -40473 -272119 -513124 -416271 -450132 -246958 -474976 -69658 208974 -376355 -310038
5050 -310038 -69549 -18790 -192215 -455567 -268582 -25618 -60682 -118325 -437482 -178208
5040 -178208 -147725 -159390 116930 -117436 -178315 -172298 77187 439928 376527 320340 747371
5029 747371 984790 635665 335183 354940 359538 147466 100831 316758 667647 431137
5019 431137 -199564 -121288 186277 503890 249676 13536 187500 445827 87722 197512
5009 197512 507170 407287 -94545 -462494 107410 244007 -55635 -223079 -283194 1353
4999 1353 -207394 -300883 87826 546183 -43010 -270345 -167882 -173368 -358617 -384237 -263287
4988 -263287 -240906 -255254 -198216 58997 -109468 -238275 -188065 -262984 -405043 -473156 -297008
4977 -297008 225698 -216041 -284066 -565647 -526010 -413959 -508422 -513068 -508452 -632214 -272228
4966 -272228 32792 -116206 -278999 -451468 -133102 -120833 -62251 -162797 -237566 170482
4956 170482 42372 -222333 -499663 -616814 -204780 -569102 -457129 -227737 -529151 -476908
4946 -476908 -455854 -377316 -273988 -297833 60626 125238 -11012 66867 -266816 -225099 5478
4935 5478 13853 -158905 -229053 -232270 -179495 -144504 3512 -90421 -380544 -68098 466124
4924 466124 491726 273676 339865 403629 121153 167158 406344 575692 625347 408734 461984
4913 461984 309985 33682 -37251 285683 -21967 -285669 -295360 -98364 -24237 219029
4903 219029 188979 255468 525896 512482 11072 -419806 -259672 -198963 -12087 170419
4893 170419 -103785 -170566 -294545 -175131 48474 -49133 -275561 -428100 -254992 366467
4883 366467 365236 242942 195569 -234901 17929 -43042 177628 -62782 -169938 203797
4873 203797 311196 -315385 -534617 -136187 -63160 -79498 -217966 -128081 234198 66978
4863 66978 40658 -141009 -343158 -454388 -482679 -85740 32155 35074 38376 -156898 -303287
4852 -303287 -389867 -138868 80689 250363 143149 148440 -120547 79334 26216 -376562
4842 -376562 -141996 144901 92519 432802 424243 -42451 -9500 -48352 -183226 -178002 488863
4831 488863 561458 1272 -314428 -468325 -122125 80457 -350742 -475613 -90860 203901
4821 203901 171400 103430 -263563 -194757 -355209 -485853 -270317 -291613 -249883 -103651 476746
4810 476746 257634 -139923 20405 1652 126515 118607 37907 -50375 -18937 187797 178447
4799 178447 177672 67591 -354290 -303842 -110163 -184637 -226657 -254975 -94667 184311 -99334
4788 -99334 -241797 -159186 -176764 -259547 -388264 -275064 179204 376507 101421 -464055
4778 -464055 -596675 -119699 41476 -20490 101505 44580 168995 221805 67550 -334035
4768 -334035 -497381 -15211 297233 246990 -39035 -576114 -200466 -157674 -298258 -139008
4758 -139008 -59890 -69713 -270382 -86637 -270146 -780856 -632693 -13920 46937 -33685 -69513
4747 -69513 169812 -105901 -621785 -461644 -167321 82483 114672 124413 -110549 -42526 -246362
4736 -246362 -131840 -13575 -296565 -178895 185716 225931 -15320 433 -44467 -315465
4726 -315465 -568329 -591537 -419385 151792 219685 -178936 145517 225174 -68594 80704
4716 80704 42343 362085 194626 -118217 -6179 -147960 -161022 -294638 -534309 -339612
4706 -339612 -203335 -423287 -289944 181161 3896 71144 62601 -238806 -297803 -34671
4696 -34671 -21294 -169178 -118809 -149197 -193518 278693 273170 63065 -105904 -24498 44645
4685 44645 16738 155978 130182 515381 631277 392045 54431 55351 169256 200414 -16713
4674 -16713 -180323 153227 272636 572658 405345 225393 508146 412126 8073 -153308
4664 -153308 -216013 -131768 -319263 -145038 357736 182225 -78996 -51843 86188 -133287
4654 -133287 -73772 52048 -46003 -181951 22289 264535 119469 219906 98590 -250686
4644 -250686 -499385 -554692 153456 375281 153943 -51758 -73083 12777 291625 411511
4634 411511 223849 1218 -59145 -36406 55003 500306 544819 173700 -125364 -231035
4624 -231035 -52603 143718 -35680 -83346 64753 -180835 -197735 -134050 144335 159798
4614 159798 -139549 163648 147885 121788 160051 382060 557065 481107 342341 372371 482920
4603 482920 696070 508137 527247 716018 457213 96936 197242 531596 449289 408493
4593 408493 183481 121283 -216404 14425 307579 398534 251119 394927 806317 884888
4583 884888 275729 -324469 -241072 -4669 248564 292183 382206 701815 236894 -58145
4573 -58145 -191556 64030 335170 615041 925029 726868 707581 538562 571604 653897
4563 653897 260430 441264 1019870 1303823 873029 916909 1122494 898683 959714 1078331
4553 1078331 1720759 1747115 1699075 1957926 2057209 2293960 2194531 2400378 2977971 2359937
4543 2359937 2169232 2876926 3289320 3101577 2801626 3379528 4211863 4508962 5102945 5733139
4533 5733139 6999062 8015710 9225324 10579368 13013237 15918773 19876405 22866704
4525 22866704 21090169 16672179 12892393 11121558 9768964 8869910 7663500 6371928
4517 6371928 5327661 4742344 4411224 3955746 3412207 2826985 2490291 2330833 2389704 2447818
4507 2447818 2170402 1868979 1804957 1362431 1131628 1114033 969618 1017975 1059179 1057555 1115706
4496 1115706 1524803 1495184 1260779 1611011 1432727 1168147 1116366 1033213 921912 899163
4486 899163 781794 894364 787583 513486 766609 1058673 1017469 972558 783153 1166666
4476 1166666 1291672 1251088 1327653 1225581 1560012 1589133 1600769 1232481 767109 718237
4466 718237 1002563 1377921 1592711 1515111 1613195 1784352 1558507 1274639 1126625 1037813
4456 1037813 1050446 935531 1043417 1329149 1315835 1082220 574505 161522 -159060 699255
4446 699255 1166564 875787 332293 -31131 -120893 -127161 -22622 17332 737714 811858 985950
4435 985950 940097 789714 734929 596481 492927 555032 464507 610717 511861 553297 402985
4424 402985 -179948 -72934 543225 1009208 996971 733756 760483 983970 1036589 856571
4414 856571 658066 592869 924922 757548 414538 80898 -88825 84308 401107 524165
4404 524165 631113 637886 566100 715573 454596 426377 350653 533415 560316 252112 71505
4393 71505 476096 610214 253792 13206 -105352 265201 83509 153256 551170 664879
4383 664879 403877 156241 505292 541039 439866 159594 342500 613626 453053 473756
4373 473756 473236 384814 57048 82310 -176075 152869 393234 -13656 420855 616201 450942
4362 450942 964419 1138568 1351807 1142848 598902 428077 490698 774339 652123 592131
4352 592131 495726 512086 544119 564567 290168 256289 225073 96772 -179114 -39567 257821
4341 257821 558163 696195 709547 552764 761100 872252 327577 367783 259408 -490
4331 -490 -53880 32756 291210 459074 482951 433741 473421 721265 731527 719292 757012 88739
4319 88739 133589 559466 639408 227534 -172747 -237539 -4296 542994 255453 -120273
4309 -120273 -273775 -212417 60910 311022 570665 430274 399668 226060 568820 410605
4299 410605 176223 608595 741401 540265 119841 450289 690108 749677 855703 762478
4289 762478 803629 807497 1234939 1182682 1002962 1026635 1062951 872888 962144 997148 1021183
4278 1021183 1085541 634703 460942 631358 677137 858351 725605 833537 937870 682444
4268 682444 750359 954180 1217604 1047931 1448231 1509131 1753471 2159134 1726781 1286669
4258 1286669 1096598 934827 747866 532185 668292 855971 576035 473519 791398 1137918
4248 1137918 805265 764941 861348 666316 525597 278047 226066 173750 56234 -103938
4238 -103938 344136 594039 293759 28175 194938 242546 283669 279513 721134 655332 144468
4227 144468 -32188 329273 552312 256894 36903 64691 154041 -126851 242821 714481
4217 714481 708109 480537 134262 382173 597171 559140 739511 705415 354697 259944 428861
4206 428861 732478 601149 385137 361031 436757 930078 949750 477434 345996 17136
4196 17136 190770 521032 779914 1002984 601946 431572 387057 46684 -94278 -83755
4186 -83755 245852 287252 -147756 -50184 93817 -92043 -433362 -394402 -278655 -40526
4176 -40526 533637 614524 264371 -160969 -14025 -186922 -38244 57061 -19469 363472
4166 363472 566794 510090 -138315 -506426 140174 259548 250476 393814 272592 143895
4156 143895 -76750 -69806 -276201 -300722 115011 622560 440398 -235 -402848 -398595 -197097
4145 -197097 -134327 38494 147221 69668 -282026 -125968 125498 -133603 -307917 -49957
4135 -49957 271757 72202 4049 173504 268679 168089 -168148 -332286 112472 56248
4125 56248 81392 81569 -159213 -5578 93767 157009 455224 518136 384240 -59513 103745
4114 103745 267716 205833 292874 79384 -193468 8060 68473 179066 -90932 -281038
4104 -281038 -178690 57485 480380 216943 164248 283203 98077 -15496 -151477 317471
4094 317471 269110 332369 44054 249871 405555 -58376 -308419 -181554 22236 -57018
4084 -57018 197422 349438 482421 187097 -54727 445156 992443 947707 371567 -4016
4074 -4016 -14348 233972 314110 315823 389924 385452 576632 535584 745596 215433 -255690
4063 -255690 -338484 67979 500725 679576 420897 260076 52312 -135387 -51340 245124
4053 245124 504169 420639 575365 363418 182781 44028 164553 407812 373454 324189
4043 324189 137930 458758 893833 448422 99669 109614 -92514 271934 364958 676655
4033 676655 626790 153010 -16742 44724 461669 1006117 1120589 906275 686633 384424
4023 384424 234128 626693 353418 370381 475185 326727 443995 656529 646803 143839
4013 143839 -57655 259608 661373 759316 739016 490323 567863 852585 1345726 1267646
4003 1267646 979060 419210 436425 813259 966429 1060908 900808 985293 663291 771966
3993 771966 730520 688450 974452 1163442 1176338 1088272 984111 802022 847018 1199781 818186
3982 818186 343359 558852 952579 1113019 1037421 902438 836758 944738 794009 752376
3972 752376 1073911 777454 1081085 870580 934894 1550333 1330511 1077588 849527 722482
3962 722482 686401 1132966 1343781 1265023 1044448 1111968 1224894 1290980 1155747 975740
3952 975740 1145778 799868 945289 1268387 1540705 1445602 1039985 914505 677741 634784
3942 634784 834326 1017884 974471 1080114 883029 861750 1029828 959421 915436 1158565
3932 1158565 1262485 1529440 1287691 1059595 1288918 1567972 1062374 733441 572828 576757
3922 576757 1131415 846645 365709 486430 842023 1116279 1084345 654727 525231 893659
3912 893659 1008451 1216180 1119926 901034 602445 970014 921189 999197 1123261 930343
3902 930343 1029583 803618 480855 520464 1104054 1049221 755333 525542 911246 1297822
3892 1297822 1156204 1149771 849257 969781 982450 1218846 1256458 984346 1088486 781048
3882 781048 759004 1011094 907075 1050215 1269623 990567 825749 766920 863132 1038675
3872 1038675 1078052 1180196 832094 422796 555373 816488 773284 1006260 859385 1045685
3862 1045685 1341065 1248749 1297005 1471759 1469667 1357005 1719511 1924334 1687678 1451856
3852 1451856 1313186 1059058 1272467 1345686 1405865 1213390 1198030 1629796 1619893 1332128
3842 1332128 1388411 1109054 1004640 1725476 2144923 2023811 1793347 1442292 1318632 1603455
3832 1603455 1995245 1767003 1832645 1998149 1626659 1562093 1882604 2038900 2330916 2256427
3822 2256427 2477915 2575525 2247315 2746639 3753180 4179401 3873083 3981929 3712266 3441581
3812 3441581 3464300 3399202 3088694 2679366 2694707 2655990 2867864 2598625 2275598 2315969
3802 2315969 2227983 2310367 2428155 2347879 3007297 3085624 2603062 2839281 3419263 3730140
3792 3730140 3529980 3015686 2851778 2695045 2314096 2069887 1775204 1695203 2048643 2144857
3782 2144857 2147015 1530711 1146748 1203755 1578744 1903003 1756047 1618541 1401392 1676337
3772 1676337 1612366 1269129 1248665 1337058 1482641 1327322 1288194 1405770 1597463 1988197
3762 1988197 1934524 1594240 1117672 1213497 1715566 1433623 1267970 1386139 1385297 1632261
3752 1632261 1671546 2017677 2070821 1633771 1390962 1294138 1497412 1644104 1867093 2007450
3742 2007450 1646599 908665 1154877 1769423 1864725 1575410 1439268 1991922 1926390 1665341
3732 1665341 1463973 1342663 1540071 1490145 1591523 2067033 2193444 2370145 2511655 2184073
3722 2184073 2029383 1970707 2224564 2568559 2589171 2402562 2403254 2372997 1937459 1872402 2074956
3711 2074956 2470134 2427358 2808724 2884836 2904975 2912515 3411720 3731631 3843243 3692863
3701 3692863 3440323 3247026 3181900 3435604 3093024 2947100 3243356 3084919 2596833 2514292
3691 2514292 2673881 2674383 3175188 3312704 3086463 2972339 3119385 3450904 4058093 4062855
3681 4062855 4224648 4294471 4203654 3823249 3489987 3333968 3428160 3482221 3605555 3807099
3671 3807099 3802190 3863742 3418377 3083625 3034160 2989740 3050110 3355194 3417811 2989502 2882508
3660 2882508 3117887 3165929 3290289 3267508 3574254 3575216 4208307 4357088 4576558 4531188 4495062
3649 4495062 4500684 4412402 4148397 3826432 3566496 3826729 4084320 3829924 3619313 3566056
3639 3566056 3494850 3614091 3644903 4364231 4500600 4299531 4386237 4424691 4757586 4971409
3629 4971409 5056578 5031823 5030644 4858538 5136452 5191600 4722450 4346536 4246074 4389707
3619 4389707 4601303 4419899 4150090 4286361 4183319 3628713 3379318 4295460 5241344 5343780
3609 5343780 5628912 5851904 6017313 5281777 4750546 4597360 4143524 4201489 4284637 3655879
3599 3655879 3614543 3629867 3444905 3711282 3759847 3790987 3974402 4490363 4505678 4255130
3589 4255130 4354940 4033358 4063349 4885563 5167481 5264722 4624580 4139267 4130016 3737059
3579 3737059 3611230 3295315 3178915 3367503 3652148 3791538 3464256 3109434 3193485 3361551
3569 3361551 3276904 3603557 3202006 2850976 3024613 3022754 3250064 2972597 2641551 2956079
3559 2956079 3112159 3317951 2900539 3054813 3460145 3422992 3171666 3213536 3394901 3424537
3549 3424537 3820954 3625899 3733100 3430832 3324034 3644397 3679373 3383407 3582304 4121295
3539 4121295 4170352 3576827 3651537 3740819 3730523 3594597 3376525 3485164 3581612 3684285
3529 3684285 3917327 3643837 3087694 3039231 3401856 3919611 3584761 3520736 3520123 3577729 3493939
3518 3493939 3571141 3839617 3795221 3855708 4348298 4589827 4421230 4070842 4100300 4314008
3508 4314008 4524190 4471153 4540188 4960864 5039030 5616229 5744488 5653683 5630221 5580550 6078060
3497 6078060 6195189 5618050 5253586 5116100 5054837 4843036 4612333 4868017 5228653 5031858
3487 5031858 5184377 5435313 5767952 5445604 5302032 5689002 5914119 6023375 6205243 6337220
3477 6337220 6292452 5723907 5099819 5515121 5518804 5429731 5050095 5136726 5768246 5364617
3467 5364617 5230155 4996994 4964770 5035945 5294229 5926893 6114591 5953606 5713153 5822829
3457 5822829 6290315 6401020 6040544 6123804 6429625 6518423 6688043 6588053 6459617 6086066
3447 6086066 5964445 6269522 6540693 6631900 6258301 6499001 6602459 6346442 6219156 6385923
3437 6385923 6876636 7024634 6864546 7109719 7443815 7436375 7410878 7496847 7184828 6794839
3427 6794839 6586727 6585936 7200046 7071298 6469420 6698255 7025745 6870869 6752117 6847453
3417 6847453 7490428 7742059 7423794 7949892 8214931 8245507 7936254 7978201 8469275 8914782
3407 8914782 8944994 9653771 10460186 10562134 10517212 10159120 10029895 10458368 10726425 11402879
3397 11402879 11559989 11524656 11844388 12661221 13170161 13068673 13581328 14418431 14846504 15215986
3387 15215986 15580586 16041054 16674819 16545869 16712214 16562359 16617935 16647614 16052851 15943136
3377 15943136 16179237 15942181 16386142 16687158 16992898 17099843 17303735 18357158 18536114
3368 18536114 18475987 18695479 18550069 18778976 18797001 18524933 18895201 19157816 19354590 19845353
3358 19845353 20649983 21261426 21555998 21637786 22398908 23008857 23487703 24307276 25456628
3349 25456628 26314027 27225259 27860329 28710691 29511774 30608016 31797616 32876353 34002389
3340 34002389 35151698 36685032 37920863 39703192 41664693 43848725 46066276 49025240
3332 49025240 51971029 54826342 57798558 61566892 66324228 72099045 79393476 88289556
3324 88289556 98421441 110971410 125922647 144722293 168290583 197066762 228958642
3317 228958642 250730841 247909808 220971905 185374340 156372791 135936320 120880349
3310 120880349 109048257 99240914 90541275 83220878 77396560 73119365 69721672 66799330
3302 66799330 64584650 62302427 59796232 56417980 53504707 51478805 49831923 48061510
3294 48061510 46857886 45578016 44836956 44332178 43559701 43171539 43030473 43571218 44198202
3285 44198202 44345708 44316584 44055486 43613861 43698941 43391524 42972775 42834625 42322343 42315424
3275 42315424 42104432 42222641 42253938 42409831 42968129 43262588 43109833 43203942 43533944 44168177
3265 44168177 45224984 45874544 46539298 47782017 49231529 50702049 52432445 54486514
3257 54486514 56508502 58677007 60625195 61706730 62383415 62644338 62482300 62262715 62115283
3248 62115283 62366071 62595915 62271904 62318005 62754249 63043078 63780428 64983989 66294577
3239 66294577 67266251 67751214 67979546 67620930 66780246 65695985 64880287 64376335 63558808
3230 63558808 62272305 61390175 59825646 57760117 55828710 54331665 53701238 53346648 52734185
3221 52734185 52506329 52339436 52505231 52837001 53246843 53346105 52982448 52532205 52208692 51362649
3211 51362649 50316339 48898761 47269929 46108208 44928206 43616874 42781613 42533958
3203 42533958 42528103 42665577 43002931 43039650 43648170 44935527 46662609 48478615 50361314
3194 50361314 52330764 53999152 55283087 55227996 54455089 53440507 52833397 52196038 51727931
3185 51727931 51044707 50780079 51065247 51200395 51398176 52776440 54207689 56287100 58540303
3176 58540303 59792717 60645111 61272322 61784529 62667983 63766786 64886025 65813884 66666965
3167 66666965 67200528 66875041 65734524 64390821 62774922 61238994 59650304 57950327
3159 57950327 56065933 54021650 52896140 52083299 51213005 50649009 50300077 50347892 50829044
3150 50829044 51655964 51641742 51227929 51215813 51082340 50976773 50352400 50103286 50147043 49633607
3140 49633607 49051064 47823778 46099154 44706060 43496647 41900891 40014491 38286467
3132 38286467 36771044 35467133 34299842 32956289 32164229 31513972 30777172 30309149 29645762
3123 29645762 29127809 29166416 29199480 28928448 28965668 29065841 29833427 30407838 30850458 30855985
3113 30855985 30574299 31052374 31604100 32176278 33376581 34534137 35759607 37643452 39658881
3104 39658881 41619802 43976579 45844418 47873088 48936259 49688579 49825542 49229982 48261139
3095 48261139 46695721 45340682 43425325 41991037 41337774 41050548 40876614 40612394 40604063
3086 40604063 41443088 42207488 43003951 44355776 45825148 47235012 48006320 48423282 49043635
3077 49043635 48849094 47981657 47047714 45258059 43297062 41209329 39266731 37314140 35190597
3068 35190597 33569610 31913035 30786714 29556501 28025799 26679317 25514911 24687998
3060 24687998 24103082 23611869 23044559 22403294 21818145 21408552 21142459 20828988 20351837
3051 20351837 20026520 19883053 19730333 19524304 18960706 18652928 18663179 18826287 19053264 19010013
3041 19010013 18910915 18989584 19396969 19555836 19745259 19873927 20341694 20762923 21036125 21072765
3031 21072765 21458388 21768679 21984882 22390492 22944899 23654308 24083796 24724229 25622696
3022 25622696 26429982 27084718 27804044 28597830 29455648 29669208 30348181 30193335 29496460
3013 29496460 29300052 29146650 28921459 29120598 29424970 29950756 30403507 30508070 31131812
3004 31131812 31734303 32376099 32877450 33498414 34745983 35991252 36767914 38012511 39447465
2995 39447465 41081380 42818385 44190044 45704522 47195879 48572420 50467803 52722217
2987 52722217 54445598 56018855 57649245 59769529 61823620 64218679 67085237 70039901
2979 70039901 72849821 75703845 78584705 81795431 84296261 85868785 86387839 86349798 86291417
2970 86291417 86049639 86797102 87983993 89104099 90263635 90904571 91806425 92780138 93651966
2961 93651966 94537406 95093112 95532366 94748860 92543334 90234186 88314635 86871223 85930497
2952 85930497 85148308 84311916 83312948 83109333 83119563 82683242 82183240 82100892 81943145 81143274
2942 81143274 80188641 79170180 77594856 75862847 74864075 74556692 74262425 73590263 73187080
2933 73187080 74010131 74793143 75161460 76042129 77509487 79082492 80482127 81514106 82390182
2924 82390182 82690945 82558859 82659067 83051120 83980581 84661269 85121865 86483256 88555628
2915 88555628 90544053 92765797 95275893 97497391 99780903 102285300 104574322 107160556
2907 107160556 110120757 113348997 116722383 120505607 124472548 129694499 136859085 145940405
2899 145940405 156389520 169479729 186227895 206809014 232108468 264411763 305420193
2892 305420193 357810135 401323066 380678578 314082575 259501595 224593927 201186252
2885 201186252 184123669 171494896 160020119 149035746 139941848 133174540 127751645
2878 127751645 123471449 120501893 117937177 115119475 111937885 108477171 105141384 102151166
2870 102151166 99388560 97379237 95296483 93674267 92682261 91723013 90759085 89484449
2862 89484449 88730719 87874224 86532641 85347006 83928692 82824990 81884153 81726503 81204423
2853 81204423 80076242 78811035 78337812 78243232 78198976 78108774 77518792 77493693 77364381 76934443
2843 76934443 76673753 76220759 75827558 75624429 75018940 74477484 73861696 72746143 72120959
2834 72120959 71987103 72147029 71927131 71297529 71502270 71816091 71752214 71136701 71096401 70843097
2824 70843097 71076264 70797355 70582572 70968877 71043146 70284214 70112166 69765923 69156800 68783236
2814 68783236 69457153 69968919 69683907 68832773 68569854 68729165 68879482 68923497 68795191 68798166
2804 68798166 68745469 69063647 69343603 69424975 69327628 69505091 70029950 70415172 70046602 69557446
2794 69557446 69653014 69559830 68970704 68796088 69391636 70153010 71480229 72543378 73152860
2785 73152860 73937587 74609613 75635626 76562454 77218991 77235886 77425253 77608239 77335655
2776 77335655 76824893 76572639 76315399 76366186 76603414 76914632 77371146 77396763 77160271 76801466
2766 76801466 76617391 76965680 77082934 76848382 76228766 75261996 74607752 74252282 73847996
2757 73847996 73779181 73293766 72632529 72035972 71237622 70194127 69174409 67873930 66284603
2748 66284603 64764847 63491921 62680455 61943248 60718214 59996612 59449780 59065696 58289875
2739 58289875 57153881 56464309 56449925 56206021 56185596 55775518 54915037 54133447 53906331 53675733
2729 53675733 52987840 52022346 51444105 51393009 50920544 50878905 50680071 51198814 52126418 53243472
2719 53243472 54312066 55745232 56829100 57597184 58113975 57865311 56699069 55043778 54180017
2710 54180017 53738961 53087955 52443820 51949489 51772256 52093504 52780220 54035599 55271075
2701 55271075 55851927 55915609 55912782 55174694 54005354 52492944 51450633 51034319 50453730
2692 50453730 49583207 49496597 49644898 49823246 50086487 51337104 52795150 53387929 54228821
2683 54228821 54222334 53522614 52557595 52037103 52260842 52180269 51911275 51803134 51975874 52464989
2673 52464989 52556049 52196223 52297933 52105752 51130353 50529060 49685137 48678784 47706403
2664 47706403 47078387 46851343 46463492 45574002 45434539 45849668 46003053 45600078 45428483
2655 45428483 45433720 45240454 44946961 44708429 44400265 43741434 43186265 42943879 42696698 42343057
2645 42343057 42041782 42215976 42776826 43192966 43244404 43046826 43330969 43688245 43224478 42977087
2635 42977087 42912269 42756095 42491022 42169710 41957955 41750295 42279203 42915221 43466545 44040478
2625 44040478 44431057 45566656 46436044 47045439 47574066 48299694 49369023 50476888 51344116
2616 51344116 51926773 52807692 52955616 53503964 54158496 54872372 55826907 56121192 56816833
2607 56816833 57069187 57254946 57325531 56916882 56453998 56014909 55918569 56082433 56070433 55802913
2597 55802913 55538000 55716525 56500146 56901493 56547333 56253431 56134945 55465539 54989327
2588 54989327 54516956 54335425 54121377 54147724 54015898 53686758 53467929 53876232 54661070 54793000
2578 54793000 54697133 54973467 55472636 55600268 55452118 55301111 55839018 56441413 57299808 58080302
2568 58080302 58812225 59391080 59670080 60432929 61457799 62562750 63581103 64677788 65369851
2559 65369851 65857563 66184796 66872182 67503902 68010413 68630739 69029962 69387742 69630432
2550 69630432 70340239 71171015 71718550 71758338 71688870 72082254 72969959 73462826 73128449 72836377
2540 72836377 73045789 73761723 74284385 74632969 74892457 75787016 76489336 76871642 77282102
2531 77282102 77714083 78278907 79592186 81104391 81804646 82200888 82634426 83692455 84232173
2522 84232173 84249616 84582845 85684588 87012206 87760073 88630580 90218399 91305420 92687581
2513 92687581 94050660 95006017 95429001 95839587 97005718 98701309 99870700 99939214 101024331
2504 101024331 102507307 103848063 104878340 105449591 105800689 105974917 106330654 106985975 107137934
2495 107137934 107157954 106982079 107193625 107961929 108225327 108718121 109481091 109967281 110489746
2486 110489746 111552003 113325397 116031980 118995435 121412416 122904444 123249573 122569812
2478 122569812 121237069 118957998 116904897 116243543 115449369 114051180 112301392 109570729
2470 109570729 106076409 102957449 100825473 99321974 97891204 96581034 95182089 94096043
2462 94096043 93283116 92845645 92955264 92815466 93091573 93901005 94736834 95181742 95788645
2453 95788645 96838244 97903639 99006861 100000929 100990248 102166859 103441552 104633281
2445 104633281 105739987 106593620 106711547 105638295 104466287 103014581 101470795 100156001
2437 100156001 99634101 99447614 99422244 99310031 99339083 99751501 99594796 99886841 100105531 99809912
2427 99809912 99597017 99264218 99073839 98776643 98552167 98950224 99087818 99400940 99089134
2418 99089134 99524193 100085657 100386687 100226573 100602125 101026101 101417157 101772732 102247434
2409 102247434 103421844 103929781 104162894 104618876 105134260 105843165 106560576 107269827 108083719
2400 108083719 109321946 111198288 113099980 115292571 117314095 119665922 121807003 124269806
2392 124269806 126623160 129253439 131796337 134509013 136968854 139512720 142182366 144957308
2384 144957308 148123208 151330593 154721096 158529952 162871321 167792642 173786392 179977369
2376 179977369 186773604 194463763 200752173 203584073 202885177 200426824 198881663 198717871
2368 198717871 199358256 200706872 202747622 204801970 206499993 208398559 210324790 211970943
2360 211970943 214076877 217334566 222255963 228479789 236042462 245482697 256668285 269247983
2352 269247983 283076007 296480136 308207047 318508198 329648574 343809573 359414749
2345 359414749 371433830 374810490 367407335 352413644 335485287 319867532 307228457
2338 307228457 296988374 288513864 282361170 278454977 276576267 276298760 276469040 277199621
2330 277199621 278936817 281973226 286728163 293420351 301683892 311206027 322428059 336085993
2322 336085993 350355952 362626396 370988993 375361932 379475452 386327804 398208890 415039143
2314 415039143 435086600 454163923 466473076 467827457 460675535 452753348 449479922 450093071
2306 450093071 447463458 432973484 404188235 368725575 335043015 306639807 283572947
2299 283572947 264031744 246970201 231582180 217903836 206367850 195854319 185834272
2292 185834272 177180553 169242568 162029254 155621931 150135619 145834304 141574970 137841003
2284 137841003 134394281 131317294 128438705 125445660 123092453 121070465 119217736 117725771
2276 117725771 115933000 114378895 113396481 112317830 112004682 112304700 112806046 113299808 113901833
2267 113901833 114713628 115790062 116859839 117834098 118825185 119478163 118938431 117192350 114779065
2258 114779065 111903693 109419456 107572064 106451451 105002514 103948194 103743804 103690652
2250 103690652 104107427 104431926 104574669 104988283 105007149 104955396 104411935 103205418 102345825
2241 102345825 101572109 100756855 100120360 98886004 97614417 96298703 94822817 92570138
2233 92570138 90643532 89319043 87973147 86012462 83934046 82294490 80794808 79438121
2225 79438121 78756187 78232011 78130770 78010909 77880389 78403325 78657244 79060264 79862558
2216 79862558 80760531 81530904 81508225 80638903 79788458 78603055 77437534 76537357 76120367
2207 76120367 75406040 74702364 74221065 74210238 74311477 74155820 73705376 73866396 74055010 74337156
2197 74337156 74966043 75883736 76776541 77480521 78264625 79620316 80630162 81306385 81925200
2188 81925200 82583212 83087551 82495037 81635939 80793244 79159346 76712152 74656671 72834454
2179 72834454 71508717 70109635 69021298 68722071 67878843 67462106 66795125 66391390 66656058
2170 66656058 66601143 66747431 67509989 68562933 69789389 70834808 71788477 73301393 74135371
2161 74135371 74699193 74635201 73489147 71716399 69623693 67858141 66676894 65323889 64065283
2152 64065283 62833394 61348483 59557977 58060301 56509653 55085897 54192722 53639954
2144 53639954 53143785 52372241 51941141 51671038 51814430 51707133 51173053 50958665 50673111
2135 50673111 50126222 49194660 48424979 48480849 47599944 47174196 47364049 47364194 47236408 46448681
2125 46448681 45805783 45287488 43772506 42752693 41957315 41113566 40361251 39852201 39258911
2116 39258911 38783373 38157886 37572832 37442590 37224568 36719349 36437322 36749320 36259922
2107 36259922 35729609 35057872 34783259 34763051 34374195 33774118 33524599 33318008 32908929 32232988
2097 32232988 31850860 31490372 31105937 30467134 30698497 30973676 30764276 30777069 30785183 31170858
2087 31170858 31648780 31741296 32707080 33921229 34472584 34548174 34539523 34459886 34326590 34055120
2077 34055120 34202248 34170976 34310195 34582397 34931693 34988725 34624175 34552423 34908630 35454706
2067 35454706 35330481 35681956 36369378 36755776 36403780 35497304 34938459 34512608 34349463
2058 34349463 33982332 33305414 33129755 32531546 32341493 32334726 32488087 32952076 33504032 33880488
2048 33880488 33735619 33394160 33455425 33532210 33093465 32609479 32028076 31945487 32250054 32307572
2038 32307572 32501257 32607380 32643531 32863764 33440704 33889039 34382158 34726336 35167510 35348370
2028 35348370 35640886 36503445 37019056 37090414 37202471 37895120 39078580 39600097 39952970
2019 39952970 40068399 40280404 40850336 41414527 41612601 42102356 42781366 43718145 44632600
2010 44632600 45017618 45739819 46488662 47286586 47841324 48383989 48872069 49805098 50642636
2001 50642636 50509505 49755179 49244334 49013868 49222939 49071573 48762663 48833694 48930747 49028847
1991 49028847 49195143 49483872 49663379 50160828 51010522 51549960 51878610 51788685 51239421 50902004
1981 50902004 50258100 49343940 49083567 49198026 49430407 49627864 49463295 49204634 49164127 49363357
1971 49363357 49574087 50034335 50248985 50405889 51066747 51750152 52098765 52364451 52548441
1962 52548441 53667165 54536164 54919783 55777153 56964916 58579958 59923620 60813802 61817966
1953 61817966 63428091 64911387 66581311 68384888 69907954 71855982 73738396 75459646
1945 75459646 76761063 78196376 79936029 82200531 84834319 87028658 88930853 90867503
1937 90867503 92567552 93707776 94346292 95155538 96432151 98350111 100211677 102090899
1929 102090899 103907408 105884916 107885137 110590596 113966894 117101690 120724000 124655506
1921 124655506 128923773 133559145 139007268 145345695 152614946 160477315 169905699 180983944
1913 180983944 193881115 207721500 222201216 236707288 249503713 260336708 268951324
1906 268951324 273416806 273450938 269039336 263016099 257485040 252614130 248603522 246401631
1898 246401631 245463169 245724634 246819175 248868233 252292106 257272740 264236280 272967100
1890 272967100 283691115 295998037 309459975 322481677 333332334 340837095 344045253
1883 344045253 344161609 342157903 338903867 334404813 328737416 321753477 312399154 300080066
1875 300080066 285630361 270397601 256667837 244680213 234267823 225611600 218829861
1868 218829861 213369332 208988886 205548839 203056705 201521676 201405266 201932159 203339231
1860 203339231 206291331 209203087 211917715 213525359 213159465 209565811 202567816 193097894
1852 193097894 182979145 172730684 163502972 155291637 148138141 141392161 134480374 127752496
1844 127752496 121954941 116176991 111658551 107141140 102805260 98905070 95221910 92360472
1836 92360472 89169762 85630393 82604325 79434107 77115691 74822474 72716238 70564707
1828 70564707 68237951 65760334 63364158 61042701 59510391 57833707 56115571 54344925
1820 54344925 52985331 51969140 50573726 49284924 47964226 46841650 45983546 45002797
1812 45002797 44024371 43322141 42213860 41331497 40600697 39847627 39053835 38296453 37939963
1803 37939963 37616063 36906391 36568273 35731638 34779977 34336334 34040197 33671247 33101329
1794 33101329 32098523 31332213 30629718 29726685 28777122 28361053 27190013 26347195 25629431
1785 25629431 25073107 24699195 24104018 23647318 23419941 22955379 22321806 21702606 21135983
1776 21135983 20757507 20622358 20560160 20205782 19540805 19046901 18950289 19025017 18770561 18091428
1766 18091428 17863801 17405186 16913093 16842669 16510082 16242252 15733985 14979866 14930625 14556840
1756 14556840 14451194 14367543 14060690 14028312 13851608 13606499 13128798 12871501 12820695 12824653
1746 12824653 12605665 12574529 12164056 11855334 11622789 11505937 11004249 10371432 10649732 11009362
1736 11009362 10746039 10278361 9732948 9714732 9409885 9328147 9281592 9370126 9587530 9372544
1726 9372544 9095704 9055961 8818352 8311787 8053095 7866125 8010658 8227927 8229360 8039170
1716 8039170 7564286 7653247 7648526 7668454 7811230 7337529 7422075 7713938 7639652 7223042 6946366
1705 6946366 6566632 6464023 6878831 7270425 6950466 6211537 5748052 5719665 6104570 6159147
1695 6159147 6167645 6135457 6283612 6263781 6321748 6032539 5527648 5495537 5449645 5801118 5705771
1684 5705771 5208851 5173779 5203391 4644664 4414113 4848179 5142062 5016202 4934648 5042588
1674 5042588 5291760 5112078 4851518 4656550 5139036 5296085 4856578 4831197 4525352 4014215
1664 4014215 4027034 4233637 4738927 4914085 4486148 4284275 4494181 4443909 4398865 4262763
1654 4262763 4283141 4371539 4396099 4473647 4389703 4158245 3972934 3939547 3949565 3809588 3417714
1643 3417714 3094583 3383260 3572800 3491257 3677381 3987233 3710206 3844735 3733609 3990299
1633 3990299 4236934 3974550 3692503 3713335 3826236 3667472 3647684 3646899 3196476 3158784 3435159
1622 3435159 3601171 3411414 3201862 2975706 3280265 3595831 3351949 3481555 3605637 3610665
1612 3610665 3337875 3250801 3774301 3710648 3511356 3284857 3682412 3927533 3642878 3729569
1602 3729569 3812270 3899548 3592051 3880875 4099207 3762505 3566981 3409530 3435492 3618678
1592 3618678 3309543 3335722 3218340 3392407 3713056 3662275 3559599 3178477 3185308 3468682
1582 3468682 3116549 2874783 3134193 3865333 4335123 4373096 4269178 3860559 3626456 3604576
1572 3604576 3144933 2791891 2619322 3335538 3571455 3217581 2904032 2970748 2594267 2547381
1562 2547381 2699421 3042529 2807732 2793143 3224602 3304799 2540490 2458362 2437863 2826267
1552 2826267 2833362 2877029 3194176 2894062 2681951 2562861 2444306 2395982 2296397 2413390
1542 2413390 2636503 2279114 1998311 1844098 1920577 1965669 1853185 1995859 2090464 1749616
1532 1749616 1532497 1578035 1872069 1740368 1644628 2010924 2019279 1855929 1830725 1781570 1855144
1521 1855144 1738493 1669642 1558314 1832990 1672921 1594495 1634586 1686913 1636380 1470112
1511 1470112 1513057 1520422 1321114 1133451 1406859 1697210 1630885 1529113 1416002 1394116
1501 1394116 1554322 1722506 1680683 1312468 701938 593687 1347919 1636514 936832 781180
1491 781180 1014831 1080445 894749 919671 1233722 1670996 1202531 1282511 1371851 1448584 1033971
1480 1033971 813075 751794 760670 919598 944884 1159614 1129057 631929 759754 1070524
1470 1070524 977013 563222 617615 1173118 1331845 1021050 1003487 1118456 772474 577522
1460 577522 660102 943151 1000956 837923 942234 764638 531011 440673 663931 1152877
1450 1152877 1222011 1252160 961100 920126 1052600 936498 821525 994120 735054 412965
1440 412965 447975 863310 985165 460192 597181 886909 934309 1007698 939561 1258129
1430 1258129 1209614 969439 996166 1193034 1062852 722052 899098 824011 456854 788181
1420 788181 1086365 1079767 846155 361035 208980 447709 490702 518008 652819 748619 774942
1409 774942 1012752 1179681 1121274 600209 353683 353119 668764 732588 988995 1085342 871074
1398 871074 636258 201663 512131 1049734 603267 382141 530870 710839 959973 910575
1388 910575 1037485 685220 367874 518400 855017 940178 616349 262679 783749 730654
1378 730654 498913 602931 503935 740784 756833 791469 1001174 1062513 1410192 940102
1368 940102 333094 253089 659210 1057879 774311 580672 226994 177512 493111 787419
1358 787419 704817 809931 631859 799458 670078 494999 429756 370877 166555 63516
1348 63516 239571 376509 746607 741119 559435 109353 107793 191854 409622 767952 667419
1337 667419 468077 463660 596259 328306 329403 443652 782354 776470 555595 259867 277174
1326 277174 253426 -78236 -96245 92778 526535 696567 417503 -65544 35491 469227
1316 469227 686378 654065 618994 590407 298123 83419 230681 502894 797201 600764
1306 600764 427676 -87359 -5738 188249 401414 253230 87743 497562 693657 459441
1296 459441 203871 11797 -63799 171674 433622 675827 605758 356722 -67073 -233651
1286 -233651 -196998 45207 410135 336669 295887 192857 -267450 -19820 129523 220864
1276 220864 102151 76206 218376 860792 984606 640385 99158 -13199 166316 60675
1266 60675 220442 134381 29912 180434 456080 326342 62004 -490162 -142736 261857
1256 261857 328799 27585 -210771 -80924 187119 -110110 354513 380932 140126 230364
1246 230364 236963 87699 122480 -148591 55256 576588 733265 584948 70120 34920
1236 34920 157815 393788 408208 267235 97393 57366 437191 490150 -117045 -151135 -106450
1225 -106450 49974 -24896 -375992 -23233 292086 -36189 38056 98236 367324 216936
1215 216936 -117777 39088 -71302 81681 418976 242991 350528 -60517 -208016 224476
1205 224476 254360 183959 -409601 -357489 -38003 -435 -181290 -182946 -295851 -309354 -223303
1194 -223303 -35543 305680 -14351 -85323 -110386 208144 -57226 -235839 287113 212100
1184 212100 -333077 -151354 151045 270380 10566 -108343 19985 -71851 -255341 -584789
1174 -584789 -652216 -259973 -246341 -142387 -264521 -263217 -66404 157961 313213 -62468
1164 -62468 -212796 -287591 -46116 179367 300080 356615 132608 -48990 -76080 -97668 100793
1153 100793 116728 -172015 -353504 86782 261727 283894 34766 -105142 -440670 -695845
1143 -695845 -151274 332311 596577 295435 -277838 -143807 -139032 -247622 90846 -45354
1133 -45354 -25146 -370280 -810771 -362242 -320489 -638473 -522166 -115521 10320 -45982
1123 -45982 -205748 151625 267057 -9044 -207445 -396459 -76868 -57892 59269 -16237
1113 -16237 -28885 18826 25109 -6477 -290058 -204210 124874 413589 358728 -58389 -257530
1102 -257530 -66299 155638 134383 156486 -29147 134674 525283 457646 515716 249974
1092 249974 -77905 -250881 -341777 -160984 234807 606586 612465 56990 -325665 -44451
1082 -44451 41963 -246943 -455624 -549544 -344510 11648 -20567 -114964 -53402 -336261 -267556
1071 -267556 -43395 244165 448019 375394 315316 142620 -152758 9127 455397 690669
1061 690669 532516 184514 76213 -211769 -308832 -119762 18033 109883 223636 101691
1051 101691 354805 -3560 -325749 -194985 154822 435584 368154 369251 193688 4686
1041 4686 -26784 124611 223500 221167 -181783 -349893 -535781 -381281 -374651 -263848 -53651
1030 -53651 -376380 -347297 -16317 249644 219276 34627 -18352 268732 -462 199876
1020 199876 286370 485687 307119 -533672 -645473 -557990 -116330 -206634 -33958 61214
1010 61214 -201075 -75035 184949 433534 758540 458162 -35616 -6780 -53963 26537
1000 26537 27089 -96182 -55454 -215106 -79052 453292 450714 149945 64045 -43188 113330
989 113330 10057 -104939 -178642 80120 195409 15948 -155163 -119275 13659 230847
979 230847 345712 -5268 -399977 -364988 -151335 -350260 -536311 -236429 214649 -242787
969 -242787 -430378 -9496 183167 -40730 -232815 -313937 -447598 -435369 -552656 -113892
959 -113892 -123108 -438643 -609091 -433387 -53891 -152465 -235082 -367595 -232892 -44499 -242139
948 -242139 -367941 -373857 -212939 -39162 -26021 -35115 -477458 -733611 -433531 20092 -154339
937 -154339 -303858 -230443 -129319 -196517 -272375 -308068 -217468 -400913 -214987 -208911 -254500
926 -254500 -87480 -154304 171908 131438 -174895 -343592 -220158 165155 -76903 -677475
916 -677475 -378773 -48928 -164581 -49072 126097 335406 367994 263112 328991 306085
906 306085 167795 -3379 128378 303179 -105300 -557823 -394583 137352 143215 -12049
896 -12049 -67554 -281278 -487372 -182338 199319 171704 -463282 -510682 -284709 -255753 -447377
885 -447377 -161263 164156 163780 -483301 -667780 -310580 -56752 96641 -71280 8072 -65506
874 -65506 -536635 -164149 358903 105149 -136907 -255146 214563 253747 94032 15420
864 15420 275437 139442 -45794 -37643 139776 -81926 -47064 70165 -62208 -303281 -360632
853 -360632 -75939 203768 -191876 -874436 -614532 -397254 -67792 -188218 -628758 -465167
843 -465167 -571984 -531984 -454911 32118 -33322 -488320 -493297 -235386 -226729 -512506 -378664
832 -378664 330303 414990 396879 472478 174485 209711 64080 8408 477607 190435 318357
821 318357 172448 -222573 -159467 -358205 234760 522678 203286 135648 237713 121630
811 121630 42142 -69106 -177913 -14642 83414 -107726 56558 222118 -380993 -668578
801 -668578 -287626 -23689 -67791 80170 245060 154864 -99367 -210243 -270658 -136054
791 -136054 227100 78340 -357124 -257716 -283847 -351385 -160929 -61069 301240 138625 242493
780 242493 -16094 -239364 -252301 -92690 -96973 124106 57317 -80487 21117 -108601 -125982
769 -125982 -7013 248596 319036 303594 -41810 -515806 -332977 -277055 -21425 -283695
759 -283695 -347178 144549 36170 15824 -341216 -412490 -462677 -475046 63021 210294 120893
748 120893 3838 -222257 -552562 -412893 -37542 132906 -26965 -105686 -2734 -294514
738 -294514 -284747 12707 -49860 -363820 -175241 -58759 2509 -57438 -148346 -280604 -483433
727 -483433 -465444 -591018 -329278 -66596 -65527 -114211 -567435 -480554 -461803 -198887 222709
716 222709 601 71994 -3839 59221 126828 -246584 -340152 -255551 -259222 -205705 144724
705 144724 341681 -93960 -662324 -540942 -90732 -62575 -183963 -245658 28377 160530
695 160530 -213996 -203863 124420 -10115 -188863 -156827 112636 -142569 -223032 -115911
685 -115911 -91818 -294569 -564521 -62506 31091 -194311 -341457 -222969 -293101 -171688
675 -171688 -22817 269899 -48850 -309802 -420206 -411580 -249381 -248735 -307908 -241140 -433980
664 -433980 -528218 -565499 -432194 27436 153661 108480 -134611 -243524 -299229 -549509 -597191
653 -597191 -455342 144557 177812 -24539 -78280 -423505 -720142 -586070 -88183 212524
643 212524 301711 183354 297724 314606 359726 185465 306301 134284 -99785 77550
633 77550 331972 179922 -101155 -78775 -268519 -44321 -23473 118467 447313 59690
623 59690 -39983 -105524 167984 161836 396374 369771 15482 -59160 -126507 -440785 -108394
612 -108394 -129113 -476749 -182772 -122255 -3661 -460077 -480868 -157947 -178988 18377 362777
601 362777 455529 387802 495626 183559 99561 78086 422851 341739 -88127 -207303 -89151
590 -89151 -160138 -116625 339033 -17001 242473 578197 320671 186367 273892 257133 281164
579 281164 234157 92043 -73842 -379655 -204746 -198373 -337426 -290713 -247954 44488 -123960
568 -123960 -218734 -405676 -402676 -676979 -610343 -147991 -40740 -199764 -195631 -248995 -316406
557 -316406 -132844 -282575 -522755 -211260 -275457 -404491 -1848 -56173 -5057 -260493
547 -260493 148470 432868 342452 -9933 127408 133375 -3891 151450 352378 -53658
537 -53658 -425870 -290308 -50509 182553 -86591 110743 86741 -52033 -353563 -310446
527 -310446 -151582 248764 294041 430531 549252 292519 141319 8108 83629 -85853
517 -85853 -581280 -559234 -346052 -429395 -538271 -376662 -66017 2197 -86946 76809 87343
506 87343 222349 -43530 -280159 -111739 -324385 -235091 144102 8704 -261509 -576488
496 -576488 -222699 -36849 -203287 104730 101847 404007 268587 -11269 60187 508471
486 508471 680611 717583 494705 235284 -118176 -168631 -129218 -25222 232610 -320221
476 -320221 -328958 125344 -60760 -229081 -96079 311391 300502 178688 403945 173204
466 173204 -381461 -585359 -589990 -58899 -61979 -450231 65665 -295852 -280161 47763 -403246
455 -403246 -341073 17890 -50687 222964 368568 335754 -177879 -281049 -222539 -123120 494445
444 494445 260219 -4763 -156578 -478549 -15348 380474 -126896 -10896 79571 354107
434 354107 674165 495579 240897 321831 278842 374443 14846 -10177 214575 -225469 -305576
423 -305576 -299429 -300976 -267598 -511185 -178341 -69102 -29441 207842 253719 198738 -290788
412 -290788 -128402 182875 91894 -379636 -148998 3725 132593 184868 -260009 -471397
402 -471397 -349001 -49856 292959 523887 270056 -31190 210384 262446 -193588 -470345
392 -470345 -296862 17445 101461 -9305 32321 -222591 -392711 -505674 -261825 -173230
382 -173230 452396 391708 29111 -23667 -537827 -397213 -241042 174866 526945 214247
372 214247 119852 317500 505066 32708 -597531 -452973 -23376 -23666 111784 137790 39809
361 39809 -134608 -443283 -103817 -87812 -21531 335653 161840 -349765 -201640 -93643
351 -93643 412915 -30449 -303001 -230743 -259575 -137311 -6775 -35849 168857 -281495 -330934
340 -330934 -107020 -77275 176723 133709 226943 542847 354731 232268 165468 -270649 -150303
329 -150303 -210761 -114483 -41678 128236 172180 -231939 -378462 -230743 -159420 152933 350719
318 350719 -51487 -52181 -203996 -470996 -490207 -344828 53141 -141182 -106673 25423 -4352
307 -4352 -91263 14597 -162928 -311831 -229769 174695 314479 -54580 -73282 -237665 -130810
296 -130810 -81904 -158311 189766 248677 4784 145780 146054 274967 448604 111996 15854
285 15854 -45589 113335 237354 317880 144550 41636 185725 149852 -387624 -542388 -385917
274 -385917 9585 438669 169672 35100 202537 -112612 -172457 -54530 208922 430127
264 430127 372118 -230459 -424964 -300615 -193742 -306874 -74886 278760 290726 124294
254 124294 -96470 -381421 -264020 -37835 -38982 79913 76751 -158663 -272248 91271 -73629
243 -73629 -283538 74538 502626 564414 574920 50797 -366323 -78874 -456581 -430194 107021
232 107021 70576 44858 191022 568448 260914 -156327 -114482 88545 -17728 51001 -137414
221 -137414 -222743 -129528 -139976 88217 170252 -199226 -240124 46322 78886 -302066 -491221
210 -491221 -540571 107465 387627 238025 35496 191540 -232812 -540459 -536418 -599146 -275534
199 -275534 -113335 82332 302522 61946 52847 252403 312861 262059 83528 102149 222265
188 222265 45638 -202254 -365998 -296668 326236 281546 141283 282515 169606 252508
178 252508 376456 318270 104344 -72423 365950 327560 381490 -70457 -217840 -41737
168 -41737 87819 -164681 -235678 -288116 -290116 -116575 -333243 -307791 -325133 -315370 238207
157 238207 431850 158890 -41933 169437 77004 -186798 -294364 -134455 109409 -26995
147 -26995 -117758 121769 569357 401566 327914 -25759 -363057 -189989 10976 311714
137 311714 460830 133119 20018 222701 261856 318012 -76310 -424222 -327681 -148479
127 -148479 204242 331992 293383 434148 -28679 -279262 42896 48173 143502 336384 388578
116 388578 104234 -197139 -145456 -144451 -266348 -149834 -143815 28273 115974 -113161 -186702
105 -186702 -10526 240335 140692 94608 139136 159062 146667 92813 190914 -40402 -147919
94 -147919 -166189 70219 135134 -45138 2330 71620 51577 107524 179681 417898 364209
83 364209 24873 210376 75425 -281133 -241407 -173965 105902 182090 -25557 -235777 -256097
72 -256097 -208137 -85554 69903 -14918 -153780 262172 319079 149805 200786 53540 -37385
61 -37385 55922 77025 -31245 -61937 -158169 -42599 -18203 9255 237393 -44719 13329
50 13329 699 -727 190347 153554 374331 323199 231873 476757 480046 266823 100359 -130586
38 -130586 -80689 -30649 137543 7950 -49131 -27102 -23016 23422 93213 133678 102204 200292
26 200292 -142866 -257451 55582 71715 -63818 -193402 179373 99548 -125243 -203191 -216173
15 -216173 -255305 -158251 99056 218647 293907 239509 124603 136413 71582 -110824 142851
4 142851 349224 352186 258401 -65398
0 -65398
##END=
