##TITLE=1H_SAV-32-singlet-bat1
 CDCl3, 8 sc, 
 29.10.2020
##JCAMPDX= 6.0         $$ Bruker NMR JCAMP-DX V2.0
##DATA TYPE= NMR FID
##DATA CLASS= NTUPLES
##ORIGIN= UXNMR, Bruker Analytische Messtechnik GmbH
##OWNER= root
$$ XWIN-NMR		Version 3.5
$$ Thu Oct 29 10:09:10 2020 Russian Standard Time (UT+4h)  she@DPX200
##.OBSERVE FREQUENCY= 200.1315066352
##.OBSERVE NUCLEUS= ^1H
##.DELAY= (6, 6)
##.ACQUISITION MODE= SIMULTANEOUS
##.ACQUISITION SCHEME= undefined
##.AVERAGES= 8
##.DIGITISER RES= 18
##SPECTROMETER/DATA SYSTEM= spect
##.PULSE SEQUENCE= zg30
##.SOLVENT NAME= CDCl3
##.SHIFT REFERENCE= (INTERNAL, CDCl3, 0, 15.7039)
##AUDIT TRAIL= $$ (NUMBER, WHEN, WHO, WHERE, WHAT)
$$ ##TITLE= Audit trail, XWIN-NMR		Version 3.5
$$ ##JCAMPDX= 5.01
$$ ##ORIGIN= Bruker BioSpin GmbH
$$ ##OWNER= she
$$ F:/spectra/data/she/nmr/H-F/1/audita.txt
$$ ##AUDIT TRAIL=  $$ (NUMBER, WHEN, WHO, WHERE, WHAT)
(   1,<2020-10-29 10:08:09.18 +0400>,<she>,<DPX200>,
      <created by zg, POWCHK disabled, PULCHK disabled
       configuration hash MD5:
       00 E9 B6 7A A2 85 ED C7 34 08 36 98 17 FE 4E 26
       data hash MD5: 16K
       82 F3 94 5B 3B CB 70 25 35 94 6C F9 63 B8 61 10>)
$$ ##END=
$$ 
$$ hash MD5
$$ CB 31 F0 EF 54 14 5E 4E 90 86 37 2F DB CB CB EE
##$RELAX= 
##$RELAX= 
##$RELAX= 
##$RELAX= 
##$RELAX= 
##$RELAX= 
$$ Bruker specific parameters
$$ --------------------------
##$DU= <F:/spectra>
##$EXPNO= 1
##$NAME= <H-F>
##$PROCNO= 1
##$TYPE= <nmr>
##$USER= <she>
##$AMP= (0..31)
100 100 100 100 100 100 100 100 100 100 100 100 100 100 100 100 100 100 
100 100 100 100 100 100 100 100 100 100 100 100 100 100 
##$AQSEQ= 0
##$AQ_mod= 1
##$AUNM= <au_zg>
##$AUTOPOS= <>
##$BF1= 200.13
##$BF2= 200.13
##$BF3= 200.13
##$BF4= 200.13
##$BF5= 200.13
##$BF6= 200.13
##$BF7= 200.13
##$BF8= 200.13
##$BYTORDA= 1
##$CFDGTYP= 0
##$CFRGTYP= 5
##$CHEMSTR= <none>
##$CNST= (0..31)
1 1 145 1 1 1 1 1 1 1 1 1 1 1 1 1 1 1 1 1 1 1 1 1 1 1 1 1 1 1 1 1 
##$CPDPRG= <>
##$CPDPRG1= <>
##$CPDPRG2= <>
##$CPDPRG3= <>
##$CPDPRG4= <mlev>
##$CPDPRG5= <mlev>
##$CPDPRG6= <mlev>
##$CPDPRG7= <mlev>
##$CPDPRG8= <mlev>
##$CPDPRGB= <>
##$CPDPRGT= <>
##$D= (0..31)
0 1.2 0 0 0 0 0 0 0 0.06 0 0.03 0 0 0 0 0.0002 0 0 0 0 0 0 0 0 0 0 0 0 
0 0 0 
##$DATE= 1603951688
##$DBL= (0..7)
120 120 120 120 120 120 120 120 
##$DBP= (0..7)
150 150 150 150 150 150 150 150 
##$DBP07= 0
##$DBPNAM0= <>
##$DBPNAM1= <>
##$DBPNAM2= <>
##$DBPNAM3= <>
##$DBPNAM4= <>
##$DBPNAM5= <>
##$DBPNAM6= <>
##$DBPNAM7= <>
##$DBPOAL= (0..7)
0.5 0.5 0.5 0.5 0.5 0.5 0.5 0.5 
##$DBPOFFS= (0..7)
0 0 0 0 0 0 0 0 
##$DE= 6
##$DECBNUC= <off>
##$DECIM= 32
##$DECNUC= <off>
##$DECSTAT= 4
##$DIGMOD= 1
##$DIGTYP= 9
##$DL= (0..7)
0 120 120 120 120 120 120 120 
##$DP= (0..7)
150 150 150 150 150 150 150 150 
##$DP07= 0
##$DPNAME0= <>
##$DPNAME1= <>
##$DPNAME2= <>
##$DPNAME3= <>
##$DPNAME4= <>
##$DPNAME5= <>
##$DPNAME6= <>
##$DPNAME7= <>
##$DPOAL= (0..7)
0.5 0.5 0.5 0.5 0.5 0.5 0.5 0.5 
##$DPOFFS= (0..7)
0 0 0 0 0 0 0 0 
##$DQDMODE= 0
##$DR= 18
##$DS= 0
$$ [...]
##$SUBNAM2= <"">
##$SUBNAM3= <"">
##$SUBNAM4= <"">
##$SUBNAM5= <"">
##$SUBNAM6= <"">
##$SUBNAM7= <"">
##$SUBNAM8= <"">
##$SUBNAM9= <"">
##$SW= 16.880792210976
##$SWIBOX= (0..15)
0 0 2 0 0 0 0 0 0 0 0 0 0 0 0 0 
##$SW_h= 3378.37837837838
##$TD= 16384
##$TD0= 1
##$TE= 0
##$TE2= 300
##$TE3= 300
##$TEG= 300
##$TL= (0..7)
0 120 120 120 120 120 120 120 
##$TP= (0..7)
150 150 150 150 150 150 150 150 
##$TP07= 0
##$TPNAME0= <>
##$TPNAME1= <>
##$TPNAME2= <>
##$TPNAME3= <>
##$TPNAME4= <>
##$TPNAME5= <>
##$TPNAME6= <>
##$TPNAME7= <>
##$TPOAL= (0..7)
0.5 0.5 0.5 0.5 0.5 0.5 0.5 0.5 
##$TPOFFS= (0..7)
0 0 0 0 0 0 0 0 
##$TUNHIN= 0
##$TUNHOUT= 0
##$TUNXOUT= 0
##$USERA1= <user>
##$USERA2= <user>
##$USERA3= <user>
##$USERA4= <user>
##$USERA5= <user>
##$V9= 5
##$VALIST= <valist>
##$VCLIST= <CCCCCCCCCCCCCCC>
##$VD= 0
##$VDLIST= <DDDDDDDDDDDDDDD>
##$VPLIST= <PPPPPPPPPPPPPPP>
##$VTLIST= <TTTTTTTTTTTTTTT>
##$WBST= 1024
##$WBSW= 4
##$XGAIN= (0..3)
0 0 0 0 
##$XL= 0
##$YL= 0
##$YMAX_a= 259261
##$YMIN_a= -228913
##$ZGOPTNS= <>
##$ZL1= 120
##$ZL2= 120
##$ZL3= 120
##$ZL4= 120
##$ABSF1= 10
##$ABSF2= 0
##$ABSG= 5
##$ABSL= 3
##$ALPHA= 0
##$AQORDER= 0
##$ASSFAC= 0
##$ASSFACI= 0
##$ASSFACX= 0
##$ASSWID= 0
##$AUNMP= <proc_1d>
##$AZFE= 0.1
##$AZFW= 0.1
##$BCFW= 1
##$BC_mod= 2
##$BYTORDP= 1
##$COROFFS= 0
##$CY= 11.3945322036743
##$DATMOD= 1
##$DC= 2
##$DFILT= <>
##$DTYPP= 0
##$F1P= 15.9154993809931
##$F2P= -4.1035820241983
##$FCOR= 0.5
##$FTSIZE= 0
##$FT_mod= 4
##$GAMMA= 1
##$GB= 0.15
##$INTBC= 1
##$INTSCL= 1
##$ISEN= 128
##$LB= 0.24
##$LEV0= 0
##$LPBIN= 0
##$MAXI= 10000
##$MC2= 0
##$MEAN= 0
##$ME_mod= 0
##$MI= 1.114404
##$NCOEF= 0
##$NC_proc= 0
##$NLEV= 6
##$NOISF1= 3.799351
##$NOISF2= 2.8
##$NSP= 1
##$NTH_PI= 0
##$NZP= 0
##$OFFSET= 15.70392
##$PC= 1
##$PHC0= -10692.13
##$PHC1= 16.40088
##$PH_mod= 1
##$PKNL= yes
##$PPARMOD= 0
##$PSCAL= 0
##$PSIGN= 0
##$REVERSE= no
##$SF= 200.130013532006
##$SI= 16384
##$SIGF1= 3
##$SIGF2= 2
##$SINO= 400
##$SIOLD= 16384
##$SREGLST= <1H.CDCl3>
##$SSB= 0
##$STSI= 0
##$STSR= 0
##$SW_p= 3612.71676300578
##$SYMM= 0
##$S_DEV= 0
##$TDeff= 0
##$TDoff= 0
##$TI= <>
##$TILT= no
##$TM1= 0
##$TM2= 0
##$TOPLEV= 0
##$USERP1= <user>
##$USERP2= <user>
##$USERP3= <user>
##$USERP4= <user>
##$USERP5= <user>
##$WDW= 1
##$XDIM= 8192
##$YMAX_p= 0
##$YMIN_p= 0
$$ End of Bruker specific parameters
$$ ---------------------------------
##NTUPLES= NMR FID
##VAR_NAME=  TIME,          FID/REAL,        FID/IMAG
##SYMBOL=    X,             R,               I
##VAR_TYPE=  INDEPENDENT,   DEPENDENT,       DEPENDENT
##VAR_FORM=  AFFN,          ASDF,            ASDF
##VAR_DIM=   8192,          8192,            8192
##UNITS=     SECONDS,       ARBITRARY UNITS, ARBITRARY UNITS
##FACTOR=    0.000296,      1,               1
##FIRST=     0,             0,               0
##LAST=      2.424536,      0,               0
##MIN=       0,             -228913,         0
##MAX=       2.424536,      259261,          0
$$ Real data points
##PAGE= N=1
##DATA TABLE= (X++(R..R)), XYDATA
0@%%%%%%%%%%%%%qJ6j6J6k4L2l6M4n6O4p2Q8j04J23j47J71j96K26k60K96l37L84
35B04m34M91n54O21o96P77q65R62j068J186j316J456j606J772j954K151k370K608
53A365k871L167l493L857m269M737n272N892o621P490q549R870j1561J3798j6869
68i329K1166l8298K85722l15457l6900K31643k45125J95785j15435j08954K72644
79A37462j53690l8690J34715j19964P4717l9871l3078J10601j07945P130J02746
90G4133j01923N892O1648j8783j0943k5220J0345M3450o3546m018Q2504m4738
102H801j9522M1755l8363R739k0990K819O8223q2499J1319Q2778p5951l311j145
115a6347J9911M2402j13306N3601Q2076j05324K7045J4415m134K1986q3057P1822
$$ plain form
0 0 0 0 0 0 0 0 0 0 0 0 0 0 0 -8 8 -8 8 -16 16 -20 24 -32 32 -40 48 -56 67 -80 91 -105 121 -139 157 -180 204
35 204 -230 261 -293 328 -368 409 -456 506 -562 624 -692 764 -842 930 -1024 1127 -1243 1365
53 1365 -1506 1661 -1832 2025 -2244 2493 -2779 3113 -3508 3982 -4567 5303 -6258 7540 -9329
68 -9329 11837 -26461 259261 -56196 -93096 138547 -106578 89207 -26228 -135182 137462
79 137462 -16228 -54918 79797 -40167 34550 -5321 -38399 72202 -35743 -28613 74133
90 74133 -27790 -21898 39750 20967 10024 -15196 -4851 38599 -24947 -28965 53539 8801
102 8801 -10721 31034 -7329 2410 -18580 -15761 52462 -30037 -18718 64060 -11891 -15202 -16347
115 -16347 3564 45966 -67340 -13739 68337 -36987 -9942 4473 339 22325 -60732 11090
127A1090K3172j02752Q6355O869m5059K2573l6438P0913l1117r5900J27213k421
139C4498p5293L9022r576N1952l5932q5906J18792j0160q0751O8057q755J903
151G851J1152n0889N2722j3531n3556P8343j8168m5627N7196o646j6785q876j7874
164b4688O1340j9552o5400P5134J2098o0996K4877J454Q562L060m7571N2447N245
177B6010o9886O2287J3915m7565J9687l620J9140k4476m6339Q1503J461o0591
189b8474L0653J2244K05l6533j4908O7821k7936k8931M0014j0035m122j9701J1686
202h017L7357o2129J3587N4404n1058o069J7242J8392Q545o4839L1693M9010o6483
215b8365k21L7397K746J444l2853J8445K5033n4136J3921M0054l5579P188K5766
$$ plain form
127 11090 34262 -68490 17865 24734 -20325 2248 -34190 36723 5606 -90294 36919 34498
139 34498 -40795 -1773 -11349 40603 4671 -81235 37557 27397 -53354 14703 5948 7851
151 7851 19003 -31886 20836 7305 -46251 32092 13924 -31703 25493 18847 2062 -6814 -24688
164 -24688 36652 17100 -48300 26834 38932 -22064 2813 4267 12829 15889 -31682 20765 26010
177 26010 -43876 18411 32326 -15239 4448 828 19968 -4508 -50847 30656 32117 -28474
189 -28474 2179 14423 14628 -21905 -36813 31008 3072 -25859 14155 4120 -2 -19703 -8017
202 -8017 29340 -32789 -19202 35202 -15856 -21925 -4683 13709 22254 -42585 -10892 38118 -28365
215 -28365 -28586 8811 11557 13001 -19852 -1407 23626 -30510 -16589 23465 -12114 -4926 20840
228B0840j5946m961j7206J6924L2233n9716O333O7421m4040j6580K0942k68K2220
241B8196n0296K596O5413o2431K063M8811m0357J5225q495o858L6283o2873K1232
254a1491O2846o8633M246L4058j1768K531m5367K7836M9215o9949O431M8907k6264
267B598n182n452P501J3638l8486J6295L1339l8951N655L0422j4982j6787p690
280b0082K5306J0430m6688J5462M5841k9041k3903J5977J8766r232k9230K5542
292h52J6390l2820J1641J4710p724k942p562K4464j4235l7616M7786J0390l4972
305a3342J1645P893J6819k5050l8783O1518K387m9815L6905P449j3800j850j6915
318a4939L1787j0200l0555M9262j0762l4197K6749J922L510j7663j5684N4321
$$ plain form
228 20840 4894 -67 -17273 -349 31884 -27832 -21499 45922 1882 -14698 6244 5976 28196
241 28196 -22100 -19504 45909 -16522 -14459 34352 -6005 9220 725 -6133 30150 -32723 -11491
254 -11491 51355 -17278 -13032 21026 9258 11789 -33578 -5742 43473 -26476 -20045 28862 2598
267 2598 -2584 -8036 -535 13103 -25383 -9088 22251 -16700 -11045 19377 4395 -12392 -20082
280 -20082 5224 15654 -31034 -15572 30269 1228 -22675 -6698 12068 2836 -26394 -852
292 -852 15538 -17282 -5641 9069 1345 -1597 -9159 15305 1070 -36546 11240 21630 -13342
305 -13342 -1697 6196 23015 -2035 -40818 20700 23087 -26728 10177 17626 3826 1976 -14939
318 -14939 16848 6648 -23907 25355 14593 -19604 7145 9067 12577 -5086 -20770 33551
330C3551k3259m8503N0131R047k2741L7n108K5606j7127l3789M4971k017k7822
343a7023K6935j515r798q187l253L0674k5556k2107N1415p911l3787J1204J1254
356B345J1224k7046j3176M6531j4650l0672K7719M791q045n085j312J9977k3672
369a1071j0979M1940j6313k3506K5514Q527j0681k3451R339L6503l0314j8771
381b3263L7130K284j5430j0793R981K0245l2250j057L5126k2418n377J8760m611
394H327l879j9279J7619K3106m5436Q398M0429k1924j3148k513J7042J4118m7035
407b4175J3961L9944l6903k04J5589p604Q990k0802R859J9054m3171K0388K9241
420B4167l7348O983J2707M8p75l7386K6793L2107m9632R473L0803j6080n060j4004
$$ plain form
330 33551 10292 -38211 11920 20967 -1774 -1737 -6845 18761 1634 -32155 12816 10799 -17023
343 -17023 9912 8397 -1401 -9588 -12841 17833 -7723 -29830 21585 13674 -20113 -8909 2345
356 2345 13569 -13477 -26653 19878 5228 -25444 2275 7066 -979 -6064 -7376 12601 -11071
369 -11071 -22050 19890 3577 -19929 5585 14112 3431 -20020 -10681 25822 -4492 -23263
381 -23263 13867 16151 721 -10072 -91 20154 -12096 -13153 21973 -445 -5822 12938 8327
394 8327 4448 -14831 2788 25894 -19542 -11144 29285 7361 -5787 -8300 8742 22860 -24175
407 -24175 -10214 29730 -7173 -7377 8212 608 9598 -11204 -1345 17709 -25462 -5074 24167
420 24167 -13181 -6198 6509 6557 5782 -31604 -4811 27296 -22336 -12863 17940 1860 -3200 -17204
434a7204J4987J6082l6400J7787K4805l3568M905J4534m783k632j5601K4182J0577
447A7671m4398J6819L1114k0780p540K701J5569j930l3823K3126J9188k6516J1983
460C184P244o208m197j2875K5881o427l0617L9777O163k9213J581N408K3084k4336
474a551k7152N0815n783l0654J5823K62J4138j4417j9927L7627j8438j8759L2506
487A4490j4695l799J0174m696J0852k7510j631M1783l0060j7158L3133p57q385
500A741j6161K962L3369k9112j9258M1109r425j7978J2089o09Q640j6615p051
513a6299L5401k6400j5878L8524j1052j0697J122L41K2442k9407r058M1859k0159
526G39j1838J6083l864P029j6720M153K3145l2863N498K7857j9652m684M531J4553
$$ plain form
434 -17204 -2217 13865 -22535 -4748 20057 -13511 -8606 5928 1145 -1487 -17088 7094 17671
447 17671 -26727 -9908 21206 426 -7114 -4413 11156 9226 -24597 -1471 17717 -8799 3184
460 3184 10428 4220 23 -12852 13029 6602 -24015 15762 21925 -7288 -5707 -299 22785 -1551
474 -1551 -28703 22112 16329 -14325 1498 1760 15898 1481 -18446 19181 743 -18016 14490
487 14490 -205 -4004 6170 1474 12326 -15184 -16815 24968 -5092 -22250 10883 10126 1741
500 1741 -14420 -11458 21911 -7201 -26459 14650 5225 -12753 -664 -1273 7367 -9248 -16299
513 -16299 19102 -7298 -23176 15348 4296 -6401 -5279 -4938 17504 -11903 -20961 20898 739
526 739 -11099 4984 1120 8149 -8571 -4418 18727 -14136 -8638 19219 -433 -5117 -586 13967
540A3967j39l7821K0144K8400k8298o629J4426J4996r351l0306K3321J4300k7368
553a0358Q711R493l675n08p988J1994n715j6519K7069k575k6004J4102J1488k307
567G208j4577p292L3160q033l7661K2790J8432j7310m416M304J4852p230k5918
580b1691K2305Q554k6905J6282J2116j3096j555m351J3948k132k6980K6680J3661
593A6836k9086N062J0182K536o447j3766K3244K81k6635J9366Q060j4052J811
606b608O826Q014j7696r791K7258l041k0824P486K0869j817k8225O489K3857j3768
620C029j4127R579J5264o128j6617J4828M451j6783O346O196n755n398N852J3408
634A4145j5282j1303K1505L733k2124m997K2101N336k2799k68K0336j38k1202
$$ plain form
540 13967 13828 -23993 -3849 24551 -3747 -10376 4050 19046 9695 -20611 2710 17010 -10358
553 -10358 -1647 7846 4171 3663 -4325 7669 1954 -14565 12504 9929 -16075 -1973 9515 7208
567 7208 -7369 -14661 18499 10466 -27195 -4405 14027 -3283 -7699 -3395 11457 4227 -21691
580 -21691 614 9168 -17737 -1455 10661 -2435 -3990 -8341 5607 3475 -23505 3175 16836
593 16836 -12250 -7188 2994 5530 -917 -14683 8561 8842 -17793 1573 9633 -4419 -2608
606 -2608 4218 12232 -5464 -15255 12003 8962 -11862 -4376 16493 14676 -13549 -7060 16797 3029
620 3029 -11098 -1519 13745 7617 -9000 5828 10279 -6504 -158 6038 283 -5115 737 14145
634 14145 -1137 -12440 9065 12798 -9326 -14323 7778 13114 -9685 -9953 10383 10245 -10957
647a0957m31K1740j0280j3510J6324J072o529k911N056R863k2616J019K6251j7685
661c594r678J3791O764o39k3187R099K4214k6311m350K2231m418n961k903O186
675A244M847j6371O028J7729j7128q059K0389R07j4776j674J2867Q234k0785r275
689a5823K9875l543k2758J4414Q633n165q340m319J7020r329j0562K3068n804
702G367j4217R526L648k499j3643N483K3268j8193j5116K0170O353j3607j0972
715a2432J4425J1361k0639k134J5471k595p664J04J0371m339j5260J4509N757
728F935j7759M411J3342J03j4321o133K1730k508k3837J3338J5148r048r793K757
742e635J3340p313j4135J6815L364j5845P838Q458o693n811K682J3104q566j8084
$$ plain form
647 -10957 -11388 10352 72 -13438 2886 3958 -2571 -5482 -426 9437 -13179 -12160 14091 -3594
661 -3594 -13272 519 7283 6644 -16543 -7444 16770 -9541 -13891 8340 3922 -2039 -4942 1244
675 1244 6091 -10280 -4252 13477 -3651 -11710 8679 9586 -5190 -6864 6003 14237 -6548 -15823
689 -15823 14052 10509 -12249 2165 10798 5633 -2707 -7026 9994 665 -9897 13171 7367
702 7367 -6850 2676 6324 3825 -9818 -4335 18933 740 -14376 5794 12147 -1460 -12432
715 -12432 1993 13354 -7285 -9419 6052 3457 -4207 -4103 6268 1929 -13331 1178 6935
728 6935 -10824 -6413 6929 7032 -7289 -13422 8308 5800 -18037 -4699 10449 1401 -8392 -5635
742 -5635 7705 392 -13743 3072 6436 -9409 -1571 6887 194 -5617 -2935 10169 1603 -16481
756a6481J9836J1396k1228k15J3307L991j0645j3044J9648N631k3969J1824J1930
769A1981j2869J961K17M278l163j3365J9380K084k2732J3327J1607q170r443k896
783g803J9635n396k3339J8139J2495j4765m591O468N599r802n503J4329k303j1479
797h316P863Q609j0434r069J3613O911j6926m227J5460M417j4250n153J8141K300
811H939k0251K095J4938o150q548Q265P209p020o531Q591K778j4933M190J7621
825A1193r575j0619Q513Q554l784j6649Q801K0542j9271r045J7903l82n760m222
839c801O098R180j7949J965J6545j5809j336J3687k175m858q352J0196J0235k3854
853a0228J674K2648p633j1901K371R648R51j7260N859J5423j3459l968J1043k878
$$ plain form
756 -16481 3355 14751 -6477 -6692 6615 10606 -39 -13083 6565 12196 -11773 51 11981
769 11981 -888 1073 1290 5568 2405 -10960 8420 10504 -12228 1099 12706 4536 -4907 -7803
783 -7803 11832 6436 -16903 1236 13731 -1034 -5625 843 6442 -3360 -8863 5466 3163 -8316
797 -8316 -453 8156 -2278 -11347 2266 9177 -7749 -11976 3484 7901 -6349 -11502 6639 8939
811 8939 -11312 -9217 5721 -429 -8977 -712 6497 -523 -7054 1537 4315 -10618 -6428 11193
825 11193 1618 -9001 -488 8066 4282 -12367 -3566 16976 -2295 -11340 6563 6181 421 -3801
839 -3801 2297 11477 -6472 -4507 12038 -3771 -5107 8580 6405 1547 -6805 3391 13626 -10228
853 -10228 -8554 14094 6461 -5440 -3069 6579 7530 -9730 -3871 11552 -1907 -5875 5168 2290
867B290n424m89P818R24j6613P273J5983j4546q610J3038O728q759j3263J2031
881a619J1980j7768k467J4866j345p927j043P366q34j0492Q872O404j1857k05
895f069J0710J531j3224k425J8923l861j8746R768J3270n849j0613K151J5160
908A0726q061j4088J4804L735j0260K580L943K459q424j782J6266j0618j2268
921a0988J8214P95r745k038M893J2422j4958j0453K1896m643j2796Q621K659J803
935E682q222j562J3731j3111p243J9522m176j0860L800P654J373j6735N33K0792
949A1178q915j4129J0247Q229n013r893M852J0551r760n496J0290k091n507M498
963i59N428m763q112Q907O548j5241k175J6041K854j3228m796J6029K068j9313
$$ plain form
867 2290 -3134 -3623 4195 5119 -11494 -4221 11762 -2784 -11394 1644 8372 -387 -13650 -1619
881 -1619 10361 -7407 -9874 4992 3647 -4280 -5323 2043 1209 -9283 -411 5993 -5864 -6069
895 -6069 4641 6172 -7052 -9477 9446 5585 -13161 -3393 9877 4028 -6585 -4434 10726
908 10726 2665 -11423 3381 7116 -3144 -564 3379 5838 -2586 -4368 11898 1280 -10988
921 -10988 7226 8021 -1724 -3762 1131 13553 -1405 -11858 10038 5395 -7401 1220 3879 5682
935 5682 -2540 -4102 9629 -3482 -10725 8797 4621 -6239 -2439 5215 6588 -10147 -9614 11178
949 11178 2263 -11866 -1619 6610 1597 -8296 -3444 7107 -2653 -8149 2141 50 -5457 -959
963 -959 4469 -294 -8406 501 7049 -8192 -10367 5674 8528 -4700 -9496 6533 8601 -10712
977a0712L123J5635l512r630J568J0945l607j1640J0410L774j0857L217N862r23
991C653o364l81J3914o580j4272J3274N682j0790k396N952Q319q926r560J6137
1005G662j476j4384Q664N521m665m833K521J1000j0351j1285J7793J552j4564
1018f845R87R540M479j2274n966J7231k394j4074N411P145k550n128L598M406
1032C566p477p72Q192m060p610N863J0417r349j0513J3061P979j2353p997J0991
1046f2R796j3765p494J6577L140j1980j309P337J900q746O91J0657n352o468J0275
1061E197r2j0899L271Q318j199q661K72J3431l863j5193J0117R183r776m059M951
1076I98O128o603p023J3162k12j2603O207O114n409o945L900J3249r658j1000
$$ plain form
977 -10712 -7589 8046 4534 -5096 -3528 7417 3810 -7830 2580 6354 -4503 -1286 4576 3653
991 3653 -2711 -3092 10822 4242 -10030 3244 8926 -1864 -4260 1692 10011 1085 -8475 7662
1005 7662 6186 -8198 466 5987 1322 -3511 -990 10010 -341 -11626 6167 7719 -6845
1018 -6845 -5858 3682 8161 -4113 -10079 7152 4758 -9316 -3905 3240 690 -4438 -840 3566
1032 3566 -3911 -4683 3509 -551 -8161 -2298 8119 -1230 -11743 1318 9297 -3056 -11053 -62
1046 -62 9734 -4031 -11525 5052 8192 -3788 -5097 2240 4140 -4606 -3915 6742 1390 -5078 5197
1061 5197 5105 -5794 -2523 5795 4596 -4065 -3793 9638 5775 -9418 699 9882 106 -3953 998
1076 998 7126 523 -6500 6662 6450 -6153 54 6168 759 -6186 -2286 10963 1305 -9695
1090i695J3548L996j1551m463R227O695j1139k649J0366k199p147K113N450l298
1104g46n694Q806J207j1135L662Q899k031j0496K50J5540o258j5133J1598J0591
1118I060q478p973M329R636o997r325J1792K894q552K838L944k118m825J766R008
1133F999p356p922J4043K576j3786J723R194R94r582l403J3349l9j3612O699Q003
1148G880o840l650K768M814n494m942J1408O28j2606N045R182o081q891M544J0826
1163H591o855j0117R703O642q522n634O986M451r441r16Q959l141m338L351L954
1178C673m597q087J0380M717j4107K116J1359j717q574l442J2673J422j6436O728
1192c892J0033o925l567K314N540k402p805Q911J551j0995N964P327n686m887
$$ plain form
1090 -9695 3853 7849 -3702 -8165 1062 7757 -3382 -6031 4335 2136 -5011 -2898 2552 -746
1104 -746 -6440 2366 3573 -7562 -3900 4999 2968 -7528 -7278 8262 2004 -13129 -1531 9060
1118 9060 582 -7391 -3062 6574 -423 -9748 2044 4938 -3614 -776 3168 1050 -3775 -2009 6999
1133 6999 -357 -8279 5764 8340 -5446 -3723 5471 6465 -3117 -6520 6829 6790 -6822 -123 7880
1148 7880 1040 -2610 158 4972 -522 -5464 5944 6572 -6034 -989 8193 2112 -6779 -2235 8591
1163 8591 1736 -8381 1322 7964 -558 -6192 794 5245 -4196 -5112 3847 706 -3632 -281 3673
1178 3673 -924 -9011 1369 6086 -8021 -5905 5454 3737 -4837 -8279 4394 5816 -10620 -3892
1192 -3892 6141 -784 -4351 -2037 3503 1101 -6704 2207 3758 -7237 -1273 6054 368 -4519
1206d519M119P348n944j0470J0559Q675j2070l363J0519J200p387l263P786L190
1220F380j0328K776Q708q254k282P030J81n270l188Q861K600j3713K793J2439
1234H733m755r318K398J0019m359j0697P306O661o382l511M983L298q043p01Q775
1249D407m785n610O125M905n650p730Q613P507j2699l721J1702J426q515k462
1263f487Q829K560j0641J045Q582m592m465N749K544n418j681O777J183j0114
1277f129J180J2463n503r835P333P008m034q399L662J0581p871p244J0122J498
1291D832o013O52L295J014o850J498R386q566m678J0758J219q329k774P987M247
1306G678j1579k315J2788j481r596K046P421k018p115K983N529n737k981P198
$$ plain form
1206 -4519 -400 6948 1004 -9466 1093 9768 -2302 -5665 4854 6054 -1333 -4596 3190 6380
1220 6380 -3948 -1172 7536 -718 -3000 4030 4211 -1059 -4247 4614 7214 -6499 -3706 8733
1234 8733 3978 -5340 -2942 7077 2718 -7979 -673 5988 -394 -3905 1078 4376 -3667 -4368 4407
1249 4407 -378 -5988 137 5042 -608 -8338 275 7782 -4917 -8638 3064 4490 -4025 -6487
1263 -6487 2342 4902 -5739 -4694 3888 -704 -5169 580 3124 -2294 -3975 2802 3985 -6129
1277 -6129 -4949 7514 2011 -7824 -491 6517 2483 -5916 -2254 8327 456 -6788 3334 4832
1291 4832 -1181 -529 2766 3780 -3070 -1572 7814 -752 -5430 5328 6547 -1782 -4556 3431 7678
1306 7678 -3901 -6216 6572 5091 -4505 -2459 4962 2944 -4171 -1188 4341 -1396 -4377 2821
1320B821L91p144J213Q163m615r072O106P704n265p420N416Q964q276p727R732
1335I91L083q122j69N414R36n620j83P777n034n829Q537K267q426m18P748K422
1351E374r178k730J2505j247j2137M314Q758k928n682J598O710m102o386P583
1365B452J084o835L473N205l271n547K180R121o563q691R884N630r005m624P710
1380B203O094r845m336J0038Q6p407J081N643j052n661L697L936p521r77P007
1395B986k8p106l7R820k325j0970M947P874m552o993L585P946n266o675Q127K155
1411C488p704L93N358n22n701J889Q068n173p810Q286M928q608k972O738N061
1426E719p243n233J0405J260r536L064M751k379k370J031M710m242l829Q624o25
$$ plain form
1320 2821 3212 -3932 -2719 5444 829 -8243 -2137 5567 302 -7118 -1702 7262 -1014 -8741 991
1335 991 4074 -4048 -4217 1197 2133 -3487 -3670 4107 -927 -6756 1781 4048 -4378 -4796 2952 5374
1351 5374 -3804 -6534 5971 4724 -7413 -3099 5659 2731 -2951 -1353 5357 1255 -5131 2452
1365 2452 3536 -3299 174 5379 2108 -3439 -1259 7862 1299 -7392 2492 8122 -883 -5507 2203
1380 2203 8297 -1548 -5884 4154 4240 -3167 -2086 3557 2505 -3156 541 4477 -3044 -4021 2986
1395 2986 2958 -4148 -4185 5635 3310 -7660 -2713 5161 609 -6384 -2799 5147 -119 -6794 1333 3488
1411 3488 -4216 -3823 1535 1013 -4688 -2799 5269 96 -7714 572 5500 -3108 -6080 658 5719
1426 5719 -1524 -6757 3648 4908 -4628 -1564 3187 808 -1562 -531 4179 -63 -3892 4732 4107
1441D107r248L650P641k652q456L253J0557n352j0174O207Q029o038p257O409
1455F76O164p246k782N447N08l790p90N073j999n922O842K785q563J72O725K99
1471C599p155k670J0287R43j2343M597Q260n456m908K009N979k450p837Q746K628
1486D229r491K347N314j613m722o75R801l027j0666Q590N159o612l052K747N738
1501D067m594n050Q706m17o305M150K198l002k644L385N478p961l475J1721o54
1516E603j0323R21Q715O33j0151K34J1582k530r173L482N835k320n562K238N206
1531D390m944j003N475l163l242K704L844l593o765P851N394j0482j305P810J053
1546D024n572n449R188L454j2086L292P644n052k297Q43M117j569p664Q240L507
$$ plain form
1441 4107 -5141 -1491 6150 3498 -4958 -1705 8852 3500 -6674 -467 7562 1524 -5733 676
1455 676 6840 -406 -3188 2259 2767 -1023 -1813 3260 1261 -4661 2181 4966 -3597 -3425 3300 3599
1471 3599 -3556 -6226 4061 5004 -7339 -2742 5518 62 -4846 -2837 3142 692 -7145 1601 4229
1486 4229 -5262 -2915 2399 786 -3936 -4611 5190 2163 -8503 87 5246 -1366 -4418 -1671 4067
1501 4067 -527 -5577 3129 2712 -3593 557 2755 -247 -2891 494 5972 -1989 -5464 6257 5603
1516 5603 -4720 -3799 4916 5549 -4602 -4368 7214 4684 -4489 -1007 4828 2508 -3054 -816 4390
1531 4390 -554 -1557 3918 755 -2487 217 4061 468 -6297 1554 6948 -3534 -4839 2971 4024
1546 4024 -1548 -6997 2191 5645 -6441 -3149 4495 -557 -2854 -2011 2106 537 -7127 1113 4620
1561D620j0595L141O647k740m551j421P842L81j0742O037O803o759j916K916K457
1576B120k619l830P162l38p774N658M474n638l035M395N692o905o467J0449L301
1591F645q986j475O854L167q301k604R469j268o198K917L091j914l301L205K666
1606C967o722Q23P592l927n387K791N917k801q519N554P879q022n047O872K866
1621C836m340m050N297L486q506J024O957n126k068L667K109k712n766O443N205
1636E456j1274J142Q666k510m709j123O312J944r797L385P244o261j471L754O73
1651A431k053k421N430O26q635M338O900n186n328N159N731n239o575O484N550
1666F212p094l384P032K156o385m4M804j405l943K577L549m208k784O296J369
$$ plain form
1561 4620 -5975 -2834 3813 1073 -3478 -4899 2943 3324 -7418 -1381 5422 -1337 -3253 -337 2120
1576 2120 -499 -4329 2833 2495 -5279 379 4853 -785 -3820 575 6267 -638 -7105 3344 6645
1591 6645 -2341 -3816 3038 6205 -2096 -4700 4769 3501 -2697 220 3311 1397 -1904 1301 3967
1606 3967 -2755 -1932 5660 1733 -3654 -863 5054 2253 -6266 -712 7167 -855 -5902 970 3836
1621 3836 -504 -4554 743 4229 -4277 -3253 3704 -1422 -3490 177 2286 -426 -6192 251 5456
1636 5456 -5818 -4676 3990 1480 -3229 -4352 1960 3904 -5893 -2508 4736 -1525 -2996 758 1431
1651 1431 -622 -3043 2387 3013 -5622 -1284 5616 430 -4898 261 5992 753 -5822 662 6212
1666 6212 -882 -4266 2766 4922 -1463 -1507 3297 1892 -2051 526 4075 -133 -2917 3379 4748
1681D748p723k14P933j401p622J602P676j363q136K280P657m935n178N175K150
1696B649l651j253L007J694n860P33O896n095m764O050L371m884m677N390O151
1711E757q725l884Q779Q73o051K05M273J235n663O67N663m527k738O418Q3n199
1727b834N34N338J7p348J004Q759l085p953M554O467m088m974L435M954m531l693
1743c444N608J103n483K250L952l217l206K903M242m625m649P364L381q715j104
1758c640P240Q54o710j414O829M35o771J586N269l190l586M124J066m273n7M222
1774A984K16o185J124P668l708p841N719M926m260m540L460N986m915n575P270
1789A329J041n888J502L392q78l128J384M456m044m150O811J910p070o99P193
$$ plain form
1681 4748 -2975 -3189 4744 3343 -4279 -2677 4999 3636 -4500 -2220 5437 502 -4676 499 2649
1696 2649 -1002 -2255 752 2446 -3414 -2681 4215 -880 -5644 406 3777 -1107 -5784 -394 5757
1711 5757 -2968 -6852 1927 2800 -3251 -3046 1227 2462 -3201 -2534 3129 -1398 -4136 2282 2365 -2834
1727 -2834 -2300 3038 3055 -4293 -3289 5470 2385 -5568 -1014 5453 1365 -3609 -174 4780 249 -3444
1743 -3444 2164 3267 -2216 34 3986 769 -2437 466 4708 83 -4566 2798 6179 -2536 -3640
1758 -3640 3600 4454 -2256 -3670 3159 3594 -3177 -1591 3678 488 -3098 1026 2092 -2181 -2238 1984
1774 1984 2200 -3985 -2861 4807 1099 -6742 -1023 3903 -357 -4897 -1437 4549 -366 -5941 1329
1789 1329 2370 -3518 -2016 1376 498 -2630 -1246 3210 -834 -4984 1827 3737 -3333 -4032 3161
1804C161O69p011l87P283l05p367J820O597l167l767L024K559l010k111M080J174
1820C242o035J638O369l831n224M423M907m533n644N199N431o372l322N812J867
1835C927n369p13M240m9m154J062M315l121l803N615J299o871N36N666K85o616
1851c751o20R001j881q365L355N432k469m722J342N562l083l738M888M44m468
1866c073J480L124j746l732K806N393n160m616O751L033o596k363O434K659p006
1881b612r13O467K29n630P37M783j679m525L988K703m639m55M290M35n308m28
1897b557P428j554p711L981N503l595m271K467M272k957m638N592J288n251J872
1912a31L045k337k848J543N027m305n846Q153K455p609r93N255K258n265m049
$$ plain form
1804 3161 3830 -3181 -3568 3715 3410 -3957 -2137 4460 1293 -2474 550 3109 99 -2012 2068 3242
1820 3242 -2793 -1155 5214 1383 -3841 582 5489 956 -4688 511 5942 -430 -3752 2060 3927
1835 3927 -1442 -2155 2085 2036 -2118 -1056 3259 138 -3665 1950 3249 -3622 -3086 2580 2865 -3751
1851 -3751 -4371 4630 2749 -5616 -2261 3171 702 -4020 -2678 2884 -199 -3937 951 1395 -3073
1866 -3073 -1593 1531 -215 -3947 -1141 4252 -908 -5524 1227 4260 -2336 -4699 1735 4394 -2612
1881 -2612 -3525 2942 3171 -2459 -1722 3061 1382 -3143 845 3548 -1091 -1546 2744 3179 -2129 -2557
1897 -2557 4871 3317 -4394 -413 5090 1495 -2776 -309 3963 1006 -3632 1960 3248 -2003 -131
1912 -131 2914 577 -2271 -728 4299 -6 -5852 2301 4756 -2853 -3846 1409 3667 -1598 -5647
1927e647Q042J427p831J823M003j552k129k55L437k179k642N919j548m951L160
1942i23L643k406n202K612P372n444n826O958L222m404m151M491N051p134j557
1957c698O665j531l050J118K840p44m713L784M164o686p80N978n67l737j571N492
1973B964J105p335J998O030m317k020K410J639j743l514M720J758p316K516N870
1988D765m014l399J539N382k147q435N909O003p281k108M119K722k824n032N590
2003G89K150o302K467K099k687O9J257J449l204k379P417j292o931L136N096j314
2019A820o025R18Q260l739p022N420L762l325l085K367L774m205j989N835j740
2034A026l527L087J793j545l493K770M942o463k269O718k25l618r56L482K768
$$ plain form
1927 -5647 2395 3822 -4009 -2186 1817 265 -1864 -2119 1318 -861 -3503 2416 868 -4083 -923
1942 -923 2720 314 -4888 -2276 5096 -348 -6174 784 4006 -398 -4549 -58 4993 -2141 -3698
1957 -3698 2967 1436 -1614 -496 2344 1600 -3113 671 4835 -1851 -2631 3347 2780 -957 -2528 2964
1973 2964 4069 -3266 -1268 4762 445 -1575 835 2474 731 -2783 1937 3695 -3621 -1105 4765
1988 4765 751 -2648 -1109 4273 2126 -6309 -400 5603 -1678 -3786 333 3055 231 -4801 789
2003 789 2939 -3363 -896 1203 -1484 -1415 -158 1291 -1913 -4292 3125 1833 -5098 -1962 3134 1820
2019 1820 -4205 -3287 4973 1234 -5788 -368 3394 69 -3016 -649 3125 -1080 -3069 2766 1026
2034 1026 -2501 586 2379 834 -2659 111 5053 -1410 -3679 3039 2814 -804 -1760 1722 4490
2049D490o638N80N777m289j577L253N46j529l001M088K533p794J058P400l367
2064A530m702J321N297q21p208K819O302m880k850L283J437j598k489L055J217
2079A713m961K730K966m415j283L995J917m662k888O843J645p669K50N919K78
2094B378m964j089O190l61o042K897L287l026r19K230J268l148j260N861k047
2109A255m989L823L300k522l950K545N650m718m043N277K006m244j193L553J167
2124B917l988L14M212k810l016L815J843l818k016M765K072o401q96O531o59n778
2140b913Q61M761l21n343J137N013l276k626L465L60k859K52K803j25m476J922
2156a365M859m120m288M637L413l922l846M854L167n248k318N095J103m179L2
$$ plain form
2049 4490 -2148 -1568 4209 -80 -1657 1596 2142 613 -2388 1700 4233 -3561 -2503 4897 1530
2064 1530 -3172 -1851 3446 2625 -4583 -1764 4538 -342 -3192 91 1528 -70 -2559 496 1713
2079 1713 -3248 -518 2448 -1967 -3250 745 2662 -2000 -4888 1955 3600 -4069 -3819 2100 2378
2094 2378 -2586 -3675 2515 2154 -3888 -991 2296 -730 -1649 581 1849 -1299 -2559 3302 1255
2109 1255 -3734 89 3389 867 -3083 -538 5112 394 -3649 1628 3634 -610 -1803 1750 2917
2124 2917 -1071 -757 3455 645 -2371 1444 3287 -531 -2547 2218 4290 -2111 -3007 3524 2865 -2913
2140 -2913 -2052 2709 2388 -2955 -1818 3195 -81 -2707 758 1118 -1741 -1489 1314 1189 -3287 -1365
2156 -1365 3494 -626 -4914 -277 3136 -786 -4632 222 3389 -1859 -4177 918 2021 -2158 -2126
2171b126L642p77l072K022K507l327j531M197O08m769L03N805j298n668J601N519
2187C636j825m941K084M853k520m122L618K279l603o14K832J97l396J156L917
2202C551k865l667M294K779m822k660N286K128n324j671M990J244n272j41M451
2217B301p68l719J532K746k299k061L248Q98m448L69M665j314m685J450N380k297
2233I98n708L284M445l574l418L220L254l233k738M183O19l440Q80K845j914k424
2249b721K923K670m101k474N041J902n678p70N607N93n360P1N138m06m513R75
2265a103L897k003k354K836R82l328K41L226p29m105J709N003l036m494L747L889
2281D378l905l493L486L370l902k862M176J523m116K78K998j341k786K321K139
$$ plain form
2171 -2126 1516 739 -2333 -311 2196 -1131 -2662 1535 2143 -2626 -2323 3482 2184 -3484 -1883 3636
2187 3636 1811 -3130 -1046 3807 1287 -2835 783 3062 -541 -1155 1677 1874 -1522 -366 3551
2202 3551 686 -2981 1313 4092 -730 -3390 1896 4024 -1300 -2971 2019 3263 -2009 -2150 2301
2217 2301 1533 -2186 -654 2092 -207 -2268 980 1878 -2570 -2201 2464 1150 -3535 -2085 3295 998
2233 998 -4710 -1426 3019 -555 -3973 -753 2501 -732 -3470 713 1332 -2108 -1228 1617 -297 -2721
2249 -2721 202 2872 -1229 -3703 1338 3240 -2438 -3208 2399 2992 -2368 -2297 2841 2435 -2078 -1103
2265 -1103 2794 791 -1563 1273 2255 -1073 -832 2394 1665 -2440 -731 4272 1236 -3258 489 4378
2281 4378 473 -3020 466 3836 -66 -2928 1248 2771 -1345 -1067 1931 590 -2196 125 2264
2296B264k934k264M203J484n385n1M830l22m980M25N166n53n123J309M215k391
2312a07k805K495J951l035q21L240K7l528J356L714k284m112L755M018m448k781
2328c365L843K704l787l031M747J960m818K13L408n66k250Q53K274k021k046L952
2344B070N80m886J394L915o81m337o8N939j496o016L006M103k404l293J844L438
2360C108k491l151L933O60l796J289K291j164k619J705L259l784k796M791J462
2375B697m444j144L847J645m704o53M637j164l580J628K725j942k062K285K099
2390A870m188k67M649r71l885P08M287k43n862K065N496l635l035K797K151j072
2406H65l488K711K509m568J534K479k569m78J604J492j782l231N067J795o279
$$ plain form
2296 2264 -670 -2934 1269 2753 -2632 -2683 2147 1825 -3155 -2730 2436 1883 -3240 -1931 2284 -107
2312 -107 -2912 -417 1534 -1501 -2322 918 945 -2583 -1227 2487 203 -3909 -154 3864 -584 -3365
2328 -3365 478 3182 -605 -3636 1111 3071 -1747 -1534 1874 1308 -942 -89 2185 164 -1882 2070
2344 2070 2650 -2236 -842 3073 2392 -1945 -2013 3926 2430 -3586 -580 3523 1119 -2174 -330 3108
2360 3108 617 -2534 1399 2059 -1737 -448 1843 679 -1940 -235 3024 -760 -3556 1235 2697
2375 2697 -1747 -2891 956 2601 -2103 -2756 1881 717 -2863 -1235 1490 -452 -2514 -229 1870
2390 1870 -2318 -2585 2064 1093 -2792 -2084 2203 1960 -3902 -1837 3659 24 -3011 -214 1937 865
2406 865 -2623 88 2597 -1971 -437 2042 -527 -1005 599 2091 309 -2922 2145 3940 -2339
2421b339K70N259m40m024j711N901M26o198K003L779k043j963R03K132j397k485
2437a927L781Rl920J603K695j815k389J323L959l506l751M606K040m201r85K825
2453C47J735l691j232M768j362l591K572J771j766k171K362L099m863j743N961
2468B196m17m145P0L338J442n049j66N426k504k308K314L82l64j134J322J535
2484A938l974J677L926m183j774L294K126k274m355M443M290o585j446N090M80
2499B673k632k572L780K166n105R73L300k418q63J618L53j072j940L711K98n235
2515b965K145L820k463k981J120M314j827m649L580K219l198r68J974J558k774
2530a095j181M107j354l429K675K123k600k098K406L319l732l047M949R81l867
$$ plain form
2421 -2339 -2069 3190 2750 -1274 -2985 2916 3342 -2856 -853 2926 883 -1080 -177 1955 558 -1927
2437 -1927 1854 1863 -2057 -454 2241 426 -1963 -640 3319 -187 -3938 668 2708 -1493 -2478 347
2453 347 2082 -1609 -2841 1927 565 -3026 -454 1317 -449 -2620 -258 2841 -2022 -3765 2196
2468 2196 1779 -2366 -2296 1042 2484 -2565 -2731 2695 191 -2117 197 579 215 -919 403 1938
2484 1938 -2036 -359 3567 -616 -2390 904 3030 756 -3599 844 5134 -1451 -2897 2193 2673
2499 2673 41 -2531 1249 3415 -1690 -717 2583 165 -698 920 1273 201 -1739 1972 2270 -2965
2515 -2965 -820 3000 537 -2444 -1324 2990 1163 -3486 94 2313 -885 -1853 121 1679 -1095
2530 -1095 -2276 1831 477 -2952 -277 1846 -754 -2852 -446 2873 -859 -3906 1043 2024 -1843
2545a843l78K601J150k829p24L943j840k192L055J45k404M28K077J078m590P54
2561a569N596l214l752K768K944j114m412K239M742m118k384L268J182k055j233
2576a112J971R37l115J322K504l040j106L001P35k891j479M005J184n023l2M493
2592B354q48l565N37L183o38l432K195K068k369j142K351K74k861J06L624j200
2608F37l949K485L101k558l082K760L328l109l186L987J399l173q53K693Q46k909
2624a583M84K484j738j864L006J157l206o52L493O09m180j51M869n87m439J080
2640a218L848r84l457J340L060j937k316K643P89k480N00K002p62k623J564L110
2656C079k935k667L442K197l731j967L578K100m076j201L690N74l362j29K739
$$ plain form
2545 -1843 -2221 380 1530 -1299 -2023 1920 80 -2112 943 1088 -1316 -888 1189 2267 -2323 -1569
2561 -1569 4027 813 -2939 -171 2773 1659 -2753 -514 4228 110 -2274 994 2176 121 -1112
2576 -1112 859 1796 -1319 3 2507 -533 -1639 1362 2097 -794 -2273 1732 2916 -2107 -2139 2354
2592 2354 1506 -2059 -1522 1661 1023 -2409 -214 1854 -515 -1657 694 968 -1893 -1787 1837 637
2608 637 -3312 -827 2274 -284 -3366 -606 2722 -387 -3573 414 1813 -1360 -2213 480 1326 -1583
2624 -1583 -1099 1385 -353 -2217 789 1946 -1260 -1912 1581 2190 -1990 -2141 2728 2141 -2298 -1218
2640 -1218 2630 1646 -1811 -471 2589 652 -1664 979 1768 -712 -212 1790 1028 -1595 -31 3079
2656 3079 144 -2523 919 3116 -615 -2582 996 3096 -980 -2181 1509 2083 -1279 -1408 1331
2671A331p34k318J756J456k318j015K925L98l775J18M237j199l883J473L788j318
2687I22m089K030L470k576k462K407J739k464n59K275j30k390J220K605k241k495
2703b738L375J900l748j411M005J146l786j256M139O56l667q6L478q10k517J106
2719b14K020j403j434K294O26l073M30L306j194l313J185M186k564l310K465L158
2735C165k762k499K477J793k302j355K444J27k299O71K169j943j596K176J541
2750A807k943j421L368J434m046q51M321r0m059J58L794l66l154P47K635j327
2766Gk096K288Q15k454M37K280p36k922J379L399k209l504L457K549l354j833
2782b497K998J855k718k013L624N08l111Q13K124j012j692J330J867k229j178
$$ plain form
2671 1331 597 -1721 35 1491 -827 -1842 1083 1481 -2294 -2176 2061 862 -3021 -1548 2240 922
2687 922 -3167 -1137 2333 -243 -2705 -298 1441 -1023 -1582 693 563 -1827 -607 1998 -243 -2738
2703 -2738 637 2537 -1211 -2622 1383 2529 -1257 -2513 1626 2282 -1385 -1471 2007 1197 -1320 -214
2719 -214 1806 403 -1031 1263 1889 -1184 -754 2552 1358 -1955 -770 3416 852 -2458 7 3165
2735 3165 403 -2096 381 2174 -128 -1483 961 1088 -1211 -540 1629 -314 -1910 266 1807
2750 1807 -1136 -2557 811 2245 -1801 -2652 1669 1579 -2480 -2322 1472 1106 -2048 -1301 1334 7
2766 7 -2089 199 1014 -1440 -1003 1277 541 -2381 -1002 2397 188 -3316 141 2690 -664 -2497
2782 -2497 501 2356 -362 -2375 1249 1757 -1354 -541 1583 571 -1121 209 2076 -153 -1331
2797a331L191L50l753N29L425m09l469k07M533j211l699J611K838j843j824J583
2813C14J487k524l49K529q40k308J431K329j809l045K727K773l563k113L578J643
2829B260l284j820L417J303l810J64K725n02j726O90J280j156j388K221R35l424
2845b115O09L154j238k489Q38L275j058m090K567L116k925j718K050J729j756
2860e1j776K937O27l324J547J981j992j297J752J964k113k600L806J267l990m5
2876a307K591Q68k810q61L273k67k707J174J611j457q02J238J073k709k14L528
2892B222j514l179J821K864j345l736J559M554l244l003K958J725j881k100J818
2907d81K065k667k60K339j666q23J716K50q99j670K518J840m558O2M397j389k640
$$ plain form
2797 -1331 1860 2210 -1543 -1014 2411 2002 -1467 -1674 2859 1648 -2051 -440 2398 555 -1269 314
2813 314 1801 -723 -1072 1457 617 -1691 -260 2069 260 -2785 -58 2715 -848 -2961 617 2260
2829 2260 -1024 -2844 573 1876 -1934 -1770 955 453 -1273 -583 697 -459 -1847 374 1309 -2115
2845 -2115 -1506 1648 410 -2079 -1241 2034 976 -3114 -547 2569 -356 -2074 -24 1705 -51
2860 -51 -1827 1110 1737 -1587 -40 1941 -51 -1348 404 2368 255 -2345 1461 2728 -1262 -1307
2876 -1307 1284 2152 -658 -1519 1754 1487 -1220 -46 1565 108 -694 544 1617 -1092 -1306 2222
2892 2222 708 -2471 -650 2214 869 -2867 -1308 3246 2 -3001 -43 1682 -199 -2299 -481
2907 -481 1584 -1083 -1343 996 -670 -1493 223 473 -426 -2096 422 2262 -2296 -2234 2163 774 -1866
2924a866O5L084L68m446J762L377k289j630J877O50r08j391K451O19l300J053
2940e24K623j716j883J512K354j626k985K886K118l221m90J930N14j448j032K434
2956A446l09k620K414O60k289k11J710J275l313r45M686n28m238J111K695k5l592
2973b073n1M616j917k845K256Q13j036p66N21J194j931L23K557k642j214K713
2989E18O17j906j910K986K109m059r62M131j0k598o51K605P65l253M94L007k129
3006b46j142K217J80j417n63K166Q16l632M74L700j774k404J173K319p88k973
3022a894K117K137k532m45J714q8j608kK121p04k768K601J627k769j221K565J593
3039B444l066j804L859P98l769J2K500M55k397n82K850o11k281J787O29k146M69
$$ plain form
2924 -1866 -1801 1283 1651 -2795 -1033 2344 55 -1575 302 952 44 -1347 1104 1723 -1577 -524
2940 -524 2099 383 -1500 12 2366 740 -2245 641 2759 -462 -952 978 1492 44 -988 1446
2956 1446 1137 -1483 931 1591 -698 -909 801 2076 -1237 -2182 2504 1976 -2262 -1151 1544 1519 -2073
2973 -2073 -2124 2492 575 -2270 -14 799 -237 -1003 -482 712 -1219 -896 1661 -981 -2195 518
2989 518 1135 -771 -2681 305 2414 -1645 -2607 1524 1514 -1084 -1735 870 1635 -1618 -1124 1883 -246
3006 -246 -1388 829 1009 -408 -971 1195 2011 -1621 -1147 2553 779 -1625 -452 1867 1079 -1894
3022 -1894 223 2360 -172 -617 1097 1009 -599 -601 1520 816 -1952 649 2276 -493 -1714 851 2444
3039 2444 -622 -2426 1433 2231 -1538 -1526 974 1429 -968 -1550 1300 689 -1592 195 824 -1322 -853
3056h53J311m2k035K70L432j895k996K313K432k081k409J736K737k406k025L057
3072E46P68k210l12J393K74j799R20J692j739j091K517M18k320m33K815M68l168
3089a261k52L833r08k753N63K581q43k253J226J736k090l62J999N4j990N59K156
3106A995j352k660K250K161k566j859K510J747k080k199K666J360k715k89J704
3121F73M33j851j41J758j032j453K217L15k202k54K607k42k582r6L465p85l263
3138b433J371K587j129k455J180K038j515j336J730O37j556r0K111j059j669J546
3154d2J918k202j840K579J753l034j269L152Q81k730p45K944M2k076J66J987q09
3171F75j576J160J029j807K8J889j99k302K12L138j016l046J405K745j508k531
$$ plain form
3056 -853 458 416 -1619 -1349 2083 188 -2808 -495 1937 -144 -2553 -817 1920 -486 -2511 546
3072 546 1314 -896 -1208 185 459 -1340 -420 1272 -467 -1558 959 1377 -943 -1376 1439 1907 -1261
3089 -1261 -1513 2320 1412 -1341 -778 1803 960 -1293 -67 1669 -421 -783 1216 1270 -720 -161 1995
3106 1995 643 -2017 233 2394 -172 -2031 479 2226 146 -2053 613 1973 -742 -1031 673
3121 673 1106 -745 -886 872 -160 -1613 604 919 -1283 -1537 1070 828 -1754 -1850 1615 830 -2433
3138 -2433 -1062 1525 396 -2059 -879 1159 -356 -1692 38 675 -881 -971 1140 81 -1588 -42
3154 -42 1876 -326 -2166 413 2166 -868 -2137 1015 1896 -834 -1579 1365 1407 -669 -503 1484 675
3171 675 -901 259 1288 -519 -491 1398 1199 -1103 -891 2247 1231 -1815 -410 2335 827 -1704
3187a704J666K188j765k097K060J069j915n13J721k65j698R45J518j679j525K345
3203C51J346k849p25K818M38k685q81L179L68k988K61K392o12j801N46J711j377
3220e08r63K012J53k483Q86K177j068k423J609K535j519k625K115K036j990j922
3236a978K518J322k168q24J957L00j946N72J681j102j081J536J182k477p84K796
3252A504L09k845k07K941j9k921L92K904j193j968Q56J621r85j283J361Q83k277
3269i27J74K112j187j797J361J849j220k937K491K156k592j699K583J114k124
3284f43j075K264O19k615N77J413q46p39J333O06j683q34K550K85k919L40K632
3301A265k49k726L28L016n83k871J409K089j555j236J134J225j468q37K021m78
$$ plain form
3187 -1704 -38 2150 385 -1712 348 1417 -498 -1011 710 445 -1253 -308 1210 -469 -1994 351
3203 351 1697 -1152 -1877 941 1379 -1306 -2187 992 1360 -1628 -1367 1025 413 -1388 -842 869 -508
3220 -508 -1471 541 694 -1789 -903 1274 206 -2217 -608 1927 408 -2217 -102 1934 -56 -1978
3236 -1978 540 1862 -306 -1130 827 1127 -819 -247 1434 332 -749 787 1969 -508 -1292 1504
3252 1504 1813 -1032 -1239 1702 1683 -1238 -846 2058 865 -1103 -247 1374 389 -894 467 1350 -927
3269 -927 -753 1359 172 -1625 -264 1585 365 -2572 -81 2075 -517 -2216 367 1481 -643
3284 -643 -1718 546 1165 -1450 -873 540 -306 -1045 288 894 -789 -1623 927 1212 -1707 -1367 1265
3301 1265 1016 -1710 -1382 1634 1051 -1820 -411 1678 123 -1113 21 1246 -222 -1059 962 484
3317D84j556J357J128j283j615J971J985k797j456L178M43k459p74K510Q93k901
3333h92j77K802q56j589R05Q77j083p44J273R84k735%K800j070j779M43J977k35
3351I01k898R76K880k453j245J936P80j324q89J495M50k371J104J700j857p85
3367a600J548J467j949k054K865J774l433k47K399M71j853j205K903o1k685J369
3383b91J284j241p2O69L29j305r7K411j002k481K065J846j731k013J456K769k498
3400I8k043K817J052k012p78J057J606k138p16K463j033j476J890J33j198n45
3416h23J158J403k753n08L376j233k143P26J878l13k240M16K688k036j144J773
3432B25l2r58k46J584K81k715R21K499j902j390J237K052j512k212J890K194k580
$$ plain form
3317 484 -1072 285 1413 130 -1485 486 2471 -326 -1782 1396 1839 -620 -1394 1116 2009 -892
3333 -892 -1069 1733 877 -712 193 1070 -13 -757 516 1500 -1235 -1235 1565 495 -1284 -841 1136 901
3351 901 -1997 -1021 1859 -594 -1839 97 877 -447 -1336 159 609 -1762 -658 1042 -815 -1600
3367 -1600 -52 1415 -534 -2588 277 2051 -1382 -1629 770 1241 -612 -1817 1086 1025 -1660 -291
3383 -291 993 -248 -320 349 678 -627 -724 1687 685 -1796 269 2115 384 -1629 -173 2596 98
3400 98 -1945 872 1924 -88 -866 191 1797 -341 -1057 1406 373 -1103 787 920 -278 -823
3416 -823 335 1738 -1015 -1523 1853 620 -1523 -797 1081 768 -1472 -1056 1632 -404 -1548 225
3432 225 193 -765 -1011 573 854 -1861 -940 1559 -343 -1733 -496 1556 44 -2168 -278 1916 -664
3449f64j060J757P23j075q30J468L29j816J374O91j776M55J381j03j534q65L130
3466A585n38l115J610K563j459j992Q29K600j101k801K193J165j642m06R87M32
3482I10r67m20J714j061j428J880N52j558q34J548J242k221r33K583K00k270O5
3499i98J631k01j542K91K135j496j352J916L64j728j9J737J64k578L74K916j407
3516B07k031J197J823r45k153J184K053j831n42J278K35q10j24J177m68j646J515
3533A19J408k389n22K491L98j850j079K595N97k861J45K367J1k270O5K101m56
3550H70j842J293P44j420j01J422j70j675L81K357j128k319J770J684j704j561
3566a399J513J666j485j867K216J64j525l7J605p03j046O69J082j309j175K040
$$ plain form
3449 -664 -1724 33 756 -319 -1149 319 648 -1168 206 897 -879 -424 957 854 -680 -1545 1585
3466 1585 1047 -2068 -458 2105 646 -1346 -517 2083 982 -1819 374 1539 -103 -509 478 910
3482 910 -57 -477 1237 176 -1252 628 1180 -378 -1212 336 1578 -643 -1576 1007 1207 -1063 -998
3499 -998 633 432 -1110 -819 1316 -180 -1532 384 748 -980 -999 738 902 -1676 -1302 1614 207
3516 207 -1824 -627 1196 251 -1902 -718 1335 -496 -1038 240 475 -335 -459 718 250 -1396 119
3533 119 1527 -862 -1384 1107 1505 -345 -1424 1171 1768 -1093 -948 1419 1430 -840 -775 1326 870
3550 870 -972 321 1065 -355 -456 966 796 -879 -498 1859 731 -1588 182 1866 162 -1399
3566 -1399 114 1780 295 -1572 644 808 -717 -754 851 148 -898 -229 853 -456 -1631 409
3582D09N96k215l08K383J44k404k5K639q55k062Q15J711p47j240R53J035j333
3599e04m91J681j26j652N22J960j399j669J505J946j810j759K147J648j968j523
3615a492K139J200k341l92J939k81j319L35J244p45j100J532N05j731j86J951
3631A258J7k547O76K453r46k130N86K290j076j744J161J555j506j180J242O18
3647G27j365M5J323o24j228J027J582j801j456K150J021k404r16K442N23k129
3663a083k53J756K13j792K42J510o59j132J137O77j279o11K212n83j524K79K041
3680A151o68k159J209K118j418j695J241J762j521j273J418Q92j365l36J402j61
3696E97j191R44R94j427p95J643R23k192j027K411O55k066m68K104M73k721N24
$$ plain form
3582 409 1005 -1210 -1518 865 1009 -1395 -1420 1219 364 -1698 -883 828 81 -1159 -206 829 -504
3599 -504 -995 686 560 -1092 -570 1390 -9 -1678 -173 1773 -37 -1796 351 1999 31 -1492
3615 -1492 647 1847 -494 -886 1053 772 -547 -212 1032 287 -813 719 1224 -507 -693 1258
3631 1258 1275 -1272 -596 1857 911 -1219 -633 1657 581 -1163 -2 1553 47 -1133 109 727
3647 727 -638 -593 730 106 -1122 -95 1487 -314 -1770 380 1401 -1003 -1919 523 1046 -1083
3663 -1083 -1336 420 633 -1159 -917 593 -66 -1198 -61 616 -663 -1274 938 355 -1169 -890 1151
3680 1151 483 -1676 -467 1651 233 -1462 -221 1541 20 -1253 165 1057 -308 -644 758 597
3696 597 -594 350 1344 -83 -878 765 1688 -504 -1531 880 1535 -531 -999 1105 1578 -1143 -619
3713f19J643m51j476J027R93j258n46J266J47j788O47J724j191j685J286J838
3729A557j675j843J695J743j649j394J631J163j629r84J992l5j447M72J063r07
3745b47q51J096R35j923l23K068R5k297J46K300n6k288L90K309p21j788R62J233
3763A040r37p32J091O94j728K7J690j148j004R34J445j115j494J682J438j964
3779h1j390K187P68j744p64J723M24j528j60J558q14o70J010M07j052q19J991
3796A046j08k205M60K077p13j841L22K413q82k407J320J785j327j278J246Q26
3812G34j205n76J395j64j610J284Q64j125q43J210J344j748j339K656J26k061
3828a058K0J726J68j787j52J956l06j351P88O80q04k55J015M70j952J75K256r27
$$ plain form
3713 -619 1024 573 -903 124 1117 -141 -687 579 726 -1062 -415 1309 118 -1567 -281 1557
3729 1557 -118 -1961 -266 1477 -172 -1566 65 1228 -401 -1385 607 572 -875 -403 660 -247
3745 -247 -1098 -2 933 -990 -1313 755 850 -1447 -1301 999 943 -1345 -955 1354 633 -1155 -193 1040
3763 1040 103 -629 462 1156 -572 -545 1145 -3 -1007 -73 1372 257 -1237 445 1883 -81
3779 -81 -1471 716 1484 -260 -1024 699 1123 -405 -565 993 179 -491 519 926 -126 -945 1046
3796 1046 938 -1267 -807 1270 557 -1284 -962 1451 569 -1838 -518 1267 -60 -1338 -92 734
3812 734 -471 -1047 348 184 -1426 -142 722 -403 -1246 -36 1308 -440 -1779 877 1003 -1058
3828 -1058 -1038 688 856 -931 -1083 873 567 -784 4 684 -120 -375 640 1110 -842 -667 1589 662
3846F62j881R89J797o89j874Q52J945j423j292J260M50j042j35N21P18j496O68
3863C0J287j696m44J655K09j659n65J915Q23k545l56K506j21k051o8J567L57k087
3881a243M80J888j374n98J077j19o63l29J472j27j972J156J394j466q13R90J386
3898A139j441j804K193J301k353m8J321M37j359k27J851p21j341J298N74j065
3914b45m40J124R12j891o82K423q4j940M24J190j6j307Q5J687q25j350J518J84
3932G67j256K84R65k75j361O73J795j814j356J738J346j523j630J768J537k082
3948d24j282K502N4j174n29J218J91j079J99Q43r00l33J219j71j256K01J683k76
3966F86k423Q65J804r03j090M90J445n84j589J035J354j825J8J190Jj004j80J685
$$ plain form
3846 662 -1219 -230 1567 878 -996 -144 1801 378 -914 346 796 -246 -381 140 858 -638 30
3863 30 1317 -379 -823 832 1041 -618 -1183 732 1555 -990 -1346 1160 1039 -1012 -1080 487 844 -1243
3881 -1243 -763 1125 -249 -847 230 111 -552 -881 591 464 -1508 -352 1042 -424 -1237 -247 1139
3898 1139 -302 -2106 87 1388 -965 -1013 308 745 -614 -841 1010 289 -1052 246 820 -245
3914 -245 -685 439 1351 -540 -1222 1201 1117 -823 -399 791 775 -532 -447 1240 415 -935 583 767
3932 767 -489 -205 760 485 -876 -203 1592 -222 -1578 160 1506 -17 -1647 121 1658 -424
3948 -424 -1706 796 850 -324 -853 365 556 -523 -324 519 -381 -714 505 334 -922 -721 962 686
3966 686 -1737 -872 932 29 -1061 -571 874 290 -1299 -264 1090 -735 -717 473 474 -530 -710 975
3984I75p27j514J478R88j565l05R23J202j484j405K145M99j826J38J291n3j382
4001f22M43J074p86p54J252K08j382M11J205j12j641K34K129j022k033J494J357
4018A455r54j769Q33J411j436m79J476k38q85K25Q69k04j112P86Q17j479o94J795
4036D17L17j270o05J836L04k261L06J574k84j258L24J326m10j175O69R99j643
4053h34J56J107j61j346M25J778p12j674J134J566j280j366J460J007j217j015
4069i72J429N84j466N4J041k85q57Q01N98r80p27J663J31j622o8J790J85j769
4087d70j33J905m76j935R09J505j001j104R74R03j064m92Q19r3r66M22P17k85
4105A35j270J001J148j520q34J613P50j715o67J427P38j423k41J323j77j294O89
$$ plain form
3984 975 248 -1266 212 1200 -365 -670 253 1455 -29 -1434 711 1210 -616 -478 813 760 -622
4001 -622 -179 895 109 -645 607 815 -567 -156 1049 937 -704 -470 1659 637 -1396 98 1455
4018 1455 501 -1268 -435 976 -460 -939 537 299 -586 -361 508 304 -808 -22 795 -684 -1378 417
4036 417 734 -536 -1141 695 999 -1262 -956 618 334 -924 -600 726 316 -859 -190 809 -834
4053 -834 -678 429 268 -1078 -653 1125 413 -1261 -127 1439 159 -1207 253 1260 43 -972
4069 -972 457 1041 -425 -371 670 385 -472 329 927 -53 -780 883 1014 -608 -676 1114 1299 -470
4087 -470 -603 1302 826 -1109 -200 1305 304 -800 174 1077 13 -479 340 247 -719 -297 420 135
4105 135 -1135 -134 1014 -506 -1340 273 1023 -692 -1359 68 806 -617 -858 465 288 -1006 -317
4122c17P13o71l98R11L46j157l88J402K91j848N06J714n93j503N53J694j016j257
4140a018J002J130r87o76N42O47r58K12P62n38p42R83P49j197q92J536J085k033
4158c93m42J683M03k064j23J765J99j633J86R97l61p87P80M62j196p8J130j63
4176C65j570Q18J426q27j701J301J382j022j446J151Q66j140q14J280P35j265
4192d61l19J218l96p54O20Q03j155o16J369N71j539m07J992M8j767j24J626M8
4210G57j633L45J435o23j034J094K08n49l45O65L39j339N28J196r69q61O38J394
4228A246r27j405J406J058j364q52J331M43j102m78J262J66j432N44Q39r55k43
4245d63P28N69j381n79K031l41j570L26J286L8j800K45J797o00j587J147M55m27
$$ plain form
4122 -317 396 -275 -673 238 584 -573 -961 441 732 -1116 -610 1104 511 -992 -439 1255 239 -1018
4140 -1018 -16 1114 127 -549 -7 640 -318 -106 656 118 -624 359 1108 -89 -981 555 1640 -393
4158 -393 -835 848 1251 -813 -936 829 1028 -605 -419 578 217 -570 210 672 -524 -602 528 365
4176 365 -1205 -387 1039 212 -1489 -188 1194 172 -1274 -123 743 -397 -1211 69 804 -461
4192 -461 -780 438 42 -712 -92 711 -444 -1060 309 880 -659 -1066 926 974 -793 -917 709 757
4210 757 -876 -531 904 281 -753 341 549 0 -345 320 659 -680 -152 1044 75 -786 -148 1246
4228 1246 319 -1086 320 1378 14 -838 493 936 -166 -644 618 784 -648 -104 735 -220 -463
4245 -463 265 834 -547 -1126 905 564 -1006 -680 606 644 -1156 -911 886 286 -1301 -154 301 -126
4263a26m04M80L68j078K35J138p37j112J123R69q24j052R91J131j314j243J827
4280C72P45j762m9J283K06j424J33J174n70o23R16K13r19r1J094J91j480K61J672
4299A342q39j394Q47J185n31j550P25J529j285p04J083K22n83m24R42j02j101
4316f38J013O65j095n74Q87Q71j373q24J629N49j818k57J607j56r96l32J424j48
4334D34j399J133K04r48P9Q33j0j277K3J833q36j439Q24J409p67j304P51J703
4352A246j430j099J392N55r07k96O62M16r67K12J084j012l69J431n47p18n9R76
4370E70M30j871L11J675o41j310O89Q99J93j664N77J142j136m12P90K72o31m00
4388e17J198j52j502R12J144j133q76R57P24o91j066J234Q41j674r3J320l37n75
$$ plain form
4263 -126 -530 -50 318 -760 -525 613 -124 -1236 -113 856 32 -1020 -29 1102 -212 -1455 372
4280 372 1117 -645 -694 589 795 -629 -496 678 108 -515 401 614 -305 -396 698 889 -591 -330 1342
4299 1342 503 -891 -44 1141 610 -940 -215 1314 29 -675 408 630 47 -377 565 463 -638
4316 -638 375 1040 -55 -629 258 1129 -244 -1068 561 1110 -708 -965 642 486 -510 -842 582 434
4334 434 -965 168 372 -576 -497 336 326 -951 -928 905 69 -1370 -546 863 96 -1208 -457 1246
4352 1246 -184 -1283 109 664 -243 -539 123 539 -428 -216 868 -144 -513 918 371 -347 -406 570
4370 570 1000 -871 -560 1115 474 -836 -147 752 945 -719 -142 1000 -136 -548 242 514 -117 -517
4388 -517 681 529 -973 -61 1083 -50 -926 31 755 64 -1002 232 1073 -601 -694 626 289 -286
4406b86k57R10k69j434J549O23j558P6R66j00j029l72J730K74k177Q35J428p89
4424A20p36p0J242k78j036O83N38r98O24L43j59p34L81J195j296r90J871M52j265
4443a13q40J171J246j620m94J368L9j363M21Q63l7j196M76R32j244l2R52p6p70
4462c17j69J130k9j359L52J464q43j096P12Q37m00j127Q86N14j142L9J210o58
4480Dm43J06P31m81j073J287P66j424m32J351M50j619m18J726K46j552k5R86j70
4499A6n07J60N99l32m21Q05J90j150N58R98o95j012N13J443j068j381J286R78
4517I80r16q95R59Q29j086n27J339M0q83M04M72n95l42K67N65r14l15J544j81
4536G45j248k44J470J13j613L0J664o26q78K96R84m73p45O20M31j173J81R28j79
$$ plain form
4406 -286 -543 367 98 -1336 213 836 -722 -646 320 220 -809 -1181 549 823 -1354 -519 909 120
4424 120 -616 -686 556 278 -758 -75 463 -535 89 432 273 -461 -80 1115 -181 -1171 700 1152 -113
4443 -113 -953 218 1464 -156 -650 718 757 -606 -185 678 641 -555 -79 853 -391 -423 529 453 -317
4462 -317 -486 644 615 -744 -392 1072 229 -867 -155 682 282 -845 41 555 -587 -548 662 4
4480 4 -439 -333 398 -83 -1156 131 897 -527 -959 392 842 -777 -1195 531 777 -775 -800 186 16
4499 16 -491 -331 268 -64 -485 320 510 -640 -82 916 221 -791 -278 1165 97 -1284 2 980
4517 980 64 -831 128 957 -129 -656 683 723 -160 244 716 121 -221 46 611 -303 -618 926 745
4536 745 -503 -747 723 836 -777 -747 917 291 -587 -291 693 220 -525 95 526 -647 -466 462 283
4555B83j095L88J079n79j051P85J039j313p48J346O53j183m71J087K16p93l29
4572f86J046j77p95M36N92o69n74J342R8j531K48J616q1j498r6J485l00j240P17
4591f7J061q49o65P75N33q18l56J030k02q42M01N87n02p44J011O98j189o07J064
4610C19N04r33p36J257L63r38l51J347m52p42Q0P93l88m44N92K78j052J14J179
4629G90o13j065L34J326m72j330N00J289m97j138N51P68o88n20O55M83q45L10
4647a62M56k75o94O04P60j063n37J115M59j332k73J550M4j491J04J470k47j057
4665e69L84Q95p39k42M63M12o32k92R74j21r53L12J216n89j217Q13R40r21j245
4684a111J333O71q39q16R24O06q89q9M25J7o97N33M05n32o15Q85M26j277o1R73
$$ plain form
4555 283 -812 -424 655 76 -975 -190 849 -464 -1212 134 787 -396 -867 220 436 -357 -686
4572 -686 360 183 -612 -176 416 -253 -827 515 613 -918 -670 946 865 -633 -729 756 456 -784 -67
4591 -67 994 145 -520 255 788 -30 -386 644 442 -400 1 588 86 -658 353 1051 -138 -745 319
4610 319 823 -110 -846 411 774 -164 -515 832 380 -362 -282 511 123 -321 271 549 -503 -389 790
4629 790 177 -888 -554 772 300 -1030 -530 759 262 -876 -325 443 -245 -765 -110 373 -472 -162
4647 -162 294 19 -675 -71 689 -374 -911 204 663 -669 -942 608 652 -839 -735 735 488 -569
4665 -569 -185 710 -29 -271 192 604 -28 -320 654 533 -420 -108 1108 519 -698 115 1055 134 -1111
4684 -1111 222 893 54 -762 162 768 -121 -210 215 232 -465 68 473 -59 -674 211 637 -640 -701 272
4704B72K41j188O8J085q4j172J60J206k18j033N75J89k43n12O53K01p66K38P72
4723D44l31r28R57L39p07q32R75R17r09r21J451j21n72k22R53J52j089K24O79
4742D59m90l72R17O9r73k08J550k12j316m1J593l86j078L91J157p69p87N17Q91
4761I12r52L4J44M04p17J35P71q38o12J021M50j057l62P73R22j426n89J382J51
4780E46j343K0J077J74p90k63R86n46k43N25j26l46kQ37r5j255K67J440p59j168
4800a064O84J034m45r79O59P63q47k34P65l9o65N5P33k56j026R78O55r57n82J127
4820C59M78j160n82J390M54j466j8J262N9r94M9O78J37r44N92K43q45J74N25k9
4840C62p23L27P52m97r56R56O35q66q40P94J139q43j121R09N36r07j69P35J95
$$ plain form
4704 272 513 -675 -607 478 394 -778 -618 588 370 -663 -88 101 -142 -654 -1 200 -566 -328 444
4723 444 113 -815 142 481 -226 -1058 -83 834 -75 -996 455 334 -238 -460 493 645 -444 -220 459
4742 459 -31 -403 514 583 -390 -598 952 740 -576 -617 976 590 -488 -97 1060 291 -496 21 912
4761 912 -40 -6 138 542 -175 -40 731 -107 -719 302 752 -305 -667 106 1028 -398 -987 395 546
4780 546 -797 -777 300 474 -316 -579 407 -139 -382 143 17 -329 -331 506 411 -844 -577 863 104 -1064
4800 -1064 -380 654 209 -770 -111 652 -195 -429 336 297 -368 -313 420 164 -862 116 771 -186 -768 359
4820 359 837 -323 -905 485 939 -527 -545 717 776 -218 -169 509 646 -298 294 537 -308 -134 391 362
4840 362 -361 -34 718 221 -735 221 856 -10 -850 -56 1083 240 -881 28 564 -343 -512 223 418
4859D18p92q3P19l69m06Q99J9r15j11Q04K33r85k72J543k96j107J11J073m49m44
4879d10L8R61r53l59J145r1o79J92O26k10r40P54Q65p27j067R04Q41p07p58R81
4899D06O27j195j31O88Nn76P0K42K6n90O09M89j045L43N49j74r18J69J282l69
4919E07j577P08J224q12o65K76R76o27m63M57M67o81k00L65K01p24J97R36r58
4938c93n81J064L74r70k64R32L71q08m08J188k57r41M46P41k69n52p8M76n9m41
4958d29O84L0q52K07Q17q6j030L27J378r99p84Q70M11m57m91P23M08p82k51N95
4978B89R7n53J21N75m29o86J011L14j145j16J084J3j163j85J142M20j369K50J010
4997F80m11n75K73N22m15l80O36k5p14K0Q44o83p60Q87O20m60r65P50P83n50q60
$$ plain form
4859 418 -374 -457 262 -107 -513 386 405 -510 -621 183 416 -569 -841 702 406 -701 -590 483 34 -410
4879 -410 -372 589 -364 -723 422 331 -348 -156 470 260 -680 74 939 212 -855 49 890 183 -575 406
4899 406 1033 -162 -293 395 400 -176 -106 136 162 -428 181 670 -375 -32 517 343 -575 -406 876 507
4919 507 -1070 -362 862 50 -615 -339 637 10 -453 4 471 -210 -410 -45 156 -568 -371 565 -393
4938 -393 -974 90 464 -506 -770 162 533 -275 -683 505 248 -693 -247 494 225 -327 -405 71 12 -429
4958 -429 255 285 -567 -360 457 371 -659 -332 1046 47 -737 133 544 87 -404 319 727 -55 -306 289
4978 289 386 -167 -46 529 100 -586 425 739 -406 -522 562 575 -588 -773 369 789 -580 -330 680
4997 680 269 -306 -33 489 74 -306 330 305 -409 -389 455 -228 -988 -101 519 59 -906 -156 627 77 -783
5018g83P06O73j205j24Q01J72p83L09N08m02l90L96N35n32l39J053r5j206K27
5037d79R75O8j182J42J252n66p77N50N45l55n42M06L43n29j00Q70m35o38O87P04
5057I39q97m16M00R68r18q84J113O29r78m09R17Lj034K01P64l93l70K82L83n12
5077b12r2L07N17j030P9J088m19j210N48Q94k56j084M19Q74m04o64N76M08n35
5096a96k68M36J93o04L40M08q36j94Q14M07p20m87J175K07r04n36J041K33q35
5115c26j57J039k30p04K56O06n37l22N04J18p77J35J118m27r17L51J172o99q00
5134e97O41N58n32n06K92P80p28j97M97K34o46M8M62m93l44M35O68j090n1Q24
5154B55K69r82j76J206o3r71k44J012K9q75K70O53l45m19M88j76j12j42M40j23
$$ plain form
5018 -783 -77 596 -609 -733 68 240 -543 -234 274 -128 -518 -122 413 -119 -458 595 500 -706 -479
5037 -479 496 564 -618 -476 776 210 -567 -17 528 173 -369 37 380 -149 -249 621 186 -452 235 939
5057 939 42 -374 26 994 76 -808 305 934 -44 -453 464 467 -567 -366 398 5 -365 -83 300 -212
5077 -212 -304 3 520 -510 -431 657 238 -972 -424 470 214 -870 -451 423 19 -645 -69 339 -196
5096 -196 -464 -28 165 -439 -99 309 -527 -721 93 500 -220 -707 468 675 -229 -765 276 509 -326
5115 -326 -483 556 326 -378 -122 484 -53 -375 129 247 -530 -395 723 296 -621 -270 902 203 -597
5134 -597 44 602 70 -436 -144 636 -92 -289 208 442 -204 -156 306 -187 -531 -96 572 -518 -569 255
5154 255 524 -458 -634 572 509 -462 -706 306 335 -540 -270 383 38 -381 107 -69 -181 -323 117 -6
5174fo81N51N06l17r48P76P85p06q33Q82P05j053oO40J32m95j35M98K9n93N26
5195B57L41q19j74O57L20r10j81J121j9j325O69P17k71r85L32R23m89n43N48K26
5215C95m36p6K16J56q31N37N75n31q07Q35O57p26n25M81P23r61m41J045J4n82
5235b82j00M35L6m90Q2P41n39m72J139o04j68j91Q18J51j262M67P42l49q22L72
5255b96P00k56o03K27P37p02k29M27K86r7j94L73k98n78O97K29p39k98P80M49
5275F15p04n10J064K96j155j3Q20N4o44r2O29k9o44P33j97n64J22N73j11q50M99
5296a08O32k56j047N53P54m68r95Q35P70o46n32O08Q2n67L55J72K3p52N54O08
5316E75r57l63R87L70p56o00J190O1r92j35J263l12o75J57N44k66m47L07M72n72
$$ plain form
5174 -6 -687 -136 370 53 -895 -119 666 -40 -873 9 714 -339 -345 295 427 -68 -203 295 324 -269 257
5195 257 598 -221 -395 262 582 -328 -509 612 593 -732 -63 654 383 -602 -270 653 164 -379 169 395
5215 395 -41 -117 99 255 -576 -39 536 5 -802 33 690 -36 -561 -80 643 -318 -759 286 300 -282
5235 -282 -382 53 89 -401 -319 422 -117 -589 550 -54 -222 -413 405 556 -706 -239 503 154 -668 -296
5255 -296 404 148 -455 -228 509 -193 -422 5 291 194 0 373 75 -503 194 423 -316 -614 166 615
5275 615 -89 -599 465 761 -394 -407 413 467 -177 -269 360 331 -313 420 223 -341 -219 354 243 -607 -108
5296 -108 524 268 -779 -226 528 60 -935 -100 670 24 -508 100 182 -385 -30 142 165 -587 -33 575
5316 575 -382 -745 242 612 -144 -744 446 507 -485 -620 643 331 -344 -187 357 91 -356 -49 423 -149
5336a49k10O11l41o6J03N89l03o11K77J002r91n03Q56M58p65m36P09L13m77k64
5356a98M83j45l26L33J77l42l21M22L30p44o4Q31j93n98k25J261k55j063M43N73
5376C79k76m08Q7P68o06o31J011l20n55N92K9j50m06M73O22p20o13J046p8l92
5396a48p89O88P04q84Q0M61J17l81j65O10l38j20L6M34p23J86O16m08m23P1J127
5417G51m89j146P56R49o72m59L23M04j62l90M31M82q99m5P17m19J2j56Q13p40
5437F1n40O35M12o04p33J057k9l56j35O96j21o07L37K61l20k81M40J06l70m56
5457e47R32m01p24M10O57l28n48L49P00n81o67Q26J64n26j89J12P85m50m45P28
5477B57j60n39M91K04m47l19O54M08q58k7Q62j81q56J7R33j77p99K81O30k11n60
$$ plain form
5336 -149 -359 252 -89 -155 -52 537 234 -377 -100 902 -89 -592 264 722 -43 -479 230 543 66 -198
5356 -198 285 140 -186 147 324 -18 -339 83 413 -331 -395 436 243 -355 -580 681 426 -637 -194 379
5376 379 103 -305 -218 550 -56 -687 324 4 -551 41 70 -80 -486 -13 609 -111 -724 322 244 -148
5396 -148 -937 -249 455 -429 -349 112 229 -152 -317 293 -45 -165 -129 305 -418 -232 384 -24 -447 -376 751
5417 751 262 -884 -128 821 149 -310 13 417 255 -135 296 778 -121 -166 551 132 144 -12 801 61
5437 61 -479 156 568 -36 -769 288 259 -97 -232 464 343 -264 73 334 14 -267 173 279 -91 -547
5457 -547 385 -16 -740 -330 327 -1 -549 -200 500 -81 -748 78 242 -284 -473 -361 424 -26 -471 257
5477 257 97 -442 49 253 -194 -513 141 549 -309 -336 526 345 -511 -494 439 262 -537 -256 374 163 -397
5498c97K64N44k49l19M43l3n91L78K68j90p91O42O65n15p31O34N70p33m28O38
5518F9K83o19r4O27M6p29K62L62l54k85N34M2n25m6O40k4p40K12P35J15r91K82
5540a98P53l73n87M07O8j37j47J71K39k74k03O58j81p72Q04J58n66l87M79O21
5560E33n79l72Q24L9o44m68J063j54j50k11K94j22j10L25Ln24Q5M69l6m97n7Q90
5582F01l97n00P5Q68l81o27L16M79m13n74P66J07n12L16L36m32j79K22M13o76
5602a92k99M20M59q10P6K94L72o11l25J175k99o24l21P97M2n78L29K31o05K19
5622b50L49J37n45K19L20j53o22N41K46k41o36O55O54o86n40P28K06m81k1K68
5642A48P8n58N79j22j2l24M53m2l20k53O74L50r61j75J082j13o94j53P69k13l57
$$ plain form
5498 -397 -133 411 162 -157 286 253 -338 40 308 118 -673 -31 634 119 -612 22 592 -141 -569 69
5518 69 352 -267 -361 266 312 -417 -155 207 -147 -432 102 144 -381 -427 213 189 -551 -339 396 511 -480 -198
5540 -198 555 182 -405 2 70 -67 -214 -43 196 -78 -281 377 196 -576 228 386 -180 -567 -88 533
5560 533 -46 -418 406 445 -199 -667 396 242 92 -119 175 53 -57 268 271 -253 -168 301 265 -232 -289 601
5582 601 204 -296 -221 647 266 -361 -45 434 21 -553 213 320 -192 124 460 28 -151 71 484 -192
5602 -192 -491 -71 388 -422 -346 -52 320 -291 -616 559 260 -364 -685 112 154 -424 -95 136 -469 -250
5622 -250 99 236 -309 -90 230 77 -545 -4 242 1 -635 20 674 -12 -552 176 382 -99 -120 148
5642 148 226 -332 247 125 113 -211 242 200 -120 -373 301 651 -310 -485 597 484 -210 -363 406 193 -164
5663a64K56P0l2m24N53j40m49M82P2J58j031O12P35p94j92J71P48o58n86O32N09
5684E28p79oL54l5k80J24L85l41j72p0L77m60j78P83j58l44k72Q25m2q48O41L87
5706D19j6r80M55N61l96k26M04j51k94K67lK92o66K09O61n62l80O34Q3l51k69
5727c09O98K93q55k85P19J42p49R7O09k12k90L98N4l85r3M39l19k50J43L12J99
5748C56p70L04P83m41q25N21N51l25o54L30M15l72r7L84J13n85N47Jo9n84L13
5769a04N51r18j25Q60r5o40j96Q57K12r22K01O43m00l28L01O17n14k17N03q3o43
5790d40N04J92l54l70K10P18m96l71M37P92o66p52O65O59o65n64P52J07m17P8
5810A9K4R2j88L41m9k81l36O95k28n77K09N74J53q34K01N38k45n32K75M54j87
$$ plain form
5663 -164 92 162 130 -294 259 119 -330 152 224 382 -649 -37 698 -96 -288 -117 631 -27 -613 19 528
5684 528 -251 -257 97 62 -218 -94 291 -50 -222 -292 85 -375 -553 230 72 -272 -544 281 239 -609 32 419
5706 419 403 -577 -122 439 43 -183 221 70 -224 43 40 332 -334 -125 536 -26 -406 228 311 -40 -309
5727 -309 389 682 -173 -458 261 403 -346 -249 360 148 -142 256 310 -75 -168 271 -48 -298 -155 157 356
5748 356 -414 -110 673 232 -593 -72 479 154 -500 -170 245 -127 -224 160 273 -312 235 236 167 -417 -104
5769 -104 447 -471 -596 264 169 -471 -667 190 402 -520 -319 324 -76 -404 -103 514 0 -217 286 203 -440
5790 -440 64 256 -98 -468 -258 460 -36 -407 30 822 156 -596 69 728 63 -501 251 358 -59 19
5810 19 43 135 -53 288 239 -42 -378 317 89 -488 -279 295 448 -386 -185 353 108 -424 -149 305 118
5831A18n51M70M88p43q4O73m89j49J59L43k92m12M41K87n03k89M62L78n24k18
5851d35M75J62o22R0M48r1l53L15K84n18q7N29J11n71l8M75J15n32j51J059j96
5872D69q92N13L48k33o35O44J08k59j93K66K8m34K82L91m17j51L65K76l72n06
5892d02P15J28o38l41P97J26p33L5M69J79l73o6K84j69k0m1J11k93j3M63k69l56
5914d07K34L20j0o61K38R80o64o64N71M07l72l71N58q9l50q6P88m71j31J81N07
5935E08o83n44Q70K67n67k80Q14K1n56j46O30j06m89N28K09j76o41N85l38K7J25
5956E8J39O3n58M22J90k30o54P46L88k70p54Q94K41r19k04N21L82p36K04K62J60
5977C45m55K09K25m01k44N44p2p17J86P67m67m45N9Q26l2p45K35Q13m31n16L63
$$ plain form
5831 118 -433 37 525 -218 -302 371 -118 -267 -108 235 -57 -469 -28 259 -244 -533 -71 307 -217 -435
5851 -435 40 202 -420 -330 118 27 -326 -11 273 -245 -332 197 308 -263 -301 174 289 -243 -394 665 469
5872 469 -423 90 438 205 -430 214 322 63 -130 136 164 -270 12 403 -14 -165 200 476 104 -402
5892 -402 313 441 -197 -538 259 385 -348 -313 156 335 -38 -104 180 11 -9 -50 61 -232 -245 218 -51 -407
5914 -407 -173 147 137 -524 -286 694 30 -634 -63 344 -28 -399 159 70 -280 -366 422 -49 -180 1 508
5935 508 -175 -719 151 418 -149 -429 385 406 -150 -296 334 228 -261 267 476 300 -341 244 -94 -67 58
5956 58 197 260 -298 124 314 84 -570 176 564 294 -460 434 675 -244 -448 73 455 -281 -77 185 345
5977 345 -110 99 324 -77 -321 223 151 -566 -380 387 -80 -525 -466 360 328 -417 -182 631 200 -316 47
5998D7J04l38M5qK88m27RO26m04m11N30K01m62k18L87P57q29m56P16L59n32k53
6020b69L30J66j51M0J27k28j40J78L69n52L20J56o4o17J01M29q9m09K02Q11o18
6041I2k82K21L88k70k51j2L12j35j69K64j09l86K24N14o21j20M44R2j93m30P39
6062C12j3o65l07P63j4l64n3M83j86j83K05J04j28j24O00j53p45K83O47k79q60
6083f77N44M81j65n89L43M01k53k60L25L0k28m7J63M6m13K51K83m1n13K77M33
6104C91m04o08Q12M57q28L4M71M8o52K58K41j64j59L00J08l84L0J36j0j49q4M98
6126C42j24o47M05L86l51n18M97K32l62r1J76M01n14j17L44k1k78J24L35m21j9
6147b21L05j46j95j63O58j41k64k56P92l5p02L67J27J72l50n3K55l04k2K29Q7
$$ plain form
5998 47 151 -187 -142 -150 138 -289 -280 346 -58 -469 61 262 -200 -418 -31 726 -103 -559 157 516 -16 -269
6020 -269 61 227 76 116 243 15 -125 53 422 -130 190 346 282 -335 -234 195 106 -303 -101 710 92
6041 92 -190 31 419 149 -102 -114 198 63 -106 158 49 -337 -113 401 -220 -340 104 196 3 -427 312
6062 312 299 -366 -673 90 76 -288 -341 142 -44 -227 -22 82 -46 -170 430 277 -468 -185 462 183 -677
6083 -677 -133 348 183 -406 -63 338 85 -175 150 180 -48 -95 68 114 -299 -48 235 194 -319 -42 391
6104 391 -13 -621 191 648 -180 -146 325 373 -279 -21 220 56 -103 197 305 -79 -49 87 77 -72 -156 342
6126 342 218 -429 -24 362 11 -507 -10 222 -140 -231 -55 346 -168 -285 59 38 -240 -116 219 -202 -221
6147 -221 84 -62 -257 -420 238 97 -167 -423 369 334 -368 -1 126 298 -52 -105 150 -154 -176 53 140
6168A40m35K68K91k45l60K58M27k85j19J48L35o71j76O42J51p04K58L67j5o87
6188d12P35j40j12j56L47K07p34j5K47L43l67j11P00j34p32L42N37o36l67L16
6208a42O22n29m70N49L13l84j63J98j7j01j50L11j57j24J97R0m41J2N14K68n15
6229a19k18M09K36m14R8L18l81K0l9K81k27j95N51k31l61K08K35J62n78K64K76
6250B95q7o30M81M51m75j10J78J79k54j42K90P9j88m5Q8P2m38L61J51m08j96O92
6272C44Km98j79N54o1m55K34N79l49n02P7K64p5j16K88q0j75J89L24j83n23K6
6294c15O54m51m02N61K96n37l78N01L86k72l13N78k51l33K91n5j85K66R7J91n14
6315a85Q5L95n5n21P6L81r9m73J63O67j20o46K96L65j62k29J16L86n23P4J49j3
$$ plain form
6168 140 -295 -27 264 19 -341 -83 344 59 -60 88 423 -248 -424 218 369 -335 -77 290 275 -412
6188 -412 323 183 71 -85 262 469 -265 -280 -33 310 -57 -168 532 398 -334 8 545 -91 -458 -142
6208 -142 480 -49 -519 30 343 -41 -204 -6 -23 -124 -274 37 -120 -244 -47 43 -398 -386 128 396 -119
6229 -119 -337 72 308 -106 -8 310 -71 -51 -90 191 -36 -231 320 89 -272 -64 171 333 -245 19 295
6250 295 208 -422 59 510 35 -75 103 282 28 -114 176 255 67 22 110 182 -256 105 256 -152 -348 344
6272 344 346 -152 -331 223 162 -293 -59 520 171 -331 -254 10 -65 -181 107 27 -148 41 365 182 -341 -315
6294 -315 339 -112 -514 47 343 -194 -572 -71 315 43 -270 308 57 -276 15 -40 -225 41 138 329 -185
6315 -185 -100 295 240 -281 -205 176 77 -396 -233 434 314 -332 -36 329 167 -62 54 440 -83 -9 140 127
6337A27l53L24Q5j97j72J88M51m28l16O13P9m69r2K80J80m71K41k3R8l75O7J00
6359f3J44r4J51J44p60J98K60o5k45J30L92q1l67J30M90m41k88L10N69l51l08
6380a45L24k54k68L19J9l14K76J42J76m31k33M64M34o89L0M89r9l03N8K54L4m07
6402a24pL07j95j42J38L7j71J95M06l39m85N05m4K35o60J80O49k21m07J98K55
6423C10l66p9J08N4j14K9L24n39K32J76R7m41j18L76J22n22m5P16k58l87o3M08
6445B0j35j91L35P4k60j91K01M30j39m69L57N2m29N59Pk01l2j1K52k77l09L02
6467e5L02k35j61L48j05k08q1K49m7m33O37o8l61l8N88k51J11k50L13j84k40P2
6489i7L75k30j64j72O09k05m04L00j1q1j87M07p6j95R3L23l20l20N48J82n31M
$$ plain form
6337 127 -226 98 183 -14 -186 2 453 25 -291 322 401 -68 -160 120 300 -171 70 47 145 -230 -163 -63
6359 -63 81 -13 138 282 -478 -280 -20 -85 -330 -200 192 111 -256 -126 364 -77 -365 -55 514 163 -145
6380 -145 179 -75 -343 -24 -5 -319 -43 99 275 -156 -389 75 509 -180 -150 339 240 -63 -5 249 283 -124
6402 -124 -131 176 -19 -161 -23 14 -157 38 444 105 -380 125 81 316 -344 -164 485 264 -143 55 310
6423 310 -56 -135 -27 27 -87 -58 266 -273 -41 135 232 -209 -327 49 171 -351 -396 320 62 -325 -388 20
6445 20 -115 -306 29 103 -157 -348 -147 283 144 -325 32 84 -345 214 221 20 -12 -23 229 -48 -357 -55
6467 -55 247 12 -149 199 94 -114 -195 54 7 -426 211 143 -218 -256 332 81 192 -58 255 71 -169 -97
6489 -97 278 48 -116 -288 321 116 -288 12 1 -80 -267 140 64 -131 -38 285 -35 -355 193 375 -156 -152
6511a52L94J74m48l04O9L18l27O7L19K7m07L06R5k20j60K24Rk47j07M65J03m04
6533b06n5J70L62n97N22J93j09n05j6N49l72k41K55K38l20Q2R9J57k88L04J27
6554C49j60m00K83K61l79j58N34n9m28m2O60k78j71jk4K69k83J38R0k22l44O50
6576B85j34m50K11L93l04m80L75M12k20k72J60K92m16j28L85j9j58j19J81p7k01
6597b84L65J22l57n6L07N1k96j04M01J23o02J14M45o9m50J64L41k33n7J6o8O8
6619e9J05L35j65m82K17M66l67l16K95L51j85k17L49J2m37k68N45J14l30j55L12
6640A20p9k86J16L62j57l12M48K39q80L92L70l32k54Q9N66j50m22J4l3J90k43
6661b42R7K06j22j34r8M40k47pL30k41M0o7K98j19n38L24K61k61k03N64j80l54
$$ plain form
6511 -152 242 416 -32 -336 -267 51 -276 -209 110 137 -270 36 131 -89 -249 -25 -16 -263 -370 95 198 -206
6533 -206 -261 -91 271 -326 196 389 280 -225 -241 308 -64 -305 -50 188 -132 -50 49 206 -82 222 349
6554 349 189 -211 72 333 -46 -204 330 271 -157 -199 461 183 12 11 -13 256 -27 111 201 -21 -365 285
6576 285 151 -299 -88 305 1 -479 -104 308 88 -184 -24 268 -148 -276 109 90 -68 -187 -6 -83 -284
6597 -284 81 203 -154 -210 97 148 -148 -252 149 272 -330 -216 229 160 -290 -126 215 -18 -75 -59 -127 -59
6619 -59 46 381 216 -266 -49 417 50 -266 29 380 195 -22 327 339 -98 -366 179 293 -37 -192 120
6640 120 41 -245 -129 233 76 -236 212 451 -429 -37 333 1 -253 -164 402 252 -170 -156 -189 1 -242
6661 -242 -145 61 -61 -195 -293 147 -100 -107 223 -18 22 -45 253 134 -404 -80 181 -80 -283 281 101 -253
6683b53P3K77J06j79j81J89Q0k49K68l8j60j03K72J22m18L3K71j9k19J05J61j27
6705A1l16J14L76k62Q4P8j4k70R7K46k57P3R9K54k76j18K1K52j54k39L18P4j14
6728G7l72O59p6l82O8J98j76j43Q5K99j21k99K55L7m55K20J11j6n27N50J51l6
6750A07o46N34P0j65j32L23j16L4j70L57m20M8L83r9j48p9R6L10l74k44M19M8
6772A36m87J18P36m43p2k13N08p0l51J98J29k23P3O6J67l71K33K62k27m57M28
6793A40jJ26m18K08Kj00j23K40K75n68J29K52q2l69L03J68k00K8n9K72k13m85
6815d75K85L72m61K47K78k29k67q3N24j0l67L05Q7k79j55J64J26l1k46M79k22
6836D2k63R8K79k28j78K23J52l01K4Q6J54m44J89J22L33m09j87O98n91J6J53J27
$$ plain form
6683 -253 -180 97 203 24 -157 32 112 -137 131 93 -67 -170 102 224 -194 -161 110 91 -128 -23 138 11
6705 11 -305 -191 185 -77 7 85 71 -199 -102 144 -113 -40 59 313 37 -81 -60 192 38 -201 117 191 77
6728 77 -295 364 288 -94 -26 172 -4 -147 -62 237 116 -183 72 109 -346 -126 -15 -31 -558 -8 143 107
6750 107 -539 -5 65 -100 -232 91 -25 9 -161 196 -224 -176 207 108 -40 -119 -23 287 -87 -331 88 136
6772 136 -351 -233 503 60 -12 -225 283 213 -138 60 189 -34 39 105 272 -99 134 396 169 -288 140
6793 140 139 265 -153 55 57 -43 -166 74 349 -219 -90 162 80 -289 14 182 -18 10 -49 223 10 -475
6815 -475 -190 182 -279 -32 246 17 -250 -333 191 181 -186 119 206 -73 -228 -64 62 31 -215 264 42
6836 42 -221 -123 156 -72 -250 -27 125 -176 -152 -66 88 -356 -167 -45 288 -121 -308 390 -201 -185 -32 95
6858I5k74n8M47j32l05J08L90j66k61L36j02k12J2k6N95m02k26J43L90k60m52
6879c60J63K67n6j19M30k65m23J49K23l42J36M38J7n02j32M64ok22k84M07p9k02
6901b98J28K00j46J05j24K52m74J09L10j57j93L51L83k48n34J04N12k96k97L91
6921G8L83l36j49O1K77l14R2K25k47k83M92k00j92J08Q7M3j60k38M93Qm68K78
6943C8K77j21l66j5M32k97K0n9K55o2k36J68N0l84R2M43k47j9k10K19R4l10K21
6966a7K91n68j51N34j90j02j90M52l6r8K93L1k76j20L70k72k84J30M32o4p63N64
6988c4J12j07j19Q5J23N9j54Q8n2j50J38l8L39n87L13L80l98k32M38K70m69k07
7010b02K80j35j04L2M02j56k58O0K44l0l31K1K91k58j91N33O5k07pK84j78m67
$$ plain form
6858 95 -179 -237 210 78 -227 -119 271 105 -156 180 78 -134 -122 -148 447 45 -181 -38 352 92 -360
6879 -360 -197 70 14 -105 325 60 -363 -214 9 -333 -197 241 258 -244 -376 88 82 -140 -424 -17 -96 -298
6901 -298 -170 30 -116 -11 -135 117 -357 -248 62 -95 -288 63 446 198 -336 -232 280 -16 -313 78
6921 78 461 125 -24 37 314 0 92 317 70 -213 279 79 -113 -5 82 125 -35 -273 220 228 -240 38
6943 38 315 194 -172 -187 245 -52 -32 -91 164 102 -134 34 84 -300 -208 235 -12 -31 -241 -22 72 -238 -17
6966 -17 274 -294 -445 89 -101 -203 -393 59 23 -75 218 249 -27 -147 223 -49 -333 -203 229 165 -598 -34
6988 -34 78 -29 -148 -63 60 119 -35 53 1 -149 -11 -49 290 -297 16 396 -2 -234 204 474 5 -202
7010 -202 78 -57 -161 -129 273 117 -141 -81 163 133 -198 -177 114 -144 -335 198 263 56 49 333 155 -312
7032c12n5Q54n64J8k12M09l04J8J00L8j40J26J56J59j57M7j79K03n92L65K00m93
7054c15K53K34Q4m17q0K30K13k35k38O81k46r6k26L80R9k79M2K15k59j36K98k41
7076c9j40J07M45m82o5K42J08j02k8j72M00l69PL69r9k56l5J82r5j38J97K67m43
7099a39l6J03j6k12K03J00J14j57j38K36K84l16j74M93m97j7J4L06q0j50J73j39
7121d5m7k1J86r6k55K00J02p7l12O06l08n0p3L59O9k90j64L27k07J8R0L09l46
7144b5j27M12j00l48M4N86k45k22n2M26l27pk02N71l62m1J3M54n34jl1K45k91
7167a64J17K15k18j81M06K07o41o1N31J01m88j11L17L06m08k41M97m0j92k61L61
7188E2R7l18L32M3l14MJ61j8l26K80L13m24k10J39L07k04q1PK57j15j28J29N1
$$ plain form
7032 -312 -367 487 -77 -59 -271 138 -166 -148 -48 -10 -150 -24 132 291 134 181 2 205 -387 -22 178 -315
7054 -315 -62 172 256 -161 -241 -11 202 -33 -271 410 164 68 -158 222 321 42 84 299 40 -96 202 -39
7076 -39 -179 -72 373 -109 -174 68 176 74 46 -126 274 -95 -88 281 182 -74 -109 73 -22 -160 37 304 -139
7099 -139 -175 -72 -88 -300 -97 3 117 -40 -178 58 342 26 -148 345 -152 -169 -155 151 71 -79 94 -45
7121 -45 -92 -113 73 -23 -278 -78 24 -53 -365 241 -67 -117 -190 169 238 -52 -216 111 -96 -78 12 321 -25
7144 -25 -152 260 160 -188 -144 442 197 -25 -77 349 22 15 -187 384 22 -19 -6 448 -86 -87 -118 127 -164
7167 -164 -47 168 -50 -231 175 382 -259 -320 211 312 -176 -287 30 336 -72 -313 184 144 -48 -309 52
7188 52 149 -169 163 206 -108 -104 57 39 -287 -7 306 -118 -328 -189 118 -86 -167 -160 97 -18 -146 -17 34
7211C4pj12M14j76k33L9K43j91j06j07L03k58K11K61q3n10K31K38j43p9K27k2
7233A74r2Jk42L08j36N9J22k16j57J58K7o5k44J93L65l40j98L08O4k88j12J29
7255a82K86k42J45q9K42m12J66M13o82K81J9O1m43K19M92k24m50K30L67Ll74L97
7277B23J04l07l92M71j93lN7R6Q0k61Q9K90m14m9L11J8o5o0J12L47n86M5J41o7
7301a3J84l46J17J87J27k08J72k29J40n4J79l20o2L35q4l09K79J88m78R2oN78
7323D69n49j28L20J9k6k50pQL4K15j65O6k11J44J00k43p3K02K14n86L15J07K52
7346B27n28L80j99R1mj45K83M5l71J07K25j77r2J02J69j82N6K05k37k94M71k1
7368A11L3o07N65j08P6p3j08n9J24P4J71j48rj04j16j62rP23k73j9K3nJ07k03
$$ plain form
7211 34 27 -85 329 153 -80 -41 202 11 -95 -202 101 -157 54 315 232 -278 -47 191 48 -31 196 174
7233 174 82 83 -159 149 13 72 194 -22 -179 -21 6 -59 -303 -110 255 -85 -283 25 89 -199 -311 -182
7255 -182 104 -138 7 -82 160 -252 -86 327 -355 -74 -55 6 -437 -218 274 50 -400 -170 197 200 -174 223
7277 223 327 20 -372 99 -94 -97 -40 56 136 -125 -36 254 -160 -209 102 120 55 -5 107 454 -132 -87 54 -13
7301 -13 171 -175 -58 129 256 48 220 -9 131 77 256 -64 -126 209 125 -184 95 283 -195 -103 -109 469
7323 469 -80 -208 112 131 105 -145 -152 -144 -110 105 -60 6 -205 -61 39 -204 -277 -75 139 -447 -132 -25 227
7346 227 -301 79 -120 -29 -33 -178 105 150 -221 -114 111 -66 -158 -56 113 -69 -13 192 -45 -339 132 111
7368 111 144 -463 102 -6 70 -3 -111 -170 -46 28 199 51 42 -62 -178 -340 -349 374 101 82 105 100 207 4
7392Dl19M03r8L3j15L99k47k69O0L73j77K3k0j5j22j76L25n5l92N95j67J0k83
7415b30L35k41J2J96k00J47n3j5j7Q5Rk22K49N1k14K81r5j55J12J39k91k7p1L45
7439A30R3m03J7M13o6m95L2K48M0n9J66J68m14R0K9jk59O68k21l05O6J18K21j60
7463A16j39Q0K87m80k33M58Pk76J93l6RL5N4L0k42J36k19K74j91O5J04j05k58
7486c31L54K32r3m55J89K48k30j75o2M93k12j5LJ25j83o4L63j82j8M4K70l34J57
7509A24j18O4m27J77Q3M06n04Q0L49k54J32J68k5r8j53J97J74m85J82K6l87J90
7531i9r8L94j91j27J05K26j6l24K77K14m43J59O5l3j86j6J41K13j69J38q3l20
7553a73j8J90J40j38l32M32k1n5j05Q3l1k84K06J49K85n30L03j66m9J00J44p6
$$ plain form
7392 4 -315 88 -10 23 -92 307 60 -209 -149 224 47 70 50 35 -87 -263 62 7 -385 210 43 53 -230
7415 -230 105 -136 -124 72 -128 19 -34 -49 -66 19 28 -194 55 106 -108 173 78 -77 35 174 -117 -144 -215 130
7439 130 223 -180 -163 250 184 -311 -279 -31 9 -50 116 284 -130 -40 -11 -12 -271 397 176 -129 -63 55 276 116
7463 116 -23 57 344 -136 -369 89 96 -180 13 -23 -14 21 75 105 -137 -1 -220 54 -137 -72 32 -73 -331
7486 -331 23 255 162 -293 -104 144 -86 -261 -323 170 -42 -57 -54 71 -112 -176 187 5 -13 31 301 -33 124
7509 124 6 70 -357 -180 -97 309 -195 -115 234 -20 112 280 255 157 4 201 375 -110 72 98 -289 -99
7531 -99 -197 197 6 -121 -16 210 194 -130 147 361 -82 77 142 109 -77 -93 48 261 92 230 147 -173
7553 -173 -191 -1 139 1 -331 101 80 25 -80 3 -28 -312 -106 43 328 -202 101 -65 -114 -14 130 54
7575E4k41J65K21k06k09J40M51l96l79L21J58l12J69J24J50j90J77p0n5m25K85
7596f8m1J04k67L31L9q7m4J45J27m85J85o2K96l11J61K63k6l92J66o2k34O5J11
7619h6J41n9p5J40j33k29K80J66k55L5L82O6l74J86o4q8j25k05K27K20n11J37
7641b24L60l05Q8N5J90l50Q6j7K2J86l6K5j82mQ5K12j20k22L22p8j44n6mJ05j79
7666a85J83J54j87k56N22k1m16J18J17J19k59Q0J13P6j28j29L26k53L7J1p2K75
7688B25m82J79J66k02n2m6J98jJ13n7k71lM0J04K3l03K65J22j43M0J17o1o1l15
7712d05M80k94k3J69K81j12l00K87m1k86O4L92r7k63j18M17r7l96M77pK6j04j42
7735i2K20l33L35j55K17k25l8J59j32J2J89J47k29k00M8M14k59k30K14j8j57r4
$$ plain form
7575 54 -187 -22 199 -7 -216 -76 375 -21 -400 -79 79 -233 -64 60 210 20 197 127 72 -353 -68
7596 -68 -109 -5 -272 59 98 11 -33 112 239 -246 -61 -123 173 -138 23 286 260 -132 34 -28 -262 -197 -86
7619 -86 55 -4 -79 61 -72 -301 -21 145 -110 -75 307 373 -1 185 121 33 -92 -297 -70 150 -361 -224
7641 -224 136 -169 -81 -26 164 -186 -100 -117 -95 91 55 80 -102 -106 -21 191 71 -151 171 93 -51 -107 -111 -6 -185
7666 -185 -2 152 -35 -291 231 210 -206 -88 29 148 -111 -31 82 158 30 -99 227 -26 11 22 -50 225
7688 225 -257 -78 88 -114 -166 -212 -14 -15 98 41 -230 -233 -193 -89 -66 -369 -104 18 -125 -85 32 -29 -90 -405
7712 -405 75 -219 -242 -73 208 96 -204 83 42 -244 -180 212 115 -148 -266 151 54 -342 135 128 154 50 -92
7735 -92 128 -205 130 -25 192 -33 -71 88 -44 -32 157 304 75 -125 -77 337 78 -152 62 44 -113 -207
7757b07O4K47m49L76J60k38k2K84j90P4l44J89m2J13o7K73l2m27K38J01O3j92
7779b8m4J88r9k04J33J03K4j22J51k27K74J1j54j58j12L92M5k57j06L32lj88o4
7802a13J25j02j8K33j60k25J88J46l4k38K34j79O8k0J2K77k25j3J75M7l4l03K43
7825H4K45k95M5j28J61k04J15P9j51j10K61J65m35R6J8K1L0j41L26o8m06L21J03
7848A32J07l03J13N8Q7m16K82k62J46j73L22j51q5K21o2r2j79N00j61J05k68K2
7870e7K99l25j47J57J49p9j77J15j13J66j02J38j46kL10n3m55K22L13k67j1m5
7892a10J75O1K4l44K48r1q5K18j80J48j26J04P3l60L15K8J75l27p8K82k12K10
7914A48k39J78j05l0K70J32k73j96K11j44m56N03j91K7J48J85k68q9O7J35j54
$$ plain form
7757 -207 -143 104 -345 31 191 -47 -69 215 25 99 -245 -56 -98 15 -52 221 189 -238 0 101 164 -28
7779 -28 -72 116 17 -187 -54 49 73 -49 102 -125 149 160 6 -152 -264 128 173 -84 -190 142 139 -49 -113
7802 -113 12 -90 -108 125 -35 -260 -72 74 40 -198 36 -143 -75 -95 -83 194 -31 -44 131 178 144 -159 84
7825 84 329 34 79 -49 112 -92 23 102 -49 -159 102 267 -168 -72 -54 -33 -3 -144 182 114 -292 29 132
7848 132 239 -64 49 107 194 -222 60 -202 -56 -229 93 -58 -143 78 16 -76 -255 245 84 189 -79 -57
7870 -57 242 -83 -230 -73 76 -3 -180 -65 -178 -12 -114 24 -122 -124 186 133 -322 -100 213 -54 -65 -110
7892 -110 65 126 150 -194 54 -37 -122 96 -84 64 -62 42 115 -245 70 98 273 -54 -132 150 -62 148
7914 148 -91 87 -18 -48 222 354 81 -115 96 -48 -504 -1 -192 -165 -17 168 -100 -189 -122 13 -141
7935a41p9K38K01L9n87K97M3k2k45J41q5j13K72K99m66j12M24k41J36lJ16PJ3
7958A32k59K73o0k33MM1K36j84k11K38K4P5k77M41k07j68J90j88R9K18O0j57j11
7981b4N9O6j35j11J3J80R0J47l87K84k9n02O07j72n3J1K3j78J57p7q8N6J78N5
8005A70M3k16k8j6L46k90j76N74l67j51J89r0j89J21j58K27m9l08J06J86J59k04
8027a21M1K25l79K29q2R0q4K59r3j62lJ01Oj22J75o1j49%PJ80r9j11L09J7o8n5
8053E0K02l11o4J71L2k1M5m9K15j60l56K42J24j21J36m7l0m33K75J39j16J9M5
8076a3K77j10l39O9L97m33J57pJ73j95k14J73P5j73L26j08j39p9J30J20j96RM86
8099C86l78k54J50P9k4KR7J4k59K63J03k9j65p3J77j27j02K7K07j99Q2j38K42
$$ plain form
7935 -141 -220 18 219 258 -329 -32 11 -11 -256 -115 -200 -313 -41 258 -208 -320 104 -137 -1 -4 112 119 132
7958 132 -127 146 86 -147 -143 -102 134 -50 -261 -23 1 76 -201 240 33 -135 55 -133 -34 184 244 87 -24
7981 -24 35 101 -34 -145 -132 48 138 285 -102 182 153 -349 258 86 33 44 67 -111 46 -31 -119 -63 115 170
8005 170 213 -3 -31 -47 299 9 -167 407 40 -111 78 -12 -201 -80 -238 -11 -60 -368 -262 -76 83 -121
8027 -121 -80 145 -234 -5 -87 3 -81 178 85 -77 -80 21 27 -95 80 19 -130 -130 -123 57 -42 -153 156 173 105 50
8053 50 252 -59 -123 48 80 59 104 55 270 110 -246 -4 120 -1 135 88 58 -375 -100 39 -77 -58 -13
8076 -13 264 154 -185 -116 281 -152 5 -2 171 -24 -238 -65 10 -163 163 55 -84 -163 -33 87 -109 -100 386
8099 386 8 -246 -96 -17 -41 -39 58 72 -187 76 179 150 -15 -88 89 -38 -140 -113 94 -105 -23 -161 81
8122H1Q8k43K88r3j64O1K22o2l07M53m90L74l27j48K72l0J92j35o1J24j19K38
8144B14j97j21J55m3K02j26j59M03k64k31K73L7j88j68J85L4j17O2K73j46r3l33
8166c48M83r1l37M79j92j93j6L25j00K6j62J45j64J25k72L00Ol39L05l2k02K83
8188B9j4j95J69
$$ plain form
8122 81 169 -74 214 121 -43 18 240 178 -129 324 -166 208 -119 -267 5 -25 167 32 -29 95 -24 214
8144 214 17 -104 51 8 210 84 -75 328 64 -167 106 143 -45 -213 -28 6 -111 -49 224 78 -15 -348
8166 -348 135 44 -293 186 -6 -199 -215 110 10 36 -126 19 -145 -20 -292 8 14 -325 -20 -52 -254 29
8188 29 15 -180 -11
8191a1
$$ Imaginary data points
##PAGE= N=2
##DATA TABLE= (X++(I..I)), XYDATA
0@%%%%%%%%%JrJ6j6J6k4L2m0M9n7P2q8J04j28J52j76K08k40K76l18L66m20M78
32B54n42O14o93P80q77R84j100J227j367J518j682J864k064K279k515K774l054
49a600L363l703M080m498M960n479O065o727P486q367R401j0639J2146j4028J6459
64H919j9724K4355l1463M3804p0913K24572q0612l27851L98190k20749L4534Q1035
76F4097k01572K42220k7244j93609K01730r2683j0859N1756q3422R9161m1382
87H193o9254J33690p5259m2768Q8803k4432l4891o78J79M2999l6385k7780Q0997
100D3414k2397o1085N3488k1929j5530J9902j6712N7901m2085m1679R9312o0165
112g565m2026M9054o962M0245p0777n016J19671r9232k1084O9280l6273K3765
$$ plain form
0 0 0 0 0 0 0 0 0 0 0 1 -8 8 -8 8 -16 16 -24 25 -32 40 -48 56 -72 80 -96 112 -128 148 -170 196 -224 254
32 254 -288 326 -367 413 -464 520 -580 647 -720 798 -884 980 -1084 1195 -1320 1454 -1600
49 -1600 1763 -1940 2140 -2358 2602 -2877 3188 -3539 3947 -4420 4981 -5658 6488 -7540 8919
64 8919 -10805 13550 -17913 25891 -45022 179550 98938 -228913 169277 -51472 -16938 64097
76 64097 -137475 104745 77501 -116108 85622 -7061 -17920 33836 -49586 49575 8193
87 8193 -61061 72629 -2630 -45398 43405 18973 -15918 -16596 -16417 26582 -9803 -37583 43414
100 43414 21017 -40068 13420 -8509 -24039 -4137 -20849 37052 -5033 -46712 52600 -7565
112 -7565 -49591 -537 -7499 32746 -38031 -43047 76624 -22608 -43692 25588 -10685 13080
124A3080m8118J7560P4584j06498M3254O1347q6000K7493p427J8895K1917j02213
136g2126R2506N3109j19518M0058K1784K28M189q6936Q6152M6523j16450N5433
148D952L2088m2451K4840m0233K1033K8176o6139N6284K1371p2365M8079J4157
160B9792m4346P458p910L6276P474p3026N2012M2007p9275J3899L0136j6078J1596
173A0015l4940K1620L7114p2177L3835M6456o7229J2016J7352o326J225m1985
185d3024N8011K9668q1815K2878L1163j9956j6204j5892N9151l442n5244M3728
197I022J840k2777J167j860L7223l7458j7360O9663m1361k7971M0372K603L588
210A6691m4061O249O7118n6670k2047N9368o072j2371j9082J451L4898l9816o122
$$ plain form
124 13080 -35038 -17478 57106 -49392 -6138 55209 -30791 -3298 -10725 8170 30087 -72126
136 -72126 20380 73489 -46029 -5971 15813 16041 20230 -66706 19446 65969 -50481 4952
148 4952 37040 -5411 19429 -20804 229 28405 -37734 18550 39921 -32444 15635 29792
160 29792 -14554 -7096 -15006 21270 28744 -44282 7730 49737 -29538 -15639 14497 -1581 10015
173 10015 -24925 -3305 33809 -38368 -4533 41923 -25306 -13290 4062 -2264 -1039 -43024
185 -43024 14987 44655 -37160 -14282 16881 -3075 -19279 -35171 23980 20538 -34706 9022
197 9022 10862 -11915 -10748 -12608 24615 -12843 -30203 39460 -1901 -29872 10500 13103 16691
210 16691 -27370 -21121 45997 -10673 -32720 26648 20576 8205 -10877 -9426 25472 -14344 -20466
223b0466N4805k8445j5202L4103j8917j4399J662M918L1110l7666j8277P2365
235D5591l1098m5298M0207k100M386k1022k0291O9219l6206l7685O7524l2766
247D61j4931K2248k4536L2538k9268j5026P6833n4577l0031N9361k0872r395j6220
260b3415M923N8549n3550k3187O7637k5307k4389J1893o26J6139k3974o09M1865
273B5949l1733j3131L7813j5712k1600M998J7592J4336l6651J429N0657k5883
285H064l4665K4586J8088r826k3876J5403K7349l1999q34K6305j4684n389j931
298c409J1113J770l5244L4239K8123m7441N634J7854k236r435l4336M6057K6559
311C9248o3511K2928K7233l2158K337o707J6376R727l8624L3850J1376m8542K5402
$$ plain form
223 -20466 34339 5894 -9308 24795 5878 -8521 -6859 -1941 29169 -8497 -26774 45591
235 45591 14493 -30805 9402 7302 11688 -9334 -29625 39594 3388 -34297 33227 461
247 461 -14470 7778 -16758 15780 -13488 -28514 48319 -6258 -36289 23072 2200 -7195 -23415
260 -23415 -18492 40057 -13493 -36680 30957 5650 -18739 -6846 -7472 8667 -15307 -15916 25949
273 25949 -5784 -18915 18898 3186 -18414 -13416 4176 18512 -18139 -16710 33947 8064
285 8064 -26601 -2015 16073 6247 -17629 -2226 25123 -6876 -7710 18595 3911 -1478 -3409
298 -3409 7704 9474 -25770 8469 36592 -10849 -5215 12639 10403 968 -33368 12689 39248
311 39248 -24263 -1335 25898 -6260 -3923 -10630 5746 15473 -23151 10699 22075 -26467 -1065
324a065J4865j4931l763j6527L8307M8n8763M3249K8831m2358J589L414J1301
337D197l76l5662L5588J8721m1689J9119J0654k2032K090j181K0841o876l1049
350b7655M2824O864m6931J4312J9549n9j5248j6587M0191R19m2941K6436J6364
363A8038k0019j056j308J3697q569j8391L7192k791l5572K4664J2434j9181j2684
376a3546O660L3348j9065l0852L7859Q160k8057l227P725J7901k0266j4308L8842
389B1174j3136k1173K4540o047r703o239O203K6513l3045r242M8477k1199k6296
402a9173J1692R358J3292l3028l340M9902l0205k0192L0443j0216L15n728n309
415a2189K6629k9560q73M3359l4899r282K7641j0791j805j9812J0842M2636m2451
$$ plain form
324 -1065 13800 -1131 -4894 -21421 16886 16934 -41829 1420 30251 -12107 -10518 -7104 4197
337 4197 3821 -31841 3747 22468 -19221 -102 10552 -11480 -9390 -10571 10270 3394 -27655
350 -27655 15169 22033 -24898 -10586 8963 8904 -6344 -22931 17260 18179 -24762 1674 18038
363 18038 -1981 -3037 -4345 9352 783 -17608 19584 16793 -18779 5885 18319 -862 -13546
376 -13546 -6886 26462 7397 -23455 14404 22564 -5493 -8720 -995 16906 -3360 -17668 21174
389 21174 8038 -13135 11405 5358 -4345 -10584 -4381 22132 -10913 -20155 28322 7123 -19173
402 -19173 -7481 1877 15169 -17859 -21199 28703 -1502 -21694 8749 -1467 -1152 -6880 -12189
415 -12189 14440 -15120 -15993 27366 -7533 -16815 10826 35 -1770 -21582 -10740 31896 -10555
428a0555j0633M4532j9483j4867J857N698K1443k7878j82L5799l0814q526K6337
441A2728r750m371n652J1130J7365l7310L283M1793k3207j6865J2468P149J140
454I901k7193J2414L1509k8716j375J7782j4980k107o087J4050R340l3233K6083
467G388J9623m0977K769J3371R330r118l1317M1257J2271m7346J6878J2203k756
480C576j666k4377K9132L085l4013L1731mk0379J7923p041K241r121j1943M0610
494A9754j4871l2224L7007M514k1452n041R26K7666j4107k9923M0150M431l2516
507a5686J4953M981j833m053j2930K9578p716l0499L8463k32k6755J1211L24J3038
521A2844j2523k1085M1496p192k9243K3660j261l457m364o804K4955j9861j0758
$$ plain form
428 -10555 -21188 23344 3861 -11006 -9149 -3451 17992 -9886 -10068 25731 -5083 -13609 12728
441 12728 2978 -1393 -7045 4085 21450 -15860 -12577 29216 6009 -10856 1612 8761 9901
454 9901 -17292 -4878 26631 -2085 -3460 14322 -658 -2765 -8852 5198 14538 -18695 7388
467 7388 27011 -13966 -11197 2174 11504 2386 -28931 12326 24597 -22749 -5871 6332 3576
480 3576 1910 -22467 6665 9750 -24263 7468 7464 -12915 5008 -2033 208 -8913 -20856 19754
494 19754 4883 -27341 9666 14180 -7272 -12313 -11387 16279 2172 -27751 12399 16830 -15686
507 -15686 -733 4248 2415 -1638 -14568 15010 7294 -23205 15258 15026 -11729 -518 -194 12844
521 12844 321 -20764 20732 13540 -15703 7957 6696 3239 -1125 -7929 17026 -2835 -13593
534a3593L5624j7333j4877J3799M096J680k7910Q467L7419k7715j5645K2204O887
547A3103r034k5472J5498K5830k9072n83J9761r758j866m523M867M229j7648J7667
561B999Q931k9744J1292J8284j0464r619n504K3363K030l8648J7825L0000k2770
574b025q409R874P438l502k2883J5476K0733k7215N919K0905j8498m297L754N762
588C032N038k2849J4779K3796l1883j830K0698m810m421j0718J3982J0517k8298
601a2967J1948J8207j9361j44Q212J906j0549j1045K4272L658k4600P136J8834
614A5507m615k4701K356K7517j1346j8567J3005J3342o564j7418R470J2074j8250
627h190J903J1762p236l670M882R121r869j4447J9084O729k2105l300K2237N903
$$ plain form
534 -13593 22031 4698 -10179 3620 7716 9396 -18514 -10047 27372 -343 -15988 6216 13103
547 13103 4069 -21403 -5905 19925 -9147 -9730 10031 273 -1593 -6116 -1249 2980 -14668 2999
561 2999 11930 -17814 -6522 11762 1298 -8321 -13825 9538 11568 -27080 -9255 20745 -2025
574 -2025 -10434 -560 6878 3376 -19507 -4031 16702 -10513 -4594 16311 -2187 -6484 -2730 3032
588 3032 8070 -14779 0 23796 -8087 -9917 10781 5971 1550 -9168 4814 15331 -12967
601 -12967 -1019 17188 -2173 -2317 5895 7801 -2748 -13793 10479 14137 -10463 -3327 15507
614 15507 10892 -13809 -11453 16064 4718 -13849 -844 12498 5934 -11484 -2014 10060 -8190
627 -8190 -6287 5475 -1761 -5431 -549 8572 -1297 -15744 3340 10069 -12036 -15336 6901 12804
641A2804k2839l027K1525r42j9855r59K2298l837j9443J5563O588j2027R8K930
655a123P676j2791o895K7816j0581j8291J8939M931o009j4411K074K7063j8420
668b2j4999K7605k564j3540J289L887N623j1465k71J8900j1723j3876J9557M025
682A2426j8242O4J2705M587j5910j0640K7024L590k8306J0555J4881j1976o642
695e884j800J3130n5j6308J8367J965k1210R848O517o286o685K242K0590j2393
709B038k0935K0677Q944j6304p912J2466J2808j8060p541J9548j212j0601J594
722d490P378p33j3952R403J2172j7451J415J5557l830j2356m840J8215L899k4509
736a4122R750K0418j2792j0929M381J0983k883j5333J2810J0214j8045L347J2562
$$ plain form
641 12804 -10035 -13062 8463 7521 -12334 -13293 9005 5168 -14275 1288 7876 -4151 -4053 -1123
655 -1123 6553 -6238 -13133 14683 4102 -14189 4750 9681 3672 -10739 -8665 18398 -22
668 -22 -15021 12584 10020 -3520 -2231 1656 7279 -4186 -4457 14443 2720 -11156 8401 12426
682 12426 -5816 -5752 6953 11540 -4370 -15010 12014 15604 -12702 -2147 12734 758 -5884
695 -5884 -7684 5446 5391 -10917 7450 9415 -11795 -1947 4570 -1716 -8401 -6159 14431 2038
709 2038 -18897 1780 10724 -5580 -13492 -1026 11782 -6278 -13819 5729 4517 -6084 -4490
722 -4490 2888 2155 -11797 -2394 9778 -7673 -6258 9299 5469 -6887 -11727 6488 10387 -14122
736 -14122 -4372 16046 3254 -7675 -3294 7689 4806 -10527 2283 12497 -5548 -2201 10361
749A0361q641n884M081Q594m235j6596J4787J6052k2292m859J7450L65j0714r945
763a1476J4104J1965k3276L493J9391j4898m049O232r02N59j0256J1281J0159
776A2327k4149P072J7401j3231q309J097J3764J055k3350J2544J8555j8169p081
789a0474R786M474o963o567J2617K135j3231N760R512r290q546J1543Q244j5107
803f107n131J6522M045j4184m513J5761M072j9860k81J8825m474j1081P835P576
817I005p845o763P071N486j2097L79J7922p676j4195J0034P779n444j1998M622
831c720K0529j4458j6358K1279K359j1797n27L120Q238j1839n535J9745j0301
844G35r410J7057l317q606k791N402J1315j7596n258K5380o318j7116N617Q718
$$ plain form
749 10361 1720 -4164 -83 8511 4276 -12320 2467 18519 -3773 -8632 8818 9183 -1531 -11476
763 -11476 2628 14593 -8683 -5190 14201 -697 -4746 1486 584 1143 -9113 2168 12327
776 12327 -11822 -4750 12651 -580 -8889 -7792 5972 7027 -16323 -3779 14776 -3393 -10474
789 -10474 -688 3786 -3177 -9744 2873 5008 -8223 -2463 7049 -2241 -10787 756 9000 -6107
803 -6107 -11238 5284 9329 -4855 -9368 6393 10465 -9395 -9676 9149 4675 -6406 1429 9005
817 9005 1160 -5603 1468 6954 -5143 -4764 13158 5482 -8713 1321 9100 3656 -8342 -3720
831 -3720 16809 2351 -14007 7272 9631 -2166 -2693 427 8665 -3174 -8709 11036 735
844 735 -8675 8382 5065 -3541 -6332 -930 10385 -7211 -12469 12911 6593 -10523 -4906 3812
858C812K22j3207J061J8184j0499j0098J3699q54p995J382N383K090j2253K472
872f601J7974j1705j2472J4787O530j0501r963R857J4268j5175p858J7499n5j1152
886d567L53O834J262r155N006R045j0945k534J1292Qj0975k774J5948M47j9851
901a0606P719J6528q736j1040K963J2404l703j6183J2485R313j3878R39N817q92
915C130m653l738J3367m237j6358J6755N585j5344J197N265P118q764j4489K0418
929E252L090j9327R624O274m200m044m236J2175n207j2118J8401J214j6068N712
943c458P055q07j1316j945K0570m714j8308J0797J0289p701q230L924J1252p169
957B39q878J1314J501q047M368N171m862o654O215P877j2196l966J6645J869j4394
$$ plain form
858 3812 4034 -9173 -8112 10072 -427 -10525 3174 2320 -5675 -4293 1090 3180 -9073 -6601
872 -6601 11373 -332 -12804 1983 8513 -1988 -11951 -2094 12174 -3001 -10859 6640 6585 -4567
886 -4567 -4214 2620 3882 -5273 -267 8778 -2167 -4701 6591 6599 -4376 -7150 8798 9245 -10606
901 -10606 -2887 13641 4905 -6135 -3172 9232 5529 -10654 1831 11144 -2734 -1795 4022 3130
915 3130 -1523 -5261 8106 3869 -12489 4266 9851 -5493 -4296 969 8087 -677 -15166 5252
929 5252 8342 -10985 -1361 4913 713 -3331 -7567 4608 -599 -12717 5684 6898 -9170 -3458
943 -3458 3597 2790 -8526 -10471 10099 5385 -12923 -2126 8163 462 -7768 -3844 7408 239
957 239 -8639 2675 4176 -3871 497 5668 806 -5848 367 8244 -3952 -7918 8727 10596 -3798
972c798l918J3835M520j8637R09J8456m369j1694K278R082j586j2002P205Q495
986H776j1682M1Q492k718n208n19R690k090j5848J0730J0256j3187k502P206N444
1001F881o557j0804J2555M894j6880O699R991p636l952K381P457n445j2816J5419
1015B187O760j7567J358J1700J155r870o403J5006K187j6490N148J0423m302n063
1029c771K303N129n575k962Q592k095p385N093R299p390j1083J1711R463j3671
1043b342o984J1404R218j2009r263J5799N463j4923j663R199J564p150j224J0070
1057G159l025q912Q146K827j1157K048R487k444p635J5J0533j253j5343O878J2897
1072A0221j1015n776P153M057m381p545R575M604j4854L820R587o580n409L883
$$ plain form
972 -3798 -7716 6119 10639 -7998 -7089 11367 6998 -4696 -2418 6664 5078 -6924 281 8776
986 8776 -2906 -2865 5627 2909 -2299 -2818 6872 4782 -11066 -336 9920 -3267 -5769 1437 6881
1001 6881 324 -10480 2075 6969 -9911 -3212 6779 -857 -4809 -2428 5029 -416 -13232 2187
1015 2187 8947 -8620 -7262 4438 5593 -4277 -10680 4326 6513 -9977 -4829 5594 1292 -3771
1029 -3771 -1468 3661 -1914 -4876 3716 1621 -5764 -671 8628 1238 -9845 1866 11329 -2342
1043 -2342 -9326 2078 11296 -713 -9976 5823 11286 -3637 -5300 3899 5463 -1687 -2911 7159
1057 7159 4134 -4778 3368 6195 -4962 -2914 6573 4129 -3506 -3491 7042 5789 -9554 -2676 10221
1072 10221 -794 -6570 583 4640 259 -7286 2289 6893 -7961 -4141 5446 -1134 -6543 -2660
1086b660J0227o176j3350J2286P249j3312l218R783O315r920n279J1530r51q444
1100e920K619N888j883n781O157M194j0612J776R599l762q373J87J3824k344j6265
1115a0696R795J3025j0623q644N789Q761n161r777R906O419j0950M92O066k978
1129A424l614J141O763l162r413J1437N307j5013m2J1245q17q580k662J1429K318
1144G761j4404L462J1013p701n261M727L323l247n322Q375L474j3391L046J0894
1158F749o440q327M929R747n429j1113R074Q408r926n710P144N113p645l052J0186
1173C708j347o748L356L573l652o267P350P930j3032j135J3315l063r039p53J0104
1188D300L523j5546L025J4274q131n779M794L794j298p591N615N637j0859L049
$$ plain form
1086 -2660 7567 1391 -11959 327 7576 -5736 -8954 829 7144 -2776 -8055 3475 2524 -5920
1100 -5920 -3301 2587 704 -5077 1080 5274 -5338 -3562 6037 2275 -6098 -5911 7913 5569 -10696
1115 -10696 -901 12124 1501 -7143 -1354 7407 2246 -7531 2375 8794 -2156 -1664 4402 1424
1129 1424 -2190 -1049 5714 2552 -6861 4576 9883 -5130 -5172 6073 5256 -3324 -5986 5443 7761
1144 7761 -6643 -3181 7832 131 -5130 -403 2920 -327 -5649 2726 6200 -7191 -4145 6749
1158 6749 309 -8018 -3089 6658 1229 -9884 -810 7598 -2328 -8038 -894 4219 -3426 -6478 3708
1173 3708 2361 -4387 -1031 2542 -1110 -7377 -27 7903 -5129 -6264 7051 3988 -5051 -5804 4300
1188 4300 7823 -7723 -4698 9576 1445 -4334 460 4254 2956 -4635 980 6617 -4242 -1193
1202a193R677o698n834M723N462m389r304Q302J0391j1700o502J2041J228q696
1216b492k160O874L840r057o71J0138o443n784Q288L13n363k003O325L789j2200
1231f606L61J3806m811j0434L388R154k778j1186O480Q998p156m736N033L208
1245B721n949k267Q742j902p393N911M640n570n703O183Q612j1021n807J2964
1259D161J955r661j381Q121L020r973r53R844k938o457N712L658n628k044N736
1274C172J654q709R1J2015l452j1752O926Q202n933p469L428R779n527r737R880
1289B568M394q829N6L904M05n106l27Q867m976p805J0379K288r905j580P580L711
1305E624r645l701J2467L19j1420J830Q217j921p487K491O624m827m087P030J505
$$ plain form
1202 -1193 8484 1786 -4048 675 6137 1748 -7556 746 11137 -563 -7065 4976 6204 -2492
1216 -2492 -4652 2222 6062 -2995 -3666 6472 29 -5755 2533 2846 -2517 -4520 1805 5594 -6606
1231 -6606 -6245 7561 2750 -7684 -4296 4858 2080 -9106 -2626 6372 -784 -5520 -487 2721
1245 2721 -3228 -5495 3247 1345 -6048 -137 4503 -1067 -6770 -587 8025 -2996 -8803 4161
1259 4161 6116 -3545 -4926 3195 6215 -3758 -4711 5133 2195 -4262 1450 5108 -520 -2564 3172
1274 3172 4826 -3883 -3792 8223 4771 -6981 -55 8147 2214 -5255 -1827 7952 2425 -7312 2568
1289 2568 6962 -1867 -1811 2093 2498 -2608 -2935 5932 956 -6849 3530 5818 -4087 -5667 1913 5624
1305 5624 -4021 -7722 4745 5064 -6356 -4526 3691 1770 -5717 -3226 3398 -1429 -5516 1514 3019
1320C019p027R0P916l178q943N720Q531n541o978N055Q418p286q895R645N942
1335F488q988j175O306R95n272j169O905k177p374P505M051q919l97P785J234
1350E798q076l166J1012J214j2753L012J0502l753p088K278N891k423p372O056
1364A132M108p882J645N779l615m882J897P508m342r455R326O500r777m370P388
1379I60N269q450n652J0169K039q742Q15O005j030n286J919M991n814k508P565
1394B250L25o619k96Q268n22j1098L773R833n091o998M236P476m108q065P169
1409E33M570q312jO187o34m757R00O771l212q364P139O534r056l095P731L527
1425F461o547n500Q831L844j0753R78P805l352l160J559L269j764m970O323J738
$$ plain form
1320 3019 -4008 -3918 3998 820 -8123 -2403 6128 587 -6391 -1336 7082 -204 -9099 546 6488
1335 6488 -2500 -3675 2631 3626 -1646 -2815 4090 1913 -5461 2044 6095 -2824 -3221 4564 5798
1350 5798 -2278 -5444 5568 6782 -5971 -2959 7543 3790 -3298 -1020 4871 2448 -4924 1132
1364 1132 5240 -2642 -997 4782 1167 -3715 -1818 5690 1348 -8107 1219 7719 -2058 -6428 960
1379 960 6229 -2221 -7873 2296 4335 -4407 -3592 2413 1383 -3903 -1984 3007 -2807 -5315 2250
1394 2250 2575 -4044 -4340 3928 3406 -7692 -3919 5914 823 -6175 -1939 5537 1429 -6636 533
1409 533 5103 -3209 -3210 2977 2343 -2414 -1514 5257 2045 -6319 820 7354 -1702 -4797 2934 6461
1425 6461 -86 -5586 3245 7089 -3664 -2686 5119 1767 -1393 166 3435 1671 -3299 3024 4762
1440D762r897K811Q445l119p879K411R534m451j0803O398Q992o479p266N925O836
1455F220p317m606O366J457m311o47L998j77n748M451M690q466q69P814q40o029
1471d014j773Q784K323j1819J961J0714o002n796L594N361j550p207N846N520
1485E942r966J41P990k575m177K72P222p46j1057O641P983q439l015M482M099
1500D797l229n943P203K606q452L108L537l816j733L049L927n116m906R772J155
1515E959j1187J188R124Pr144j023J1421j458j1059L105P335k788n485J768N788
1530C551l971l280N677j268m653L086K868k509n617N473P088r902l232R350L40
1545C001o026l144O704N819j1477O7J0238m807m319L165K173q6o131M723O507
$$ plain form
1440 4762 -5135 -2324 6121 3002 -4877 -2466 7068 2617 -8186 -1788 7204 725 -6541 -616 6220
1455 6220 -1097 -5703 663 2120 -2191 -2838 1160 983 -4765 -314 4376 -4090 -4959 2855 2015 -4014
1471 -4014 -5787 2997 5320 -6499 -4538 6176 174 -5622 -2028 3333 1783 -5424 422 5942
1485 5942 -4024 -3883 4107 1532 -2645 -2373 4849 4103 -6954 -313 7670 -769 -3784 698 4797
1500 4797 1568 -4375 2828 5434 -3018 90 3627 -189 -1922 1127 5054 -62 -4968 4804 5959
1515 5959 -5228 -4040 5084 5091 -4053 -5076 6345 4887 -6172 -3067 4268 1480 -4005 -2237 3551
1530 3551 -420 -3700 1977 709 -3944 -858 2010 -499 -6116 -643 6445 -3457 -6689 2661 3001
1545 3001 -3025 -6169 535 6354 -5123 -5056 5182 375 -3944 -779 1394 1308 -4823 -100 6407
1560F407j0488M02R177l891m647K27N950K061j0334L049R636p445l556M820J339
1575B707j758l483M800K346p889L059O310o386l112M742M304n107o818R276M701
1590G692j0393j986P729K217p484l212Q906Q13q084K407M442k658k853J575L268
1605B379m815j044P320k847o178L447N535k988p504M043Q768p005o503P843L411
1620C862n321l652M562M531o977j471Q109l467m067M479J452k483l814M049O556
1635F348r406k099J0732k768o156J041M714K405q525N33R261n337l773N364M8
$$ plain form
1560 6407 -4081 -3679 5498 1607 -3040 -2813 3137 5198 -5136 -2087 7549 104 -3452 1368 2707
1575 2707 949 -2534 2266 4612 -3277 -218 6092 -294 -3406 1336 5640 533 -6285 2991 7692
1590 7692 -2701 -4687 3042 5259 -2225 -5437 3469 4282 -3802 -1395 3047 389 -2464 -889 2379
1605 2379 -2436 -3480 3840 993 -5185 -1738 3797 809 -6695 -2652 6116 -889 -7392 451 3862
1620 3862 -1459 -5111 -549 3982 -2995 -4466 3643 176 -3891 588 2040 -443 -4257 -208 6348
1635 6348 -3058 -5157 5575 2807 -3349 -2308 2406 4811 -3714 -3181 6080 743 -3030 2334 2382
$$ [...]
8191a81
##END NTUPLES=NMR FID
##END=
