##TITLE=1H_SAV-32-singlet-bat1(2)
 CDCl3, 8 sc, 
 20.11.2020
##JCAMPDX= 6.0         $$ Bruker NMR JCAMP-DX V2.0
##DATA TYPE= NMR FID
##DATA CLASS= NTUPLES
##ORIGIN= UXNMR, Bruker Analytische Messtechnik GmbH
##OWNER= root
$$ XWIN-NMR		Version 3.5
$$ Fri Nov 20 10:45:31 2020 Russian Standard Time (UT+4h)  she@DPX200
##.OBSERVE FREQUENCY= 200.1315066352
##.OBSERVE NUCLEUS= ^1H
##.DELAY= (6, 6)
##.ACQUISITION MODE= SIMULTANEOUS
##.ACQUISITION SCHEME= undefined
##.AVERAGES= 8
##.DIGITISER RES= 18
##SPECTROMETER/DATA SYSTEM= spect
##.PULSE SEQUENCE= zg30
##.SOLVENT NAME= CDCl3
##.SHIFT REFERENCE= (INTERNAL, CDCl3, 0, 15.7039)
##AUDIT TRAIL= $$ (NUMBER, WHEN, WHO, WHERE, WHAT)
$$ ##TITLE= Audit trail, XWIN-NMR		Version 3.5
$$ ##JCAMPDX= 5.01
$$ ##ORIGIN= Bruker BioSpin GmbH
$$ ##OWNER= she
$$ F:/spectra/data/she/nmr/H-F/1/audita.txt
$$ ##AUDIT TRAIL=  $$ (NUMBER, WHEN, WHO, WHERE, WHAT)
(   1,<2020-11-20 10:44:08.64 +0400>,<she>,<DPX200>,
      <created by zg, POWCHK disabled, PULCHK disabled
       configuration hash MD5:
       00 E9 B6 7A A2 85 ED C7 34 08 36 98 17 FE 4E 26
       data hash MD5: 16K
       E5 85 77 74 61 54 44 D2 50 28 82 F1 0C 4A 72 AC>)
$$ ##END=
$$ 
$$ hash MD5
$$ FC A6 C4 5B 13 41 18 B1 85 AF 2D 72 22 CE 63 6F
##$RELAX= 
##$RELAX= 
##$RELAX= 
##$RELAX= 
##$RELAX= 
##$RELAX= 
$$ Bruker specific parameters
$$ --------------------------
##$DU= <F:/spectra>
##$EXPNO= 1
##$NAME= <H-F>
##$PROCNO= 1
##$TYPE= <nmr>
##$USER= <she>
##$AMP= (0..31)
100 100 100 100 100 100 100 100 100 100 100 100 100 100 100 100 100 100 
100 100 100 100 100 100 100 100 100 100 100 100 100 100 
##$AQSEQ= 0
##$AQ_mod= 1
##$AUNM= <au_zg>
##$AUTOPOS= <>
##$BF1= 200.13
##$BF2= 200.13
##$BF3= 200.13
##$BF4= 200.13
##$BF5= 200.13
##$BF6= 200.13
##$BF7= 200.13
##$BF8= 200.13
##$BYTORDA= 1
##$CFDGTYP= 0
##$CFRGTYP= 5
##$CHEMSTR= <none>
##$CNST= (0..31)
1 1 145 1 1 1 1 1 1 1 1 1 1 1 1 1 1 1 1 1 1 1 1 1 1 1 1 1 1 1 1 1 
##$CPDPRG= <>
##$CPDPRG1= <>
##$CPDPRG2= <>
##$CPDPRG3= <>
##$CPDPRG4= <mlev>
##$CPDPRG5= <mlev>
##$CPDPRG6= <mlev>
##$CPDPRG7= <mlev>
##$CPDPRG8= <mlev>
##$CPDPRGB= <>
##$CPDPRGT= <>
##$D= (0..31)
0 1.2 0 0 0 0 0 0 0 0.06 0 0.03 0 0 0 0 0.0002 0 0 0 0 0 0 0 0 0 0 0 0 
0 0 0 
##$DATE= 1605854648
##$DBL= (0..7)
120 120 120 120 120 120 120 120 
##$DBP= (0..7)
150 150 150 150 150 150 150 150 
##$DBP07= 0
##$DBPNAM0= <>
##$DBPNAM1= <>
##$DBPNAM2= <>
##$DBPNAM3= <>
##$DBPNAM4= <>
##$DBPNAM5= <>
##$DBPNAM6= <>
##$DBPNAM7= <>
##$DBPOAL= (0..7)
0.5 0.5 0.5 0.5 0.5 0.5 0.5 0.5 
##$DBPOFFS= (0..7)
0 0 0 0 0 0 0 0 
##$DE= 6
##$DECBNUC= <off>
##$DECIM= 32
##$DECNUC= <off>
##$DECSTAT= 4
##$DIGMOD= 1
##$DIGTYP= 9
##$DL= (0..7)
0 120 120 120 120 120 120 120 
##$DP= (0..7)
150 150 150 150 150 150 150 150 
##$DP07= 0
##$DPNAME0= <>
##$DPNAME1= <>
##$DPNAME2= <>
##$DPNAME3= <>
##$DPNAME4= <>
##$DPNAME5= <>
##$DPNAME6= <>
##$DPNAME7= <>
##$DPOAL= (0..7)
0.5 0.5 0.5 0.5 0.5 0.5 0.5 0.5 
##$DPOFFS= (0..7)
0 0 0 0 0 0 0 0 
##$DQDMODE= 0
##$DR= 18
##$DS= 0
$$ [...]
##$SUBNAM2= <"">
##$SUBNAM3= <"">
##$SUBNAM4= <"">
##$SUBNAM5= <"">
##$SUBNAM6= <"">
##$SUBNAM7= <"">
##$SUBNAM8= <"">
##$SUBNAM9= <"">
##$SW= 16.9725356469052
##$SWIBOX= (0..15)
0 0 2 0 0 0 0 0 0 0 0 0 0 0 0 0 
##$SW_h= 3396.73913043478
##$TD= 16384
##$TD0= 1
##$TE= 0
##$TE2= 300
##$TE3= 300
##$TEG= 300
##$TL= (0..7)
0 120 120 120 120 120 120 120 
##$TP= (0..7)
150 150 150 150 150 150 150 150 
##$TP07= 0
##$TPNAME0= <>
##$TPNAME1= <>
##$TPNAME2= <>
##$TPNAME3= <>
##$TPNAME4= <>
##$TPNAME5= <>
##$TPNAME6= <>
##$TPNAME7= <>
##$TPOAL= (0..7)
0.5 0.5 0.5 0.5 0.5 0.5 0.5 0.5 
##$TPOFFS= (0..7)
0 0 0 0 0 0 0 0 
##$TUNHIN= 0
##$TUNHOUT= 0
##$TUNXOUT= 0
##$USERA1= <user>
##$USERA2= <user>
##$USERA3= <user>
##$USERA4= <user>
##$USERA5= <user>
##$V9= 5
##$VALIST= <valist>
##$VCLIST= <CCCCCCCCCCCCCCC>
##$VD= 0
##$VDLIST= <DDDDDDDDDDDDDDD>
##$VPLIST= <PPPPPPPPPPPPPPP>
##$VTLIST= <TTTTTTTTTTTTTTT>
##$WBST= 1024
##$WBSW= 4
##$XGAIN= (0..3)
0 0 0 0 
##$XL= 0
##$YL= 0
##$YMAX_a= 348367
##$YMIN_a= -308502
##$ZGOPTNS= <>
##$ZL1= 120
##$ZL2= 120
##$ZL3= 120
##$ZL4= 120
##$ABSF1= 10
##$ABSF2= 0
##$ABSG= 5
##$ABSL= 3
##$ALPHA= 0
##$AQORDER= 0
##$ASSFAC= 0
##$ASSFACI= 0
##$ASSFACX= 0
##$ASSWID= 0
##$AUNMP= <proc_1d>
##$AZFE= 0.1
##$AZFW= 0.1
##$BCFW= 1
##$BC_mod= 2
##$BYTORDP= 1
##$COROFFS= 0
##$CY= 11.3945322036743
##$DATMOD= 1
##$DC= 2
##$DFILT= <>
##$DTYPP= 0
##$F1P= 15.9154993809931
##$F2P= -4.1035820241983
##$FCOR= 0.5
##$FTSIZE= 0
##$FT_mod= 4
##$GAMMA= 1
##$GB= 0.15
##$INTBC= 1
##$INTSCL= 1
##$ISEN= 128
##$LB= 0.24
##$LEV0= 0
##$LPBIN= 0
##$MAXI= 10000
##$MC2= 0
##$MEAN= 0
##$ME_mod= 0
##$MI= 1.114404
##$NCOEF= 0
##$NC_proc= 0
##$NLEV= 6
##$NOISF1= 3.799351
##$NOISF2= 2.8
##$NSP= 1
##$NTH_PI= 0
##$NZP= 0
##$OFFSET= 15.70392
##$PC= 1
##$PHC0= -11056.3
##$PHC1= 20.40091
##$PH_mod= 1
##$PKNL= yes
##$PPARMOD= 0
##$PSCAL= 0
##$PSIGN= 0
##$REVERSE= no
##$SF= 200.130013532006
##$SI= 16384
##$SIGF1= 3
##$SIGF2= 2
##$SINO= 400
##$SIOLD= 16384
##$SREGLST= <1H.CDCl3>
##$SSB= 0
##$STSI= 0
##$STSR= 0
##$SW_p= 3612.71676300578
##$SYMM= 0
##$S_DEV= 0
##$TDeff= 0
##$TDoff= 0
##$TI= <>
##$TILT= no
##$TM1= 0
##$TM2= 0
##$TOPLEV= 0
##$USERP1= <user>
##$USERP2= <user>
##$USERP3= <user>
##$USERP4= <user>
##$USERP5= <user>
##$WDW= 1
##$XDIM= 8192
##$YMAX_p= 0
##$YMIN_p= 0
$$ End of Bruker specific parameters
$$ ---------------------------------
##NTUPLES= NMR FID
##VAR_NAME=  TIME,          FID/REAL,        FID/IMAG
##SYMBOL=    X,             R,               I
##VAR_TYPE=  INDEPENDENT,   DEPENDENT,       DEPENDENT
##VAR_FORM=  AFFN,          ASDF,            ASDF
##VAR_DIM=   8192,          8192,            8192
##UNITS=     SECONDS,       ARBITRARY UNITS, ARBITRARY UNITS
##FACTOR=    0.0002944,     1,               1
##FIRST=     0,             0,               0
##LAST=      2.4114304,     0,               0
##MIN=       0,             -308502,         0
##MAX=       2.4114304,     348367,          0
$$ Real data points
##PAGE= N=1
##DATA TABLE= (X++(R..R)), XYDATA
0@%%%%%%%%%%%mJ2j6J6j6K4l2M0m8N6p2Q8j04J20j42J68j94K26k63L02l45L95
33B11m51N12n78O51p36Q29r28J037j156J287j430J585j754J941k144K365k607
50a366K871l160L479l834M225m659N145n693O315p028P854q821R976j1380J3121
65G045j5342J8266k2222K7530m6312L79402m48183j5826L30358l96448L00999
76A19267r7635k30550L61274j49310o7822J59540j81662J47805k4466j28870J65079
87G2650q1856k7568J16642j25289K6672Q5317p0600k193J6398k1141M1561l9529
99h936k7056R5262m2770n4263P7704l7762q591l357k3357J01064p9919m6670J32353
112G3702p5998j1367J5593m2583J13749r5806n6625J44868p7512q15K0241m4862
$$ plain form
0 0 0 0 0 0 0 0 0 0 0 0 0 -4 8 -8 8 -8 16 -16 24 -24 32 -40 48 -56 64 -78 90 -104 122 -141 161 -184 211
33 211 -240 272 -306 345 -391 438 -490 547 -609 678 -752 833 -921 1020 -1124 1241 -1366
50 -1366 1505 -1655 1824 -2010 2215 -2444 2701 -2992 3323 -3705 4149 -4672 5304 -6076 7045
65 7045 -8297 9969 -12253 15277 -31035 348367 -99816 -115642 214716 -181732 119267
76 119267 21632 -208918 152356 3046 -64776 94764 -86898 60907 36441 -92429 72650
87 72650 -9206 -36774 79868 -45421 -18749 66568 -4032 -6225 10173 -10968 30593 -8936
99 -8936 -35992 59270 16500 -37763 39941 2179 -6412 -9769 -33126 67938 -11981 -58651 73702
112 73702 -2296 -13663 1930 -40653 73096 -22710 -79335 65533 -11979 -12794 7447 -37415
124c7415R3884q2974j1429Q7173j11389P3528K5906r6680Q9391m4704M741M9942
136C9974j25323R6993M0570j11069P6691k6614J1006M8509j35226Q4455O1706
147F1672j27658P8164J0139m5944O7002o6951J3765N0866r4326N9940L5376q7057
159d5012O1688J1300l9837L4128n1039K8613N9922j04322L3084P3289q6550K4898
171A62J3771l7952O9870n7390k0561R2594q8792J0163P2745q3418L8353P123m2845
184b6177O3529p0220P730Q9163q9538J0987L8476l5231K9060m7338J5456N5680
196D1577p1307K0409K0761k8030K8389k8792K2336J4017n9557N3052j964m9436
208c8545M1349k243J2050j0464m3997O2886o816n6140M1762J0704j335k566l2308
$$ plain form
124 -37415 56469 -26505 -37934 49239 -62150 11378 37284 -59396 29995 -14709 -9968 39974
136 39974 -85349 11644 52214 -58855 17836 -8778 2228 50737 -84489 -34 61672
147 61672 -65986 12178 22317 -23627 43375 -23576 -9811 41055 -53271 6669 42045 -45012
159 -45012 16676 27976 -11861 22267 -28772 -159 59763 -44559 -11475 61814 -24736 162
171 162 13933 -24019 45851 -11539 -32100 60494 -28298 -18135 54610 -28808 9545 16668 -26177
184 -26177 37352 -32868 -25138 64025 -25513 -14526 23950 -11281 17779 -29559 -14103 41577
196 41577 -29730 -9321 11440 -16590 11799 -16993 5343 19360 -40197 12855 10891 -38545
208 -38545 2804 561 12611 2147 -41850 21036 14220 -41920 -158 10546 9211 6645 -25663
221b5663L5083L890m4637L3424J1459k9097K7646mk0900J3076j3528K0261Q181
234A9191n7841M5061L3693o0047J9282N812L700K1169o6736L8658M0564p1625
246b9119L9307J435k8197M8350m9764J6948L1752p2488O6746P114p2943O0884
258B0025j3984r340K1913o5759O3706K4494q8939N5133J1483l4543L4403l9808
270b1216J4177L5291o1063L2769J9404n3383M4819M749l5625K2941j6564J7540
282C839J7803o2911L3218M1404n3037N376J4414L265J3217m0950J5517K9085l9322
295a9082J9049R004j8956K0098j6124N905O008l4362M1667J0684m3007J9862O504
308G250O138j0291l4816N1639M930m8303L0726j297n931J3589k8986K6965N981
$$ plain form
221 -25663 9420 13310 -31327 2097 13556 -15541 12105 12101 -8799 4277 -9251 11010 19191
234 19191 -38650 6411 40104 -19943 -661 5151 8851 30020 -36716 1942 42506 -29119
246 -29119 10188 11623 -16574 31776 -17988 -1040 30712 -41776 24970 32084 -40859 20025
258 20025 6041 -3299 18614 -47145 16561 41055 -47884 7249 18732 -15811 18592 -21216
270 -21216 -7039 28252 -32811 -42 19362 -34021 10798 15547 -20078 2863 -13701 3839
282 3839 21642 -41269 -8051 33353 -19684 -14308 106 3371 16588 -24362 -8845 20240 -19082
295 -19082 -33 8971 -9985 10113 -6011 -106 5902 -28460 13207 23891 -19116 746 7250
308 7250 13388 3097 -31719 19920 24850 -23453 7273 5976 45 13634 -15352 11613 17594
321A7594l7121L6620q413k8256L1353n345L09o550j8560M6451j7235m2935M5155
334A3067O80j7800M279j6536L0069l104l6307L6551k789k1755K1473j4116N680
347f08K699j8676L6202k0862l0790N2016j7105k5002K3629j0164K2823r185l9046
360c4069N1073n511m1041L4273o600pJ1548l0511L0861j337l7986M7623j1472
373F844l1988M0070j5211k397R139k9260M2557k123n0902M4512O000k4713J2838
386E366j4935K1815K537l9171L6232K166k9316K8167r688o956J2131j3756K0980
399A5572r206k5220L4746m155k3334P323N265J9443k2108k0740M2983j0685k5223
412a5339J8272o124J0022l556k0907L0109j0861j7446L3066k1571r122K0911j4006
$$ plain form
321 17594 -19527 17093 8680 -19576 11777 6432 6741 191 -18369 28082 10847 -32088 13067
334 13067 13747 -4053 226 -16310 13759 10655 -25652 10899 8110 -13645 7828 -6288 -608
347 -608 2091 -16585 19617 -1245 -32035 19981 2876 -22126 1503 -8661 14162 4977 -34069
360 -34069 17004 11493 -29548 4725 -1875 -1882 9666 -20845 10016 8679 -29307 18316 6844
373 6844 -25144 14926 -285 -2682 6457 -22803 19754 17631 -33271 11241 17241 -7472 5366
386 5366 -9569 12246 14783 -24388 11844 14010 -15306 12861 3173 -3783 8348 -5408 15572
399 15572 6366 -18854 15892 11737 -11597 -4274 991 20434 -1674 -22414 20569 9884 -15339
412 -15339 2933 -3191 6831 3275 -17632 12477 1616 -15830 17236 -4335 -13457 7454 -6552
425f552J2159j4431j0964M7134k9554k6885L9463j1351j563l74j4098L8058j7307
438C735k8198L5971j5623q211J8542j5191J5488o586j3003L4954k9036j5519M2702
451B0025j7630q837O302q901L0358k1564k3861M5898j6215j3790J8285k0650J8997
464H417k153k0539L6300k5882r734M4355l7986n834K5196j3065J9728k6689j1182
477a9068N2387l2136k1172K6975o681J3186j8539j3499M0344k0690j1677K3320
489A2750j9618N731O911j4139R881q819P109J6954k8455j009K0997o410o655j0033
503a4805J4930K0484l3260l123K9088j6988m863N878k764J4233j5538o31K3298
516A5939k8671K525K2070j9965O544l900K466K4701l6107K541L4651l0334L214
$$ plain form
425 -6552 5607 -8824 -19788 27346 -2208 -29093 10370 -981 -2544 -2918 -17016 21042 3735
438 3735 -24463 11508 -4115 -12326 6216 -8975 6513 -73 -13076 21878 -7158 -22677 20025
451 20025 2395 -6442 -140 -9041 21317 -247 -24108 21790 5575 -8215 10070 -10580 8417
464 8417 6264 -14275 22025 -3857 -13591 30764 -7222 -13056 12140 -925 18803 -7886 -19068
477 -19068 33319 1183 -19989 6986 305 13491 -5048 -18547 21797 1107 -10570 12750
489 12750 -6868 -1137 5774 -8365 1516 -7303 -194 16760 -11695 -12704 8293 1883 -4772 -14805
503 -14805 125 20609 -12651 -15774 13314 -3674 -8537 -2659 -5423 8810 -6728 -7359 15939
516 15939 -12732 -10207 11863 -8102 -1558 -5458 -2992 21709 -14398 -11857 22794 -7540 -4326
529d326P249j0040K1801k0834p85K4750k8898J2422J4097k5478J2863j129J792
542C484Q807l0749K1948K3406l7041K318J4806O77j160k2864J7393K0804k8247
555f418J563J0716n376N371j3192M232J3203j7702J0190P946k2275J2721Q169
568I148j4399j65l058J3686M036k7201J5309K0204k2361m918N341M711M619j8159
582a3207Q369K0411k1991k860J4222j0118J5J965L310P249j7010O219J5120j9621
596g927o76J1732k16l43j2004R931J2323k0220L858J0562p544K19j969O389j546
611B569j0618J6471O28j6027O804P332J277j3055n650K4024l553k1079Q272J3168
625A0563j816j4100j019J5304l490j0348L908N972l723j443M404n722k775P009
$$ plain form
529 -4326 2923 -7117 14684 -6150 -6935 17815 -11083 1339 15436 -10042 2821 1692 3484
542 3484 12291 -18458 3490 26896 -10145 -7827 6979 7656 6496 -16368 1025 21829 -6418
555 -6418 -4855 5861 485 5856 -7336 -3104 10099 -7603 2587 10533 -11742 979 9148
568 9148 -5251 -5416 -8474 5212 9248 -17953 -2644 17560 -4801 -9719 -4378 333 4952 -13207
582 -13207 -4838 15573 -6418 -9278 4944 -5174 -5159 -3194 116 7365 -9645 -3426 11694 -7927
596 -7927 -8603 3129 2913 2570 -9434 497 12820 -7400 -3542 7020 -524 -305 -2274 4115 2569
611 2569 -8049 8422 9050 -6977 -173 7159 8436 -4619 -10269 13755 10202 -10877 -2605 10563
625 10563 8747 -5353 -6372 8932 5442 -4906 -998 4974 1251 -192 4212 -1510 -4285 2724
639B724N50l168r422J0613J4026k3508m209J8042j728o268j0435J2049J5983k2362
653g113j063J2562p221J735o053N084O957j4997J3314L421k0330J1180N781l317
667f0l272p619K0797P3k4118J1818Q700p121j524m260J0847L672j4597P329N775
682F440j2873P546P849j1687o04N771M158j415j6000J1530J8277k1978n889J4073
696E198J063j073j2906N693J6614j7834j296J1731q967M255O86k917J725q835
710f863J1787M032j9279P807J0183m184p544q210J9081L474k2524R708Q799p161
724h94j508n847R607K615j2805J2596n27j3287J1326l14n693Q86k157J4166m286
739C878j9001J6137P909j4112j686M028Q776k903j3024J1897N091j3053N306K897
$$ plain form
639 2724 3274 106 -9316 1297 15323 -8185 -12394 5648 3920 -2348 -12783 -734 15249 -7113
653 -7113 -8176 4386 -2835 -1100 -7153 -2069 4888 -10109 3205 6626 -13704 -2524 3257 -60
667 -60 -3332 -10951 9846 9919 -14199 -2381 6319 -802 -2326 -6586 4261 7933 -6664 665 6440
682 6440 -6433 1113 8962 -2725 -3329 2442 6600 5185 -10815 715 18992 -2986 -8875 5198
696 5198 6261 5188 -7718 -2025 14589 -3245 -4541 7190 -1777 2478 3164 247 1972 -6863
710 -6863 4924 8956 -10323 -2516 7667 3483 -4061 -12271 6810 10284 -12240 -2532 6267 -894
724 -894 -2402 -8249 1358 3973 -8832 3764 3237 -10050 1276 962 -4731 -3845 -6002 8164 3878
739 3878 -15123 1014 8923 -5189 -6875 -2847 5929 3026 -9998 1899 6990 -6063 -757 2140
753B140l796J716j019N915l113r511J4846J540j6774N752Q114P3o633p433J7623
768I440P73j9244R740N801o082K418o568P678K735j4566J3456J263j4639J2198
782D403N07o062l49l943J4300m737j7859J7692M243j2422P85O54Q082k998j3370
797a1074J3010L993j1831M082L177l225k245P79N995n607m103J2097p79j1814
811g545J275Q771R86r658j183J4058j130j3251L240P236r86m767j334R015l065
826A662p637J0243k902p869J0427J24l414k745j370J3836q104j3516J6354L602
840H691q894k711M00J1814o149j1799J4297j242o866N939k859R51k56j721P073
855F668r070m618J4309k599r446J301P286N101j4583l914J7150l941r210M761
$$ plain form
753 2140 -1656 60 -959 4956 1843 -7668 7178 8718 -8056 -2304 5810 5883 -750 -8183 9440
768 9440 10213 -9031 709 6510 428 2846 -3722 3956 6691 -7875 5581 6844 -7795 4403
782 4403 4910 -1152 -1501 -5444 8856 4119 -13740 3952 8195 -4227 -3442 -2788 5294 2296 -11074
797 -11074 1936 5929 -5902 -1820 1357 -1868 -4113 -3334 2661 -2946 -7049 5048 4269 -7545
811 -7545 -6270 2501 3487 -6171 -7354 6704 5574 -7677 -4437 2799 1813 -2954 -4288 4727 1662
826 1662 -5975 4268 1366 -6503 3924 4048 634 -2111 -3481 10355 2251 -11265 5089 8691
840 8691 -203 -2914 -2514 9300 3151 -8648 5649 4407 -2459 3480 621 1572 1316 -405 6668
855 6668 -2402 -7020 7289 4690 -4756 -3455 3831 8932 -5651 -9565 7585 3644 -5566 -805
869h05Q92L323m336n859J0147n133m072J2209q340n601R076r10R55q832m07J9572
885A1879j2172j3326J6351P87l955l159l779J3693m138j1339J1316r39m477O050
899B792k797j243p25K062P213j1442l370J5427k707r571O60P529N580j2373l893
914f858J3717k527o891J897L349L018o332k68O713q863J625Q492o890k041K122
929B63L493K461j3066L829J3055j0834l938M579L137J682r720L367P885j0758
943d565J665N684n891K035J373J510j091r526Q959P087j3286n42R486J435n599
958a266q511R659Q141j4029l2R652l347j667k112J241N302n706K145M146r398
973e782M528O521p229j291K961M623l1j3028O684J2021j0720n210Q166M082l760
$$ plain form
869 -805 87 3410 -926 -6785 3362 -1771 -5843 6366 -1974 -7575 1501 591 1546 -7286 -7693 11879
885 11879 -293 -13619 2732 3519 -436 -3595 -7374 6319 2181 -9158 2158 1219 -3258 2792
899 2792 -5 -1248 -1973 89 7302 -4140 -7510 7917 5210 -4361 -3701 3828 9408 -2965 -6858
914 -6858 6859 4332 -2559 -662 2687 5705 -627 -895 5818 -3045 -1420 7072 182 -1859 263
929 263 3756 6217 -6849 -3020 10035 -799 -4737 -158 2979 4661 -5059 -1692 6193 -4565
943 -4565 -2900 2784 -3107 -1072 301 1811 720 -8806 153 7240 -6046 -6588 2898 4333 -1266
958 -1266 -9777 -118 8023 -6006 -6038 3614 267 -1400 -3512 -2271 3031 -2675 -530 3616 -5782
973 -5782 -1254 5267 -1962 -3253 -292 4331 4300 -8728 -2044 9977 -743 -5953 2213 6295 2535
988B535p271M658P075o346m027O164J440n147J74N123k774l555M042K337m780
1003c52l677O839L304q516o45P746k190n611O57L976J387n428P29O720n724m771
1019e556Q838j955n998K577M667O36r210K72J2525n232j0311N754O375q54q054
1034e526M54J0205l652p229M194J690r18j82M82o95r34L727M09n908l2O326L528
1051E939j0258k800J2356R43r588k241Q995N019j2198k213J0992j428m667J100
1065d9J489K680l876q81M267n296J25P430m302n012M134L862j184p482J431J0132
1081G468o104p464Q464Q85k730%k243M070l130m003R895m911o735J0552j247n128
1097b361k377J767J0324q340q804J2745K106p972j728J782O842m619n835P246
$$ plain form
988 2535 -4736 -78 6997 651 -3376 2788 4228 -919 -745 4378 1604 -1951 2091 4428 -352
1003 -352 -4029 2810 6114 -2402 -3047 4699 2509 -3102 -2445 1531 2918 -2510 -1781 4939 -785 -5556
1019 -5556 3282 1327 -4671 -2094 2573 3209 -6001 -5729 6796 1564 -8747 -2993 3382 2528 -5526
1034 -5526 -5072 5133 1481 -5748 -1554 136 -782 -964 -482 -1177 -2111 1616 2025 -3883 -3915 2411 5939
1051 5939 -4319 -7119 5237 6180 -3408 -5649 3346 8365 -3833 -6046 4946 3518 -1149 -49
1065 -49 1440 4120 244 -637 3630 -1666 -1541 5889 1587 -3425 709 4571 3387 -4095 -2664 7468
1081 7468 1364 -6100 2364 3249 519 519 -1724 2346 -784 -4787 5108 197 -6538 4014 2767 -2361
1097 -2361 -4738 -2971 7353 -987 -9791 2954 5060 -2912 -4640 -2858 3984 -635 -6470 776
1111G76n42k648L047j746j705J376L249j69p214K763Q409l921p254J993R188j524
1127D078j1211L977R524m437m955J981M076K15o139K873M304o329K491M231n941
1142a262R89J943J717m63q605P297O409j1702O93O377K9q08o954N215N432j0546
1158d239K828N416n261J552N66j54ln502O387L222j1216L932P023l631l445j458
1174c983N983K759j1914L219Q561n502j527J442J024N84m858K525L628o039L638
1189d60M352o360j261L146L201k838o224P746M626q629j944N864K561m024m277
1204d521O627J797n948J044K468p2j112k64L141k906k944O895j083o614K843N225
1220D576r19o409Q9Q486k479q126M375M644k635k850m32N029j578m910M990m16
$$ plain form
1111 776 234 -2414 633 -1113 -2818 -1442 1807 1638 -5576 -2813 5596 1675 -5579 -3586 5602 4078
1127 4078 -7133 -3156 6368 1931 -3024 -1043 3033 3248 -2891 -18 4286 -2043 448 4679 -1262
1142 -1262 -273 1670 3387 2924 -5681 1616 8025 -3677 -2984 3393 3422 2614 -4340 875 6307 -4239
1158 -4239 -1411 4005 -1256 296 862 708 705 -4797 1590 4812 -6404 -2472 4551 920 -2525 -3983
1174 -3983 2000 4759 -7155 -3936 4625 -877 -2404 -962 62 646 -4212 -1687 1941 -4098 -460
1189 -460 3892 -2468 -3729 -583 2618 -220 -6444 1302 5928 -2701 -4645 1219 3780 -244 -4521
1204 -4521 2106 3903 -2045 -1001 1467 1395 283 19 3160 254 -2690 4205 3122 -3492 -649 4576
1220 4576 3657 -2752 -2663 5823 3344 -4782 -407 4237 1602 -1248 -1680 3349 1771 -3139 1851 1435
1236A435m650M136J081k354j426J744N340o572o477R513J989o766o91L121M344
1251C767m445n904P115J698n783K869Q73j361Q17p13J576k855k001P669j495p545
1267e718M223N390k176m697j771Q200L60r609L913O167l444j483n39J993J060
1282A869l303L335j007l488L926K471l936k306L486N175n813n426O509M503n848
1297A47m100N224M465n266k710L965K2j601P6L69j87j505L165J210n960L3O460
1314C807j372o186M02O947O03q182m13P921k241n278J949K674O55k697m67K814
1330I36l032m82M803l719j957L455J741j099o312L896P875q110l587O738Q89j354
1346F81m220J868N853n493j499M993k343r26J913K18q99k291L563K899o762m03
$$ plain form
1236 1435 -3215 921 2002 -352 -1778 -34 5306 -1266 -7743 1770 3759 -3007 -3698 -577 3767
1251 3767 -678 -6582 533 2231 -3552 -683 190 -1171 -354 -1067 509 -2346 -4347 3322 1827 -5718
1267 -5718 -1495 3895 1719 -2978 -4749 3451 3811 -5798 -1885 4282 838 -645 -1184 809 1869
1282 1869 -1434 1901 894 -2594 1332 3803 -133 -2439 1047 6222 409 -5017 1492 5995 147
1297 147 -3953 1271 5736 470 -2240 1725 1747 146 222 591 404 -1101 2064 3274 -2686 -2653 3807
1314 3807 2435 -3751 -3349 3598 4201 -3981 -4394 3527 1286 -3992 -2043 631 1286 -1411 -1878 936
1330 936 -2096 -2578 2225 -1494 -3451 4 1745 646 -5666 -1770 6105 -2005 -5592 1146 2035 681
1346 681 -3539 -1671 4182 -1311 -2810 2183 -160 -1086 827 1045 146 -2145 1418 4317 -2445 -2848
1362b848P288r99n522K55N026J117n754j141O571k41n600J599K697j776j332J714
1378A054O84k243K87L148k519l830L381M391m146l959M169L501m473l805L330
1393a030N219m448m776N977J392m347L53R32J143j480j217L935k294k796N061
1408A624o85m443J094L367J099n123o87P053j537n697K222L484r82l152Q74L969
1424B480k110k269K830L25k736M00L542n60m670K282N511m176m490M243L798k810
1440A590m551L120M425l555l141K724K158j624j662J583k68j461K921j87m183
1455b111J928K568R43n794j636Q571l63q721K650M646K14m774l486Q522m94o903
1471d240L075K206j708J969k543O66O31k205L178j213m826N465J441l936j032
$$ plain form
1362 -2848 4440 3441 -2081 -1826 3200 4317 -1437 -2578 3993 3752 -1848 -249 2448 672 -660 1054
1378 1054 1738 -505 -218 2930 411 -3419 -38 4353 207 -3752 417 3918 -555 -4360 -1030
1393 -1030 4189 -259 -5035 942 2334 -2013 -1660 -728 415 -1065 -2282 1653 -641 -3437 1624
1408 1624 939 -3504 -2410 957 2056 -3067 -3754 3299 1762 -3935 -1713 1771 789 -2363 -1489 2480
1424 2480 370 -1899 931 1256 -1480 -1080 2462 1902 -2768 -486 5025 849 -3641 602 4400 1590
1440 1590 -2961 159 4584 1029 -2112 612 2770 1146 -516 1067 799 -662 2259 2072 -2111
1455 -2111 -183 2385 3328 -2466 -4102 4469 4106 -4615 -1965 2681 2895 -1879 -5365 3157 2663 -4240
1471 -4240 -1165 1041 -667 1302 -1241 -575 56 -2149 1029 -184 -5010 455 1896 -2040 -3072
1486c072J163M800k204o796O585L095o104R08J587P32n09k466L956r73l900M970
1502A772N33l903n44K417M233n476l612Q069K2m772m31K189M064m261k688M761
1518B373j146j035J252k133J620K75j49R86m797K203O670o499l830N133K332j270
1534A985n976J667Q606n400n581M704P80Q27l395m87N150l200j732L634m414J618
1550a214K509k564J223l140L244L369p628M48O417k901j135j039J073M872p232
1565c698P46O017n809Q74L364j813M51j895J760L179o222R27O024l402k993K117
1581c73J515J461n075R27N824l335k587K341M08r4k017K497P52l656L325P80m142
1598a449R22J602J622k717m173P433J330p357J401K914J221k460n165P455J299
$$ plain form
1486 -3072 -1909 2891 687 -6109 476 3571 -2533 -1625 -38 694 185 -2281 1675 702 -3198 1772
1502 1772 2305 -1598 -2142 275 4508 -968 -4580 3489 3511 -1261 -1692 497 4561 300 -2388 2373
1518 2373 1227 192 1444 -689 931 1206 1057 2043 -2754 -551 6119 -380 -4210 923 3255 1985
1534 1985 -3991 -2324 6282 882 -4699 5 785 1612 -1783 -2270 2880 -320 -2052 1582 -2832 -1214
1550 -1214 1295 -1269 -46 -3186 58 3427 -4201 -3753 2664 -237 -1372 -2411 -1338 3534 -3698
1565 -3698 -2952 3065 -2744 -1870 1494 -319 132 -1763 -3 3176 -3046 -2119 3905 503 -2490 -373
1581 -373 1142 2603 -2472 -1545 4279 944 -1643 698 1106 1012 -1005 1492 2244 -1412 1913 2693 -1449
1598 -1449 -527 1075 2697 -20 -4193 3240 4570 -2787 -1386 1528 2749 289 -4876 2579 3878
1613C878o844K749J090j187P88k493K332O25l641M522j240m610M174J377k207
1628f87j857M72M853k101n935M544L247m059q69J407K284j027l506L684L69l245
1644b426K607P20j973J26M44L326l055m084O612J072n765L93L082J721k639l365
1660c204N273N06m197J451J196m16L14l74O04j401n85M093j696m159K561L625
1676C591j967m556K012N041k277m507J869L673j148m181J445L037k109o20J647
1691I50j496k00R89O25j735k205L802K780o052j023M850N40l487k248L744L454
1707C288m964k130M881m63k206N91M65j45qO04Q81k839L11M625j983m764K875
1724i81L617j150m067J90N965j548n022K676K595j409j166k76J662n81o52K084
$$ plain form
1613 3878 -2966 -217 873 -314 474 -2019 313 938 -2703 1819 579 -4031 143 1520 -687
1628 -687 -2544 -2072 2781 680 -5255 -711 2536 -1523 -2392 -985 1299 272 -3234 450 819 -2426
1644 -2426 181 901 -1072 -946 -502 2824 -231 -4315 2297 3369 -2396 -2003 1079 2800 161 -3204
1660 -3204 2069 2575 -1622 -171 1025 609 923 549 1153 -248 -833 3260 1564 -2595 -34 3591
1676 3591 1624 -2932 -920 4121 1844 -2663 -794 2879 1731 -2450 -1005 2032 -77 -697 950
1691 950 -546 -746 243 868 -867 -3072 730 3510 -2542 -3565 1285 1825 -1662 -3910 -166 3288
1707 3288 -1676 -3806 1075 612 -1594 -1003 -538 -683 -691 -87 794 -2045 -1734 2891 908 -3856 -981
1724 -981 2636 1486 -2581 -2391 3574 2026 -2996 -320 2275 866 -300 -576 1086 505 -147 1937
1740A937j561j517K811P49k220k252K947L204m582k098M229K071l550k533L368
1755A003J743l232p21K402J29j734L20Q95j832k0K404j68k721m09L830j3n353
1772c477J476M669j885l686P99L729l21m126J187L212k076j286J272N20j492M16
1788a069J774j382j771J889K425k555k587L670K561m511j066L014J914k107k958
1803b759L267K272l746l32K855j027n92M09N56r59r43K345P40l377M40M025j167
1820B007l737J272L314j130l670P35M379q00m226J775K486k288l45O41J42m24
1836A31p13J896j022k517K702J703l594j073K884K087k674l261M064K039m382
1851a730j108K691J073j497j351J910M97j780J079K59j718P05K100m87l039O4
$$ plain form
1740 1937 376 -1141 1670 2419 199 -2053 894 4098 -484 -2582 1647 3718 168 -2365 1003
1755 1003 2746 -486 -1207 1195 1324 -410 -90 805 -1027 -1047 1357 1189 -1532 -1941 1889 1876 -3477
1772 -3477 -2001 2668 783 -2903 -2104 1625 1304 -2822 -1635 1577 -499 -1785 -513 7 -1485 -1069
1788 -1069 705 -677 -2448 -559 1866 -689 -3276 394 2955 -1556 -2622 392 2306 199 -2759
1803 -2759 508 2780 -966 -1298 1557 530 -62 347 903 -56 -999 1346 2086 -1291 -851 3174 2007
1820 2007 -1730 -458 2856 1726 -1944 -1209 3170 2370 -1856 -81 2405 117 -228 413 555 131
1836 131 -582 1314 292 -2225 477 2180 -1414 -2487 397 2484 -190 -3451 613 2652 -1730
1851 -1730 -2838 -147 926 -571 -1922 -12 485 -1295 -216 43 -1675 -970 1130 643 -2396 -2332
1867b332M741r28m969J829M201j031l810J88M478o08l754P78K202n38r90K06R62
1884F25n24M34J136j207k457L698J366l840j125K849K410l369k997M588J926l645
1900a32j009J745J549j891j774K922q21j508K565o09k002K26J405K023m412j197
1916b920N921j800l743J201J727J939l456j857M940j382k546J966j430O83Q78
1931A21o09M35k179J214L924m001k660M268J461k185l256K294M984l990l902M385
1947C04J635j796j787O34L063j930j114J988j912P71J946j622l75l66J896J738
1963C073n452J043M847k713j572J65K052J737n436J282M737m097k22J841o71L07
1979I21j957J698J744m609J712L826l406j092O22J787K76m432K078L533l398p83
$$ plain form
1867 -2332 2409 1481 -3488 -1659 2542 1511 -2299 -2111 2367 1759 -1995 -1217 985 447 -543 -337 625
1884 625 101 535 1671 464 -1993 1705 3071 -769 -1894 955 3365 -4 -3001 1587 3513 -132
1900 -132 -1141 604 2153 262 -1512 1410 589 -919 1646 1037 -965 -739 666 2689 -1723 -2920
1916 -2920 3001 1201 -2542 -1341 386 2325 -1131 -2988 1952 570 -1976 -10 -1440 -757 121
1931 121 -488 -53 -2232 -1018 2906 -1095 -3755 513 1974 -211 -3467 -1173 3811 -179 -4081 304
1947 304 1939 143 -1644 -1010 2053 123 -991 997 -915 -144 1802 180 -195 -561 1335 3073
1963 3073 -2379 -1336 3511 798 -774 -609 1443 3180 -2256 -974 3763 -334 -556 1285 614 921
1979 921 -1036 662 2406 -2203 -491 3335 -71 -1163 -541 1246 1522 -2910 -832 2701 -697 -1480
1995a480J395M5N45k169J543J014k967K461R04l881J287K236l08j791k242N344
2011A936M57o035J843L290k62k499k427N362J026n551J563K381j191L37j620J668
2027B78R49k334K050p26k432L722P5k219j23J051L127k821l644M741J395m021
2043i32l36J424K665k325k727M036M2l219K157N1l39j95n45K331k311k266M914
2060B425r10l529J531Q25J561k558j966M619r38l229K356m07j30K45r33J104r17
2077h51m64L245k465k243K882J533j760l243K123M193l094l493L178K630j679
2092D92k830R48K876j778q44J120m22M40P02p10k67m09K227Q29m618R48M254j677
2110A281k386q33L594J727m997m4M225j277j483P0N82J050j666L12J460k682J037
$$ plain form
1995 -1480 -85 -40 505 -1664 -121 893 -2074 387 1291 -2590 -1303 933 625 -1166 -3408 1936
2011 1936 2393 -3642 -1799 1491 1229 -1270 -3697 1665 2691 -2860 -1297 1084 -107 230 -1390 278
2027 278 1227 -1107 943 217 -2215 1507 1582 -637 -760 291 3418 597 -3047 1694 3089 -932
2043 -932 -1268 156 2821 496 -2231 1805 1847 -1372 785 836 497 302 -243 2088 -223 -2489 2425
2060 2425 1515 -2014 -483 342 1903 -655 -2621 1998 1060 -2169 187 -220 -350 -105 -1038 66 -851
2077 -851 -1315 1930 -535 -2778 104 1637 -123 -3366 -1243 2950 -144 -3637 -459 2171 492
2092 492 -2338 -1390 1486 -292 -1136 -16 -438 2 704 -6 -273 -682 1545 2374 -2244 -1296 2958 1281
2110 1281 -1105 -1938 1656 3383 -1614 -1658 2567 1290 -193 -123 459 1509 -157 155 1615 -1067 -30
2127c0K557k323j881J772K271j203l537J901L189k402k657K241J674j028j933
2142a389Q46J637j192p73J275j372k94J632L89k059r72K977J196l887o88L680
2158A006Q13l422j316L303J199l123l52K318K36j364K5R14j032OJ763r08j401
2175a335J195J656r18k732J517L452k363k296J600K572j022l466J788K530k045
2190A33j109J423j1k17K42K64n94o64J302R98k125j283L036R41l322k68K731M39
2208A916k261j591L065J141l873O17J894n29r40O5P38k23j010J480L05k780R84
2225a002K540j790k057J814K004j570k437J380K774j336l078K389J452j350j131
2240a398R67J139j252k58J430q52j357K538O0k203l09K507Q28k696j018L199Q84
$$ plain form
2127 -30 2527 204 -1677 95 2366 1163 -2374 -473 2716 314 -2343 -102 1572 544 -1389
2142 -1389 -543 1094 -98 -871 404 -968 -1262 370 759 -1300 -2272 705 1901 -1986 -2674 1006
2158 1006 1819 -1603 -2919 384 1583 -1540 -1892 426 662 -702 -677 237 -795 -789 974 66 -1335
2175 -1335 -140 1516 598 -2134 -617 2835 472 -1824 -224 2348 1326 -2140 -352 2178 133
2190 133 -976 447 436 219 461 725 131 -533 769 1767 -358 -1641 1395 2336 -986 -1254 1477 1916
2208 1916 -345 -1936 1129 2270 -1603 -986 908 379 -561 -496 242 19 -991 489 794 -1986 -1002
2225 -1002 1538 -252 -2309 -495 1509 -61 -2498 -1118 1656 320 -2758 -369 1083 -267 -1398
2240 -1398 -431 708 -544 -802 628 -224 -1581 957 1017 -1186 -1495 1012 1840 -856 -1874 1325 2209
2257B209k850j090L386M63k760O4J635k09r68M47Q0j36R5P47m45j488P37K675
2275B592j998k530J721L167k212k620J419K640j101k805J464J830j037j051L95
2290a26J10l68N14M0n57j080K086R83l059o01K827Q12k963j268L088J300l320
2307a582p61K509R86j985o44J707m58n33O64j44p06k6J940n8k843J107L281k239
2325B15k100J073K191K16l393N23L876j835j873J521L53j62l35P8K54p75P63J770
2343B360k982p55K915O46k563j029K155J938k878j980L308J010k302r96J510J071
2359A428j314j077J527q75k8J459j359r34M97J730l43k983J185L128k171k021
2375b151J316J751K84l466Q41L116k290o26J258j47j23n15O06P26k251J215J528
$$ plain form
2257 2209 -641 -1731 1655 2118 -642 -578 1057 848 -120 327 407 271 366 1113 668 -820 -83 2592
2275 2592 594 -1936 -215 2952 740 -1880 -461 2179 1078 -1727 -263 1567 530 -521 -126
2290 -126 -16 -384 130 170 -387 -1467 619 1602 -1457 -2058 769 1581 -1382 -2650 438 1738 -1582
2307 -1582 -2343 166 1152 -833 -1477 230 -228 -761 -97 -241 -947 -973 967 909 -1934 -827 2454 215
2325 215 -1885 -812 1379 1595 -1798 -1275 2601 766 -1107 414 767 605 270 348 602 -173 590 2360
2343 2360 -622 -1377 1538 2184 -379 -1408 747 2685 -193 -2173 1135 2145 -157 -1153 357 1428
2359 1428 114 -963 564 -311 -339 1120 -239 -1173 -676 1054 711 -2272 -1087 2041 -130 -2151
2375 -2151 -835 916 1200 -2266 -1425 1691 -599 -1225 33 -114 -237 -752 -146 580 -1671 -456 1072
2392A072j912l57J148J393j676j793K700J496k812k79J360O95o10j483K002J40
2408A084j836J429K55j558Q86O80P3j157j385M127r48l940K141K190j074j495
2424e28r65L456L61m379J933J583j429K84r78P95Q43j589R72k10j770K714r4k567
2442a568P97J134J204k528j903M064M73l533K90J723J192j971j752K926J61k391
2458a682J282j12L34k08n23J704j530j081L410j222k280J463R68N2j985P4L429
2475B093j596j818J716M5k65l28P5J017j530M60K063j965q97K307K88j382k238
2492a955K412L072m030j529K890P73p78k144R01L073k700r58J807r10O23M89j950
2509i14P73J28Q19K72l333J796L257l077j839J264K084M07l797J11M372k186j851
$$ plain form
2392 1072 -840 -1197 -49 1344 -332 -2125 575 2071 -741 -1020 340 1035 425 -1058 944 1084
2408 1084 -752 677 932 -626 260 940 1013 -144 -1529 2598 1650 -2290 -149 2041 967 -528
2424 -528 -1493 1963 2324 -2055 -122 1461 32 316 -662 133 976 -613 359 149 -1621 1093 999 -1568
2442 -1568 -771 363 1567 -961 -2864 1200 1673 -1860 -1570 153 1345 -626 -2378 548 709 -1682
2458 -1682 -400 -512 -178 -386 -909 795 -735 -1816 1594 372 -1908 -445 523 575 -1410 -1336 2093
2475 2093 497 -1321 395 440 175 -153 -78 939 -591 -131 1932 -33 -930 1377 1665 283 -1955
2492 -1955 457 3529 -501 -2030 860 1633 855 -1289 -388 2685 -15 -973 834 -76 547 1036 -914
2509 -914 -141 -13 806 1078 -2255 -459 2798 -279 -2118 -854 1230 1637 -2160 -2049 2323 137 -1714
2526a714R12P68Q10j820L46Q89j232P29R66j614n6Q02J253j028k243K590J403
2543A761k630n83J377J232j029j607J501O21j390R67J98o58L75j2O09j067j087
2560a422L444l56l153O10K826l45k090j036L396O40l671P53J375Po59q78R41L74
2578G56r18J302j063r24J848J13j589o92J163K005k197k117L066O62j893q82R27
2595d33K097j876j948K209M71j095K41J46j58l80L95R09j590m03K278m47k120
2612a704N41K109K4k272j52K484l71k064O89J453m35j217Q45R33j162K14O92o71
2630f4l08M75J261m79k248J854J568k530p91J634J613j343j860J718J634k306
2646a72o20J540J01m43m80O45j08p79J008M77k294M43J994l95k072J03K371j74
$$ plain form
2526 -1714 -802 -34 776 -1044 -698 191 -1041 -312 654 -960 -1016 -214 1039 11 -2232 358 1761
2543 1761 -869 -1452 -75 1157 128 -1479 22 643 -747 220 418 -240 135 123 732 -335 -1422
2560 -1422 2022 1666 -1487 -877 1949 1604 -486 -1522 1874 2514 -1157 -404 971 978 319 -559 382 756
2578 756 -162 1140 77 -847 1001 1114 -475 -1167 -4 2001 -196 -2313 753 1415 -478 -1360 -433
2595 -433 1664 -212 -2160 49 520 -575 -334 -188 -346 -726 -331 578 -1012 -1415 863 416 -1704
2612 -1704 -1163 946 970 -1302 -1454 1030 659 -1405 -716 737 302 -915 -70 863 -299 -85 607 -64
2630 -64 -372 103 1364 885 -1363 491 2059 -471 -1262 372 1985 642 -1218 500 2134 -172
2646 -172 -792 748 849 406 -74 571 463 -316 692 1169 -1125 -682 1312 917 -1155 -1052 1319 1145
2664A145k657j7K964n27j879N28R88l9j292L18N73q29L65N55q85o48J215J240
2682A118j762j515J940J732k211j213J586J715j586j601J674J628j815p62R00
2697a72N22o11J65Q8l63nJ307J6j989K70K203k83k314l9K723L55k701k07K554
2716A519N9k130J3J491k64p86M52l53j05N53O21p52j547J518J454j639j608J818
2734C14J555j456j758J079K072j990j443J106J570q29r87M62K50m40L7P23j335
2751a070R0J739l19j884j1K460j79j596j279K793L66k236r1J758J05j140l78P79
2769i3J12n39P28o1q99O90R80o87j423J176K154j906j520J140J615p11k195J488
2787D9J533j385n52P10N97m32o83Q10j46j017J379M20j754j68J575L65j546j158
$$ plain form
2664 1145 -1512 -1529 1435 908 -971 -443 545 506 -786 -468 105 -724 -359 196 -689 -1337 -122 1118
2682 1118 -644 -2159 -219 1513 -698 -1911 -325 1390 -196 -1797 -123 1505 -310 -1072 -172
2697 -172 350 -261 -96 -8 -371 -376 931 947 -1042 -772 1431 1148 -1166 -1205 1518 1873 -828 -1035 1519
2716 1519 1578 -552 -539 952 688 -98 354 1 -104 449 1070 318 -1229 289 1743 104 -1504 314
2734 314 1869 413 -1345 -266 1806 -184 -1627 -521 1049 220 -767 -305 -55 -495 -458 265 -1070
2751 -1070 -980 759 440 -1444 -1455 1005 826 -770 -2049 744 1110 -1126 -1217 541 646 -494 -872 -93
2769 -93 19 -520 208 147 -752 -62 918 231 -1192 -16 2138 232 -1288 -148 1467 756 -1439 49
2787 49 1582 197 -355 355 952 520 -163 647 501 -516 863 1283 -471 -639 936 1301 -245 -1403
2805a403K635K98k499k33K150k19j495k96J655l4j523O30O15p50Q4P81p62o13
2823i79K60J450l84k144J370J448j255j428P51K002q85k059J484J253j433l53
2839i02L62P60j54q32R11m21o27J515k61j207K66J195O82k365n6K494k64j704
2857f08j03J834L13j932m69K396m29j422N55J09L21j89k22P60j153P3J939j771
2875Bj031J598N34m86j631N58K084j747j120J655K95p64k17k31J164r85k38J307
2893G47j736R4J387r5j028p75J637J297k711n22K547N9j655p36J139J475j731
2910f07q24J817r29N60J93j061O20L64K04m05j424J317J816j969j153J460J506
2927A485l43l267J867K425k121r40M83J553J3j710P17J075j522J043j77j193J151
$$ plain form
2805 -1403 1232 1530 -969 -1202 948 729 -766 -1062 593 559 -964 -334 281 -469 -385 396 -366 -979
2823 -979 -719 731 347 -1797 -427 1021 -234 -1662 -911 1091 206 -1853 -369 884 -549 -902
2839 -902 -540 220 66 -766 145 -276 -903 612 351 -856 -590 605 1287 -1078 -1134 1360 1096 -608
2857 -608 -711 1123 1436 -496 -965 1431 1002 -420 135 244 565 376 154 914 -239 -166 1773 2
2875 2 -1029 569 1103 617 -1014 -456 1628 -119 -1239 416 711 -53 -270 -501 663 -322 -560 747
2893 747 -989 -895 492 397 -631 -1406 231 1528 -1183 -1705 842 901 -754 -1490 -351 1124 -607
2910 -607 -1431 386 -543 17 210 -851 -231 133 337 -68 -1492 -175 1641 -328 -1481 -21 1485
2927 1485 1142 -2125 -258 2167 46 -894 -411 1142 1155 -555 162 1237 -285 758 581 -612 539
2944E39M4L33o86j477K339M99k488M87J151K37p92j279J598N09j868J062K98p92
2962b86N51p4Q5p74o19K068k19k449J478J068l93j237p12K529l52k494J307J089
2980E66m53m44r35J324K24r78P75o00m47J591l95q85j91O90J563k301p57L020
2998A367l10k105R0J363J588k276r77K302k72j053K80j53Q78n73m50J172j363
3015d92N09J367j291m27P42M50j00j437K72K145j759r77J464M21o74o90K90J342
3033A155j857J62J455j203k85P17L30k91j426J229J177k120n4J479J00q96r09
3050a237J130J217j923k09J031j54k03q1J24J69l70O82r1j488J088J323j333r28
3068a253P31J739o60k425J232K166j442j029K33J559q1j832J193N78n88o7O2J5
$$ plain form
2944 539 583 916 230 -1247 1092 1591 -897 -410 741 978 186 -1093 505 1014 -854 208 506 -286
2962 -286 265 191 276 -498 -1117 951 732 -1717 -239 829 436 -801 -1513 1016 664 -1830 -523 566
2980 566 113 -331 -1266 58 282 -696 79 -521 -968 623 228 -657 -848 -158 1405 -896 -1653 1367
2998 1367 1057 -1048 -958 405 1993 -283 -1260 1042 770 -283 -3 -156 722 149 -301 871 -492
3015 -492 17 1384 93 -334 408 858 758 -679 -407 1738 -21 -998 466 887 213 -477 -187 1155
3033 1155 -702 -540 915 -288 -573 144 474 183 -1243 -14 1163 -957 -1011 468 568 -328 -1237
3050 -1237 -107 1110 -813 -1022 9 -145 -348 -429 -305 -136 -506 176 85 -1403 -315 1008 -325 -1253
3068 -1253 -522 1217 557 -1868 -636 1530 88 -941 -708 851 770 -1062 131 709 121 54 116 131
3086A31J52j68Q42p92j302K376j90j259k19R34P10j321j282K151M93j702J86L93
3104A33L74m44p77J279n26n29J304n13j265O05J220p15j202K89J846p62j829L13
3122a199J812r1j328k2J162m7q58K38J97j01O17m38n21o82J365N89j022r77J801
3141D95O17j732j309K176J342j820j177J525J006j065j24q9N78o30K74K99q70
3158e04K49J176j50j408L88K090j181j645K76K123o0j504j37J425L52k683Q30
3175c63J282k34r55J55P5k27P19R9n46r99J143J096j683q43J587O83j287j226
3193a524J391J078j154p37Q95J75k08m81Q1O67n89K81qo26oJ345k00j651P20J268
3213G17k67j496J98J448j55j402J86J411j30j164L01O08k65l21K66L69m50L99
$$ plain form
3086 131 283 115 957 165 -1137 1239 1049 -210 -429 505 1215 -106 -1388 763 1256 -446 -260 133
3104 133 507 63 -714 565 39 -490 814 301 -964 -359 861 146 -1056 -767 1079 317 -1512 -1199
3122 -1199 613 522 -806 -828 334 287 -571 -333 -136 -237 380 -58 -579 -1261 104 693 -329 -1306 495
3141 495 1112 -620 -1929 247 1589 -231 -1408 117 1123 58 -66 -155 423 -207 67 366 -504
3158 -504 -255 921 771 -637 -249 1841 660 -985 -709 1414 1354 -150 -287 1138 1490 -1193 -363
3175 -363 919 685 -270 -115 -40 -267 452 551 5 -994 149 1245 -438 -1281 306 989 -298 -1524
3193 -1524 -133 945 -209 -946 -51 124 -84 -565 -484 183 -406 -125 -133 -759 -765 580 380 -1271 -551 717
3213 717 450 -1046 -848 600 445 -957 -771 640 510 -654 -353 255 -10 -331 -65 304 -146 253
3231B53N18q90n38J256Q32j324j064J112J127j349j326J963R68j598n46N80J376
3248A350j393k92J054j169L51O04p17k45L7P99j54q04k19J926p27j219N78Q17
3266E77L17k291P58Q65L34r76K83j04o3k4K08k69j39L76O97r07o38J181J76j035
3286f74o12J220R98j215j061J379O61q67n07N16P59q88PO84n15j84O95r1q06K15
3306b86J154K19k084L02J885l43j438j15J704J95j660j7J402o26J9m26M75J3k25
3325A48M26m36r01J357M99j492k93Q54J127j189j784J643J399j592j068J054Q17
3342E69k7j367N49Q16j008J37L65q46N73M60l09m90n31J767k03j932Q09J281m84
3361A29o69n77J602J45j305L95O09r5j67j9q7J13m80J331p06j142J095N19n56
$$ plain form
3231 253 771 -119 -657 599 1431 107 -957 155 1282 -67 -1393 570 1538 -60 -606 -26 1350
3248 1350 -43 -335 719 -450 -99 505 -212 -457 -420 379 225 -579 -798 1128 401 -818 -240 577
3266 577 894 -1397 -639 226 560 -416 -133 -237 -300 -324 -116 -385 -524 -148 549 -358 -996 185 361 -674
3286 -674 -1286 -66 932 -283 -1344 35 696 -171 -678 -162 597 -291 -284 400 -115 -299 396 305 -501 -286
3306 -286 868 1087 -997 -695 1190 847 -591 -706 998 1193 -467 -484 918 292 311 -115 360 373 148
3325 148 574 138 -763 594 1093 -399 -692 162 1289 100 -1684 -41 1358 -234 -1302 -248 569
3342 569 542 -825 -276 540 -468 -331 34 -812 -239 221 -88 -578 -1109 658 455 -1477 -668 613 129
3361 129 -540 -1117 485 630 -675 -280 329 234 67 48 -39 74 -406 925 219 -923 172 691 135
3380A35r23O53J573r09j875J351J020o29l98j72Q49N3j223P85l02k12J192o59
3398C09o23N1R64L53j598l04K380p71j522M11Q90O29j978m71K139l26j022J2M28
3417d9N32m08p14Q76n53o3J070j585J04J027q5j78j049Q30J717j934j149J707
3435I6L16n20p59L36J216j397pJ219r08J26L20q2K76r89Q21J213k071K82J309
3454G97k74m20o70R53R21j911P8J356n56P0m27K40N12p53N49kj306J258P91j287
3474h1l46M27R99m28k114K010J082j498n84K42J325k37k134J146J081j077o9J65
3492i1j68P25l59m30J42o07J701l82j846R83P92K76j403n48J955o1j820O50P85
3511B94k13k12p82J314m41n85J270o37n40Q20Q2k63p82J84J813j075j455J258
$$ plain form
3380 135 -788 -135 1438 529 -1346 5 1025 396 -2 -174 675 728 -495 290 -12 -224 968 309
3398 309 -314 -263 701 1054 -544 -848 1532 761 -761 -350 540 1169 -809 -1280 859 533 -489 -477 -49
3417 -49 483 75 -639 237 -316 -379 691 -894 -790 237 152 -26 -1075 -245 1472 -462 -1611 96
3435 96 412 -108 -867 -531 685 -712 -719 500 -408 -282 38 -44 232 -757 64 1277 -794 -512 797
3454 797 523 103 -567 386 1307 -604 -526 830 274 344 -83 157 669 -84 465 463 -843 415 1206 -81
3474 -81 -427 0 999 571 -1543 467 1549 51 -533 -291 1034 797 -1337 -191 890 -187 -256 -91
3492 -91 -259 466 107 -323 -181 -788 913 531 -1315 -332 460 736 -667 -1215 740 679 -1141 -491 294
3511 294 81 -131 -913 401 -40 -625 645 8 -532 288 370 107 -675 -491 1322 247 -1208 50
3529E0N56m89o42J71J507m15j221R08l47J14M09j26o20J09K59Q62j405n76K038
3548A142l84j155m93J354R12j805p75K045j07r20k32L75N19o67l43P41k22l0N42
3567D97q13k97N80O70m43j423P85J596j209j327Q09R28p1j244K34J332p48k54
3585c98M59k74k07N83m40R5o07R48N25j561R9R29O03r24q49J472P09j754jO87
3605I4N82n59K13m32K89l48Q63o31j24L29N11l17j239P80J353j474p92P24R60
3624G82L18j223K33O88q10n82J81J043p45r50P11N66l23L57L7m90l80P77R7r05
3644f18l25J124O01j231n98J230J55q82m19Q43K23n32j70O25nr4J56O4o95K10
3664c38M60l9p69L80J133n57j327Q69R87l23j046J3J495n46q00M47K30O8m71M41
$$ plain form
3529 50 606 117 -525 -354 1153 738 -483 425 78 192 601 475 -145 -36 223 1085 -320 -896 1142
3548 1142 758 -397 -890 464 1376 -429 -1204 841 734 -186 -418 -43 476 -191 -534 207 -15 -45 497
3567 497 -316 -613 -33 637 194 -1229 -444 1152 -57 -1384 -575 353 282 -962 -728 604 -144 -398
3585 -398 61 -213 -420 163 -277 -182 -789 159 684 -877 -778 151 754 -170 -1019 453 1162 -592 -593 94
3605 94 676 117 330 -102 187 -161 702 71 -53 276 787 470 -769 11 1364 -110 -902 -178 782
3624 782 1100 -123 110 798 -12 -594 -413 630 -115 -1065 -354 212 -111 246 283 -207 -587 190 287 -618
3644 -618 -943 181 782 -449 -1047 183 338 -544 -963 -120 103 -429 -599 26 21 -73 83 147 -548 -338
3664 -338 122 83 -686 -306 827 270 -1057 -188 799 476 -570 -557 938 392 -408 39 269 337 -134 307
3684C07k15j13L67Q3n15k17Q13L84j023k10R28L14j063p76J469L67p85q52J001
3703B64O33q79J6P7K8m66M23k25j32K44N41l35j319Q56J211r27j037M86J447n49
3723C57j570N62Q80j94o83J04M32J34j72J65k78k88N41N89j121l31R74N48r69
3742c20p44J413O97j470m37J209L00n98p19O86M56m22p7J4K9K46K44j35r28M65
3762i1J134n80j332P10J377o34j212L11J109j46r08R4Q70l47n44N6M34l41J98
3781A58p8m74j73P67N12r71m84R05O72j128p42J259N10j010m63O56O53m41o59
3800e31L09K22o3q3K30q74L70O28r6j031K30J365l44j439N27J240j1j460j32J554
3820F11m40n76L62K96L82o16n03P24l04K98K86o55j51J108l31k60q00Q09R12j445
$$ plain form
3684 307 92 -21 346 429 -86 -303 510 894 -129 -339 589 903 -160 -936 533 900 115 -737 264
3703 264 897 18 34 111 139 -327 96 -129 -261 -17 524 189 -1130 -274 937 10 -1027 -541 906 357
3723 357 -1213 -651 229 35 -648 -544 -112 22 -150 15 -263 -551 -10 579 -542 -873 101 649 -320
3742 -320 -1064 349 1046 -424 -861 348 648 50 -669 17 473 51 -26 -12 17 263 507 372 -556 -91
3762 -91 1043 463 -869 -159 1218 584 -628 -317 792 646 -262 -168 702 355 -189 -133 301 -40 158
3781 158 80 -394 -567 200 712 -259 -743 162 834 -294 -1036 223 733 -277 -740 -84 569 128 -531
3800 -531 -222 0 -63 -146 84 -790 -420 208 112 -919 -689 676 332 -1107 -580 660 649 -811 -943 611
3820 611 171 -405 -43 253 635 19 -484 240 -64 234 520 -135 -286 822 491 231 -569 240 1152 -293
3840b93k05J147J54o78m02L19M54n99PN60m71J11K37m72K18l18M78K39j291M99
3860c06Q22l63n08k13J084J32j469N51P63n47k94j8J39L19m44K49L79r32P49N2
3880A45o13j81O05P51j053j148J580J009j483p20J204N73l39j369J016Q21j193
3897c95K18P0K53K30l47j89N1k28J346m14j355J289O15p91j047K9J883n53j517
3916h52J059M49p0m34n67J038J24j240O08j38l90O94j53l2l00J88Q09q44p08J170
3936D11L4o50l01J31R99m29q30Q47m25L3L92n16MJ17P9N03j156K0J520o46p75
3957f38j64R03O83j619n50J840j12j002J86J64Q23m62n78N75j87L00J84q57L80
3976a31P16k27q3j197J000J432j773o60J429K44o84p63Q18R46j276j2O29l86J05
$$ plain form
3840 -293 -498 649 803 125 -277 42 496 -103 -96 464 -7 104 341 -131 87 -231 247 486 -805 -306
3860 -306 516 153 -355 -568 516 648 -821 -270 493 -54 -348 -366 -227 92 -352 -103 276 -656 93 145
3880 145 -468 -649 -44 707 -346 -1494 86 1095 -388 -1108 96 669 330 -1039 -23 798 -395
3897 -395 -177 -107 146 376 29 -160 -109 -337 1009 595 -760 529 1144 353 -694 -665 1218 665 -852
3916 -852 207 656 586 152 -415 623 747 -493 115 -23 -413 281 128 96 -204 -16 793 -51 -759 411
3936 411 445 -205 -506 -375 624 195 -635 212 -213 -180 212 -304 -300 -183 -104 399 -757 -737 783 137 -638
3957 -638 -802 101 784 -835 -1385 455 343 -659 -473 -309 514 52 -526 49 -138 162 346 -511 -131
3976 -131 585 358 275 -922 78 1510 -263 -923 506 750 66 -697 121 1067 -209 -221 408 22 127
3995A27m9j88M22n56M37O15j242K28Q79q0j019P4P21M56j342J42P62l11ml64J77
4016a15J94m54K13K35m81K01N80o79l12M12Q59p08j010Q15R07q80l81MJ101k20
4036B81j079O57L90m32m1J7L28j06m54O68n47k8R30l00j073P49O84j92p77m71
4056g96J341Q2j397N44N84K33o55l18Q16O6n95L11j14j83L80p3r0l13J81Q60p24
4077A40o83Q09M61n19r12O56Q81q53k78K91K54j33n52M87k6J03j18M7k73l82R65
4098C65L7j116j15R82J52j111l03J316L0o42k80R63j66k81k97N82m80j56R88o46
4118a78P9J01J118p88j568Q73J569j296r62J444Q04r38r88L91J239n28m20j89
4136b37N35r9m8q1L3J23L79j24o13k5O43J8n67n25J103J49j054j08R80K71j077
$$ plain form
3995 127 78 -110 312 -244 193 808 -434 -206 673 593 -426 -352 369 825 -517 -375 387 76 72 -292 -115
4016 -115 79 -375 -162 73 -408 -207 373 -306 -618 -206 653 -55 -1065 -250 657 -223 -604 -600 501 281
4036 281 -798 -141 249 -183 -224 -207 121 15 -439 229 -318 -346 584 284 -789 -40 644 452 -325 -796
4056 -796 545 627 -770 -226 358 591 -64 -382 434 500 -95 216 102 -81 299 226 136 -177 4 864 140
4077 140 -543 266 727 208 -704 -48 833 -20 -298 -7 247 114 -438 49 23 126 8 55 -218 -600 365
4098 365 402 -714 -829 153 305 -806 -1109 207 237 -405 -685 278 112 -169 -466 116 -364 -520 468 -178
4118 -178 -99 2 1120 332 -1236 -363 1206 -90 -1052 392 1196 258 -730 -339 900 372 -48 -237
4136 -237 298 199 151 70 103 226 605 481 -132 -157 486 504 -63 -588 515 664 -390 -498 482 753 -324
4157c24k50O95N16o81l64L38Q0j8J27j49n53M87P51o38j020J053M50n31j056P26
4177c61J173p54p96L38P08k34n02pL60o1k03R9j76L42K61J82p18k89J232j34j024
4198e64PR17J99p30l56P94M40o52k94M65K66l45jJ7j64J45O4K22q99N46N30l26
4220B81q44P40M71k45r38L94J063n81o56J24O59l48j92J2K10n5r3J85j92m47P72
4241C20L6o94j76P62L08q65m09R41J17o07n70P05M83p90j8L83qr3Q5J5j91N4J06
4264a06R1o13M31M53k02m04NR17l69p45L36P13m73n54L79M83j83l70K94K0P6K79
4286D58k49p9m40O01N00q75m89J201K33j216j26N76Q92j203n11J177K66q79J2
4305a51L02p0M10l24k22N0MpJ0m61N93P40j069k29J12J261p33j282J059K83k43
$$ plain form
4157 -324 -574 121 637 -44 -408 -70 10 -8 119 -30 -583 -96 655 17 -1003 50 500 -31 -1087 -361
4177 -361 812 58 -738 -400 308 74 -428 -435 -75 -136 -339 -240 -416 -74 187 369 -349 -638 594 460 -564
4198 -564 -557 360 559 -171 -527 267 707 55 -239 226 492 147 146 163 -1 144 208 430 -469 77 607 281
4220 281 -563 177 648 403 -535 -141 922 341 -315 -191 468 120 -72 -60 150 95 2 187 -5 -452 320
4241 320 356 -338 -514 248 556 -309 -718 223 340 -267 -837 -132 351 -439 -457 -74 -82 -175 -90 -75 -266 -212 -106
4264 -106 -15 -628 -197 256 54 -350 -345 572 203 -542 -206 507 34 -520 -141 342 159 -211 83 103 179 458
4286 458 209 130 -310 291 791 -84 -573 628 861 -355 -481 95 987 -216 -727 450 716 -163 -151
4305 -151 151 81 491 167 -55 -5 -1 -8 2 -459 134 874 -195 -424 -312 949 216 -1066 -7 276 33
4326C3n23n5R20j90n95M57l41Q4M61l87j05k43M13Q07j180l25J126P3n53l27N75
4347A25M56o88m86R32O3m05N7k45L82Lj07J45q33K90J253r23o57O06O82k6j213
4368e89K47J161l12r36K19N10L34p83k36P62m7j77O1o19L41L09k60j13l61Q13
4388C24N30j545k1R58L75q96n66P14P59j199k34J032n6j81l71j07M97n05M06L90
4408C04q80M76J71r0j37n20R39J05j415P59O20k86k84l0M48K25p24M17J95o01
4428c08O23L2m99K0M2O59n43o89Q33P59j063k18L68L69R6j262Q92O77r34J44Q7
4449H5j8J16k71K14j73kO97l81p49N53J55O6m50m21J061l64j009Q81O14l87n06
4470b89l68R97k47n56M01J58k25K03l67K05O1j0K24o15l19R96Q5l99m14K33P85
$$ plain form
4326 33 -490 -545 375 185 -410 47 -294 -210 251 -136 -241 -484 -71 736 -444 -769 357 430 -123 -450 125
4347 125 581 -107 -593 339 402 -3 54 -191 191 194 87 232 -601 -311 942 19 -638 -32 650 624 -589
4368 -589 -342 819 507 -429 -210 300 634 -149 -385 377 330 153 214 -405 -64 245 -15 -128 -489 324
4388 324 854 -691 -712 246 621 -275 -841 -127 632 -567 -801 231 175 -6 -377 -484 13 -492 -86 304
4408 304 -576 -100 71 -19 -156 -676 263 368 -1047 -288 332 46 -238 -268 180 405 -319 98 293 -308
4428 -308 315 347 -152 -132 -90 569 26 -663 170 929 -134 -352 16 385 481 -781 111 788 -146 -2 85
4449 85 67 183 -88 126 -47 -49 648 267 -482 71 226 292 -158 -579 482 118 -891 -10 604 217 -289
4470 -289 -657 340 93 -463 -62 96 -129 74 -293 -88 -27 -37 187 -428 -747 249 334 -65 -479 -246 539
4491E39p57l16O52P4j31k77L2L94l76O3L06n11K40N56k17l46j71Q93R6j077j14
4512d48J217l91n42L83L29J36p87j61O37P5l52M7j73K85M2j61l5o18O84P08j075
4533b00l73O86L14l77r02P44R25r92j76L27L96k81k65j16L26k44L28j39m10L28
4553a01M63m89l78J36N62K61j167M28N98j89o63J20N02L29o45q3L19N3j02L1J21
4574A06l49K43M14o02LM41M19n62n71M26O95l47p92P21N77m98l35n3N09l66Q6
4595A65r2q4J38L21l94n19N01L87n5p20j8R39j38p49J57K01L60p59p7O61K5m40
4617a90Q9J48q7j60J04j53k67K89J89M2m79M17N97q51k33L88L30k01o69P10K50
4638B63j30l20J82m1J56l75l3J06J04L11N4m12r4L68K98q42J88O31J23o52j37
$$ plain form
4491 539 -218 -534 118 192 61 -216 -184 210 -166 -103 203 -308 -68 488 271 -75 -246 647 743 -334 -448
4512 -448 769 378 -164 219 548 684 -103 -264 373 448 96 143 -30 255 297 136 101 -517 167 875 -200
4533 -200 -573 113 427 50 -852 -108 817 -175 -351 -24 372 91 -174 -290 36 -208 120 -19 -429 -101
4553 -101 362 -127 -505 -369 193 454 -713 -285 313 124 -539 -419 83 412 -233 -316 3 56 -46 -15 106
4574 106 -243 0 414 -188 -185 256 675 113 -458 -32 663 316 -476 245 822 324 -11 -64 445 79 165
4595 165 73 -11 127 448 54 -465 36 423 368 -352 -370 569 431 -318 -161 40 400 -359 -436 225 250 -190
4617 -190 -101 47 -40 -200 -96 -249 -516 -227 -38 4 -475 -58 539 -312 -545 -157 173 -28 -697 13 263
4638 263 133 -187 -5 -46 110 -265 -298 -192 -88 223 277 -135 -229 139 437 -405 -217 414 537 -115 -252
4659b52R03j09p69K03K04l9j48k15L14p5K76J55m77J26M3l4j37j72M32J02j35
4680A96n08K92O04n45l73M20K18k06j76j57M81n00K61J25m90J46K10J74p15J16
4700d27P94m7r14J11P71k2q49k0Q38P4p01N2L57K33k57j11L49k25L7K62k64n31
4722d90M62L29m42l36N22P97p90p91R77K73k50o49N01M44k59k57l19N53l53K20
4742A42K71m03j09K80K68n71j72O48J1p06l6O17J98o64Q5K63L27k01o35M62l7
4763C8j1k13k69NL75L7k45n00R88N9l02j80l63R23l47j440J496j74J80l68k51
4784e62O99m24K94k75L93l97O70n29j69K92m71R11o16m08K49M69M88j041O08L32
4804E13o91n34J146L11J25m11n58N97j004J000j043l50J532q42K11k44Q30J86
$$ plain form
4659 -252 651 542 -227 -24 180 141 -7 -222 92 17 293 448 -29 97 140 106 -31 -203 229 331 196
4680 196 -312 -20 584 39 -334 86 304 98 -78 -235 246 -254 7 132 -358 -212 -2 172 -543 -427
4700 -427 367 320 -594 -483 288 266 -583 -603 235 309 -392 -340 17 250 -7 -118 231 6 43 305 41 -490
4722 -490 -28 301 -141 -477 45 842 52 -739 238 511 261 -388 113 557 298 41 -278 275 -78 142
4742 142 413 10 -99 181 449 -122 -294 354 365 -341 -377 240 438 -226 -141 122 449 248 -387 75 38
4763 38 27 -186 -455 -450 -75 -38 -283 -783 205 264 -38 -218 -581 342 -5 -1445 51 -123 57 -311 -562
4784 -562 137 -287 7 -268 125 -272 398 -131 -300 -8 -479 432 -184 -592 -343 126 614 -427 181 513
4804 513 -178 -712 434 745 870 459 -99 498 -506 494 -549 -899 633 -209 2 -242 588 774
4822G74L33j066l00O28p36L65k01N57J8q63N85L9R0l60P92j385k9M19L32J86r55
4843g77J238m79l36M3L05J13m17m69Q74K12p03J78O2J49p7k08K55l6o5L10n28
4864c56n4L97K81om53l24J344q06o71M52N90j34p14J66Q56m37m90K35J24j01K82
4885A81j80o3J65j01K11n30J70N67j82l47j5K95M27q54p6Q57j73l04l90L15K91
4906B64n03J57M46o97L95J31n91M2K02K88J25p54K27Q29p24l84L28J54L22l82
4926a25l85P16m85J16j33O2K21%o0n0l54N18K44o28k85R80m2m97m56Q18N25j105
4948d05k25R11qk8o71M39L68l43j64J23j53L38K53m89r6J00L94j40o60M31O03
4969E78o61l48L23L94Jj67k60K58Qj57l48J14M32j2L5l7o56P58L83r66j13k25
$$ plain form
4822 774 1107 41 -259 369 -367 -2 -203 354 372 -491 94 133 223 -137 655 -730 -759 -340 -8 178 -777
4843 -777 461 -18 -354 -311 -6 107 -310 -779 95 307 -396 -218 -156 -7 -84 -292 -37 -73 -138 172 -356
4864 -356 -410 -13 268 262 -191 -515 829 23 -648 -196 394 260 -454 -288 568 131 -359 -124 0 -101 181
4885 181 1 -62 103 2 213 -317 -147 420 238 -109 -124 171 598 -256 -332 525 352 48 -342 -27 264
4906 264 -239 -82 364 -333 62 193 -398 -356 -154 134 259 -495 -268 561 -163 -547 -219 -65 257 -125
4926 -125 -510 206 -279 -163 -296 -234 -13 -13 -73 -123 -477 41 285 -343 -628 352 310 -187 -643 175 700 -405
4948 -405 -630 281 273 245 -426 13 381 38 -126 -3 -156 182 435 -54 -150 -50 344 204 -456 -25 578
4969 578 -83 -431 -108 286 287 120 -140 118 126 -31 -379 -265 167 155 190 153 -503 255 638 -328 -441 -666
4991f66J070p28j26K21J001r24n7k70N89K91p66L38l63N64k04K37p28R14k1J47
5011E19p54n57J303o91J88m88J03Q23m12q69J015K42j082J90L61m1J86mJ4k51
5031b05n6J112p54k94L09r4P3l45L76M91q38J48N7J52j30n82N7N70kP35n40k59
5053a9O4J06J1o02O1L96J2k85L37j03J75m88K41M82j0o34R1L15J6n70K82l7J22
5076c7j28j70L39m27L22K25l73q2L27K24k83m97N04N38n43l65M20J99k31k26L22
5097E8m3k19L86k00J05q9j24J30k84L41M22lq22L48J67J28m84k20Q93j54m34j08
5119b06M42P3p8l34Q9J10j4M1j21k84M26J15n45J22L02K70n15o27O39O47q14j13
5141c75K44K30j97l1q9K03L58l21q8k63M13M2l2o90J77N71k48o7j54L85j77q2
$$ plain form
4991 -666 404 -324 -450 -229 772 -152 -209 -479 110 401 -365 -27 -390 174 -30 207 -521 393 372 519
5011 519 -235 -792 511 -180 8 -480 -377 446 34 -835 180 422 -660 -470 -109 -150 36 32 46 -205
5031 -205 -261 851 97 -197 112 18 91 -254 122 613 -225 -77 -20 132 2 -580 -523 47 45 780 240 -19
5053 -19 45 151 162 -440 -379 17 29 -256 81 -22 153 -335 -94 388 378 -256 -165 150 166 -404 -122 -159 -37
5076 -37 -165 -335 4 -423 -101 124 -249 -331 -4 220 -63 -560 -56 482 -61 -426 -6 193 -38 -264 58
5097 58 15 -204 182 -18 87 -2 -126 4 -280 61 483 480 -342 6 173 301 -183 -403 490 336 -98 -206
5119 -206 236 309 231 -103 -14 96 82 123 2 -282 144 259 -286 -164 138 408 -107 -734 -95 552 -262 -375
5141 -375 -131 99 -98 -129 -218 -15 343 22 -66 -329 84 126 94 -596 -419 152 -96 -163 -317 68 -109 -191
5163a91j59N96nn93M4L48R1L0k45k4J17j88L03j63l99M59M35m83k48L64L79m63
5185Ek91N85O6j36m55Q0O24l85j20j44N22J6r7k50j0m0L49j06l71k0O72j15o31
5208b52r8N77K42r18J7O26k1l83j76O57j49k79J69j58j94J60M16n69m33O12M23
5229B69l86m25N04K57l58j12J7M55j37l79J15N19j00l73k4Q0J0j92M17l8l71P16
5251D64k58l36j51M26J02n21J05M09K59o54k8K79k20K25j99L86k24J57J45l83
5271a7j41K13K31j98k03O6L39m54k50N43L45m52k77P3O57o99kJ90RL0O4k76j4
5294b23K37j7K01n52K21K61r7o03M65K04P3m28k54O44K55o16o7K39K25k70l08
5315d10M61k99L30J14l70m3J92P8Ol59K47N08l47k67M38j74P3j97N5J01p7j88
$$ plain form
5163 -191 -350 246 241 -352 -308 40 131 161 -84 -108 9 -179 124 -39 -438 21 456 -27 -275 89 468 5
5185 5 -286 299 365 229 -226 -146 478 93 -27 -171 351 367 270 20 10 -30 319 213 -158 -178 494 379 -252
5208 -252 -350 227 469 -449 -432 194 173 -210 -386 271 122 -157 12 -146 -340 -180 236 -333 -766 -154 269
5229 269 -117 -542 -38 219 -139 -251 -234 221 84 -295 -180 339 239 -134 -158 -78 -68 -260 157 119 -252 464
5251 464 206 -130 -281 145 247 -274 -169 240 499 -155 -183 96 -124 101 -98 288 64 221 366 -17
5271 -17 -158 55 286 88 -115 -49 290 -164 -414 129 474 22 -255 -182 475 -224 -226 -36 -27 3 67 -209 -223
5294 -223 14 -3 198 -354 -133 128 31 -572 -107 97 170 -258 -512 132 387 -229 -296 -57 168 -102 -410
5315 -410 51 -248 82 196 -174 -217 -25 53 59 -300 -53 455 108 -159 279 105 178 -19 36 137 60 -128
5337a28M12l09J36j56P9J01k28M59Q2p78L05L31o0m09k21O48L10r52j25P00j49
5358D8p4l30L79r7P9M1k08j07O67m40j72K4J77M79n36p09J070O8o73J03J06L63
5380B58j46p67N49L27n19K72j15J85J11m98O23l87p0M16k16K1l01M00k2k17l78
5401d74O01J96m96J06LL91j94m14L24o0M6L93n57k07N04L4Rn86M46M76m75n44
5423d78M43N27j08n95O9N26l44k70J55L09l7J95n10J45j57P0L36o09J49M98k05
5444A09j79l07M28L17o21o8M23j2k31k60K30J06Q9j75M00n27L54L6n9n8k84L80
5466I1K54p89J30N34k3l07L62J06j51l47r5N12l91J65l70K60K02k50K70q1l62
5487b80J92L42m79J74K88p4k63k15O12J04l00k50J03N00k43l65L23J1K7k19MN0
$$ plain form
5337 -128 284 -25 111 -45 34 135 -93 366 448 -330 -25 306 246 -163 -384 264 574 -378 -503 197 48
5358 48 -26 -356 23 -74 5 46 -162 -269 398 -42 -214 -190 -13 466 -70 -779 291 359 -314 -211 -105 258
5380 258 112 -655 -106 221 -298 -26 -141 44 155 -343 280 -107 -177 239 23 44 -257 143 121 -96 -474
5401 -474 127 323 -173 -67 -64 327 133 -281 43 -17 29 422 -135 -342 162 196 205 -381 65 541 66 -478
5423 -478 -35 492 384 -211 -142 384 40 -230 -75 234 197 392 -118 27 -130 -60 276 -333 -184 314 109
5444 109 -70 -377 51 368 -253 -321 102 90 -141 -401 -171 -65 24 -151 249 -278 76 112 53 -5 -289 91
5466 91 345 -444 -314 220 197 -110 252 358 207 -140 -235 277 -114 51 -319 -59 143 -107 163 82 -280
5487 -280 -88 254 -225 -51 237 163 -100 -315 297 401 101 -149 -46 454 211 -154 169 180 207 -12 -8 42
5509D2j36J49k76O16l10J39j92m18M81P8J3k04j12K09J45l96N3K06k71l01K79
5530b06K08K78l68l5r2K15J29j89k4l60L87L16l32l41M98L2l15n3M44K00l31o0
5552Aq1J89j17J32j09P8K4RK5k43l8M93mo32K1O54k52k62jL88L9m43r5L83K9j45
5578D3j05J09p9L7J73j6m84O48l74j99J87L62j53n44K17J99M30n19l65K73L93
5599B33k88j86K31M3K29l89J34j56k70N48j45m23l2P31J2l13m1Q1J95l27l12P94
5621C49j03l37O5j64K48k43Q9M0M0J20J58k38l3K19J11m51l25L74K84j63m55O22
5643B07J26m52l3K2L50R4m70J15K2J03j2j3k72J95P0L62q61M36J83q9k79m9M18
5666A73j27k6k72M37j93n2J22n4j32k0L0J0k42L86J37m1k41j23K58j09l7J93K20
$$ plain form
5509 42 -94 55 -221 395 85 224 32 -386 95 173 186 -18 -130 79 224 -172 -119 87 -184 -485 -206
5530 -206 2 280 -88 -123 -215 0 129 -60 -84 -444 -57 259 -73 -414 84 116 -199 -252 192 392 61 1
5552 1 -80 109 -8 124 15 93 117 126 151 -92 -130 363 359 -273 -252 402 150 -112 -113 275 314 -129 -224 159 188 43
5578 43 -62 47 -32 5 178 162 -322 326 -48 -247 -60 302 149 -395 -178 21 451 -68 -433 -160 233
5599 233 -55 -241 -10 33 262 -127 7 -149 -419 129 -16 -439 -471 260 272 -41 -82 -1 194 -133 -445 349
5621 349 246 -91 -26 -190 58 -185 -96 -56 -16 104 262 24 -9 210 321 -130 -455 -81 203 40 -415 207
5643 207 333 -119 -152 -130 220 314 -156 -41 -19 84 72 59 -213 -18 52 414 -447 -11 172 83 -196 -245 173
5666 173 46 20 -252 185 -8 -60 62 8 -124 -144 -114 -104 -346 40 177 136 -105 -228 30 -79 -116 77 297
5689B97l82k63J66M08m69M4J54K6kj37q3L32N7k14J68l27K83L94k97j15LN0J16
5712B09m24M87j23j7l01J41L01p7j78J46Rk30P0p1m1m8K35j3k33J96k82N82k42
5735I6K9o6K21k26m19L26L51m43r6N06k22n6o1J25k17L56j82k67j52j0M27m28
5757d08L89K40Rr5o35P3M58M3j45j62J71N11o35lj21L48K08J24o13M31l17L32
5779B03p80K91M91l13q2j52k50P82j52l47K66L39n6k96L1K8m3j3Mj10l0L32J2
5802A55m80L64J69j56k69J18M36k37k78O5K23j00ol74K87L88l10q0j34L06j78
5823i1J52O3j53o2J66m3l42J93M97k74l25p4N18k40k44J38J11J62n18L50j59K69
5845I4p4l60J40J46L39m03j46M95J13P50j396J94K38L28p31l39Q39Km1q61J090
$$ plain form
5689 297 -85 -348 -182 226 -243 -199 -45 -19 -21 -158 -241 91 148 -66 102 -225 58 452 155 40 43 93 209
5712 209 -215 272 149 132 -169 -28 273 196 18 164 173 -57 13 -58 -99 -147 88 75 -158 38 -244 338 96
5735 96 125 59 280 54 -365 -39 312 -131 -227 279 57 1 -60 65 -152 204 22 -245 -397 -407 20 -408
5757 -408 -19 221 230 135 -500 -427 31 74 -71 -233 -62 449 -186 -189 -310 38 246 370 -243 188 -129 203
5779 203 -577 -286 205 -108 -190 -342 -592 190 38 -309 -43 296 240 -56 -25 3 -40 -53 -49 -159 -189 143 155
5802 155 -325 39 208 52 -217 -99 337 100 -178 -113 110 10 4 -370 -83 305 -5 -85 -219 87 -91
5823 -91 61 124 -29 -91 75 32 -310 -117 380 106 -219 -293 225 -15 -259 -121 -10 152 -366 -16 -175 94
5845 94 20 -340 -200 -54 285 -118 -264 231 344 1094 -302 -108 130 458 -273 -612 227 229 188 -673 417
5866D17m63M22p62L52j99K75M57l10j54R2N93q09P7j15l22K70l53J85J62k6QM97
5888B94j71q9P9m8j54j72M90l34L03o23M91k8k00n6l8N25m14j11k11O05j71j01
5910a34l65O89m11L58k70J05J88l16K90m35Q43m08k45l39M64N69k78o2m39N97
5930D01j48k98j39L29o1J74q1j89O3k48L88J89o38L15R1k41R9R4Q3k42k3M10m97
5953a69J03m9J59L23j73m47L02J5J43O5j46K30m62Q11o93L09r11J150j317M51
5973c06R8K89j97J65n12J98K87j33L16k28J81l57J69m7J75l12J88%R8k03N3J46
5995F8nrK82n38j30M48Q5l52k15M24K52k65k41J43P6j95J49k03K95MN7j13kJ43
6019A58k4j00k55L12J29j43k55j61N91j22l20K1L14k08K94m45M69l39J6J31j54
$$ plain form
5866 417 -46 376 -386 -34 -233 42 499 189 35 127 720 -89 -12 -127 -449 -179 -532 -347 -185 -211 -203 294
5888 294 123 34 113 65 -89 -261 229 -105 198 -425 66 38 -162 -218 -256 269 -145 -256 -467 138 -33 -134
5910 -134 -499 190 -221 137 -133 -28 160 -156 134 -301 542 134 -111 -450 14 583 305 243 -196 401
5930 401 253 -45 -184 145 84 258 177 -12 51 -197 191 380 -258 57 148 -93 6 100 183 -59 -82 328 -169
5953 -169 -66 -115 44 367 194 -253 49 64 207 272 126 356 -106 705 12 321 -590 560 -757 -306
5973 -306 -208 81 -116 49 -463 -265 22 -111 205 -23 158 -199 -30 -77 98 -214 -26 -26 72 -131 -78 68
5995 68 63 54 336 -202 -332 116 201 -151 -366 58 310 45 -196 -53 23 -172 -23 -226 69 73 130 17 15 158
6019 158 134 34 -221 91 220 77 -178 -339 252 130 -190 -169 145 -63 231 -214 255 -84 -68 63 -91
6040i1n0J01J36j76k28K75J68l55N3K76K0l58K18KK96k22k80Q3K00K03l06n6J03
6063A2K44k43K14l59R7J92k3m58O9K99K08l08K64j27Rk64L44J1op9P5k94J3L41
6087B31k96J6jK11ol39j35O24j2l74l8J82K99k31k32rL26j24l41L11p7l1L0K40
6111B24k64k2k7J66l38L23k4j86j28J36K24l24P8j21J18K03k17k0J85P6k02L92
6133B52l14K1K28r2k51O7J74k3j39l75K83M48k03k98J86K76l24J84o9J8j37k6
6155a14nJ33J7K05l84J95j28J87k18K12r0J66J21k40j78N08r2l50J81j43J74o3
6177I4o0K7k7N5l24K66l0l04M08m98L61J07j59r4k9L51J26j85l87L31O8j65q0
6200a48J05o2q7K8J92J05k27j57K51r0j5Q7j75J37r7K08J0k90J97R8J83k36j67
$$ plain form
6040 -91 -141 -40 96 -80 -308 -33 135 -220 -167 109 129 -229 -11 -9 287 65 -215 -132 68 271 -35 -91 12
6063 12 256 13 227 -132 -35 157 134 -324 -255 44 252 -56 208 81 90 -174 170 181 175 96 171 -123 -110 231
6087 231 -65 -49 -50 161 155 -184 -319 305 293 -81 -119 63 362 131 -101 -110 216 92 -249 62 -15 -46 -16 224
6111 224 -40 -62 -89 77 -261 62 38 -148 -276 -140 84 -240 -162 -283 -165 38 -179 -199 -14 62 -140 252
6133 252 -62 -41 187 95 -156 -89 85 62 -77 -452 -169 279 76 -222 -36 240 -84 100 31 49 -88 -114
6155 -114 -119 14 31 236 -148 47 -81 106 -112 100 10 176 297 57 -121 387 295 -55 126 -17 157 94
6177 94 34 61 34 89 -235 31 1 -303 105 -393 -32 75 -84 -178 -207 144 270 85 -302 29 97 -68 -148
6200 -148 -43 -105 -192 -164 28 133 -94 -251 0 -90 -105 -18 -193 -56 -153 55 65 -225 -28 70 253 17 -150
6223a50L79j31N8j21O0m5p6J95l55r4L78J05j03l89M40pr3Jj90M54J8m10M7K5
6247dJ88p3k01K87r5J71m66L15k47L57k02k47R6K10J07l69j8M03om85J34JJ79
6270C5j11lK5o1J97l0k10L48k81Q9l1j00L86mj48l01M53j28m51P0K21K69k84Q
6294d2J25j77Mk9n5K93K14k34j33r6J50L08m47K6r5K40K18k33r9K30k0l2q1J9
6318E4R5j7m3j87l2K55j19j25Q3K76m0j24l65M72q0j81L11k18p5N1m1J10K20l92
6342a12O4m1J4K5o5o0J06P1k7k27M5K12k36L48j2k41L85j63j33k06K37J50l40
6365b06m0K53j9J26q9k74M84k51oj30J85j06K59k10J3J08N4k22J82q1J46k14k
6388d0L95l84L30n85K81J15J39l82L8J06K44o2j31j92J47R4J18j91k63L62l01
$$ plain form
6223 -150 229 98 156 35 95 50 -26 169 -186 -280 98 203 100 -289 151 144 51 52 -138 316 334 -76 -29 -4
6247 -4 184 111 -90 197 102 273 -193 122 -125 232 30 -217 -121 89 196 -173 -191 212 206 -279 -145 -144 35
6270 35 -76 -79 -54 -115 82 52 -158 190 -91 -2 -33 -133 253 249 101 -200 253 125 -326 -256 -35 234 -50 -42
6294 -42 83 -94 -90 -119 -174 119 333 99 -34 -130 20 328 -119 -93 -188 52 270 37 -62 168 148 116 35 54
6318 54 149 132 89 -98 -130 125 6 -119 -36 240 200 76 -289 183 103 -78 233 15 -60 -9 -50 60 280 -112
6342 -112 -48 -89 -75 -50 -115 -175 -69 2 -25 -252 -207 5 -231 117 105 -136 249 86 -47 -253 -16 134 -206
6365 -206 -246 7 -12 114 25 -249 235 -16 -22 -152 33 -73 186 -24 -11 97 151 -71 111 30 176 -38 -40
6388 -40 355 -29 301 -284 -3 112 251 -131 -93 13 257 195 64 -128 19 113 231 40 -223 139 -162
6409a62J18k27Q9L11l02j51M30o4j94p1J41k0n9K38k2j24m2L04k04j26JL86Q6
6432C36l80q1L09o6j17l5N2r8j80K46J5k35K54r9Lj9J11J0m7j42K68K2l71K69
6456B5Q4K0j17j96J10L15j8m23J54J57o6o5K6J75l62N62l91k11L82J91j75j65
6478A2m2M54l89j88J65J95j95PJ99l22J15JQ5K8k51O0k6l7Q3KK27k12J8oJ89l59
6504a87l8K04R4j62k74M26j35J65k84K73L5k6q7J01p2r6L94m76J20Pr8J77j89
6527a28L0K22P1l93J52J54J57l05R7K01p8Q3j81j11O3J0L21m00O9J23j51j66o3
6550b23K94K28k85j09M7K34n9k78R8K16j43J43j24j38nP1j33N9n5N46o37J63O4
6573b6j13L89m27J45J31n7l9l61N48p4k4j32J18j77l7j17k1K61r4R6j2l4k3J73
$$ plain form
6409 -162 -44 -271 -182 129 -173 -324 106 42 -152 -223 -82 -102 -161 77 55 -69 -111 193 -11 -137 -136 250 336
6432 336 -44 -125 184 118 1 -34 18 -80 -260 -14 1 -234 20 -79 -76 -95 16 26 -21 -163 105 127 -244 25
6456 25 109 129 12 -184 -74 241 223 -200 -46 111 45 -20 6 181 -181 381 -10 -221 161 352 177 12
6478 12 -30 424 35 -153 12 207 12 19 218 -104 11 12 97 125 -126 -66 -92 -129 -46 -44 183 -29 -11 -17 172 -187
6504 -187 -225 -21 73 -89 -363 63 -72 93 -191 82 117 91 4 105 33 -63 331 -145 -25 -18 -116 61 -128
6527 -128 -98 124 195 -198 -46 108 265 -40 57 258 180 263 82 -29 34 44 365 -35 34 157 6 -160 -223
6550 -223 71 299 14 -95 -48 186 127 -151 -53 163 20 163 39 -99 -104 -33 -166 -107 -162 384 -253 -90 -26
6573 -26 -139 250 -177 -32 99 42 3 -358 190 116 92 -40 78 -99 -136 -253 -274 -13 -107 -11 -23 -57 -80 93
6597I3l04J00L34j72l65q1M73J41k51j82J17K04n9k69J71J55k09K5P1J2J41K16
6619C61l45j79K28P5J74m77K74k97J92k20M9K46rj43K9N6j38J42j78Q5r9J66J26
6642A18j79j02J63J30k05JJ23o5Np7N6j22n0K93r0j59K31k69K39j76q4L31l7m9
6666B6j38K39P5j87j15M23j02m78J99K10k5l00M4M81m0k32l08J96j48J36L9K08
6688B03k09O7l7p9p4K50j08M7n7l05O76m04P5P0r2k89K45J09J68m10JJ59J67J35
6712C08k34m14O95o83L08N72l53l71N98k72j82K68k10n7J9k06J30K35l61j02K15
6733i7K4k02J65M2J93j66M5j82P4J77J9j50O4J25j41k03J48q1J44R3k59J16M6
6756fj27K12k59N1O1L9R4j70O2J95J76m39P5K01k73J92j08l5Q4j2l2k5j8p4j5
$$ plain form
6597 93 -211 -111 223 51 -314 -395 78 219 -32 -214 -97 107 48 -221 -50 105 -104 -79 -8 4 145 361
6619 361 16 -163 65 140 314 -163 111 -186 6 -214 -165 81 72 -71 -42 14 -124 18 -160 -75 -174 -8 118
6642 118 -61 -163 0 130 -75 -74 49 -16 -11 -88 -32 -154 -204 89 -1 -160 71 -198 41 -135 -219 112 75 26
6666 26 -112 127 202 15 -100 323 221 -257 -58 152 127 -173 -129 352 312 80 -228 -32 -180 -44 -5 203
6688 203 -6 61 24 -55 -129 121 13 60 3 -302 374 -30 45 115 23 -266 -21 88 256 -154 -153 6 173 308
6712 308 74 -340 355 -328 -20 552 199 -172 426 154 -28 240 30 -27 -8 -214 -84 151 -210 -312 -97
6733 -97 -73 -275 -110 -68 125 -41 4 -178 -104 73 92 -58 6 131 -10 -213 -65 -146 -2 91 -168 -52 -6
6756 -6 -133 79 -180 -129 -68 -29 65 -105 -43 152 328 -111 -36 165 -108 84 -24 -59 25 13 -19 -44 -62 -136 -151
6781a51K95p1k9K5j55N7K70l57r8J53j12N19m53J15j2J04j08K20l39P5Q6j43J65
6804E6K1j11K51j56j92J70o7K8n4j32K94o3m06p4R76m0r28M60k7%Q9l82J71M68
6828C52k49l3k43J31r4J15k12N75L43m95m8r9l24N40l49n1K24j37O6J93k16J4
6850CL1P4q5r2P8K1j08L09k44L16l62R2k30J65L31l17l84N51j11m7j3j58J57Q
6874a5Q3k15L11k21K82k95q0K26o8J06l11L02n3O5l82J36M73l66l00M0M58k13
6896c7L40r5K50k13j5l54M42l5m85J96j91K59M8P3l02L37q6k39L10k09L08j77
6918A25L8K15p36J61K58m5n8J79m34O87n95J84m70M5L78m23J74L37N9J97l57k20
6940c01L76L2O3l58J23R8L6P4L6r9K50n50K92L24m79J02O0l0rl00J89k4J41k1
$$ plain form
6781 -151 144 73 44 69 -86 -29 241 -116 -214 -61 -173 346 -107 8 -4 100 -8 212 -127 -52 34 -109 56
6804 56 77 -34 217 61 -131 39 -28 0 -54 -186 108 45 -361 -435 541 501 -427 33 6 6 95 -287 -116 352
6828 352 103 70 -173 -42 -136 -21 -233 342 685 190 142 43 -281 259 -90 -141 83 -54 12 205 -11 3
6850 3 34 108 23 -69 9 30 -78 231 -13 303 -59 33 -197 -32 299 -18 -402 149 38 -9 -22 -180 -23 -15
6874 -15 68 -147 164 -57 225 -70 -150 76 8 114 -197 105 52 117 -265 -129 344 -22 -322 -282 176 -37
6896 -37 303 208 458 245 230 -124 318 283 -202 -6 -197 62 110 183 -119 218 132 -107 203 -6 302 125
6918 125 163 378 -358 -197 61 16 -42 137 -297 390 -205 -21 -491 -446 -68 -491 -317 20 79 276 -81 -301
6940 -301 75 107 170 -188 -65 33 69 143 179 80 330 -220 72 396 -83 19 79 49 40 -260 -71 -95 46 25
6964B5L6J8j88J30J44j23J52j72k72L58p6j50r3n3M12J85j49l77J96L3L65m30
6986b9j18j9K65J43m89K10j7K99l53K10j07%o3L00o46O23P9l58J72j68L79k87
7008B6j62q4K19j16qMrJ82O6l18K31K3J02j15J37k71J66k7o4l65M25r3j15j3J53
7033b6J03J83r6j81J50j72j43J96N6P9p25L98l08L78N24k88l49K38P76n98j26
7054F9m03M23N43o74j13L8K7j62N93o91O21k52j41L10o62P9M31Kp8m46O70n14
7076c30J70K54l2J98m36L2K48L04l91k87n7N18k89J15l77R83J9p51N6L51j46j67
7098a5k0q9M96l05j44j37M73l51P1K00j12K11l19n5R6J79r2j45p3OL13q2j57N33
7122D82k86n22K33J11k3R4J35j22K56q7q2m08K93j19L64m12m2L16J45j24k30O9
$$ plain form
6964 25 61 79 -109 21 165 42 194 22 -250 108 32 -118 -211 -264 148 333 184 -193 3 36 401 -29
6986 -29 -147 -166 99 242 -247 -37 -54 245 -108 102 -5 -5 -68 232 -414 209 288 -70 102 -66 313 26
7008 26 -136 -220 -1 -117 -125 -121 -130 52 118 -200 31 54 156 41 178 -93 73 46 -18 -383 42 -51 -166 -179 -26
7033 -26 77 260 164 -17 133 -39 -182 14 70 149 -576 -178 -486 -108 416 128 -221 17 793 195 69
7054 69 -334 89 632 -42 -155 -117 -90 -252 341 -350 271 19 -122 188 -474 -395 36 38 -40 -486 184 -330
7076 -330 -160 94 62 260 -176 -144 104 408 17 -270 -327 191 -98 17 -360 623 642 -109 -53 298 152 -15
7098 -15 -35 -124 372 67 -77 -214 259 -92 -21 179 67 278 -41 -96 0 179 87 -58 -131 -125 188 106 -51 482
7122 482 196 -326 -93 18 -5 89 224 102 358 271 189 -219 74 -45 319 -93 -135 181 326 202 -28 41
7144D1O3j06j05K0q0N96p11J57L7jK48k13L0J26L7j44L2j16J32J4k09K68j21r1
7168i6K13n0k59J55j01j70K68Q0j50Q6j06J97L3j22k55j3M58j08K2j25NJ50j66
7191e4J34k18R9J28j3n4Klm1J57o58N77L5l03K02m6L64l62R9K2j27rK37k17J05
7216E6k12J88j1k51J50K44r6Q4k47K7K01l41K91J69k9j96j92K93p7m5m9J07p4
7239a0j98L29m95K25J60q8n5K10j81K50l64L6K82j09k5J0n0J61o8k28L62j80J56
7262A30k59J33k0k05M04j4m07J23K64l61p0K0M28k38J2K9M9m5L18m52K67j81k3
7285i8J18j62L22j90J75l8j27J35k77L6q8L13J91m52k23J40n54R97q0n26O82k52
7307D2J14J32m45N49O3o29K31j70L22q46L28N67J57M63m82p02m08R80k44m92K91
$$ plain form
7144 41 104 -2 -107 -87 -167 429 -282 -125 -88 -89 159 -54 -24 102 139 -5 27 -89 43 57 -152 116 -5 -96
7168 -96 117 67 -192 -37 -138 -308 -40 40 -110 -24 -130 67 100 -22 -277 -290 168 60 82 -43 -38 112 -54
7191 -54 80 -138 -39 89 76 22 24 21 -20 137 -521 56 91 -212 -10 -56 308 -54 45 67 -60 -69 168 -49 56
7216 56 -156 32 21 -230 -80 164 68 152 -95 -68 133 -208 83 252 223 27 -165 128 51 6 -43 64 -10
7239 -10 -208 121 -374 -149 11 -77 -132 78 -103 147 -217 -181 101 -8 -33 -23 -73 88 20 -208 154 -26 130
7262 130 -129 4 -16 -221 183 169 -238 -115 149 -212 -282 -262 166 -72 -60 -31 18 -27 291 -161 106 -75 -98
7285 -98 20 -142 180 -10 165 127 0 135 -142 -106 -194 119 310 -142 -365 -225 -779 218 138 -388 294 42
7307 42 156 288 -157 392 455 -174 57 -113 209 -637 -309 258 415 878 396 -306 -714 266 22 -470 -179
7328a79J30K2p7M07m75K74j70rL29m09K87j27n6J98j49j83l1K13j08J50l52J34
7350a81L03J62l39jp8L1K3O9j31K15l5k2R1j62J80j59L6M4N2J0k99M31j6j66P5
7375A33k1k25J16m7M9P0j37J93j52l4L40j44j56p0mJ9J59p5k18R9K7j30J83j29
7399a54M35l19jJ34j7J20k00j44L40k10K3r4m6P4J56o4k3k36mL91j46m3J6j22
7423a34rQ4j14M22m72O18n69J2M81k54j24K35k30K52k17m5K15qj5k61J94n0R0
7446A01j02J68J24k71o8P5J48j08N3q0k8l5m3j2k3J02K60j06m31K17J98p9j26
7469f6K6P9m5p1L6N7q6j32J3J37j16K79k24K46j08k06J27J18j08K45k37j39J81
7492Foj30J33R5j76K67k05R3p2K8N9k10K35p2KJ3n6J19N8k09M8k47J20M03m5j70
$$ plain form
7328 -179 -49 -27 -104 303 -172 102 -68 -77 252 -157 130 3 -53 145 -4 -187 -218 -5 -113 37 -315 -181
7350 -181 122 284 -55 -56 -134 -103 -80 -11 -142 73 38 16 107 -55 125 -34 2 46 98 108 -191 240 224 58 133
7375 133 112 -113 3 -44 5 75 -62 131 -21 -55 285 141 -15 -85 -89 -70 89 14 -204 -105 -78 -208 -25 -154
7399 -154 281 -38 -39 95 78 198 -2 -146 194 -16 7 -87 -133 -59 97 33 10 -226 -230 161 15 -28 -12 -134
7423 -134 -143 -59 -173 249 -223 395 -174 -162 319 65 -59 176 -54 198 -19 -64 151 143 128 -133 61 11 101
7446 101 -1 167 291 20 -48 27 175 67 120 40 12 -23 -66 -78 -101 1 261 155 -276 -59 139 60 -66
7469 -66 -40 39 -6 -77 -41 16 -70 -202 -189 -52 -168 111 -113 133 25 -181 -54 64 -44 201 -36 -175 6
7492 6 0 -130 3 98 -78 189 -16 77 5 33 92 -118 117 45 47 60 4 123 181 -28 20 -227 -107 296 251 81
7518H1m48M03o96L76Q3N74n37p6L06p7m0K49l20J73j69K58J7k30J6p5K72j44j87
7541a91m1M04rj57j67M1P0J44n18L64j22L98j12r9k12M29k22j21K02K61k94k67
7563b19Q5J11M0J5j44K13j12k44J59J87qR8j63n9m5K56k20J30J51R3k56N8k7k7
7587G2l9K4j55J33J64j8l98J23K32n9o8J93k10J49k41q5k0K38n6j73O1j67J48
7610a52K38O6k49L12r7j59j41J58J47j01r3R1l16M35k05J70k28L23l99K40j39
7631i9J74J99l33j30k6K93k02J25j77J80l7k33Q3K39J77k35J8k6J69K8r1o0L7
7654G3J12k20J66k03j10K84k7k45J67J89j80N1J29k57J66k5j85K90k35L94j66
7675A68j53J31K23l84p3J9J64O5k07k3q5K27J65n05J92J91l7M5o6p9KK17k69p0
$$ plain form
7518 81 -367 36 -660 -284 -201 373 -164 -240 66 -11 -51 198 -122 51 -118 140 157 -73 -57 -132 140 -4 -191
7541 -191 -232 172 163 6 -161 -120 -50 94 -424 -60 -182 216 104 5 -207 222 0 -121 81 342 48 -219
7563 -219 -134 -23 17 32 -112 101 -11 -255 -96 91 83 181 18 -41 -86 170 -50 80 231 324 68 126 99 72
7587 72 33 57 -98 35 199 181 -217 -94 138 79 11 204 -6 143 -98 -183 -203 35 -21 -194 -133 -300 -152
7610 -152 86 152 -97 215 118 -41 -182 -24 123 22 -71 20 -296 139 -66 104 -124 199 -200 40 -99
7631 -99 75 274 -59 -189 -215 78 -124 1 -176 4 -33 -266 -183 56 233 -2 16 -10 159 187 96 36 73
7654 73 185 -35 131 -72 -182 102 75 -170 -3 186 6 57 186 -71 95 70 -115 175 -60 334 168
7675 168 15 146 369 -15 -88 -69 95 160 -47 -70 -155 72 237 -268 -76 115 78 123 57 -22 -20 197 -72 -142
7699a42J1n3P6m0K23j63k0K92k67J23k64l9L00j55J74q7J53q3k89Q7K52j65j32
7722b08J53J13j82K55j91K07k44K86O9l64J00j0k10J59j2J49p6J96n43N50j92
7743EJ35k60J30K22j61j80L0R1J70p6J20k43p2J74L9j63j20O2Q9J14k01Q8L6p
7767B2J3r9K1K45k04j83J86N7N5K0k42O0L40j45N5j14o0j17J76j73K4k2m0j09
7791b34J60J94p3J7P0k88J7L39m15J92O8J74p5m02L20k8m3RJ2O4k48J84k5j97
7815b08J57K08j90k80J72M61r7m92J00K29O6l1j56j20J25j2J92p9k8l1P8j14L
7838d7k8P2k1K62m18L59j45P3K5K7l08J23J51j82k8k0J18k09J4j34j29K41L97
7861A93l85N11j99q9J30k02j34J25K77j42k15J32l1k10K19jK07p6k35jL29J57
$$ plain form
7699 -142 -131 -184 -108 -148 75 -88 -108 184 -83 40 -224 -263 37 -118 56 -31 122 39 -250 -163 89 -76 -208
7722 -208 -55 58 -124 131 -60 147 -97 189 258 -106 -6 -16 -226 -67 -79 70 -6 190 -353 197 5
7743 5 140 -120 10 232 71 -109 -79 12 182 106 226 -17 -89 85 124 -39 -159 -97 -8 106 -95 -7 29 22
7767 22 35 -64 -43 202 -2 -185 1 58 113 133 -109 -49 291 146 201 87 27 -90 86 -87 -63 -85 -125 -234
7791 -234 -74 120 47 64 134 -154 -137 202 -213 -21 47 221 146 -256 64 36 -7 2 14 78 -170 14 -11 -208
7815 -208 -51 157 -33 -313 -141 320 223 -269 -169 60 126 95 -61 -181 -56 -68 124 45 17 -14 64 -50 -47
7838 -47 -75 -3 -24 238 -180 179 34 107 132 159 -149 -26 125 -57 -85 -105 13 -196 -182 -316 -445 -204 193
7861 193 -192 319 120 31 161 -41 -175 -50 227 85 -130 2 -29 -239 -20 -21 186 110 -125 -126 203 360
7883C60m13p0L3L04k95R7J58m98K04L05k4j41K88j59j35j76J64K04l91K40j23
7904f8J98J45p9k26P2k65Q5q6M91k60j44K52j12l09J89P1J6k2M8J2k81R4j81M19
7928E9j23j02J51J67Lj18K31j64P8n4l7k81K80k19J35j67P0L10m96J69J52k0m3
7951a9K4K09l3j34k13K83lj65L37j56k22J04M5L8j70J23j4k19K97j62L22k25j59
7974a12J77j9K4ML4Q0j91k80M39j75j09J82j08K18m20K52j5j22j86K88J09q8j01
7997a19J38JoP4j53J01p1j3OJ39k70K64k39N0j79L51l7j29J04J29j46Rj70K36
8021G0lK0l26J07K61j28J17j83Q2J01k69J42j38P6K80q4j80L8j1k3L7K12j85L4
8045D7r2n7L6j25Q9m5P6K74m47M5J85j5J01k50J94j59R3R6J08l20j0N7jK7N3k53
$$ plain form
7883 360 -53 -123 -90 214 -81 16 174 -324 -120 185 161 20 308 149 14 -162 2 206 -185 55 -68
7904 -68 130 275 196 -30 42 -223 -138 -224 267 7 -137 115 3 -306 -117 -46 -30 -52 -4 8 -273 -179 -360 59
7928 59 -64 -166 -15 152 155 37 268 104 182 128 91 -190 90 -129 6 -161 -91 219 -277 -108 44 24 -19
7951 -19 5 214 181 47 -166 117 114 -51 286 130 -92 12 57 95 -75 48 34 -185 112 -50 272 47 -112
7974 -112 65 46 70 74 108 188 -3 -283 156 -19 -128 54 -54 164 -256 -4 -19 -141 -327 -39 70 -18 -119
7997 -119 19 20 14 88 -65 36 -35 -48 -42 97 -173 91 -148 -98 -277 74 37 -92 12 141 -5 4 -166 70
8021 70 67 87 -239 -132 129 1 118 -65 17 118 -151 -9 -147 -71 209 125 -55 -17 -28 -51 -14 198 13 47
8045 47 -45 -102 -66 -191 -102 -147 -71 203 -244 -199 -14 -29 72 -178 16 -143 -50 46 154 -166 -176 -119 -120 -93 -40 -293
8071b93J66K01l29K54k2k58L48L9l49J06J5K02l7J64m1k03j97N12o44J40J37j34
8093b23J3M03l06J57J5j08j15J58KN2K25l13J00j4k38K10o98R42k53L4j99J76
8115B0J98l42L61j13l21J41J35j6K8n4j73K22j58J69l9k79M05k81J22j61J41R7
8137A02j4r4o9J28l7p6k46m3L52k91R5P6l9n9L48j93m3L6K07R4l29ll9K52J33
8162B48l46j6J38L8j03K82k84j16P8j6j9L51j46j02J47k00K33l28M6J56J13l25
8184a71K00j31r0K51j05p1j17
$$ plain form
8071 -293 -127 74 -255 -1 -23 -281 67 106 -243 -137 -122 80 43 207 166 -37 -234 278 -366 -226 -89 -223
8093 -223 -210 193 -113 44 59 -49 -164 -6 -4 48 273 -40 60 46 -192 18 -680 262 9 43 -156 20
8115 20 218 -124 237 124 -197 -56 79 63 91 37 -136 86 -72 97 58 -221 184 -97 25 -136 5 102
8137 102 88 -6 -75 53 16 -60 -306 -349 3 -288 -193 -117 -156 -215 133 -60 -103 -67 140 234 -95 -98 -137 115 248
8162 248 -98 -114 24 62 -41 241 -43 -159 -81 -97 -116 235 89 -13 134 -66 167 -161 -115 41 154 -171
8184 -171 29 -102 -192 59 -46 -117 -234
8191b34
$$ Imaginary data points
##PAGE= N=2
##DATA TABLE= (X++(I..I)), XYDATA
0@%%%%%%%%qJ6j6J6j6K4l5M3n6P2q8J04j20J44j73K02k37K75l18L70m26M88n60
31b99O38p26Q22r26J044j173J316j472J640j825K028k249K489k754L044l358L701
48A940m077M490m947N451o008O626p317Q097q982R997j1176J2559j4210J6226
62H669j8745K1994k6357L2549m2055N8541r4661K99156j22340m25253N61986l47876
74i4392N2379J79456l39417K92495M0395k74520K37706j23470J3627J03336j83216
85i5621J24095K4739j26419J40358p3686m3113J18331o5394m4081N2037k2331
96a1085K1220m738m3510P1994l561r1135P4868r0n0189L5863k4247N9924j6395
109A8919r7632J29309k7099q4738P1910m2416O1662j4606j13042J49975k2963
$$ plain form
0 0 0 0 0 0 0 0 0 0 -8 8 -8 8 -8 16 -19 24 -32 40 -48 56 -64 80 -93 109 -128 147 -171 199 -227 261 -299
31 -299 339 -387 435 -491 553 -620 696 -776 864 -961 1067 -1182 1307 -1447 1597 -1761 1940
48 1940 -2137 2353 -2594 2857 -3151 3475 -3842 4255 -4727 5270 -5906 6653 -7557 8669
62 8669 -10076 11918 -14439 18110 -23945 34596 -60065 239091 116751 -308502 253484 -94392
74 -94392 -42013 137443 -201974 90521 130916 -143604 94102 -29368 -15741 87595 -95621
85 -95621 28474 53213 -73206 67152 -6534 -49647 68684 3290 -40791 11246 -11085
96 -11085 10135 5397 -38113 33881 30320 -60815 14053 13963 -36226 -363 -24610 35314 18919
109 18919 -78713 50596 23497 -61241 10669 -31747 29915 15309 -97733 52242 29279
120B9279q2245P6248n0183N2030j3514p8603J15121o7442q676R4857j15575N0189
132A486K7858o7401P7540q2351K3482J07979j32842L4708M4579n6754O5548q7868
144d4036J2773J24030j31194J8681P9646q5623M8377j5811m1187P9052o8832M541
156a9583Q1449q9819K1588N4759o8391K3107p837j3584P2207p4402j9773J03929
168F3650p5346k3796O3180m9258L8570m544o3831R3262m0215n2241J01782o4441
180a3228j6608N8964o2506M3205j1444m3121J01132o1833m3011P9391m1700N409
192e350l654j9505O8493n3613j8169N7713l7686J4497j831j2650L4580n2186K3120
205f241L6985o3351L3359K0559k0738P168l8146L9714K5021o8863L3714L1770
$$ plain form
120 29279 -52966 23282 -26901 25129 11615 -66988 48133 -19309 -27985 66872 -48703 1486
132 1486 29344 -38057 39483 -42868 -19386 88593 -44249 -9541 35038 -21716 43832 -44036
144 -44036 -31263 92767 -38427 -19746 59900 -25723 22654 6843 -34344 44708 -24124 -19583
156 -19583 61866 -27953 -6365 48394 -19997 3110 -4727 -18311 53896 -20506 -40279 63650
168 63650 -11696 -35492 27688 -21570 17000 12456 -51375 41887 1672 -50569 51213 -13228
180 -13228 -29836 29128 -33378 9827 -1617 -44738 56394 -5439 -48450 30941 -10759 -5350
192 -5350 -9004 -28509 39984 -13629 -31798 25915 -11771 2726 895 -11755 22825 -29361 -6241
205 -6241 30744 -32607 752 21311 573 7741 -30405 9309 34330 -34533 -819 30951
217C0951k7670J231k1493J8084K4365m6170J7721L2197l6335J1945J5595l1058
229a0637J0839K715k191J9453m2683J6698N4315o3036l489L6694j9782J9225l9025
242b0904J363O7484o8827K351M5785n0111L7119j3418k6476N7843n8128J8412
254g507N1792q8203L8350L0025m8936L4541l7536J8055O0043r1762K1512N6516
266C6890n9255K3524n607j8520N1225m6361j604N0531n3657J7898L3301n1114
278b2749J7474R277r522K7471m5982O468O0471n1470j4443L8361q626O313k4346
291a1303l861M3206l3152l751K9945k6680J1113n5j3803K0076k4943J9182K9150
304C5124n0911R179K3743j3152j040k6153L2043K6481n9485J8348K3546k5795
$$ plain form
217 30951 3281 4512 -16981 1103 25468 -20702 -2981 29216 -7119 4826 20421 -10637
229 -10637 202 2917 726 20179 -22504 -5806 48509 -14527 -18016 18678 -1104 18121 -20904
242 -20904 -19541 47943 -20884 -18533 27252 -22859 14260 842 -25634 32209 -25919 -7507
254 -7507 44285 -43918 -5568 24457 -24479 10062 -27474 -9419 50624 -41138 -19626 36890
266 36890 -22365 1159 -4448 -22968 28257 -18104 -19708 30823 -22834 -4936 28365 -22749
278 -22749 -5275 4002 -5520 21951 -24031 -17563 42908 -8562 -23005 15356 6730 13043 -11303
291 -11303 -15164 28042 -5110 -8861 21084 -5596 5517 5462 -8341 11735 -13208 5974 35124
304 35124 -15787 -6608 17135 3983 2943 -23210 8833 35314 -24171 -5823 17723 -8072
316h072J6720j6237M993K4331m0977J8032J6626l9344K7695R523j9291O201j7178
329a6978K7504M871n2263L7491K2343l7742Q205m054J2201J3542m0047K3401J9335
342A7809l6159J8218J387j0849J6098j8765J8586L394m2333M3014P822m4773K9580
355C029L303k371P991l9776L3352K1467n4745K7392J7358k2727J8473k1308Q182
368c80K1483m3383K9402J6793m8314L4154O469k7240K1326j9912J6567K1247n5746
381b7534K7655L0332m2959J0750K339J290J6607l8042J8367K4449m0864J9306
393A696R809k1959J7065q759L162O726k9137K5735J1323l3620J1052J0681N280
406I054r223k5743L5718N967l9773K0258P155o444P445k1000J9065Q273l0671
$$ plain form
316 -8072 8648 -7589 -2596 21735 -19242 -1210 15416 -23928 3767 13290 -6001 200 -16978
329 -16978 10526 15397 -36866 625 22968 -14774 -6569 -10623 1578 15120 -24927 -1526 17809
342 17809 -18350 -132 1255 -9594 6504 -12261 6325 9719 -32614 10400 18222 -26551 3029
355 3029 6332 3961 11952 -27824 5528 26995 -27750 -358 17000 -5727 12746 -8562 -380
368 -380 21103 -22280 7122 23915 -24399 9755 16224 -11016 10310 -9602 6965 28212 -27534
381 -27534 121 30453 -12506 -1756 583 1873 18480 -19562 -1195 23254 -17610 1696
393 1696 11505 -10454 6611 -2148 1014 7740 -21397 4338 15661 -17959 -6907 3774 9054
406 9054 -169 -25912 9806 15773 -24000 -3742 3413 -3031 4414 -16586 2479 10752 -19919
419a9919K7491k980k5473K8281p204m431N398j8574L5956p956m4044M1985N209
432A3739k2732J3190j2562K0963J595m1216L2307O078k5272K5130q338k310R272
445I844k1282K4911o387l1153M3226m408k9005J8735o088J4384k002l4581L8637
458A4831K959l6066K5028p865q3J5947k8531K3139p40l1237M3692j7524k8784
471b5234M0248j2274r79k646k3873M7139j2080m2167L7549N75o582m25k0437L5177
485A3991l971l1355K7904q603r363J8279j5019M428M181n186J6831j9846j0232
498a7961K8129n954j2131P0Q097J8843k4913j4558L4563r720j6604J5869l072
511F58O618m790j2417K4027j5571j2912L1156j5688p016J2232q201J9845j9748
$$ plain form
419 -19919 7572 4592 -20881 7400 196 -4235 1163 -17411 18545 10589 -33455 8530 13739
432 13739 -8993 4197 -8365 12598 14193 -27023 5284 11362 -13910 11220 2882 572 9844
445 9844 -11438 13473 7086 -24067 19159 14751 -14254 4481 -1607 12777 10775 -23806 14831
458 14831 17790 -18276 6752 -1113 -1196 14751 -13780 9359 8619 -22618 21074 3550 -25234
471 -25234 15014 2740 1761 -885 -24758 22381 10301 -31866 5683 6258 -324 -749 -21186 13991
485 13991 10020 -21335 6569 -2034 -11397 6882 -8137 -3709 472 -4714 12117 -7729 -17961
498 -17961 10168 4214 -7917 -7847 250 19093 -5820 -20378 14185 4465 -12139 3730 658
511 658 7276 2486 -9931 14096 -1475 -14387 16769 1081 -5935 6297 -1904 17941 -1807
524a807j6210M2320k2081j6418K4441j3439J2346m122j7516K9279j8190p910K7129
537A7822k5221K674J3843j1448J0221j8836M561L2624l4701r363K7897n747m079
550B47j2675P023K6450k6346j0141K1847p843l1l478l270J7343j2891k855J6159
564I539k0073L339J7049j7428j144N914N010P206k2010N104K6178k2450j1724
577a5490J5893K303K185j0937k15K2311j7012j2689K1157o307o182Q071m83M805
591G410r823k659J8248j5187p962J8382k155l855n148K455J4765j7518m773J7631
605I811q389l183L266Q27K915j0574R498O518j8287M869J0392m342q279n265J9562
620I339J928k4661Q098J5303o512j1788l87J5312j410j3639M171Q310m096m250
$$ plain form
524 -1807 -18017 24303 2222 -14196 10245 -3194 9152 5030 -12486 16793 -1397 -9307 17822
537 17822 -7399 -4725 9118 -2330 7891 -10945 -6384 26240 -8461 -17824 10073 4326 247
550 247 -12428 -5405 21045 -5301 -15442 6405 -1438 -1469 -4947 -8217 9126 -3765 -6620 9539
564 9539 -10534 -7195 9854 -7574 -8718 -2804 2206 9412 -12598 -7494 18684 -3766 -15490
577 -15490 403 2706 4891 -6046 -6261 16050 -962 -13651 7506 1199 -4983 3088 2605 7410
591 7410 -2413 -5072 13176 -2011 -9973 8409 6254 2399 -2749 -294 14471 -3047 -7820 9811
605 9811 1422 -1761 1505 2332 5247 -5327 4171 10689 -7598 -2729 7663 3321 -4958 -10223 9339
620 9339 11267 -13394 -5296 10007 3495 -8293 -8680 6632 5222 -8417 -4246 4064 -32 -4282
634d282L930k048l715P081R07n127l974N466J3236j7844j0376K3792j282j1192
648e428k556O277J6465j8487r972K0494o142l793J481n39J0347j1854K717J1801
662A0811k0891O009J4134r750j029l324J1659O032k5784O415J7915j1237k750
675a790R58N203N586j4470J873J1652j1616J148J1683j1489l617R322M42k032
689B853j0562N005J9262j8462j2920J9970J105n842o382Q07J6966j3086j0331
702a1617J7561o717k496O314o593K462l934L498R234j7959L136J5840q670o655
716f596k802J2282Q783k3140L901J6664j1185k980k02N042P342j2624M979P478
730F942j5810P588O731r841L697P06O456N72j9100J1241J4362j7204k396R052
$$ plain form
634 -4282 -352 -2400 -6115 966 1873 -3254 -7228 -1762 11474 -6370 -16746 7046 5764 -5428
648 -5428 -7984 -1707 14758 -3729 -13701 6793 651 -3142 -1661 -2200 8147 -3707 -990 10811
662 10811 -10080 -4071 10063 313 -716 -4040 7619 13651 -12133 -5718 12197 960 -1790
675 -1790 -832 4371 9957 -4513 -2640 9012 -2604 -1456 10227 -1262 -4879 4443 4885 2853
689 2853 -7709 -2704 16558 -1904 -14824 5146 6251 409 -5973 -5166 11800 -1286 -11617
702 -11617 5944 -773 -3269 3045 -3548 -1086 -5020 -1522 7712 -10247 -7111 8729 59 -6596
716 -6596 -9398 2884 11667 -11473 -7572 9092 -2093 -5073 -5275 -233 7109 -5515 -536 6942
730 6942 -8868 -1280 5451 -4390 -693 13 6469 7041 -12059 -818 13544 -3660 -6056 2996
744B996M103j603j3106P896J0443j4066R87Q373o039J297N27J341P76r522R409
759C812O498j8076L110J2767m462n419m636J0947O317k0574M863J3488j0262L53
773a274r08J376P284j3959N542R659j6866P610P756j1781K136k67O368J974j8413
788a3763J2739J1823j7706L41N760K729O81j2180Q198R664j3612O17P301m106
802a514j256J579M374l069n294R430J526j2636K046J0379k2r107j572J2081Q42
817G787j4502K319J0816k654m628p76O433J00r534P641K815j0481Q391L098q202
832a377L49p95Q769j626j6374J3758Q530j4363j545L853O994j694j4087J0884
846A276N310j2010N488J297l187K702l633M080k976p062J3403Q15j2986L086O947
$$ plain form
744 2996 7099 5496 -7610 286 10729 -3337 -2350 6023 -16 1281 1808 3149 3925 -5597 3812
759 3812 10310 -7766 -4656 8111 3649 -1770 -6406 4541 10858 -9716 -4853 8635 -1627 -1274
773 -1274 -2182 -806 6478 -7481 -1939 7720 -9146 -1536 6220 -5561 -3425 -3692 2676 4650 -13763
788 -13763 -1024 10799 -6907 -6566 -806 1923 2604 -9576 -1378 8286 -5326 -4709 2592 -1514
802 -1514 -2770 -1191 3183 114 -5180 4250 5776 -6860 -4814 5565 5543 -3564 -5136 6945 7787
817 7787 -6715 -4396 6420 3766 -862 -1638 4795 4895 -4639 3002 5817 -4664 3727 6825 -1377
832 -1377 -1028 -1823 6946 5320 -11054 2704 11234 -3129 -4674 -821 6173 4479 -9608 1276
846 1276 6586 -5424 64 1361 -1826 876 -2757 1323 -1653 -8715 4688 5503 -7483 -4397 2550
861B550J928r984n700J7001j52j3932N712M036p36j597n941Q096J025q824J0643
876D125k563j0266J1320P74m240k014k855J5638n435j8451J6797O198j1010K04
890a778j846Q912J434j4299Q991N189q780N136l0m277K391K59M450o046o606J4543
906G643J97j3832L198P727K648r632o160J3783O72j1123L588M328M58m302l298
921d105P416m843l354J0505n176n557N020R99J658q664n00J5181q962q699R481
936D00J749l14o538n44J0500q517l205J0108n680p24M291j632m3o484M773R983
952H123j2436k881J2193p65o194n127O670J0061j2491m360J2925k440n034J039
966g17oM857l295k188O118o300j21R019p409l030N462K092J07j0784L072J4017
$$ plain form
861 2550 4478 -5506 -11206 5795 5643 -8289 -2577 1459 723 -874 -6815 1281 2306 -6518 4125
876 4125 1562 -8704 2616 3390 -850 -2864 -5719 9919 4484 -13967 2830 9028 -1982 -1778
890 -1778 -3624 5288 6722 -7577 1414 6603 -2177 2959 2929 -1348 1043 1302 5752 -294 -6900 7643
906 7643 7840 -5992 -2794 4933 7581 -2051 -8211 5572 6244 -4879 -1291 3037 3495 -807 -4105
921 -4105 3311 -1532 -4886 5619 443 -5114 -94 905 2563 -6101 -6601 8580 -382 -9081 400
936 400 2149 1835 -4703 -5247 5253 -3264 -6469 3639 -2041 -2765 1526 -106 -149 -6633 -1860 8123
952 8123 -4313 -7194 4999 4234 -1960 -7087 -417 9644 -2847 -7207 5718 3278 -1756 -717
966 -717 -723 4134 839 -1349 4769 -1531 -1652 7367 -42 -3072 2390 4482 4589 -6195 -3123 10894
982A0894r743q755J0555L578n251n711L112P684n696n359O512K293n466j030N110
997B727j992m259L539L003m773l014N911L466p648k814Q707j199o898J860M254
1012H70O72m065j015O287k996p322Q122K224q349L756M946q15o755j575J1677
1027E662k620j1495O155P886k764o919k67R810k166r278M963M225k095o85K20
1042F32J69l86J597J638n578J43N643J958q115l446J2059J481j1260j206Q918
1057D247L669j0409m697J2924K86q208J509K235O99k306k418M632k462k488O996
1072D209k847o737N020M059l139n263P18Q894l292r661Q066M302o569M06p82K064
1088e52Q74n635P243O56r752Q672K411q912J057K492O826m034j1038J1879M993
$$ plain form
982 10894 1151 -7604 2951 6529 1278 -4433 -1321 6363 667 -4692 1820 4113 -1353 -2383 2727
997 2727 735 -3524 15 3018 -1755 -4769 1142 4608 -3040 -5854 2853 1654 -5244 -3384 870
1012 870 1542 -2523 -3538 2749 -247 -7569 553 2777 -5572 -1816 3130 2315 -4440 -6015 5662
1027 5662 3042 -8453 -2298 5588 2824 -4095 -4362 5448 3282 -5996 -1033 3192 1097 412 632
1042 632 801 415 2012 3650 -1928 -1785 3858 5816 -2299 -5745 6314 7795 -3465 -4671 4247
1057 4247 7916 -2493 -7190 5734 6020 -2188 -679 1556 2255 -51 -2469 2163 -299 -2787 4209
1072 4209 1362 -5375 -355 3704 565 -4698 -3980 4914 1622 -8039 27 4329 -2240 -1834 -2616 -552
1088 -552 322 -5313 1930 2586 -7166 1506 3917 -4995 -3938 -1446 5380 1346 -9692 2187 7180
1103G180j1308n58M046M838k448p150O372K403n094K557k10j784K139J523m07
1118B099n408J560Q599l633q105L450P869j961j0056K787J0823m335p247L568
1132A0L385k92n056O62N975n059j429N991n313r30M479r12l24n843L331Q426j0446
1149c345k666R944j628k975l244J709P074q503j203Q973n525j142L387k210N23
1164h31l185L054N189r490P29J0090n015m855J280L825L416r379K65J1676n527
1179A242n331M597m9P87k991J30N419m817j0N820n696j922M553J205j491n487
1195d041N673O336r253l281P738J453m443l673N232L804p000LM148j242j001n90
1211a37J719o89l257M640J178p186K321N906k507n281J14P427j415q635L476O390
$$ plain form
1103 7180 -4128 -4686 -640 4198 1750 -5400 972 3375 -1719 838 628 -1156 983 2506 2099
1118 2099 -3309 -1749 6850 3217 -4888 -1438 6431 4470 -5586 -2799 8024 3689 -3558 10
1132 10 3395 3103 -1953 -1291 4684 -375 -1804 4187 -1126 -2056 2423 1511 1187 -4656 -1325 7101 -3345
1149 -3345 -6011 3933 2305 -670 -3914 -2205 4869 -3634 -4837 4136 -1389 -2531 856 -1354 -831
1164 -831 -4016 -962 4227 -5263 -4534 5556 541 -4314 -3034 791 4207 -5172 -4907 6769 1242
1179 1242 -4089 508 459 1246 -1745 -1615 3804 -1013 -1023 4797 -899 -2821 1732 2937 1446 -4041
1195 -4041 1632 7968 -1285 -4566 3172 4625 182 -3491 1741 5545 -1455 -1452 2696 1454 453 -137
1211 -137 1582 893 -2364 2276 3454 -3732 -1411 4495 1988 -3293 -3179 4248 2833 -5802 -2326 4064
1227D064l557l532P16L981l1o040L351K493n471L638K402m122l67Q93L443l245
1243a384n999Q337M178q709j48L948K932l222o270O502M444p218J215L403k665
1258f56J016n13L29n25k680O103O42q062L270O812m190l985l38O553J293r423
1274d354K393P677l726l326J431K317k53l186J973J414l994K593L356n141j618
1289b444L435L743m768n890O631M807o308l752N013M210n312l778M568J229k704
1304a320Q5R39k41q75J380J339m188j093O302q67o077J214O490m9p514m77Q046
1321C094r35o970K642L927m21k113j547L223j135k135M771j789l294M415Q36k187
1337C82l839J825P782n704n775Q117J560m107j894O25N905l707m352O146j313
$$ plain form
1227 4064 507 -3025 -2309 1672 1641 -4399 -1048 1445 -4026 -388 2014 -2108 -2475 -1582 1861 -1384
1243 -1384 -7383 954 5132 -3577 -3725 223 3155 -67 -6337 165 4609 -2609 -1394 2009 -656
1258 -656 360 -153 176 -349 -3029 3074 3716 -4346 -1076 5736 1546 -2439 -2777 3776 5069 -4354
1274 -4354 -1961 5716 1990 -1336 95 2412 2159 -1027 946 2360 -1634 959 4315 -826 -2444
1289 -2444 991 4734 -34 -5924 707 5514 -794 -4546 467 4677 -635 -4413 155 1384 -1320
1304 -1320 -1235 -296 -537 -1412 -32 1307 -2881 -3974 2328 1461 -4616 -3402 3088 3039 -4475 -4952 3094
1321 3094 2159 -4811 -2169 1758 1337 -776 -2323 900 -235 -2370 2401 612 -2682 1733 2569 382
1337 382 -3457 -1632 6150 446 -5329 2788 4348 241 -1653 -1028 4877 1170 -3182 2964 1651
1352A651k692K561j33j034j040J817K924n449j981P718j047o473J358M504M02
1367C086m918j703N903J115o679J109M273k031k021J441J181k188k1K583j412
1382b82l594K801M256l961l827M072L570m332l877M111M588l529n327N487L022
1397C178n753j2K569P6m02j276K816m89l836M153J265n258J719L281L43l629j532
1414b787O514o05o554K562M402j447l469P07L848j656l080K463J365l035L84K823
1430B435m38l952R72N262k983n182M112M135l569m077K856M563l451m211L219
1445c09K483j609k276J299J262k088J491R31l580J021L515j073l605j805P073
1460B730O08q743K000O499j172m461l014O714K208p380J152N605l563O5K39j641
$$ plain form
1352 1651 -1041 1520 1387 353 -687 1130 4054 -1395 -3376 4342 3295 -3178 -1820 2684 3086
1367 3086 -1832 -3535 2368 3483 -3196 -2087 2186 155 -1866 -425 756 -1432 -1453 1130 -282
1382 -282 -3876 -1075 3181 -780 -4607 -535 3035 -1297 -5174 -1063 3525 -4 -5331 156 3178
1397 3178 -2575 -2587 -18 58 -344 -1620 1196 707 -3129 1024 2289 -2969 -1250 2031 2374 -1255 -2787
1414 -2787 3727 3122 -3432 -870 3532 2085 -1384 -677 3171 1515 -1565 898 2263 -772 -388 2435
1430 2435 1997 -1955 -983 4279 1296 -3886 226 4361 792 -3285 -429 4134 683 -3528 -309
1445 -309 2174 565 -1711 -412 850 -1238 253 1184 -2396 -1375 2140 1067 -2538 -4343 2730
1460 2730 3338 -5405 -3405 3094 1922 -2539 -5553 1161 3369 -4011 -2859 2746 -817 -752 -513 -2154
1476b154K653k125J686J260m793M187L535o580O9K354K427o31o200M667N500o916
1492a061j017L919n11j95k282K465R97m254L591K163m897j22K573K712l925m623
1508d467P949R28o571N39L159J849k813m500N414N71l247J386j467L93K227o98
1524F52m46k221o21P012m985n328O910K472l836m046J097Q585m623p419P112K524
1540B839k995j920p31M999j818m329M882j671j307M218k711n65m58Q27M701o199
1556b238j287P672k897l367J739R99L518n436j682P485m021l213M926j092r39
1571A67l43k8M221n172j349P404l377m266L347J710M54m681N16N659k544m001
1587b283L263O90j718n3q63L066l222RL178l525j22K774O1j503l826N115L191
$$ plain form
1476 -2154 499 -1626 60 1320 -3473 714 4249 -2331 -2262 92 2519 1888 -4312 355 5855 -1061
1492 -1061 -2078 1841 1330 1135 -1147 1318 2315 -1939 1652 3815 -1082 -1204 1369 4081 156 -4467
1508 -4467 3482 4410 -2161 -1622 1537 3386 573 -3927 1487 2058 -1189 197 -1270 -877 1350 652
1524 652 206 -2015 -2636 4376 -609 -5937 973 3445 -391 -4437 -3340 5245 622 -6797 315 2839
1540 2839 -156 -2076 -2807 2192 374 -3955 927 -744 -2051 2167 -544 -1109 -1567 -740 3961 -2238
1556 -2238 -3525 4147 1250 -2117 -378 621 4139 -1297 -2979 4506 485 -2728 2198 1106 167
1571 167 -176 -204 4017 -1155 -2504 4900 1523 -2743 604 2314 2768 -1913 -1397 4262 1718 -2283
1587 -2283 980 1670 -48 -101 -964 2102 -1120 -1111 2067 -1458 -1580 1194 1255 -248 -4074 1041 4232
1604D232q501N69N595n85k261l331M911L543q189J426M296k852O46j172P47K448
1620A522l618K473J072n153L450K823l482j145J054L666j107o135M052M667m598
1635d59k037K671J832p35l425K518K308m021J631K024k619L56Q53J344j236l872
1651b867M568L124o739M6M592k85k242l226M440K342n286Q38K574j844L11p5K4
1668B95j63j121K851n43m385K244M095k701m209J685N207k244n172K489L946j546
1684G28l914J079L801j813j873K192p40r88J358J5r29j386K518L010n056j662
1700c660N458M22m229p81K982L367m122l177M897J090l778Q67J450m45L16J14
1716G71K80j656n06M066r00m926K649L988k008l694P95M798n03n913J762M177
$$ plain form
1604 4232 -4269 -3700 1895 1310 -951 -4282 629 4172 -4017 -2591 1705 -1147 -501 -1673 -926 1522
1620 1522 -2096 377 1449 -3704 -254 2569 -913 -2058 -1004 2662 1555 -4580 -528 4139 -459
1635 -459 -2496 175 2007 1272 -2153 365 2673 -1348 283 2307 -312 44 897 2241 1005 -2867
1651 -2867 1701 4825 -1914 -1868 2724 2439 197 -3029 1411 3753 -1533 -695 1879 35 346 271 295
1668 295 132 -989 1862 1319 -3066 -822 3273 572 -3637 -1952 3255 1011 -4161 -1672 2274 728
1684 728 -3186 -2107 1694 -119 -1992 200 -540 -1528 -170 -155 -1084 -2470 48 3058 -1998 -3660
1700 -3660 1798 2220 -2009 -2790 192 3559 -563 -3740 1157 2247 -1531 -664 786 341 657 771
1716 771 1051 -605 -1111 2955 2055 -2871 -222 3766 1758 -1936 -1141 3657 3154 -2759 -997 3180
1732C180k482j488N40J527j40j798K000n67k495K737P99k708j478K747K859l983
1748g50l153M929J860l942k167L192K483l620j319K975K04j992J02J161q25p54
1764a616J831J12k290K39K909l0m167L41N058j522l855J555L222m00l723N64L739
1781A967j421j910J610R74j403l01J908j073j531J626J935j938k616K956K906
1796C689m366j895M189Q88j983k508K870K680l937j451L918n73j726N89L69m11
1812C42r52J094J489l096j68L911j444l457J375L506j569l613R80L761p45m287
1828b873J725K918k207j426J324K68m00j66Q16L25k779J485K772l040j338L002
1844D06J723k852l137L917K671m097j621L814P15k097r86J581J173j754J32J628
$$ plain form
1732 3180 698 -790 -250 1277 1137 -661 1339 772 -1723 1014 1813 -895 -2373 374 3233 -750
1748 -750 -3903 1026 2886 -1056 -3223 -31 2452 -1168 -2487 488 692 -1300 -1198 -37 -862 -1616
1764 -1616 215 327 -1963 -1724 1185 1155 -3012 -2671 2387 865 -2990 -1435 1787 1387 -2336 -1772 1967
1781 1967 546 -1364 246 1220 -183 -484 1424 351 -1180 446 2381 443 -2173 783 3689
1796 3689 -677 -2572 1617 2505 522 -1986 884 3564 -373 -1824 2094 1521 -205 384 753 342
1812 342 -610 484 1973 -1123 -1291 2620 1176 -2281 -906 2600 1031 -2582 -1602 2159 1414 -2873
1828 -2873 -1148 1770 -437 -1863 -539 -271 -671 -837 -21 304 -2475 -990 1782 -1258 -2596 406
1844 406 2129 -723 -3860 57 2728 -1369 -2990 824 1539 -558 -1544 37 1210 -544 -412 1216
1860A216j959L15J920n93k150k66M345l83n349J890M507j654l828M24L894L58
1876B687m258L21L829j327j086P6k68Q29n51J054p57k296K750J970m262j234L456
1893I33J642k713k923L626K688m409j649L006R48j441j726K548M57k943K027J96
1909B67k395J116J289P02k530k030N743m37n312K002K264P89k359k316M678J84
1925A655m114K394O3p51J404q83J86p61j13L708k764l683N156J821l546k240K224
1942b44M220l069m508M454K749l158j579R55K485q68k542K127k65j032K151j497
1958C79q57Q46M72J333l818n60N983k864l046J872J255J111l609r11N416k914
1974H8k199K925j131j24l77NK563l572l95M666k806k258K551L50M43l514P72M939
$$ plain form
1860 1216 -743 -428 1492 899 -1251 -1517 2828 2445 -2904 -1014 3493 1839 -1989 -1565 2329 2687
1876 2687 -1571 -1250 2579 1252 166 242 -26 803 252 1306 549 -1747 1003 2973 -1289 -2523 933
1893 933 2575 -138 -3061 565 3253 -1156 -2805 201 1149 -292 -2018 530 987 -1956 71 267
1909 267 -2128 -1012 277 979 -1551 -3581 2162 1725 -3587 -1585 679 1468 -891 -3207 1471 1655
1925 1655 -2459 -65 -2 -753 651 -232 -46 -807 -920 2788 24 -3659 1497 3318 -228 -2468 -244
1942 -244 3976 907 -3601 853 3602 444 -1135 -180 2305 1437 -1105 1022 757 -275 1876 379
1958 379 -478 368 840 2173 -1645 -2205 3778 914 -2132 -260 995 2106 -1503 -2414 3002 88
1974 88 -2111 814 -317 -441 -818 -813 1750 -1822 -2217 2449 -357 -2615 -64 286 729 -2785 -2013 2926
1992B926l444j927K725j07j66j178J48K189k239O29K117l408M45K751o11j362
2008e12j497L447J787n985J053M715j489k269j293L451K361n817N82L979j948
2023E65j37l63K79J796k396N94Q39k632K591J112l088J27J375J727j726l871M129
2040I21K685m913n73K659J049j663k580K767J868m090J282J392j757N82l32J188
2056D85n74l023M201P51m573J569K012l53j553j857L688J004m587J761J781j376
2072f44O09n72N85n11o70K675j490k841L144J901k265k026J754L884k837m116
2088c420L657K689k217k691J334L183j491k222J678K01j13O55j211lM3R39J412
$$ plain form
1992 2926 -518 -2445 280 173 7 -1171 -1023 1166 -1073 -444 1673 -1735 -1290 1461 850 -512
2008 -512 -2009 1438 3225 -2760 -1707 3008 1519 -750 -2043 1408 3769 -2048 -1466 2513 565
2023 565 428 65 344 2140 -256 338 1177 -1455 1136 2248 -840 -713 662 2389 663 -3208 921
2040 921 3606 -1307 -1880 779 1828 165 -2415 352 2220 -1870 -588 804 -953 -371 -703 485
2056 485 -89 -3112 1089 1840 -2733 -1164 848 495 -1058 -2915 773 1777 -2810 -1049 732 -644
2072 -644 -35 -607 -22 -533 -1203 1472 -18 -2859 285 2186 -79 -2105 -351 3533 696 -3420
2088 -3420 237 2926 709 -1982 -648 2535 1044 -1178 500 701 588 1243 32 29 72 1011 2423
$$ [...]
8191A29
##END NTUPLES=NMR FID
##END=
