##TITLE=1H_SAV-32-singlet-baf20(7H)
 CDCl3, 8 sc, 
 16.11.2020
##JCAMPDX= 6.0         $$ Bruker NMR JCAMP-DX V2.0
##DATA TYPE= NMR FID
##DATA CLASS= NTUPLES
##ORIGIN= UXNMR, Bruker Analytische Messtechnik GmbH
##OWNER= root
$$ XWIN-NMR		Version 3.5
$$ Mon Nov 16 10:27:01 2020 Russian Standard Time (UT+4h)  she@DPX200
##.OBSERVE FREQUENCY= 200.1315066352
##.OBSERVE NUCLEUS= ^1H
##.DELAY= (6, 6)
##.ACQUISITION MODE= SIMULTANEOUS
##.ACQUISITION SCHEME= undefined
##.AVERAGES= 8
##.DIGITISER RES= 18
##SPECTROMETER/DATA SYSTEM= spect
##.PULSE SEQUENCE= zg30
##.SOLVENT NAME= CDCl3
##.SHIFT REFERENCE= (INTERNAL, CDCl3, 0, 15.7039)
##AUDIT TRAIL= $$ (NUMBER, WHEN, WHO, WHERE, WHAT)
$$ ##TITLE= Audit trail, XWIN-NMR		Version 3.5
$$ ##JCAMPDX= 5.01
$$ ##ORIGIN= Bruker BioSpin GmbH
$$ ##OWNER= she
$$ F:/spectra/data/she/nmr/H-F/1/audita.txt
$$ ##AUDIT TRAIL=  $$ (NUMBER, WHEN, WHO, WHERE, WHAT)
(   1,<2020-11-16 10:25:05.62 +0400>,<she>,<DPX200>,
      <created by zg, POWCHK disabled, PULCHK disabled
       configuration hash MD5:
       00 E9 B6 7A A2 85 ED C7 34 08 36 98 17 FE 4E 26
       data hash MD5: 16K
       4F 90 7D E5 C1 9A A9 C6 A5 4E 9E 9E 67 FE 0B 4E>)
$$ ##END=
$$ 
$$ hash MD5
$$ 57 DC 8A 70 EF B4 14 A9 DE 74 6A 16 FB 87 A7 36
##$RELAX= 
##$RELAX= 
##$RELAX= 
##$RELAX= 
##$RELAX= 
##$RELAX= 
$$ Bruker specific parameters
$$ --------------------------
##$DU= <F:/spectra>
##$EXPNO= 1
##$NAME= <H-F>
##$PROCNO= 1
##$TYPE= <nmr>
##$USER= <she>
##$AMP= (0..31)
100 100 100 100 100 100 100 100 100 100 100 100 100 100 100 100 100 100 
100 100 100 100 100 100 100 100 100 100 100 100 100 100 
##$AQSEQ= 0
##$AQ_mod= 1
##$AUNM= <au_zg>
##$AUTOPOS= <>
##$BF1= 200.13
##$BF2= 200.13
##$BF3= 200.13
##$BF4= 200.13
##$BF5= 200.13
##$BF6= 200.13
##$BF7= 200.13
##$BF8= 200.13
##$BYTORDA= 1
##$CFDGTYP= 0
##$CFRGTYP= 5
##$CHEMSTR= <none>
##$CNST= (0..31)
1 1 145 1 1 1 1 1 1 1 1 1 1 1 1 1 1 1 1 1 1 1 1 1 1 1 1 1 1 1 1 1 
##$CPDPRG= <>
##$CPDPRG1= <>
##$CPDPRG2= <>
##$CPDPRG3= <>
##$CPDPRG4= <mlev>
##$CPDPRG5= <mlev>
##$CPDPRG6= <mlev>
##$CPDPRG7= <mlev>
##$CPDPRG8= <mlev>
##$CPDPRGB= <>
##$CPDPRGT= <>
##$D= (0..31)
0 1.2 0 0 0 0 0 0 0 0.06 0 0.03 0 0 0 0 0.0002 0 0 0 0 0 0 0 0 0 0 0 0 
0 0 0 
##$DATE= 1605507905
##$DBL= (0..7)
120 120 120 120 120 120 120 120 
##$DBP= (0..7)
150 150 150 150 150 150 150 150 
##$DBP07= 0
##$DBPNAM0= <>
##$DBPNAM1= <>
##$DBPNAM2= <>
##$DBPNAM3= <>
##$DBPNAM4= <>
##$DBPNAM5= <>
##$DBPNAM6= <>
##$DBPNAM7= <>
##$DBPOAL= (0..7)
0.5 0.5 0.5 0.5 0.5 0.5 0.5 0.5 
##$DBPOFFS= (0..7)
0 0 0 0 0 0 0 0 
##$DE= 6
##$DECBNUC= <off>
##$DECIM= 32
##$DECNUC= <off>
##$DECSTAT= 4
##$DIGMOD= 1
##$DIGTYP= 9
##$DL= (0..7)
0 120 120 120 120 120 120 120 
##$DP= (0..7)
150 150 150 150 150 150 150 150 
##$DP07= 0
##$DPNAME0= <>
##$DPNAME1= <>
##$DPNAME2= <>
##$DPNAME3= <>
##$DPNAME4= <>
##$DPNAME5= <>
##$DPNAME6= <>
##$DPNAME7= <>
##$DPOAL= (0..7)
0.5 0.5 0.5 0.5 0.5 0.5 0.5 0.5 
##$DPOFFS= (0..7)
0 0 0 0 0 0 0 0 
##$DQDMODE= 0
##$DR= 18
##$DS= 0
$$ [...]
##$SUBNAM2= <"">
##$SUBNAM3= <"">
##$SUBNAM4= <"">
##$SUBNAM5= <"">
##$SUBNAM6= <"">
##$SUBNAM7= <"">
##$SUBNAM8= <"">
##$SUBNAM9= <"">
##$SW= 16.9725356469052
##$SWIBOX= (0..15)
0 0 2 0 0 0 0 0 0 0 0 0 0 0 0 0 
##$SW_h= 3396.73913043478
##$TD= 16384
##$TD0= 1
##$TE= 0
##$TE2= 300
##$TE3= 300
##$TEG= 300
##$TL= (0..7)
0 120 120 120 120 120 120 120 
##$TP= (0..7)
150 150 150 150 150 150 150 150 
##$TP07= 0
##$TPNAME0= <>
##$TPNAME1= <>
##$TPNAME2= <>
##$TPNAME3= <>
##$TPNAME4= <>
##$TPNAME5= <>
##$TPNAME6= <>
##$TPNAME7= <>
##$TPOAL= (0..7)
0.5 0.5 0.5 0.5 0.5 0.5 0.5 0.5 
##$TPOFFS= (0..7)
0 0 0 0 0 0 0 0 
##$TUNHIN= 0
##$TUNHOUT= 0
##$TUNXOUT= 0
##$USERA1= <user>
##$USERA2= <user>
##$USERA3= <user>
##$USERA4= <user>
##$USERA5= <user>
##$V9= 5
##$VALIST= <valist>
##$VCLIST= <CCCCCCCCCCCCCCC>
##$VD= 0
##$VDLIST= <DDDDDDDDDDDDDDD>
##$VPLIST= <PPPPPPPPPPPPPPP>
##$VTLIST= <TTTTTTTTTTTTTTT>
##$WBST= 1024
##$WBSW= 4
##$XGAIN= (0..3)
0 0 0 0 
##$XL= 0
##$YL= 0
##$YMAX_a= 262857
##$YMIN_a= -225198
##$ZGOPTNS= <>
##$ZL1= 120
##$ZL2= 120
##$ZL3= 120
##$ZL4= 120
##$ABSF1= 10
##$ABSF2= 0
##$ABSG= 5
##$ABSL= 3
##$ALPHA= 0
##$AQORDER= 0
##$ASSFAC= 0
##$ASSFACI= 0
##$ASSFACX= 0
##$ASSWID= 0
##$AUNMP= <proc_1d>
##$AZFE= 0.1
##$AZFW= 0.1
##$BCFW= 1
##$BC_mod= 2
##$BYTORDP= 1
##$COROFFS= 0
##$CY= 11.3945322036743
##$DATMOD= 1
##$DC= 2
##$DFILT= <>
##$DTYPP= 0
##$F1P= 15.9154993809931
##$F2P= -4.1035820241983
##$FCOR= 0.5
##$FTSIZE= 0
##$FT_mod= 4
##$GAMMA= 1
##$GB= 0.15
##$INTBC= 1
##$INTSCL= 1
##$ISEN= 128
##$LB= 0.24
##$LEV0= 0
##$LPBIN= 0
##$MAXI= 10000
##$MC2= 0
##$MEAN= 0
##$ME_mod= 0
##$MI= 1.114404
##$NCOEF= 0
##$NC_proc= 0
##$NLEV= 6
##$NOISF1= 3.799351
##$NOISF2= 2.8
##$NSP= 1
##$NTH_PI= 0
##$NZP= 0
##$OFFSET= 15.70392
##$PC= 1
##$PHC0= -11044.69
##$PHC1= 9.400887
##$PH_mod= 1
##$PKNL= yes
##$PPARMOD= 0
##$PSCAL= 0
##$PSIGN= 0
##$REVERSE= no
##$SF= 200.130013532006
##$SI= 16384
##$SIGF1= 3
##$SIGF2= 2
##$SINO= 400
##$SIOLD= 16384
##$SREGLST= <1H.CDCl3>
##$SSB= 0
##$STSI= 0
##$STSR= 0
##$SW_p= 3612.71676300578
##$SYMM= 0
##$S_DEV= 0
##$TDeff= 0
##$TDoff= 0
##$TI= <>
##$TILT= no
##$TM1= 0
##$TM2= 0
##$TOPLEV= 0
##$USERP1= <user>
##$USERP2= <user>
##$USERP3= <user>
##$USERP4= <user>
##$USERP5= <user>
##$WDW= 1
##$XDIM= 8192
##$YMAX_p= 0
##$YMIN_p= 0
$$ End of Bruker specific parameters
$$ ---------------------------------
##NTUPLES= NMR FID
##VAR_NAME=  TIME,          FID/REAL,        FID/IMAG
##SYMBOL=    X,             R,               I
##VAR_TYPE=  INDEPENDENT,   DEPENDENT,       DEPENDENT
##VAR_FORM=  AFFN,          ASDF,            ASDF
##VAR_DIM=   8192,          8192,            8192
##UNITS=     SECONDS,       ARBITRARY UNITS, ARBITRARY UNITS
##FACTOR=    0.0002944,     1,               1
##FIRST=     0,             0,               0
##LAST=      2.4114304,     0,               0
##MIN=       0,             -225198,         0
##MAX=       2.4114304,     262857,          0
$$ Real data points
##PAGE= N=1
##DATA TABLE= (X++(R..R)), XYDATA
$$ [...]
$$ plain form
1993 569 500 1023 -30 659 1189 -721 346 590 10 535 389 -628 985 400 -377 8 -663 36 442
2012 442 -692 -953 463 -316 -344 -465 -982 345 -402 -1347 -611 -816 140 -282 -1883 -484 215 -782 -577
2031 -577 -963 -933 588 -627 -1600 -244 773 -64 -349 -913 104 641 -250 -533 -390 435 1043 102 -850
2050 -850 892 916 680 -168 -498 866 1543 50 -93 550 1016 1118 -311 -151 1625 1389 57 -448
2068 -448 414 1352 1007 -340 35 552 1126 457 -1027 -441 1438 769 -672 -372 196 539 260 -1285
2086 -1285 -818 603 397 -666 -1439 -175 982 -485 -1482 -864 -44 405 -913 -1916 -410 683 -353
2103 -353 -1280 -1432 143 480 -941 -1380 -248 565 254 -1253 -1004 402 1013 -270 -1087 -311 1012 542
2121 542 -816 -738 750 1015 352 -635 -171 1372 1103 -573 -337 978 1324 1113 -420 -211 1254 1405
$$ packed form
1993E69o9N23j053O89N30j910J067K44n80N25j46j017J613n85p77L85o71O99M06
2012D42j134k61J416p79k8j21n17J327p47r45P36k05R56m22j601J399O99r97K05
2031e77l86L0J521j215r73J356J017q37k85n64J017N37q91k83J43Q25O08r41r52
2050h50J742K4k36q48l30J364O77j493j43O43M66J02j429J60J776k36j332n05
2068d48Q62R38l45j347L75N17N74o69j484N86J879o69j441L00N68L43k79j545
2086a285M67J421k06j063p73J264J157j467r97O18Q20M49j318j003J506J093j036
2103c53r27j52J575L37j421m39J132Q13l11j507K49J406O11j283q17P76J323m70
2121E42j358P8J488K65o63r87M64J543k69j676K36J315L46k11j533K09J465J51
$$ plain form
2139 1405 355 -424 404 1802 832 -533 -125 872 1109 62 -505 234 1258 467 -721 -489 694
2156 694 929 -14 -1295 -135 823 62 -893 -878 62 592 -319 -1372 -718 540 -60 -1356 -1215 -301 153
2175 153 -236 -1310 -952 385 264 -1084 -1125 -230 474 -466 -990 -536 -163 389 -549 -1228 -102 793 -72
2194 -72 -552 -458 480 683 11 -476 364 1143 120 -67 -203 648 1295 386 -314 412 960 1084 257 105
2214 105 954 750 531 481 165 957 971 -243 74 625 669 607 -254 135 543 448 -113 -522 -170 479 155
2235 155 -689 -357 -146 35 -128 -819 -722 471 -555 -1024 -271 -371 221 -90 -1318 -253 -199 -586 -191
2254 -191 -1069 -632 242 -675 -591 -474 -462 -9 -493 -558 -71 -10 -165 47 -592 -311 345 -235 -440 179 229 491
2276 491 350 -99 180 776 341 268 143 252 981 317 215 721 129 875 525 -56 716 734 282 856 1
$$ packed form
2139A405j050p79Q28J398r70j365M08R97K37j047n67P39J024p91j188K32J183
2156F94K35r43j281J160R58p61r55J5R40N30r11j053O54J258o00j296J41R14M54
2175A53l89j074L58J337j21j348m1Q95P04r40n24M54L73N52r38o79J126Q95q65
2194g2m80R4R38K03o72m87Q40P79j023j87j36Q51O47r09p00P26N48J24q27j52
2214A05Q49k04k19n0l16P92J4j214L17N51M4o2q61L89M08r5n61m09L52O49l24
2235A55q44L32K11J81j63o91R7J193j026m69P53j00N92l11j228J065N4l87L95
2254a91q78M37Q74r17Q4J17J2M53m84o5M87O1j55K12o39K81O56n80k05O19N0K62
2276D91j41m49K79N96m35p3j25J09P29o64j02N06n92P46l50n81P72J8m52N74q55
$$ plain form
2297 1 407 1387 196 283 543 -70 694 187 -360 330 61 77 -102 -315 -153 176 -409 -338 -366 -467 -20 -29
2319 -29 -1218 -77 61 -838 -57 -762 -604 319 -560 -638 -545 -639 83 -379 -814 127 13 -749 -109 -889 -149
2340 -149 242 -414 -372 -26 -125 175 -69 -418 216 484 93 245 160 244 733 50 -241 978 531 414 379
2361 379 98 954 444 57 504 93 871 970 -126 258 1058 337 342 -63 -238 724 689 23 41 199 605
2382 605 150 -441 -338 410 -45 -434 -563 -590 495 -67 -964 -236 -168 -59 -173 -1070 -554 441 -657 -592
2402 -592 -727 -646 430 -453 -909 -153 -216 188 -752 -1189 309 423 -454 -640 -505 157 338 -507 -741 470
2422 470 682 -120 -68 -386 425 1085 -22 -377 283 795 615 -24 -340 1028 1060 192 227 -217 1196 1206
2442 1206 -83 125 675 583 606 -388 58 963 668 -111 -56 425 718 226 -908 -577 752 408 -548 -936
$$ packed form
2297AM06R80j191Q7K60o13P64n07n47O90k69J6j79k13J62L29n85P1k8j01M47r
2319b9j189J141J38q99P81p05J58R23q79p8R3r4P22m62m35R41j14p62O40p80P40
2340a49L91o56M2L46r9L00k44l49O34K68l91J52q5Q4M89o83k91J219m47j17l5
2361C79k81Q56n10l87M47m11P78R9j096L84Q00p21Nm05j75R62l5o66J8J58M06
2382F05m55n91J03P48m55l89j29k7J085n62q97P28O8J09j14q97N16R95j098O5
2402e92j35Q1J076q83m56P56o3M04r40m37J498J14q77j86J35O62J81q45k34J211
2422D70K12q02N2l18Q11O60j107l55O60N12j80o39l16J368L2q68L5m44J413J0
2442A206j289K08N50r2K3r94M46R05k95p79N5M81K93m92j134L31J329l44r56l88
$$ plain form
2462 -936 -238 574 -16 -759 -342 -102 290 -483 -1301 -357 503 -255 -1187 -1211 -248 299 -1272 -818 -337 362
2482 362 109 -1139 -1130 297 211 -599 -679 -299 293 231 -687 -863 237 270 -117 -494 -557 644 701 -571 -304
2503 -304 364 436 663 -338 -334 806 753 334 -517 217 1087 353 -606 244 730 804 554 -543 286 1022 611
2524 611 -126 -175 691 1017 296 -352 -73 503 480 -394 -845 440 696 -270 -650 -351 313 99 -531 -933
2544 -933 71 446 -320 -860 -693 21 220 -1024 -903 -244 59 -171 -1141 -918 -266 323 -402 -637 -169
2563 -169 39 104 -709 -544 144 551 -238 -602 -434 453 205 -502 -148 273 488 101 -338 -127 733 539
2583 539 231 -238 448 791 298 158 144 648 678 60 -49 443 866 555 -133 97 663 630 133 181 199 473
2605 473 390 -239 -59 467 293 151 -315 -268 51 29 -387 -387 44 -58 -347 -533 -380 -407 -97 -356 -488 -213
$$ packed form
2462i36O98Q12n90p43M17K40L92p73q18R44Q60p58r32k4R63N47j571M54M81O99
2482C62k53j248RJ427q6q10q0L80N92o2r18j76J100L3l87l77o3J201N7j272K67
2503c04O68P2K27j001MJ140n3m19q51P34Q70p34r59Q50M86P4k50j097Q29P36m11
2524F11p37m9Q66L26p21o48K79N76k3q74m51J285K56r66l80K99O64k14o30m02
2544i33J004L75p66n40J67P14J99j244J21O59L03k30r70K23O52N89p25k35M68
2563a69K08O5q13J65O88M07p89l64J68Q87k48p07L54M21K15l87m39K11Q60j94
2583E39l08m69O86L43m93j40j4N04L0o18j09M92M23l11o88K30N66l3m97M8J8K74
2605D73q3o29J80N26j74j42m66M7L19k2m16%M31j02k89j86J53k7L10k59j32K75
$$ plain form
2627 -213 -235 -374 -363 -424 -240 -99 -244 -490 -435 74 -259 -107 -153 -405 -32 -3 -387 -258 135 114 42 37 -158
2650 -158 -55 163 315 87 249 235 139 511 356 77 191 370 264 319 7 265 449 117 341 587 467
2671 467 457 147 242 489 609 111 -102 122 -22 197 114 135 320 315 -91 -66 -180 89 -51 -419 -266 -75
2693 -75 -311 50 -397 -471 62 -461 -377 -667 -161 27 -366 -727 -409 -72 -420 -553 -794 -448 218 -175 -681
2714 -681 -562 -298 -264 -265 -504 -119 353 162 -376 -41 164 642 -334 -111 332 581 345 -219 -136 466 760
2735 760 -60 33 152 804 693 88 89 564 611 485 -73 218 636 616 -162 -40 138 650 355 -492 -35 818
2757 818 333 -81 -342 141 769 294 -693 -448 214 205 -59 -627 -178 261 133 -729 -625 7 179 -548 -866
2778 -866 -315 56 -89 -446 -893 -120 546 -534 -571 -564 -138 129 -487 -679 -58 231 -268 -401 -436 172 452
$$ packed form
2627b13k2j39J1o1J84J41j45k46N5N09l33J52m6k52L73K9l84J29L93k1p2nj95
2650a58J03K18J52k28J62j4r6L72j55k79J14J79j06N5l12K58J84l32K24K46j20
2671D67j0l10R5K47J20m98k13K24j44K19q3K1J85nm06K5j14K69j40l68J53J91
2693g5k36L61m47p4N33n23Q4k90N06J88l93l61L18L37l48j33k41L46O66l93n06
2714f81J19K64L4jk39L85M72j91n38L35K05M78r76K23M43K49k36n64Q3O02K94
2735G60q20R3J19O52j11o05JM75M7j26n58K91M18k0p78J22J78N12k95q47M57Q53
2757H18m85m14k61M83O28m75r87K45O62rk64n68M49M39j28q62J04O32J72p27l18
2778h66N51L71j45l57m47P73O66j080l7PM26K67o16j92O21K89m99j33l5O08K80
$$ plain form
2799 452 -444 -219 185 540 712 -431 -521 456 495 154 -14 203 559 563 -85 -226 824 821 264 -219 181
2820 181 719 517 265 182 304 967 478 -188 97 642 440 141 9 24 470 172 -199 -317 199 242 -246
2841 -246 -621 -67 432 -278 -533 -416 -125 214 -192 -715 -336 41 101 -582 -761 -161 200 -550 -533 -247 -187
2862 -187 34 -487 -711 129 -86 -91 -655 -447 318 151 46 -424 -91 179 265 -443 -177 294 315 -214 41
2883 41 57 485 228 -5 29 254 528 243 -292 -218 585 414 222 -237 375 830 198 -4 122 569 438
2904 438 257 -306 148 729 107 -327 75 -258 383 104 -609 -142 332 284 -223 -311 -4 332 -581 -259 -416
2925 -416 -42 10 -485 -699 -29 16 -316 -476 -523 -8 190 -498 -512 -38 -115 -84 -236 -474 38 88 -336 -412 -191
2948 -191 -129 233 -125 25 -8 176 -237 -35 -187 407 255 -261 4 319 562 143 271 -18 669 383 277
$$ packed form
2799D52q96K25M04L55J72j143r0R77L9l41j68K17L56Mo48j41J050ln57m83M00
2820A81N38k02k52q3J22O63m89o66K85N45k02k99j32J5M46k98l71j18N16M3m88
2841b46l75N54M99p10k55J17K91L39m06n23L79L77O0o83j79O00L61p50J7K86O0
2862a87K21n21k24Q40k15nn64K08P65j67j05m70L33K70Q6p08K66M71K1n29K55
2883D1J6M28k57k33L4K25K74k85n35P4Q03j71j92m59O12M55o32k02J26M47j31
2904D38j81n63M54N81o22m34M02l33O41k79p13M67M74m8n07q8L07L36r13L22j57
2925d16L74N2m95k14O70M5l32j60m7N15J98o88j4M74p7L1j52k38N12N0m24p6K21
2948a91O2L62l58J50l3J84m13K02j52N94j52n16K65L15K43m19J28k89O87k86j06
$$ plain form
2969 277 186 275 552 213 99 362 48 755 512 47 123 560 375 -260 90 232 295 -251 -82 78 -120
2990 -120 118 -126 -170 -208 105 -311 -367 -399 -176 -166 -65 -358 -218 -258 -39 -162 -266 -350 -238 -310 -181 -262 -411
3013 -411 -301 -288 -85 -184 -99 51 -11 -312 -242 96 205 -170 -29 35 -83 88 -68 -139 301 233 34 38 104 384
3037 384 292 93 224 195 434 324 132 284 398 629 426 322 608 303 514 112 161 268 476 272 52
3058 52 162 149 314 -40 -248 151 484 44 -743 -267 340 70 -338 -232 -95 168 33 -487 -452 47 -111
3079 -111 -376 -569 -177 244 66 -415 -361 -283 13 -18 -490 -129 77 36 -226 -674 15 287 -74 -380 -192
3100 -192 152 -18 -123 -389 -23 521 132 -352 87 219 426 212 -160 263 618 235 -238 -318 531 804
3120 804 48 -123 113 336 437 -206 -290 531 612 54 -49 -98 769 391 -218 -71 257 520 -84 -398 -128
$$ packed form
2969B77r1Q9K77l39j14K63l14P07k43m65P6M37j85o35L50J42O3n46J69J60j98
2990a20K38k44m4l8L13m16n6l2K23J0J01k93J40m0K19j23j04q4J12p2J29q1j49
3013d11J10J3K03r9Q5J50o2l01P0L38J09l75J41O4j18J71j56p1M40o8j99MO6K80
3037C84r2j99J31k9K39j10j92J52J14K31k03j04K86l05K11m02M9J07K08k04k20
3058E2J10j3J65l54k08L99L33m40p87M76O07k70m08J06J37K63j35n20L5M99j58
3079a11k65j93L92M21j78m81N4P8K96l1m72L61K06m1k62m48O89K72l61l06J88
3100a92L44j70j05k66L66N44l89m84M39J32K07k14l72M23L55l83m73q0Q49K73
3120H04p56j71K36K23J01o43q4Q21Q1n58j03m9Q67l78o09J47L28K63o04l14K70
$$ plain form
3141 -128 361 318 -236 -290 -72 414 -207 -414 -94 89 -105 -449 -719 -281 53 -210 -738 -444 -4 8 -192
3162 -192 -742 -5 259 -333 -526 -404 21 351 -266 -285 -70 412 210 -330 -265 455 92 -17 -240 72 746
3183 746 271 -47 108 136 582 102 -509 61 703 457 -85 -150 91 531 236 -104 -140 516 466 -45 -207
3204 -207 359 579 62 -283 -246 358 264 -30 -73 174 425 -100 -60 -288 -143 538 108 -534 -14 131 -188
3225 -188 -280 -542 176 77 -349 -524 -396 -104 -36 -170 -806 -417 -22 -470 -373 -495 92 91 -431 -221 -518 -179
3247 -179 115 -351 -479 25 240 -27 -367 90 320 218 -435 -205 176 455 165 -207 -10 490 361 -112
3267 -112 71 -45 503 141 -50 286 419 235 62 176 201 214 235 68 10 122 299 372 -13 109 160 271
3289 271 26 18 -93 152 -78 -21 -94 -133 131 -156 -236 16 -157 -137 -171 -412 -221 -299 -45 -328 -464 -229 -259
$$ packed form
3141a28M89m3n54n4K18M86o21k07L20J83j94l44k70M38L34k63n28K94M40J2k00
3162a92n50P37K64n92j93J22M25L30o17j9K15M82k02n40O5P20l63j09k23L12O74
3183G46m75l18J55K8M46m80o11N70O42k46n42o5K41M40k95l40l6O56n0n11j62
3204b07N66K20n17l45L7O04r4k94m3K47K51n25M0k28J45O81m30o42N20J45l19
3225a88r2k62P18r9m26j75J28K92O8j34o36L89L95m48R7j22N87jn22K10k97L39
3247a79K94m66j28N04K15k67l40M57K30j02o53K30L81K79k90l72J97N00j29m73
3267a12J83j16N48l62j91L36J33j84j73J14K5J3K1j67n8J12J77P3l85J22N1J11
3289B71k45qj11K45k30N7p3l9K64k87q0K52j73K0l4k41J91p8K54k83j36K35l0
$$ plain form
3312 -259 -594 -642 -286 -29 -283 -95 -402 -344 -16 -481 -143 146 70 91 -161 -11 -30 37 61 69 106 104 284 -27
3336 -27 -65 293 25 175 147 283 208 214 -21 290 308 289 279 122 -39 476 142 349 240 23 279 370 72
3359 72 -11 168 -44 171 -120 -122 109 72 -28 -144 -52 100 -62 -92 -30 -124 -4 -95 -452 -226 34 -399 -357 -272
3383 -272 -415 -55 -319 -149 -333 -324 -89 -402 -270 -8 5 40 -28 -262 -76 29 180 -239 -163 31 87 107 -163
3406 -163 81 26 53 -42 155 -51 478 94 26 132 246 241 180 139 297 495 132 115 216 182 413 152 112 188
3430 188 257 99 -66 74 216 91 228 -208 -159 511 507 79 -173 -217 429 73 -284 -104 98 340 -210 -406
3452 -406 125 187 -218 -567 -426 27 51 -311 -406 -369 -179 22 -12 -491 103 -123 -331 -274 -362 189 -221 -352
3474 -352 -185 120 -55 123 -355 -130 136 172 -131 -103 200 532 305 -185 -2 96 450 -105 -214 162 389
$$ packed form
3312b59l35m8L56K57k54J88l07N8L28m65L38K89p6K1k52J50j9O7K4QL7kJ80l11
3336b7l8L58k68J50k8J36p5Ok35L11J8j9j0j57j61N15l34K07j09k17K56R1k98
3359G2q3J79k12K15k91kK31l7j00j16R2J52j62l0O2r4J20r1l57K26K60m33M2Q5
3383b72j43L60k64J70j84RK35l13J32K62J3L5o8k34J86J05J51m19P6J94N6K0k70
3406a63K44n5K7r5J97k06N29l84o8J06J14no1m1J58J98l63j7J01l4K31k61m0P6
3430A88O9j58j65J40J42j25J37m36M9O70mm28k52m4O46l56l57J80K02K42n50j96
3452d06N31O2m05l49J41M53K4l62r5L7J90K01l4m79N94k26k08N7q8N51m10j31
3474c52J67L05j75J78m78K25K66L6l03K8L03L32k27m90J83R8L54n55j09L76K27
$$ plain form
3495 389 401 -275 -63 630 431 174 -187 -35 628 303 -198 1 354 64 149 25 -58 473 279 -171 -546
3516 -546 106 116 99 -502 -198 116 -37 -222 -305 205 111 -21 -353 -556 -94 65 -212 -468 -190 56 -198
3537 -198 -501 -467 -146 173 -300 -479 -242 3 64 -412 -103 55 -36 113 -360 -157 343 357 -289 -119 162
3558 162 198 -49 53 -180 612 511 62 -348 137 411 238 104 -90 249 223 104 40 220 565 533 -332
3579 -332 -146 398 508 205 -166 -20 470 6 9 -86 56 449 -93 -310 -195 351 283 -89 -498 13 106 -315
3601 -315 -361 -212 -74 -65 -447 -392 -41 134 -5 -243 -193 -138 175 -240 -353 -47 267 -60 -158 -188 -18 -78 -37
3624 -37 -150 -31 -63 234 -482 -114 -54 -50 -15 -315 73 134 112 37 184 -28 211 70 -57 226 191 222 76 -141
3648 -141 215 388 120 455 280 86 155 95 66 150 306 -37 94 57 134 463 -27 -118 79 86 87 -11 -26 313
$$ packed form
3495C89J2o76K12O93j99k57l61J52O63l25n01J99L53k90Q5j24q3N31j94m50l75
3516e46O52J0j7o01L04L14j53j85q3N10r4j32l32k03M62J59k77k56K78K46k54
3537a98l03L4L21L19m73j79K37K45O1m76L09J58r1J49m73K03N00J4o46J70K81
3558A62L6k47J02k33P92j01m49m10M85K74j73j34j94L39k6j19o4J80L45l2q65
3579c32J86N44J10l03l71J46M90m64Lr5J42L93n42k17J15N46o8l72m09N11R3m21
3601c15m6J49J38Rl82N5L51J75j39k38N0N5L13m15j13L06L14l27r8l0J70o0M1
3624c7j13J19l2K97p16L68O0ML5l00L88O1k2p5J47k12K39j41j27K83l5L1j46k17
3648a41L56J73k68L35j75j94O9o0k9Q4J56l43J31l7P7L29m90r1J97PJr8j5L39
$$ plain form
3672 313 5 -81 -137 -290 -138 83 -155 45 -10 -127 -253 8 -285 -118 -214 -158 -130 -313 -184 -124 3 -247
3694 -247 -77 -158 -6 101 -287 -269 -18 178 -26 -393 -138 149 43 -214 -297 58 346 -121 -154 310 215 107
3716 107 559 -526 290 33 159 251 -508 61 139 462 392 235 285 370 -7 128 -49 133 458 209 495
3737 495 570 516 131 -17 -196 453 751 -23 -341 -124 -68 358 -183 -182 10 -87 -175 -363 -26 9 -158 -504 -89
3760 -89 -112 -118 -451 -396 -36 17 -130 -528 -322 267 140 -380 -71 -108 -90 -177 -325 30 128 281 -204 -136 -78 294
3784 294 122 -331 -48 136 416 228 -219 -25 218 294 -152 -84 -22 446 133 53 201 280 398 267 -106 104
3806 104 64 27 -57 154 365 118 -146 166 43 380 136 -211 -45 96 156 -98 -162 329 175 153 -82 -266
3828 -266 185 97 -137 -343 -92 -83 44 -459 -129 -14 105 -17 -391 -506 0 44 -222 -263 -120 203 -282 -210
$$ packed form
3672C13l08q6n6j53J52K21k38K00n5j17j26K61k93J67r6N6K8j83J29O0J27k50
3694b47J70q1J52J07l88J8K51J96k04l67K55K87j06k57q3L55K88m67l3M64r5j08
3716A07M52j085Q16k57J26R2p59N69P8L23p0j57N0Q5l77J35j77J82L25k49K86
3737D95P5n4l85j48j79O49K98p74l18K17N6M26n41JJ92r7q8j88L37L5j67l46M15
3760h9k3ol33N5L60N3j47l98K06N89j27n20L09l7J8q7j48L55R8J53m85O8N8L72
3784B94j72m53K83J84K80j88m47J94K43P6m46O8O2M68l13q0J48P9J18j31l73K10
3806A04m0l7q4K11K11k47k64L12j23L37k44l47J66J41O0k54o4M91j54k2k35j84
3828b66M51q8k34k06K51RJ27n03L30J15J19j22l74j15N06M4k66m1J43L23m85P2
$$ plain form
3850 -210 -81 12 269 -214 -1 -12 68 -28 -19 19 211 173 413 -141 154 441 246 11 42 206 478 280 -16
3873 -16 58 251 356 102 -128 291 316 -37 8 84 399 135 159 -314 88 239 89 -241 -76 126 374 -173
3895 -173 100 -114 198 -111 -253 7 -30 239 -256 -10 -267 134 -89 -511 -305 -317 -7 -179 -476 -41 126
3916 126 100 -66 -80 -139 182 -120 -357 -170 -23 -47 -46 -211 -90 361 -108 98 -9 41 301 209 -240 80 52
3939 52 169 1 -106 24 235 67 -96 -204 497 214 78 -309 180 377 274 15 87 263 57 116 -89
3960 -89 48 97 10 -366 116 106 196 79 -163 -20 193 138 -259 -163 94 293 -110 -181 -23 -34 -154 14 -219
3983 -219 -305 139 -217 -423 -211 -168 -211 -336 -359 -255 -124 -200 -307 -255 76 -38 -3 -222 -24 -86 -30 -64 -227
4006 -227 11 72 61 -11 114 -161 150 -19 219 88 187 -170 -106 40 48 237 169 -106 152 159 294 146 -27
$$ packed form
3850b10J29R3K57m83K13j1Q0r6RL8J92l8K40n54K95K87j95k35L1J64K72j98k96
3873a6P4J93J05k54k30M19K5l53M5P6L15k64K4m73M02J51j50l30J65K02K48n47
3895a73K73k14L12l09j42K60l7K69m95K46k57M01k23m22K06j2L10j72k97M35J67
3916A26k6j66j4n9L21l02k37J87J47k4Jj65J21M51m69K06j07N0K60r2m49L20k8
3939E2J17j68j07J30K11j68j63j08P01k83j36l87M89J97j03k59P2J76k06N9k05
3960h9J37M9q7l76M82j0R0j17k42J43K13n5l97R6K57J99m03p1J58j1j20J68k33
3983b19q6M44l56k06K12M3m3j25k3J04J31p6j07N2L31j14L5k19J98o2N6l4j63
4006b27K38O1j1p2J25k75L11j69K38j31R9l57O4J46QJ89o8k75K58PJ35j48j73
$$ plain form
4029 -27 177 53 395 -30 82 4 145 -85 -66 1 214 142 44 24 -87 -112 190 148 -31 -59 73 134 -18 229
4053 229 -57 144 -26 -326 -187 -55 87 30 -128 -7 30 -29 -311 -155 -48 -24 -135 -127 -295 172 108 86 -418
4076 -418 -289 -121 -133 -188 12 209 214 -197 -79 18 -1 90 22 -38 36 367 27 -136 -139 64 281 -9 -152 222
4100 222 221 289 -5 179 537 297 -72 256 119 420 78 90 85 98 120 113 -52 561 88 55 -86 16 351 -5
4124 -5 -244 -433 -2 -65 -126 -1 -72 8 286 4 -233 -381 67 30 -368 -162 67 37 -228 9 13 -251 -55
4147 -55 -423 -91 -104 -188 -169 -393 -123 92 -126 -372 -207 -66 40 -52 -311 62 320 112 -89 -273 181 319
4169 319 179 -146 -161 368 184 258 -210 53 459 275 31 120 197 329 95 -18 16 290 426 106 19 224
4191 224 60 163 -132 356 296 126 64 -279 215 238 78 -263 -51 -23 -9 -239 -323 -56 271 -233 -184 147
$$ packed form
4029b7K04j24L42m25J12p8J41k30J9O7K13p2r8k0j11k5L02m2j79k8J32O1j52K47
4053B29k86K01j70l00J39J32J42n7j58J21L7n9k82J56J07K4j11Qj68M67o4k2n04
4076d18J29J68j2n5K00J97Nm11J18R7j9R1o8o0P4L31l40j63lK03K17k90j43L74
4100B22jO8k94J84L58k40l69L28j37L01l42J2nJ3K2pj65O13m73l3j41J02L35l56
4124ek39j89M31o3o1J25p1Q0K78k82k37j48M48l7l98K06K29l0k65K37Mk64J96
4147e5l68L32j3q4J9k24K70K15k18k46J65J41J06r2k59L73K58k08k01j84M54J38
4169C19j40l25j5N29j84P4m68K63M06j84k44Q9P7J32k34j13L4K74J36l20q7K05
4191B24j64J03k95M88o0j70o2l43M94K3j60l41K12K8J4k30q4K67L27n04M9L31
$$ plain form
4213 147 11 -147 -348 -68 -157 14 235 -206 -209 217 276 130 -323 -11 40 -54 -75 -336 -282 -3 -80 -126 -172 53
4237 53 16 -124 -79 -49 375 -39 -172 41 71 218 -30 89 276 114 156 -5 245 60 178 -60 2 80 217
4260 217 144 26 5 9 301 -3 125 -49 246 -50 -75 -16 253 87 -40 -121 -172 227 -122 -562 -264 -214 56
4283 56 4 90 -178 -246 -20 -73 -344 -323 13 -65 -390 -235 -243 -28 128 -3 -9 -187 -61 -287 -273 -220 30 -74
4307 -74 -145 -107 -2 -189 167 -38 -26 98 -44 -158 -21 -45 -14 152 45 53 8 75 -126 107 50 292 541 -144
4331 -144 209 263 160 48 146 204 86 -49 15 95 324 276 -78 -154 178 -65 128 9 -211 -122 38 -196 -42
4354 -42 -115 -27 -31 -11 87 -142 -46 -65 -133 -231 77 83 -164 -245 -36 260 -147 -187 123 143 -77 -129 -94 -6 -243 53
4380 53 -73 -102 -97 1 -175 -108 -46 -346 36 12 -203 -95 36 199 11 59 208 143 110 -103 57 196 -10 212
$$ packed form
4213A47j36j58k01K80q9J71K21m41lM26N9j46m53L12N1r4k1k61N4K79p7m6m6K25
4237E3l7j40M5L0M24m14j33K13L0J47k48J19J87j62M2j61K50j85J18k38O2P8J37
4260B17p3j18k1MK92l04J28j74K95k96k5N9K69j66j27q1n1L99l49m40K98N0K70
4283E6n2Q6k68o8K26n3k71K1L36p8l25J55qK15J56j31oj78J26k26J4N3K50j04
4307g4p1L8J05j87L56k05J2J24j42j14J37k4L1J66j07Qm5O7k01K33n7K42K49o85
4331a44L53N4j03j12R8N8j18j35O4Q0K29m8l54p6L32k43J93j19k20Q9J60k34J54
4354d2p3Q8mK0R8k29R6j9o8r8L08Ok47q1K09K96m07m0L10K0k20n2L5Q8k37K96
4380E3j26k9NR8j76O7O2l00L82k4k15J08J31J63j88M8J49o5l3k13J60J39k06K22
$$ plain form
4404 212 -180 130 141 314 -45 -115 58 113 189 109 367 12 43 -49 92 148 55 226 204 61 175 187 -5 20
4428 20 35 221 155 -283 9 -141 69 -61 -171 -94 -83 108 -290 -385 -89 -68 111 1 -238 11 242 -126
4450 -126 -72 -15 130 -236 -273 -11 -39 -196 -80 -106 42 -143 208 -165 52 -25 0 36 83 -201 258 123 -265
4473 -265 -2 -121 17 13 -145 371 108 269 -340 225 286 33 122 119 76 206 -340 -97 291 -48 291 55
4495 55 -44 -168 43 65 34 105 -83 55 156 -147 -98 -120 117 116 -259 -205 61 182 -224 -240 0 28 -68 -26 -55
4520 -55 -135 146 -124 -281 -311 617 -189 247 274 227 564 -855 80 -91 276 114 -131 -22 736 54 -218
4541 -218 147 43 103 420 -406 -303 -57 44 131 319 -73 191 336 247 -180 -42 235 201 46 -196 157
4562 157 310 93 -98 36 118 124 70 -27 361 286 -94 -183 -20 353 70 17 -217 119 449 -89 -282 10 52
$$ packed form
4404B12l92L10J1J73l59p0J73N5P6q0K58l55L1r2J41N6r3J71k2j43J14J2j92K5
4428B0J5J86o6m38K92j50K10j30j10P7J1J91l98r5K96K1J79j10k39K49K31l68
4450a26N4N7J45l66l7K62k8j57J16k6J48j85L51l73K17p7K5L6M7k84M59j35l88
4473b65K63j19J38mj58N16k63J61o09N65O1k53Q9lm3J30n46K43L88l39L39k36
4495E5r9j24K11K2l1P1j88J38J01l03M9k2K37jl75N4K66J21m06j6K40K8r6M2k9
4520e5q0K81k70j57l0R28q06M36K7m7L37j419R35j71L67j62k45J09P58o82k72
4541b18L65j04O0L17q26J03K46J01Q7J88l92K64J45q9m27J38K77l4j55k42L53
4562A57J53k17j91J34Q2On4r7L88p5l80q9J63L73k83n3k34L36L30n38j93K92M2
$$ plain form
4585 52 63 -81 -359 -247 238 -63 -122 -137 168 42 62 -356 -108 -25 -95 -176 -165 -176 58 79 -211 -391 181 60
4609 60 -143 -123 -92 -2 -153 -20 231 -117 -59 42 -358 -103 216 -182 -213 249 325 245 -105 47 213 206 248 -99
4633 -99 117 215 314 178 60 252 406 -8 -10 21 90 105 -26 172 -84 -110 -182 269 -80 -59 -34 -64 -89 0 -170
4658 -170 344 -7 -29 337 228 -75 -232 -225 7 27 -123 -310 -199 -225 -273 -198 -215 -29 59 55 -136 -293 -91 -80
4682 -80 -200 -48 103 128 14 -273 -20 -129 55 -65 85 304 -39 -117 -112 460 136 -82 214 109 165 -8
4704 -8 130 147 -67 28 151 -160 247 205 -11 15 196 -10 70 -146 177 214 70 141 174 -94 213 -68 210
4727 210 -351 707 172 105 -121 -255 159 -230 -247 -20 -297 -104 -131 -26 333 70 124 -188 165 -155 -226
4748 -226 -102 -156 84 -345 -268 -347 -208 -83 66 -218 -120 45 161 -14 -98 -137 274 190 -172 -123 -161 -42 -62
$$ packed form
4585E2J1j44k78J12M85l01n9j5L05j26K0m18K48Q3p0q1J1j1K34K1k90j80N72j21
4609F0k03K0L1R0j51J33K51l48N8J01m00K55L19l98l1M62P6q0l50J52J66pM2l47
4633i9K16R8R9j36j18J92J54m14kL1O9J5j31J98k56k6p2M51l49K1K5l0k5Q9j70
4658a70N14l51k2L66j09l03j57PK32K0j50j87J11k6m8P5j7J86Q8mj91j57K02J1
4682h0j20J52J51K5j14k87K53j09J84j20J50K19l43p8NN72l24k18K96j05N6j73
4704hJ38J7k14R5J23l11M07m2k16K6J81k06Q0k16L23L7j44P1L3k68L07k81K78
4727B10n61J058n35o7k26j34M14l89j7K27k77J93k7J05L59k63N4l12L53l20p1
4748b26J24n4K40m29P7p9J39J25J49k84R8J65J16j75q4l9M11q4l62M9l8J19k0
$$ plain form
4771 -62 -94 100 220 234 357 224 325 152 -111 -110 -50 201 165 214 114 101 -112 267 211 432 170 247 28 -51
4795 -51 175 225 255 23 403 269 234 -223 74 -177 -116 99 177 -222 -22 66 -179 -116 -48 102 305 139 -259
4818 -259 -58 -320 -124 50 -547 -96 -119 -319 -706 -285 140 -299 65 -126 4 -115 -125 -53 111 15 155
4839 155 -57 -301 -38 327 139 -14 -192 -51 75 47 -236 202 220 364 -340 -29 356 114 294 -210 -152
4860 -152 92 258 -433 31 537 239 -14 156 260 134 -927 -295 151 -281 336 315 -52 333 458 235
4880 235 -321 512 -298 483 363 441 -59 215 -356 -298 -345 -874 -168 -60 -421 168 859 -42 204 -307 15
4901 15 323 -240 0 -106 -441 246 -470 -126 -217 46 114 -277 -271 430 48 -881 433 365 315 200 -241 443
4923 443 -628 107 101 353 433 -97 492 5 -97 133 64 232 207 128 113 129 312 -208 298 -2 150 -299
$$ packed form
4771f2l2J94J20J4J23j33J01j73k63JO0K51l6M9j00j3k13L79n6K21k62P7k19p9
4795e1K26N0L0k32L80j34l5m57K97k51O1K15P8l99K00Q8k45O3O8J50K03j66l98
4818b59K01k62J96J74n97M51k3k00l87M21M25m39L64j91J30j19j0P2J64r6J40
4839A55k12k44K63L65j88j53j78J41J26k8k83M38J8J44p04L11L85k42J80n04N8
4860a52K44J66o91M64N06k98k53J70J04j26j061O32M46m32O17k1l67L85J25k23
4880B35n56Q33q10P81j20P8n00K74n71N8m7n29P06J08l61N89O91r01K46n11L22
4901A5L08n63K40j06l35O87p16L44r1K63O8l91OP01l82r29J314o8n0j15m41O84
4923D43j071P35oK52Q0n30N89m87j02K30o9J68k5p9j5J6J83n20N06l00J52m49
$$ plain form
4945 -299 -443 -407 237 270 -216 70 603 -144 -573 248 -114 30 -5 -100 191 -437 734 464 -691 295 243
4966 243 79 593 -523 196 132 117 325 141 77 688 756 -272 -446 -188 -14 -235 -379 -272 -743 479
4986 479 73 512 246 160 806 140 105 -695 -174 72 -254 -358 -114 -138 755 6 -253 -100 263 152 150 -11
5008 -11 -412 62 214 89 107 419 -424 -290 89 -520 -136 194 281 393 -73 348 348 468 416 -66 6 -142
5030 -142 284 -212 -22 673 472 -14 -488 492 -49 7 -554 528 75 326 -427 -570 -276 -650 -155 -164 582
5051 582 -265 -67 -311 -656 96 -65 -270 -267 244 -480 -45 334 -362 376 9 425 -194 -478 1 988 177
5072 177 -121 70 30 80 200 320 -39 280 187 28 -66 224 406 476 -330 110 363 605 -244 69 466 -20
5094 -20 175 -55 152 -55 151 407 68 34 194 169 -85 -86 200 25 -145 -350 144 -4 -42 79 -363 41
$$ packed form
4945b99j44L6O44L3m86K86N33p47m29Q21l62J44l5r5K91o28J171k70j155R86n2
4966B43j64N14j116P19o4j5K08j84o4O11O8j028j74K58J74k21j44J07m71J222
4986D79m06M39k66q6O46o66l5q00N21K46l26j04K44k4Q93p49k59J53L63j11kj61
5008a1m01M74J52j25J8L12q43J34L79o09L84L30Q7J12m66M21%J20n2m82P2j48
5030a42M26m96J90O95k01m86m74R80n41N6n61J082m53K51p53j43K94l74M95rP46
5051E82q47J98k44l45P52j61k05LN11p24M35L79o96P38l67M16o19k84M79R87q11
5072A77k98J91m0N0J20J20l59L19r3j59r4K90J82P0q06M40K53K42q49L13L97m86
5094b0J95k30K07k07K06K56l39l4J60k5k54jK86j75j70k05M94j48l8J21m42M04
$$ plain form
5116 41 -132 -39 -30 41 -289 -44 63 -120 -337 27 101 -203 -138 -152 82 32 -75 -223 -89 267 -148 -228 -107
5139 -107 -332 18 3 -196 -16 -232 101 -344 -111 -63 -140 96 -222 -134 -58 160 106 138 246 173 146 6 27
5162 27 58 118 40 -25 -32 178 174 -64 -21 -112 184 -92 -83 105 180 371 79 89 89 288 -76 -102 -306 402 66 -308
5188 -308 -146 240 -289 263 58 74 178 41 242 -56 121 339 87 -365 276 270 320 98 39 242 70 74
5210 74 -157 -160 291 180 87 -167 195 78 196 -89 -180 212 -230 37 -68 -17 256 196 73 87 -83 268 -59
5233 -59 45 74 211 263 34 -448 28 639 194 183 -141 368 259 -407 89 263 361 323 -247 691 468 626
5255 626 -217 -310 387 11 692 -33 -116 -10 -14 -485 62 -773 454 264 63 -177 -173 213 -145 -471 -17 325
5277 325 117 -205 -564 231 768 203 -709 -167 262 -122 -282 -10 -217 300 -79 -92 546 -100 17 242
$$ packed form
5116D1j73R3RP1l30K45J07j83k17L64P4l04O5j4K34n0j07j48J34L56m15q0J21
5139a07k25L50j5j99J80k16L33m45K33M8p7K36l18Q8P6K18n4L2J08p3k7j40K1
5162B7L1O0p8o5pK10mk38M3r1K96k76RJ88P5J91k92J0%J99l64k6k04P08l36l74
5188c08J62L86n29N52k05J6J04j37K01k98J77K18k52m52O41oN0k22n9K03j72M
5210G4k31lM51j11r3k54L62j17J18k85r1L92m42K67j05N1K73o0j23J4j70L51l27
5233e9J04K9J37N2k29m82M76O11m45j1l24N09j09o66M96J74R8l8n70R38k23J58
5255F26q43r3O97l76O81p25q3J06mm71N47q35J227j90k01k40ML86l58l26M54L42
5277C25k08l22l59P95N37n65r12N42M29l84j60K72k07N17l79j3O38o46J17K25
$$ plain form
5297 242 260 42 -169 -713 -393 -234 72 50 -205 -150 6 -26 290 -93 61 266 87 170 103 293 -57 434
5319 434 62 -152 -236 104 -330 178 85 -88 123 202 113 409 480 255 -213 31 270 -236 437 21 259 87
5341 87 152 -53 123 158 -175 -279 -145 -364 -404 300 318 -48 -109 -212 -116 -99 -432 -310 270 -141 -2 158 305
5364 305 -442 -607 161 142 143 203 -478 32 646 -316 -53 234 57 238 -231 597 140 -478 -411 -437 -7 -707
5386 -707 -143 -201 359 -171 -67 88 599 -54 1 290 406 -244 -430 -54 -115 334 -62 -334 409 150 -263
5407 -263 41 79 -67 290 -93 -20 234 1 -52 55 -119 -50 -119 184 140 -189 -91 168 -83 -23 -42 -15 -132
5430 -132 -221 -148 53 -195 -141 -338 162 89 26 -270 106 158 -107 -210 -230 -197 188 181 143 159 43 -153 129 -25
5454 -25 -35 -45 46 102 113 290 -85 6 108 171 -46 -53 219 -45 350 -3 12 21 -236 12 241 404 7 524
$$ packed form
5297B42J8k18k11n44L20J59L06k2k55N5J56l2L16l83J54K05j79Q3o7J90l50M91
5319D34l72k14q4L40m34N08r3j73K11P9q9K96P1k25m68K44K39n06O73m16K38j72
5341H7O5k05J76L5l33j04J34k19m0P04J8l66o1j03R6J7l33J22N80m11J39J60J47
5364C05p47j65P68j9JO0o81N10O14r62K63K87j77J81m69Q28m57o18O7k6M30p00
5386g07N64n8N60n30J04J55N11o53N5K89J16o50j86L76o1M49l96k72P43k59m13
5407b63L04L8j46L57l83P3K54k33n3J07j74O9o9L03m4l29R8K59k51O0j9K7j17
5430a32q9P3K01k48N4j97N00p3o3k96L76N2k65j03k0L3L85pl8J6j16j96K82j54
5454b5j0j0R1N6J1J77l75R1J02O3k17pK72k64L95l53J5Rk57K48K29J63l97N17
$$ plain form
5478 524 88 -61 -57 63 -342 2 503 -53 170 188 -286 -73 -112 -223 -125 -290 307 63 17 38 -82 145
5500 145 -86 -12 4 91 -258 14 -439 -20 -34 -143 275 365 -16 -53 -245 -83 -303 36 -256 -311 -68 230
5522 230 6 297 -7 5 37 56 -88 124 54 -244 -120 -108 48 85 -150 5 178 1 215 -115 -50 317
5544 317 239 -52 152 -42 -29 -255 442 124 -118 -501 -191 120 110 50 -281 592 112 88 -150 -434 549 709
5566 709 309 -265 184 -9 44 -93 -209 -378 -337 578 -520 -306 -271 -255 47 418 -639 -325 118 -78 -76
5587 -76 -501 334 -180 30 7 468 441 184 -40 -104 -401 204 190 -134 305 123 -231 86 301 -17 538 479
5609 479 123 -24 373 275 -242 97 102 115 141 -38 176 2 -139 149 -101 173 183 -143 -124 -45 355 -169 -152
5632 -152 232 39 0 -76 -136 -61 103 -234 153 -154 273 -7 8 -31 -82 46 -93 308 -365 -96 313 -193
$$ packed form
5478E24m36j49MJ20m05L44N01n56K23J8m74K13l9j11R8j65N97k44m6K1j20K27
5500A45k31P4J6Q7l49K72m53M19j4j09M18R0l81l7j92J62k20L39k92n5K43K98
5522B30k24K91l04J2L2J9j44K12p0k98J24J2J56L7k35J55J73j77K14l30O5L67
5544C17p8k91K04j94J3k26O97l18k42l83L10L11j0o0l31Q73m80k4k38k84R83J60
5566G09m00n74M49j93N3j37j16j69M1R15j098K14L5J6L02L71j057L14M43j96K
5587g6m25Q35n14K10k3M61k7k57k24o4k97O05j4l24M39j82l54L17K15l18N55n9
5609D79l56j47L97r8n17L39NJ3K6j79K14j74j41K88k50K74J0l26J9P9M00n24J7
5632a52L84j93l9p6o0P5J64l37L87l07M27k80J5l9n1J28j39M01o73K69M09n06
$$ plain form
5654 -193 561 196 165 255 -80 67 81 -99 -167 -180 -57 -13 -74 0 86 316 22 213 180 -113 -43 179 128 -272
5678 -272 376 10 -175 47 -182 -1 159 148 -282 -54 -60 -43 198 43 -197 45 107 153 -52 413 -96 145
5700 145 252 2 213 78 -246 317 37 73 116 255 126 234 -63 -109 101 -336 117 -135 301 96 35
5721 35 -138 112 -79 -82 43 -118 -51 -211 -122 12 91 219 -314 -202 -81 -243 -203 -70 -174 56 23 -538 -500
5744 -500 208 -178 -227 24 58 89 76 -93 -50 -2 46 -43 -90 -174 129 -153 -225 -37 22 192 119 -78 -167 77 49
5769 49 -58 200 -101 -22 -150 -150 -15 -15 7 143 478 294 79 576 108 157 9 325 221 164 206 20 51 -43
5793 -43 -82 103 33 247 9 -254 31 -147 -163 -301 -187 -347 26 -156 147 -292 136 -182 -189 -22 -78 20 -335
5816 -335 51 57 -318 -258 -342 6 -134 -184 75 241 203 -10 46 -1 27 107 -161 109 -35 53 16 128 219 18
$$ packed form
5654a93P54l65l1R0l35J47J4j80o8j3J23M4o1P4Q6K30k94J91l3k93P0K22n1m00
5678b72O48l66j85K22k29J81J60j1m30K28oJ7K41j55k40K42O2M6k05M65n09K41
5700A45J07k50K11j35l24N63k80L6M3J39j29J08k97m6K10m37M53k52M36k05o1
5721C5j73K50j91lJ25j61O7j60Q9J34P9J28n33J12J21j62M0J33j04K30l3n61L8
5744e00P08l86m9K51L4L1j3j69M3M8M8q9m7q4L03k82p2J88N9J70p3j97q9K44k8
5769D9j07K58l01P9j28%J35%K2J36L35j84k15M97m68M9j48L16j04n7M2j86L1r4
5793d3l9J85p0K14k38k63K85j78j6j38J14j60L73j82L03m39M28l18pJ67n6R8l55
5816c35L86Ol75O0q4L48j40n0K59J66l8k13N6m7K8Q0k68K70j44Q8l7J12R1k01
$$ plain form
5840 18 -327 -339 49 -139 214 322 6 79 74 210 -47 -151 93 128 -5 128 19 160 -29 174 -60 1
5862 1 62 -83 94 91 34 293 -144 27 31 -69 222 -70 297 -4 -98 11 117 -118 -175 -53 115 -107 -96 -135
5886 -135 -84 271 -6 -69 -17 20 -181 78 -98 -183 110 92 -56 134 -118 -139 -39 -114 24 58 11 124 -61
5909 -61 -129 121 -148 167 223 305 355 -34 73 -127 20 -348 15 139 46 69 185 -99 14 -39 -51 -26 132
5932 132 203 -223 285 99 109 15 -55 196 -83 236 -5 -69 -84 17 178 -113 -406 -81 -107 105 7 -21 -216
5955 -216 -151 11 -49 -189 75 173 18 -138 200 -91 -179 -244 -148 59 14 -64 -75 -94 18 -132 11 -208 -196 53
5979 53 247 28 -96 -185 -99 12 60 -17 -3 -59 -434 91 118 403 -301 197 -112 26 62 135 73 63 183 104
6003 104 265 -1 37 119 -109 -13 21 65 126 -147 -32 -285 59 -111 119 -99 58 88 9 125 -69 56 423
$$ packed form
5840A8l45j2L88j88L53J08l16P3nJ36k57j04K44L5j33J33j09J41j89K03k34O1
5862AO1j45J77ln7K59m37J71Mj00K91k92L67l01r4J09J06k35n7J22J68k22J1l9
5886a35N1L55k77o3N2L7k01K59j76q5K93j8j48J90k52k1J00p5J38L4m7J13j85
5909f1o8K50k69L15N6Q2N0l89J07k00J47l68L63J24r3K3J16k84J13n3j2K5J58
5932A32P1m26N08j86J0r4p0K51k79L19k41o4j5J01J61k91k93L25k6K12r8k8j95
5955b16O5J62o0j40K64R8j55j56L38k91q8o5R6K07m5p8j1j9J12j50J43k19J2K49
5979E3J94k19j24q9Q6J11M8p7J4n6l75N25K7K85p04M98l09J38L6P3o2j0J20p9
6003A04J61k66L8Q2k28R6L4M4O1k73J15k53L44j70K30k18J57L0p9J16j94J25L67
$$ plain form
6026 423 70 156 -51 -68 98 23 -112 15 42 -19 -182 -24 -10 -237 -66 215 38 -51 -54 -353 -69 -10 93
6049 93 -184 64 234 150 57 29 -245 -117 -371 -195 -102 -157 -194 123 -15 -137 256 25 126 121 -785 291 -20
6072 -20 85 56 120 36 76 140 90 251 -228 -206 60 20 166 100 -13 -90 64 368 -137 16 -68 -8 -121 -6
6096 -6 -24 -194 -48 -103 134 -67 -68 155 5 46 68 -75 188 -107 196 16 -22 39 -93 -132 -10 161 -223 42
6120 42 -115 23 -109 -463 56 16 3 58 -26 15 -24 66 -61 196 -87 31 335 -118 81 -162 -101 -30 114
6143 114 -90 555 145 -243 261 7 92 249 174 12 -99 -13 -167 -36 140 196 87 14 -148 -436 -163 -280
6165 -280 -115 -121 -87 47 8 11 42 125 -149 92 -1 -78 40 -178 -85 85 -45 -41 -105 200 -109 -54 -281 26 265
6190 265 96 45 10 107 -57 -96 -55 4 215 135 -97 -28 -64 156 -261 150 -74 -6 -172 -68 -66 -212 107 156
$$ packed form
6026D23l53Q6k07j7J66p5j35J27K7o1j63J58J4k27J71K81j77q9lk99K84N9J03
6049I3k77K48J70q4r3k8k74J28k54J76R3n5l7L17j38j22L93k31J01nr06J076l11
6072b0J05k9O4q4M0O4n0J61m79K2K66m0J46o6j13p7J54L04n05J53q4O0j13J15
6096fj8j70J46n5K37k01jK23j50M1K2j43K63k95L03j80l8O1j32l9J22J71l84K65
6120D2j57J38j32l54N19m0j3N5q4M1l9R0j27K57k83J18L04m53J99k43O1P1J44
6143A14k04O45m10l88N04k54Q5J57p5j62j11Q6j54J31J76N6j09p3j62k88K73j17
6165b80J65oL4J34l9LL1Q3k74K41r3p7J18k18R3J70j30Mo4L05l09N5k27L07K39
6190B65j69n1l5R7j64l9M1N9K11q0k32O9l6K20m17M11k24O8j66J04Kj46L19M9
$$ plain form
6214 156 -62 -258 49 459 -488 -24 598 -78 265 439 636 -217 409 344 127 -72 3 95 121 -93 173
6235 173 -60 232 -151 14 -81 13 -37 131 18 -43 164 30 -5 -75 0 -225 -215 -127 0 -33 99 -204 -238 163
6259 163 211 45 27 -234 -175 -98 -56 -243 -107 -144 -118 24 -59 154 -153 -12 55 -208 -238 -99 -7 -30 35 190
6283 190 112 -379 82 123 -79 -184 4 98 18 -109 114 31 46 -147 104 -73 -116 47 -112 -203 -223 75 -17
6306 -17 4 -81 195 -44 -103 78 -33 238 2 16 1 119 -39 -43 -226 5 7 25 42 -9 -143 34 58 -233 -130
6331 -130 -171 -51 38 -300 -40 49 176 -77 -67 63 -52 80 -14 -1 -109 -353 11 43 69 59 -26 33 -86 197
6355 197 -211 -165 7 119 96 -329 2 67 -70 76 49 -140 7 42 -55 92 -171 -40 -90 -32 201 -164 144
6378 144 223 -53 -13 -54 377 85 72 -162 63 46 71 66 -134 87 128 -35 28 89 65 8 32 -65 189 61 -51
$$ packed form
6214A56k18j96L07M10r47M64O22o76L43J74J97q53O26o5k17j99P5R2K6k14K66
6235A73k33K92l83J65r5R4n0J68j13o1K07j34l5p0P5k25J0Q8J27l3J32l03l4M01
6259A63M8j66j8k61N9P7M2j87J36l7K6J42q3K13l07J41O7k63l0J39R2k3O5J55
6283A90p8m91M61M1k02j05J88R4q0j27K23q3J5j93K51j77m3J63j59r1k0K98r2
6306a7K1q5K76k39n9J81j11K71k36J4j5J18j58mj83K31KJ8J7n1j34J77K4k91J03
6331a30m1J20Q9l38K60Q9J27k53J0J30j15J32r4J3j08k44L64L2K6j0q5N9j19K83
6355A97m08M6J72J12k3m25L31O5j37J46k7j89J47L5r7J47k63J31n0N8K33l65L08
6378A44P9k76M0m1M31k92j3k34K25j7K5nk00K21M1j63O3O1k4n7K4r7K54j28j12
$$ plain form
6403 -51 76 -21 77 -287 37 0 121 46 -114 -76 -56 30 103 108 61 55 -299 248 13 214 48 -122 4 -150 72
6428 72 307 -18 67 -125 234 -207 240 273 -169 214 110 59 141 281 103 192 -36 191 271 17 -31 -73 -20
6451 -20 -142 -63 -126 76 75 -6 -169 -37 130 11 53 87 34 16 -52 9 -93 43 153 86 -24 181 213 64 125
6476 125 108 62 69 55 106 -68 -193 280 104 -67 -23 -137 8 -245 -170 -153 54 -9 -87 -202 184 -72 -145 -288
6500 -288 -181 -97 -85 77 -18 -39 -7 60 -93 -50 168 -30 -64 71 57 -109 -162 -9 64 -72 -23 -141 18 -91
6524 -91 -19 -235 91 -22 48 119 -125 29 146 -57 45 32 70 -347 -70 50 -156 -57 160 -12 101 94 73
6547 73 -64 61 -31 -60 -71 -26 -10 -27 -23 -30 138 -26 76 -194 142 66 68 -16 79 -168 -17 37 -16 42 -255 -15
6573 -15 -7 82 -156 27 18 324 -298 -126 45 7 -29 -72 -151 114 74 204 -368 -190 84 -64 101 -71 -36 74
$$ packed form
6403e1J27r7R8l64L24l7J21p5j60L8K0Q6P3Nm7ol54N47k35K01j66j70J26j54K22
6428G2K35l25Q5j92L59m41M47L3m42L83j04n1Q2J40j78Q9k28K27Q0k54m8m2N3
6451b0j22P9o3K02jq1j63J32J67j19M2L4n3j8o8O1j02J36J10o7j10K05L2j49O1
6476A25j7m6Pj4N1j74j25M73j76j71M4j14J45k53P5J7K07o3p8j15L86k56p3j43
6500b88J07Q4J2J62r5k1L2O7j53M3K18j98l4J35j4j66n3J53P3j36M9j18J59j09
6524i1P2k16L26j13P0P1k44J54J17k03J02j3L8m17K77J20k06R9K17j72J13pk1
6547G3j37J25r2k9j1M5J6j7MpJ68j64J02k70L36p6Kq4R5k47J51N4n3N8k97K40
6573a5QQ9k38J83rL06o22J72J71l8l6m3p9K65m0J30n72J78K74j48J65j72L5J10
$$ plain form
6597 74 28 -159 15 190 2 32 -124 -123 153 37 53 -41 70 -47 85 97 -42 -140 -63 8 79 70 -50 192 14
6622 14 83 24 144 89 -180 -165 71 19 178 -217 21 -21 -213 -152 142 -50 -165 94 3 -31 -85 -118 -10 -239
6646 -239 -39 250 -6 -127 -268 6 154 134 160 -158 205 146 9 -236 -209 -104 195 -272 368 -150 141
6667 141 -54 -610 130 60 39 -250 5 219 -75 -110 -81 -256 49 -116 154 -147 -115 77 94 78 -139 -104 -100
6690 -100 -64 247 79 167 120 82 174 -230 54 -17 -69 201 106 11 -271 -60 -45 105 -170 -113 -10 -165 -19 -282
6714 -282 -39 81 -202 -287 42 -82 -117 -131 283 -222 -168 -121 -212 139 -101 -28 42 -28 -39 -65 28 -274 56 -41
6738 -41 95 -196 -131 -6 -133 -5 267 -128 -64 5 134 -96 -70 124 84 -79 92 56 136 -29 117 72 17
6761 17 152 228 197 -2 1 -100 168 104 -150 186 -125 -165 -90 -17 -63 191 -14 -32 -13 20 -81 -141 -16 14 -82
$$ packed form
6597G4m6j87J74J75j88L0j56JK76j16J6r4J11j17J32J2j39r8P7P1P1rj20K42j78
6622A4O9n9J20n5k69J5K36n2J59l95K38m2j92O1K94j92j15K59r1l4n4l3J08k29
6646b39K00K89k56j21j41K74J48k0K6l18L63n9j37k45K7J05K99m67O40n18K91
6667A41j95n56P40p0k1k89K55K14k94l5K9j75L05j65K70l01L2J92J7j6k17L5M
6690a00L6L11j68Q8m7l8R2m04K84p1n2K70r5r5k82K11J5J50k75N7J03j55J46k63
6714b82K43J20k83q5L29j24l5j4M14n05N4M7r1L51k40P3P0p0j1k6R3l02L30r7
6738d1J36k91O5J25j27J28K72l95O4O9J29k30K6J94m0j63J71l6Q0j65J46m5n5
6761A7J35P6l1j99Lj01K68o4k54L36l11m0P5P3m6K54k05j8J9L3j01o0J25L0r6
$$ plain form
6786 -82 -161 -81 -54 -110 5 -17 -9 50 -44 10 -256 -53 41 -5 -11 121 -57 -90 -83 -39 215 -3 89 -184 -84 -208 -26
6813 -26 -72 -159 116 -65 -2 -160 -101 -72 -31 76 -76 4 217 41 39 -162 143 145 159 -123 -59 117 -63 122 236
6838 236 -150 4 120 -111 222 -6 168 173 -89 -42 -30 165 5 142 244 -82 55 -189 -145 28 -100 -103
6860 -103 -201 -27 -188 59 -80 -14 123 70 -19 -135 -101 162 -255 -123 25 167 -28 -127 -5 -179 -310 -3
6882 -3 -96 -23 -220 168 -32 31 241 -156 -87 130 113 -17 119 75 -49 -8 124 54 -123 -153 -4 -89 -68 -114 312
6907 312 -346 266 190 -53 94 184 90 102 137 -35 276 -56 11 113 -151 218 46 -72 48 -422 -166 14
6929 14 -67 234 -149 22 -37 67 43 -107 130 -148 71 -44 -244 164 -13 -190 -161 106 78 -273 -110 189
6951 189 0 65 -31 -32 258 37 -23 -32 -19 -175 170 -129 131 -37 41 80 -270 -72 -21 -269 52 142 2 168
$$ packed form
6786h2p9Q0K7n6J15k2QN9r4N4k66K03R4m6oJ32j78l3PM4K54k18R2k73J00j24J82
6813b6m6q7K75j81O3j58N9K9M1J07j52Q0K13j76kk01L05KJ4k82O4J76j80J85J14
6838B36l86J54J16k31L33k28J74Nk62M7J2J95j60J37J02l26J37k44M4J73j28l
6860a03r8J74j61K47j39O6J37n3q9j16L4K63m17J32J48J42j95r9J22j74j31L07
6882cr3P3j97L88k00O3K10l97O9K17j7j30J36m4j24M1J32p0j77l0J49q5K1m6M26
6907C12o58O12p6k43J47R0r4J2L5j72L11l32O7J02k64L69j72j18J20m70K56J80
6929A4q1L01l83J71n9J04k4j50K37k78K19j15k00M08j77j77K9K67k8l51J63K99
6951A89j89O5r6jK90k21o0rJ3j56L45k99K60j68P8L9l50J98N1k48L21R0j40J66
$$ plain form
6975 168 -326 -179 -151 313 300 -108 62 -30 201 113 64 -13 -94 -128 -192 -16 -32 234 -127 -61 83 -17 152 105
6999 105 139 -33 -15 -237 -96 31 -65 3 76 -97 138 4 -135 -29 -54 163 -36 162 -289 -426 79 -62
7021 -62 2 237 129 -98 43 -78 -82 233 -165 61 -152 9 154 -97 -79 -13 -141 28 -158 72 50 -61
7043 -61 -119 -56 -57 118 -457 87 -145 -200 498 -160 136 341 -175 -92 -175 53 45 -66 44 -93 194 -27 13 -20
7067 -20 -128 94 18 121 108 -63 129 97 -96 303 -75 44 26 -179 141 74 -11 -76 199 112 -82 363 -18
7090 -18 -45 263 -29 -147 -67 -66 32 216 -158 98 -325 -98 -160 21 -428 -661 -422 -37 -72 -101 165 84 31 97
7114 97 412 -11 79 147 20 150 122 -55 86 138 -71 133 217 29 154 -62 -121 -322 9 -156 -2 -19 2
7137 2 -184 220 -148 275 179 -144 92 46 -4 163 107 132 89 218 -72 99 6 -15 -3 110 -81 -49 79 -81
$$ packed form
6975A68m94J47K8M64j3m08J70r2K31q8m9p7q1l4o4J76j6K66l61O6J44j00J69m7
6999A05L4j72J8k22J41J27r6O8P3j73K35j34j39J06k5K17j99J98m51j37N05j41
7021f2O4K35j08k27J41j21mL15l98K26k13J61J45k51J8O6j28J69j86K30k2j11
7043f1n8O3jJ75n75N44k32n5O98o58K96K05n16Q3q3K28qj11J10j37K87k21M0l3
7067b0j08K22p6J03j3j71J92l2j93L99l78J19j8k05L20o7q5o5K75q7j94M45l81
7090a8k7L08k92j18Q0JR8J84l74K56m23K27o2J81m49k33K39L85l5k9K66q1n3O6
7114I7L15m23R0O8j27J30k8j77J41N2k09K04Q4j88J25k16n9k01L31j65J54j7K1
7137Bj86M04l68M23r6l23K36m6n0J67n6K5m3J29k90J71r3k1J2J13j91L2J28j60
$$ plain form
7161 -81 -159 -205 -135 123 534 -89 -85 138 -158 -62 71 -361 41 3 169 -52 -31 -55 -3 271 -22 96 151 -67
7185 -67 -227 58 -52 112 55 -31 55 55 -33 -54 -121 212 58 26 -22 43 8 -82 -94 -59 -88 216 189 -94 81 127
7211 127 64 346 57 -30 9 -33 195 15 -134 21 95 86 70 167 -63 277 -22 -258 -56 134 -34 -88 -44 -133
7235 -133 60 115 76 -206 -102 113 34 -28 95 -125 1 166 -61 -41 131 -38 60 86 123 -77 -89 -31 -49 -54
7259 -54 33 -76 -77 154 52 -96 58 -183 -49 -144 50 114 5 3 -14 -65 52 -91 78 256 32 -209 73
7282 73 -70 -136 -50 -85 15 -212 -939 -17 42 -282 317 65 34 -177 109 68 275 238 -140 -423 69 -82 -11
7305 -11 -228 -195 104 192 108 3 -3 -262 -1 114 127 -125 -299 -93 -73 -48 24 2 -238 -146 -40 45 43 -147 -159
7330 -159 52 -110 -279 -39 -41 80 -297 -66 32 73 167 -167 -193 107 58 131 -208 4 71 -63 177 -26 80
$$ packed form
7161h1p8m6P0K58M11o23MK23k96R6J33m32M02l8J66k21K1k4N2K74k93J18N5k18
7185f7j60K85j10J64n7q6Q6%q8k1o7L33j54l2m8O5l5r0j2L5k9L04k7k83J75M6
7211A27o3K82k89q7L9m2K28j80j49J55P4rj6R7k30L40k99k36K02J90j68n4M4q9
7235a33J93N5l9k82J04K15p9o2J23k20J26J65k27K0J72j69R8K6L7k00j2N8j8n
7259e4Q7j09jK31j02j48J54k41J34r5J94O4j09kj7n1J17j43J69J78k24k41K82
7282G3j43o6Q6l5J00k27p27R22N9l24N99k52l1k11K86m1K07l7l78k83M92j51P1
7305a1k17L3K99Q8q4j05ok59K61J15J3k52j74K06K0K5P2k2k40R2J06Q5kj90j2
7330a59K11j62j69K40kJ21l77K31R8M1R4l34k6L00m9P3l39K12O7j34K40k03J06
$$ plain form
7353 80 67 -55 -101 274 1 356 26 22 57 -145 -11 -6 41 -177 103 243 54 -32 -105 161 49 92 -16 5
7377 5 -65 57 -149 27 154 27 -109 -12 -97 -30 -49 -70 -66 -67 147 87 130 -12 13 -167 -20 68 -64 150 -3
7402 -3 250 -120 -313 63 139 -8 -216 45 -216 16 76 224 164 72 21 59 -45 9 -75 -70 97 -114 -34 18 -204
7427 -204 -161 106 -7 96 72 -171 -87 90 -10 182 119 71 -219 -327 34 248 -57 245 17 45 51 -133 13
7450 13 -105 -166 22 121 220 -14 -24 -74 -57 258 98 -52 -93 -271 -122 -65 -2 103 -178 277 -50 0 -41 -160
7474 -160 -125 -157 -145 93 -148 -146 -61 246 -59 352 41 8 -221 -149 -202 -13 -113 17 129 7 51 134 54 -92
7498 -92 -2 -97 354 -5 100 20 126 -108 -62 158 23 -35 64 10 83 112 -105 -65 213 -22 30 -104 -7 167
7522 167 65 -115 -19 111 183 89 204 -73 91 96 50 221 98 232 -86 -56 72 83 -44 75 -35 -178 142
$$ packed form
7353H0j3j22m6L75k73L55l30mL5k02J34NM7k18K80J40j89q6p3K66j12M3j08K1
7377Ep0J22k06J76J27j27j36R7q5O7j9k1MjK14o0M3j42K5j80J47Q8j32K14j53
7402cK53l70j93L76P6j47k08K61k61K32O0J48o0r2n1L8j04N4q4NJ67k11Q0N2k22
7427b04M3K67j13J03k4k43Q4J77j00J92o3m8k90j08L61K14l05L02k28K8Oj84J46
7450A3j18o1J88R9R9k34j0n0J7L15j60j50m1j78J49N7O3J05k81M55l27N0m1j19
7474a60L5l2J2K38k41KQ5L07l05M11l11l3k29P2n3J89j00J30J12j22M4Q3q0j46
7498i2R0r5M51l59J05q0J06k34M6K20j35n8R9n4P3K9k17M0K78k35N2j34R7J74
7522A67j02j80R6J30P2r4J15k77J64Nm6J71j23J34l18L0J28J1j27J19j10j43L20
$$ plain form
7545 142 -39 167 172 -112 -84 -37 -141 276 -6 118 -4 2 76 80 -42 -121 -17 -61 7 48 28 72 93 134 -238 -88
7571 -88 66 24 -1 -5 -5 -92 -227 -49 121 -171 -35 -87 82 -279 -88 -185 -166 67 19 -123 312 -115 98 -32
7595 -32 -64 182 -10 283 2 36 37 -70 -81 -27 -49 59 371 -2 -188 -40 -92 -49 -46 108 70 -96 6 -120
7619 -120 -54 -200 -86 -79 -280 -139 129 -321 -209 47 75 17 313 -16 189 18 -178 120 4 -93 220 28
7641 28 -128 81 -145 -48 41 142 -32 -400 -33 67 63 70 221 77 235 -149 23 124 -254 48 -71 -12 -29
7664 -29 -23 -203 -35 194 -56 -324 -228 137 30 108 -40 64 -189 67 111 -60 1 -130 0 -131 -87 45 20
7687 20 -243 44 -123 53 116 10 142 -334 -39 -71 -51 -200 45 -4 -97 -38 139 67 -48 175 81 84 -109 181
7711 181 664 -188 -504 292 96 406 -128 66 274 -153 72 -287 7 51 56 174 201 -71 91 78 -92 225
$$ packed form
7545A42j81K06Nk84K8M7j04M17k82J24j22OP4Mj22p9J04m4O8M1k0M4K1M1l72J50
7571h8J54m2k5m%q7j35J78J70k92J36n2J69l61J91r7J9K33m8j42M35m27K13j30
7595c2l2K46j92K93k81L4Jj07j1N4k2J08L12l73j86J48n2M3LJ54l8j66J02j26
7619a20O6j46J14Pk01J41K68m50J12K56K8n8K96l29K05j71j96K98j16r7L13j92
7641B8j56K09k26R7Q9J01j74l68L67J00mPJ51j44J58l84J72J01l78L02j19N9j7
7664b9Oj80J68K29k50k68R6L65j07P8j48J04k53K56M4j71O1j31J30j31M4J32k5
7687B0k63K87j67J76O3j06J32m76K95l2K0j49K45m9r3N9J77p2j15K23r4Lj93K90
7711A81M83q52l16P96j96L10n34J94K08m27K25l59K94M4NJ18K7k72J62j3j70L17
$$ plain form
7733 225 68 -31 -177 138 5 101 94 108 -82 -87 -10 -97 -13 101 109 110 -129 -209 -163 147 -133 74 -84 42 -150
7758 -150 -15 169 -57 -7 172 -41 -161 29 62 43 28 183 42 158 10 -12 361 -67 -212 -48 -127 -143
7780 -143 -12 -44 -12 101 -91 17 -49 -284 146 -117 -191 -448 -10 25 -57 -113 -211 -94 141 -156 -148 -300 145
7803 145 36 -150 87 139 83 161 235 -49 61 188 -135 -17 -86 -112 -8 -96 -160 152 188 -19 59 -79 -28 -59
7827 -59 46 54 34 113 347 107 141 -113 104 158 -34 16 23 206 17 -138 281 64 -188 -2 83 116 97 -63
7851 -63 22 98 -174 -182 -9 47 27 83 86 18 -38 206 24 -51 10 -52 -34 -205 165 100 22 -84 75 133 316 69
7877 69 -20 -388 -46 239 134 25 -1 -7 -1 18 11 -28 -59 22 125 115 19 168 -182 -19 35 -126 2 64 123 0
7903 0 260 -172 -165 106 -172 191 176 -33 -112 -31 297 -59 168 104 -108 49 -32 -165 21 62 140 157 35 -107
$$ packed form
7733B25j57r9j46L15j33R6pJ4j90nP7q7Q4J14QJk39q0M6L10k80K07j58J26j92
7758a50J35J84k26N0J79k13j20J90L3j9j5J55j41J16j48k2L73m28j45J64p9j6
7780a43J31l2L2J13j92J08o6k35M30k63p4k57M38L5q2n6r8J17K35k97Qj52M45
7803A45j09j86K37N2n6P8P4k84J10J27l23J18o9k6J04q8o4L12L6k07P8j38N1l1
7827e9J05Qk0P9K34k40L4k54K17N4j92N0PJ83j89j55M19k17k52J86Q5L3j9j60
7851f3Q5P6k72qJ73N6k0N6Lo8n6K44j82p5O1o2J8j71L70o5p8j06J59N8J83k47
7877F9q9l68L42K85j05j09k6oOJ9pl9l1Q1J03j0r6J49l50J63N4j61J28O2N9j23
7903@K60m32PK71k78L63j5k09p9Q1L28l56K27o4k12J57q1j33J86M1P8J7j22j42
$$ plain form
7927 -107 2 108 204 -47 138 -118 80 130 -82 -49 -16 -118 -46 63 -238 -129 -352 62 38 -15 -150 117
7949 117 150 -187 -73 -106 -149 -68 -141 30 -154 198 -55 -119 -168 250 272 -36 238 31 77 -41 -133 135 201 -105
7973 -105 51 30 -219 -168 -132 -3 -150 -106 -2 -56 -155 211 49 -89 138 56 -102 -95 -138 27 -229 -36 -15 189
7997 189 38 -189 74 -53 68 -60 76 120 -79 -236 -91 116 -40 -142 -112 -137 -149 -292 21 -45 -142 -28
8019 -28 -149 72 108 118 167 -33 57 -82 57 129 207 35 54 78 207 14 -155 174 -88 21 -44 -108 176 71
8043 71 -449 82 187 -12 -166 92 14 -27 18 -195 254 -127 -15 -104 6 199 32 168 -40 115 -246 -39
8065 -39 -300 -38 -140 -110 -23 112 -282 -129 233 -11 -326 -27 29 -146 -450 -83 -53 -334 -265 53 50 129 205
8088 205 7 -137 7 63 -162 -65 61 156 142 13 31 67 57 -97 -81 14 203 -87 128 -260 -30 89 84 -52
$$ packed form
7927a07J09J06R6k51J85k56J98N0k12L3L3j02P2J09l01J09k23M14k4n3j35K67
7949A17L3l37J14l3m3Q1p3J71j84L52k53o4m9M18K2l08K74k07M6j18r2K68O6l06
7973a05J56k1k49N1L6J29j47M4J04n4r9L66j62j38K27q2j58Pm3J65k56J93K1K04
7997A89j51k27K63j27J21j28J36M4j99j57J45K07j56j02L0k5j2j43L13o6r7J14
8019b8j21K21L6J0M9k00R0j39J39P2P8j72J9K4J29j93j69L29k62J09o5o4K84j05
8043G1n20N31J05j99j54K58p8m1M5k13M49l81J12q9J10J93j67J36k08J55l61K07
8065c9k61K62j02L0Q7J35l94J53L62k44l15K99N6j75l04L67L0k81O9L18lP9P6
8088B05j98j44J44N6k25R7J26R5j4j29J8L6j0j54J6R5J89k90K15l88K30J19nj36
$$ plain form
8112 -52 164 141 159 341 -212 137 16 19 105 -18 -1 -23 -16 -118 12 -267 126 108 83 -95 -62 24 -88 68 247
8137 247 61 -143 181 -107 92 147 -241 22 -1 102 150 -146 -53 134 -5 79 16 -62 138 30 82 -3 31
8160 31 -50 -96 -222 153 -120 263 213 -25 -205 75 45 -37 46 -171 31 -130 -65 25 77 -22 163 -174 -129 -186
8184 -186 -111 -12 -15 -114 -6 -21 157
$$ packed form
8112e2K16k3J8J82n53L49j21LQ6j23J7k2Pj02J30k79L93j8k5j78L3Q6j12J56J79
8137B47j86k04L24k88J99N5l88K63k3J03M8k96R3J87j39Q4o3p8K00j08N2q5L4
8160C1q1m6j26L75k73L83n0k38j80K80l0q2Q3k17K02j61O5R0N2r9J85l37M5n7
8184a86P5R9lr9J08j5J78
8191A57
$$ Imaginary data points
##PAGE= N=2
##DATA TABLE= (X++(I..I)), XYDATA
$$ plain form
0 0 0 0 0 0 0 0 0 0 0 8 -8 8 -8 16 -16 16 -24 32 -34 40 -50 64 -72 88 -103 120 -136 160 -182 208 -237 269
32 269 -306 346 -389 438 -492 550 -615 685 -760 846 -935 1038 -1145 1265 -1394 1537 -1693
49 -1693 1865 -2055 2263 -2495 2754 -3045 3372 -3746 4177 -4680 5275 -5992 6875 -7994 9460
64 9460 -11473 14408 -19084 27675 -48417 196504 131089 -225198 203705 -82098 -92098 146691
76 146691 -99309 -21237 116800 -6265 36918 -56174 -7853 74470 -25838 -12119 14916
87 14916 -20215 23623 20384 -36026 -5255 97305 -7542 -57212 18322 -54925 18835 45823
99 45823 -79839 57637 32376 -44828 38754 -86876 -20234 82456 -66073 4701 12229
110 12229 -35742 49331 -40510 -38872 25282 -17311 18199 -34068 -43185 38172 -3855 -6547 -3679
$$ packed form
0@%%%%%%%%%Qj6J6j6K4l2L2m0N6o6P4r0J14j36J60j91K23k56K96l42L90m45N06
32B69n75O52p35Q27r30J042j165J300j445J606j781J973k183K410k659K931l230
49a693L558l920M318m758N249n799O417p118P923q857R955j1267J2867j4869J7454
64I460k0933K5881l3492M6759p6092K44921o5415l56287M28903k85803j0000K38789
76A46691k46000P8072J38037j23065M3183r3092M8321Q2323j00308J3719K7035
87A4916l5131M3838l239n6410L0771J02560j04847m9670P5534p3247P3760K6988
99D5823j25662J37476k5261p7204Q3582j25630O6642J02690j48529P0774P528
110A2229m7971Q5073q9841J638O4154m2593L5510n2267r117Q1357m2027k692K868
$$ plain form
123 -3679 -14096 17186 -10588 -20828 -20038 8146 31947 -25052 -3431 -1313 -10092 30290 -40317
136 -40317 -8024 43117 -18076 34280 -11130 -34243 66177 -25331 -16360 39383 -37107 46187
148 46187 29598 -48375 43364 11795 -16616 21327 -22544 5995 35558 5251 965 4540
160 4540 15551 3465 -6185 -7388 -165 25852 -7485 -2142 12580 -19638 29862 -3777 -40187
173 -40187 39092 -16472 -18956 28155 -41583 20778 30609 -43992 13961 -14688 -26111 22210
185 22210 -33281 -4146 22757 -15573 8494 -13636 -21574 10412 -11627 -11257 8 -3193 -2455
198 -2455 -3482 -5155 -12045 12394 5333 -23544 6728 -7033 -10844 19291 -14178 5523 16432
211 16432 -16406 10912 -10383 -7123 28524 -16308 6219 17889 -20489 18194 2240 -15366
$$ packed form
123c679j0417L1282k7774j0240P90K8184K3801n6999K1621K118q779M0382p0607
136d0317L2293N1141o1193N2356m5410k3113J00420r1508Q971N5743p6490Q3294
148D6187j6589p7973R1739l1569k8411L7943m3871K8539K9563l0307m286L575
160D540J1011j2086r650j203P223K6017l3337N343J4722l2218M9500l3639l6410
173d0187P9279n5564k484M7111o9738O2361R831p4601N7953k8649j1423M8321
185B2210n5491K9135K6903l8330K4067k2130p938L1986k2039L70J1265l201P38
198b455j027j673o890K4439p061k8877L0272j3761l811L0135l3469J9701J0909
211A6432l2838K7318k1295L260L5647m4832K2527J1670l8378L8683j5954j7606
$$ plain form
223 -15366 25702 5493 2193 11765 -5467 6599 6935 3474 6965 3604 9631 2809 4389 7449
237 7449 772 6085 -2461 1371 4886 -2523 14383 1049 1125 17301 -18839 -5941 5239 -23065
251 -23065 10308 8061 -9866 15921 -6066 -11145 -1464 -16108 1310 -7436 -14169 9241 -6826
264 -6826 -5107 9204 -10925 -6078 -227 -17147 -17217 -4331 638 -624 4697 4012 -1432 -1899 -11938
279 -11938 -12581 -6732 917 13150 -1489 -2383 12908 -5998 -4306 2285 -9752 7363 7163 -5273
293 -5273 4847 4470 11725 10776 -5420 4966 5579 -5213 -1013 -1781 6080 17920 13309 1941 -3621
308 -3621 5402 1890 -9080 2064 9479 9980 12958 779 -7159 3312 5545 -5481 -5296 6468
322 6468 6339 3243 -2279 -10083 3131 7460 -4971 -5092 -5123 1919 5121 -10198 -4509 2605 -1892
$$ packed form
223a5366M1068k0209l300R572j7232J2066L36l461L491l361O027o822J580L060
237G449o677N313q546L832L515p409J6906j3334P6J6176l6140J2898J1180k8304
251b3065L3373k247j7927K5787k1987n079R681j4644J7418q746o733K3410j6067
264f826J719J4311k0129M847N851j6920p0J2886M969j262N321o85n444m67j0039
279a1938o43N849P649J2233j4639q94J5291j8906J692O591j2037J7115k00j2436
293e273J0120l77P255r49j6196J0386O13j0792M200p68P861J1840m611j1368n562
308c621R023l512j0970J1144P415N01K978j2179p938J0471K233j1026J85J1764
322F468j29l096n522p804J3214M329j2431j21l1P042L202j5319N689P114m497
$$ plain form
337 -1892 -255 -16038 -14707 6985 -3295 -6308 849 -4978 5519 -1816 -22646 -9722 1346
350 1346 1828 2143 -7146 459 7193 -7418 -11011 -8410 -2546 12192 1751 -9591 6821 9092
364 9092 -451 -889 -5080 1926 13113 -2460 -9284 4258 10523 14142 4987 -6123 6346 5594
378 5594 -6823 -3341 -620 13704 22610 1548 -1634 5372 -743 1394 -8001 -6654 17687 10863
392 10863 -2223 -549 -3358 7464 7659 -11004 -5401 4557 1961 -214 -7860 -905 13819 1449
406 1449 -10470 -8117 -6719 2056 1042 -12360 281 12509 -1932 -8971 -11661 -7279 8132 -2488
420 -2488 -11791 -1438 -2058 2597 -3054 -17051 3252 8560 -8516 -5167 -8945 -2961 11508 -6437
434 -6437 -8355 7835 2768 2833 -4255 -12824 8516 10241 -7404 -779 868 4120 12609 -4073 -4714
$$ packed form
337a892J637j5783J331K1692j0280l013P157n827J0497p335k0830J2924J1068
350A346M82L15r289P605O734j4611l593K601N864J4738j0441j1342J6412K271
364I092r543m38m191P006J1187j5573o824J3542O265L619r155j1110J2469p52
378E594j2417L482K721J4324Q906k1062l182P006o115K137r395J347K4341o824
392A0863j3086J674k809J0822J95j8663N603R958k596k175p646O955J4724j2370
406A449j1919K353J398Q775j014j3402J2641J2228j4441p039k690M382J5411j0620
420b488r303J0353o20M655n651j3997K0303N308j7076L349l778N984J4469j7945
434f437j918J6190n067O5p088q569K1340J725j7645O625J647L252Q489j6682o41
$$ plain form
449 -4714 12487 5485 867 -1379 -5045 14515 11353 -8005 4005 5726 4136 11584 -6114 -4231
463 -4231 15931 1885 -4800 1330 -847 12936 8830 -9282 2078 3890 -3342 504 -10300 -1220
477 -1220 17008 -2272 -7922 237 -6065 3637 -1658 -16063 3776 5671 -5800 -390 -9303 -1872
491 -1872 10320 -10252 -11074 -164 -5653 687 -4009 -9161 7757 4529 -7139 -6060 -9167 197
505 197 6495 -8770 -3142 7088 -2377 61 -2454 -8844 7832 5671 -7473 1297 798 2918 6445
520 6445 -6776 1986 10146 -1265 2338 -1580 -2691 14243 3924 -4690 5858 1353 2615 4243
534 4243 -3836 5431 11059 1231 1475 532 -579 7456 909 -5512 7382 5120 -1523 4042 -3675
549 -3675 854 8208 -7788 -3444 1298 -4943 8137 -304 -5701 9030 -6874 -10210 -800 -11530
$$ packed form
449d714J7201p002m618k246l666J9560l162j9358J2010J721j590P448j7698J883
463d231K0162j4046o685O130k177J3783m106j8112J1360J812p232L846j0804R080
477a220J8228j9280n650Q159o302R702n295j4405J9839J895j1471N410q913P431
491a872J2192k0572q22J0910n489O340m696n152J6918l228j1668J079l107R364
505A97O298j5265N628J0230r465K438k515o390J6676k161j3144Q770m99K120L527
520F445j3221Q762Q160j1411L603l918j111J6934j0319q614J0548m505J262J628
534D243q079R267N628r828K44r43j111Q035o547o421J2894k262o643N565p717
549c675M529P354j5996M344M742o241J3080q441n397J4731j5904l336R410j0730
$$ plain form
563 -11530 1762 6024 -7909 3055 -238 -8024 -1639 -8730 -5710 3329 -4124 -3832 541 -3453
577 -3453 -484 1211 -3995 -1571 -1036 -8992 -2934 421 -1252 10082 2890 -3416 6243 -7172 -7343
592 -7343 4916 -3599 6760 9372 -3834 5235 1090 -3050 4628 -2461 5255 7731 -4728 3172
606 3172 3662 851 10372 4166 -1857 3066 583 -4950 -979 5814 5870 7865 3726 -3658 1400 -1737
622 -1737 -2881 1193 -813 8903 4143 -7916 1489 -2328 -1463 5779 -7848 -1372 4191 -7216 -1414
637 -1414 -3683 -1699 7814 -4627 -6496 -3040 -4506 244 -5011 -5179 1962 771 -2881 -7882 -4911
652 -4911 1428 410 -1354 -5664 102 3039 -6472 -1878 -2655 -346 9298 -6039 -5436 4638 -2007
667 -2007 3885 -2258 -5694 10960 1930 -1477 2372 -2661 8534 5662 -5929 2242 4127 5017 3572
$$ packed form
563a1530J3292M262j3933J0964l293p786O385p091L020R039p453K92M373l994
577c453K969J695n206K424N35p956O058L355j673J1334p192o306R659j3415j71
592g343J2259q515J0359K612j3206R069m145m140P678p089P716K476j2459P900
606C172M90k811R521o206o023M923k483n533L971O793N6J995m139p384N058l137
622a737j144M074k006R716m760j2059R405l817Q65P242j3627O476N563j1407N802
637a414k269J984R513j2441j869L456j466M750n255j68P141j191l652n001K971
652d911O339j018j764m310N766K937r511M594p77K309R644j5337O03J0074o645
667b007N892o143l436J6654r030l407L849n033J1195k872j1591Q171J885Q90j445
$$ plain form
682 3572 -3020 3306 7592 3624 -1540 -426 4673 4941 2758 -4956 -1597 10671 1765 -1735 2272
697 2272 -1898 6035 172 -9379 1902 2096 3340 1684 -8692 3657 3842 -6244 -1917 -4775 1669
712 1669 5693 -7262 -5642 -914 1789 1440 -8005 -4067 1296 -884 -3025 -8529 -1164 4690 -913
727 -913 -2722 -6736 25 4138 -6129 -4670 -586 2032 3570 -6858 -3982 2828 2040 3155 -5214
742 -5214 -2858 6801 -460 -2910 -1551 2668 8711 1439 -1306 -326 2012 6746 -3368 -3881 7446
757 7446 6104 5369 -203 -1700 6805 3486 405 -2166 -1424 8709 2609 -3129 3124 2450 4850 738
773 738 -7156 507 3587 1014 -2395 -3425 4428 3710 -1595 -3652 -4633 2213 1107 -6864 -4417 68
789 68 3449 -318 -5017 -1546 -1259 -329 -4494 -10328 1150 3191 -2336 -1305 -4496 356 2139 -6901
$$ packed form
682C572o592O326M286l968n164J114N099K68k183p714L359J2268q906l500M007
697B272m170P933n863r551J1281J94J244j656j0376J2349J85j0086M327k858O444
712A669M024j2955J620M728K703l49r445L938N363k180k141n504P365N854n603
727i13j809m014O761M113j0267J459M084K618J538j0428K876O810p88J115q369
742e214K356R659p261k450J359M219O043p272k745R80K338M734j0114n13J1327
757G446j342p35n572j497Q505l319l081k571P42J0133o100n738O253o74K400m112
773G38p894P663L080k573l409j030P853p18n305k057r81O846j106p971K447M485
789F8L381l767m699L471K87R30m165n834J1478K041n527J031l191M852J783r040
$$ plain form
805 -6901 -4446 -2038 523 4162 -4817 -3208 5138 841 -1378 -2615 -1841 2092 1335 -2018 -1899 4270
821 4270 6635 -100 -2846 -1034 3390 2771 -1482 1413 2601 4607 5481 -4409 -973 7097 1122 1696
837 1696 1253 -242 6636 1130 -2730 2753 2485 5313 2188 -4384 1737 3944 -934 -451 -299 1406
853 1406 4082 -351 -4729 -1194 1261 -623 -736 -2619 -42 2695 -4433 -4605 -496 -1842 2239 -1431
869 -1431 -6078 822 -1327 -4611 -2146 -4908 902 3103 -4767 -2294 -1000 -2853 678 -2696 -3346
884 -3346 2473 -173 -2565 -1619 -968 2411 1669 -1358 35 443 -848 1259 -454 252 6452 2946
900 2946 -1314 1762 -81 -87 3616 -208 1752 5138 799 1096 913 216 4905 1649 -377 3120 -546
917 -546 394 3218 -1284 3275 4773 -824 1024 -1103 -3113 2006 -582 -241 4136 -86 -585 448
$$ packed form
805f901K455K408K561L639q979J609Q346m297k219j237P74L933p57l353J19O169
821D270K365o735k746J812M424o19m253K895J188K006Q74r890L436Q070n975N74
837A696m43j495O878n506l860N483k68K828l125o572O121K207m878M83J52J705
853A406K676m433m378L535K455j884j13j883K577K737p128j72M109j346M081l670
869a431m647O900k149l284K465k762N810K201p870K473J294j853L531l374o50
884c346N819k646k392R46O51L379p42l027J393M08j291K107j713P06O200l506
900B946m260L076j843oL703l824J960L386m339K97j83o97M689l256k026L497l666
917e46R40K824m502M559J498n597J848k127k010N119k588L41M377m222m99J033
$$ plain form
933 448 -3750 -607 300 -2640 242 -938 -2741 341 -2140 -2260 986 -3210 -2963 -76 -4606 -2562
949 -2562 691 -2761 807 1269 -4207 -1012 -1665 -3744 -473 -2418 -600 2502 -2589 -538 802 -2286
965 -2286 1644 -452 -3688 2281 1066 -721 2397 -5 1592 3624 -1025 -666 1449 513 2700 1914
981 1914 -401 4879 3707 -529 2165 1539 1457 3428 -1486 -19 4501 1415 2580 98 -1446 4532
997 4532 291 -3105 1274 294 2646 2417 -3165 165 1894 -964 -813 -2333 -154 2665 -2137 -3928
1013 -3928 -590 312 65 -1169 -3964 -1716 1910 -2385 -3759 -1269 -341 1570 -2931 -6028 304 -1
1029 -1 -2062 -293 -4084 587 3050 -5097 -3696 929 726 2894 -2621 -3469 2665 178 -920 -1369
1045 -1369 -1917 4158 2786 -3483 -315 2944 2222 2096 -543 -654 4493 2598 -2384 47 2767 5074
$$ packed form
933D48m198L143R07k940K882j180j803L082k481j20L246m196K47K887m530K044
949b562L253l452L568M62n476L195o53k079L271j945J818L102n091K051J340l088
965b286L930k096l236N969j215j787L118k402J597K032m649L59K115r36K187p86
981A914k315N280j172m236K694o26q2J971m914J467M520l086J165k482j544N978
997D532m241l396M379r80K352k29n582L330J729k858J51j520K179K819m802j791
1013c928L338R02k47j234k795K248L626m295j374K490R28J911m501l097O332l05
1029ak061J769l791M671K463q147J401M625k03K168n515q48O134k487j098m49
1045a369n48O075j372o269L168L259p22j26k639j11N147j895m982K431K720K307
$$ plain form
1061 5074 3055 -3415 616 4626 394 1291 -741 598 6805 1560 -2521 899 2172 3450 -1227
1076 -1227 -4679 1623 3331 -142 -536 -1693 1615 3134 -3069 -5122 -831 2424 215 -2621 -2386
1091 -2386 868 1543 -3161 -4562 -850 897 656 -4243 -5587 1748 1966 -2413 -2413 -2037 1426 900 -4943
1108 -4943 -3857 -277 2610 1531 -4038 -799 2900 -585 -1861 -2450 -108 3974 322 -3271 -366
1123 -366 3078 3296 -480 -1641 1397 3189 500 -2826 -223 3940 4385 1764 -1432 455 3579 995
1139 995 -1306 -115 3656 4825 -460 -1554 1017 2163 2907 -389 -2086 2046 2494 -989 -2388 242
1155 242 3323 2327 -883 -2354 -956 779 -798 -3427 -395 2618 1461 -2843 -3497 -1047 -33 -822
1171 -822 -3220 -2389 1033 306 -2069 -3014 -1399 1277 -586 -4011 -2467 -599 -592 -812 -1927 -507 1461
$$ packed form
1061E074k019o470M031M010m232Q97k032J339O207n245m081L420J273J278m677
1076a227l452O302J708l473l94j157L308J519o203k053M291L255k209k836K35
1091b386L254O75m704j401L712J747k41m899j344P335K18m379%L76L463n26n843
1108d943J086L580K887j079n569L239L699l485j276n89K342M082l652l593K905
1123c66L444K18l776j161L038J792k689l326K603M163M45k621l196J887L124k584
1139I95k301J191L771J169n285j094K571J146P44l296j697M132M48l483j399K630
1155B42L081r96l210j471J398J735j577k629L032L013j157m304o54K450J014p89
1171h22k398Q31L422p27k375r45J615K676j863l425J544J868Pk20j115J420J968
$$ plain form
1188 1461 -40 -2640 -2559 525 1535 -687 -801 472 1150 962 -603 -846 1043 2347 1150 -1304
1204 -1304 1000 2956 990 857 404 1051 2860 1439 -438 695 1954 2265 251 193 1440 2028 1125
1221 1125 350 424 1112 1829 484 125 237 909 264 -849 -578 768 1140 -385 -706 -145 -1031 -648 -1123
1240 -1123 -2101 16 973 -897 -652 -1170 -1680 -1343 -2053 -1253 -746 -1057 -394 -1282 -1796 -97 -1053 -1727 -946
1259 -946 -1703 -1181 37 -888 -164 16 -393 -252 -586 -1764 -522 -190 -213 1739 784 -76 1423 9
1277 9 -242 753 52 1398 1508 283 1956 1235 1088 2361 -360 213 2366 23 503 1940 342 2345
1295 2345 2109 -41 630 749 617 384 -610 638 1734 502 155 18 -581 765 -143 -2285 103
1312 103 815 -397 72 -1458 -821 1055 -1650 -2138 -513 -1706 208 -813 -3053 -65 -31 -1860 -987
$$ packed form
1188A461j501k600Q1L084J010k222j14J273O78j88j565k43J889J304j197k454
1204a304K304J956j966j33m53O47J809j421j877J133J259L11k014n8J247N88r03
1221A125p75P4O88P17j345l59J12O72o45j113K71J346L72j525l21N61q86L83m75
1240a123r78K117R57j870K45n18n10L37p10Q00N07l11O63q88n14J699r56o74P81
1259i46p57N22J218r25P24J80m09J41l34j178J242L32k3J952r55q60J499j414
1277Ik51R95p01J346J10j225J673p21j47J273k721N73K153k343M80J437j598K003
1295B345k36k150O71J19j32k33r94J248J096j232l47j37n99J346r08k142K388
1312A03P12j212M69j530O37J876k705m88J625j193J914j021k240K988L4j829Q73
$$ plain form
1329 -987 -2044 -601 613 -2143 -1697 -341 -484 103 -1328 -2350 614 1036 -1215 -780 -138 129 764
1346 764 -1062 -1096 1727 934 1084 110 -1204 2460 1546 -1494 1246 1024 1427 2789 -1086 269 2889
1363 2889 915 478 57 -66 3461 1499 -513 1367 1232 1502 1277 -1533 249 2687 514 -533
1379 -533 184 583 2153 42 -2405 295 484 245 -313 -2594 -309 2304 -2055 -2082 -236 -537 848
1396 848 -2191 -4058 593 673 -986 -1168 -3109 144 918 -3031 -1948 30 -269 777 -2375 -3057 984
1413 984 654 -1564 -720 -956 1295 1346 -3387 -1257 1661 722 762 -825 -1480 2908 1659 -1280 83
1430 83 530 2633 1536 -2488 483 2994 1210 1523 -51 81 3746 530 -2120 878 2364 2591
1446 2591 1288 -1672 707 2932 118 -795 -720 790 3034 -379 -2707 1497 1598 384 -297 -2863
$$ packed form
1329i87j057J443J214k756M46J356j43N87j431j022K964M22k251M35O42K67O35
1346G64j826l4K823p93J50r74j314L664r14l040K740k22M03J362l875J355K620
1363B889j974m37m21j23L527j962k012J880j35K70k25k810J782K438k173j047
1379e33P17L99J570k111k447K700J89k39n58k281K285K613m359k7J846l01J385
1396H48l039j867M651Q0j659j82j941L253P74l949J083J978k99J046l152o82M041
1413I84l30k218Q44k36K251N1m733K130K918r39M0j587o55M388j249k939J363
1430H3M47K103j097m024K971K511j784L13j574J32L665l216k650K998J486K27
1446B591j303k960K379K225k814r13P5J510K244l413k328M204J01j214o81k566
$$ plain form
1462 -2863 501 1834 -2105 -1808 -254 979 2061 -2222 -3564 538 -27 -1683 -1823 -2501 1287 1689
1478 1689 -2773 -2326 -521 -66 -87 -3310 -2365 2163 363 -1149 -1032 -1087 1283 596 -3790 -1584 1126
1495 1126 1091 211 -1339 -23 2838 456 -1552 -670 235 2521 890 -1961 1323 2733 881 154
1511 154 -783 384 3136 508 -1028 1523 1845 2239 657 -1906 1653 2837 -206 128 -91 1173
1527 1173 2864 -1210 -1076 1646 564 902 -744 -1893 1641 1124 -1856 -464 -202 344 947 -2221
1543 -2221 -1794 813 -24 -1273 -1444 -1219 371 -431 -2697 -1178 -88 -290 123 -2273 -1593 857 -1509
1560 -1509 -1687 -913 -1032 968 -228 -1951 -316 -389 -133 42 -1676 324 1237 -581 -296 230 886 1069
1578 1069 -64 -480 530 931 741 696 397 1606 2156 -61 288 1459 221 1196 1492 -200 1849
$$ packed form
1462b863L364J333l939K97J554J233J082m283j342M102n65j656j40o78L788M02
1478A689m462M47J805M55k1l223R45M528j800j512J17n5K370o87m386K206K710
1495A126l5q80j550J316K861k382k008Q82R05K286j631k851L284J410j852p27
1511A54r37J167K752k628j536K551L22L94j582k563L559J184l043L34k19J264
1527A173J691m074J34K722j082L38j646j149L534n17k980J392K62N46O03l168
1543b221M27K607q37j249j71K25J590q02k266J519J090k02M13k396O80K450k366
1560a509j78P74j19K000j196j723J635p3K56J75j718K000R13j818K85N26O56J83
1578A069j133m16J010M01j90m5k99J209N50k217L49J171j238R75K96j692K049
$$ plain form
1595 1849 1564 -92 1066 291 945 1135 -615 830 535 -213 1283 -89 -102 958 -603 -258 266
1612 266 -833 56 -292 -710 -9 -685 -1255 -450 -215 -930 -602 -667 -1340 -358 -587 -1209 -232 -964 -1026 -690
1632 -690 -1763 156 -183 -1542 -47 -1148 -1015 290 -1434 -704 591 -132 -494 -945 -396 254 -20
1649 -20 109 -52 496 995 -38 -643 314 931 1063 -8 515 879 1030 936 -487 691 1514 496 386
1668 386 57 734 2174 510 179 648 856 1053 -567 -273 1198 1223 1174 -854 -582 1250 333 -939
1686 -939 -736 -205 1140 62 -1462 -441 113 705 -1135 -2249 39 209 -530 -1547 -1513 448 555
1703 555 -954 -2092 -1424 123 -767 -1809 -1138 -321 777 -663 -1903 -395 -24 -132 -921 -2091 723
1720 723 1292 -683 -711 -629 1191 1175 -1555 -617 836 984 1216 -946 -228 2153 1550 -96 -430 1080
$$ packed form
1595A849k85j656J158p75O54J90j750J445k95p48J496j372j3J060j561L45N24
1612B66j099Q89l48m18P01o76n70Q05K35p15L28o5o73R82k29o22R77p32o2L36
1632f90j073J919l39j359J495j101J33J305j724P30J295p23l62m51N49O50k74
1649b0J29j61N48M99j033o05R57O17J32j071N23L64J51r4j423J178Q23j018j10
1668C86l29O77J440j664l31M69K08J97j620K94J471K5m9k028K72J832r17j272
1686i39K03N31J345j078j524J021N54N92j840j114K288J70p39j017L4J961J07
1703E55j509j138O68J547q90j042O71Q17J098j440j240J508L71j08p89j170K814
1720G23N69j975k8Q2J820j6k730R38J453J48K32k162P18K381o03j646l34J510
$$ plain form
1738 1080 2222 731 -172 -118 1523 2213 -121 -767 429 2337 1367 -907 227 1121 1239 515 -1246
1755 -1246 143 2021 562 -412 -809 434 1585 -819 -1728 -167 455 777 -1044 -1955 418 465 -675
1772 -675 -1699 -1970 534 511 -1298 -1334 -444 328 -329 -1624 -1944 -140 703 -1402 -1915 -190 437 370 -1551
1791 -1551 -1673 434 135 -486 -1299 -1283 1640 1014 -1257 -201 456 919 831 -1525 -172 1936 687 160
1809 160 -147 685 2314 722 -828 -33 1438 1405 453 -208 963 2120 931 -473 -36 609 1759
1826 1759 529 -1348 1078 1555 -155 358 -815 379 1924 -491 -1050 211 358 757 -856 -1493
1842 -1493 619 242 -248 -721 -1389 267 439 -1798 -1373 -123 106 -52 -1194 -1784 325 268 -1454 -1115
1860 -1115 -720 57 424 -1762 -1351 700 48 -497 -1326 -898 1060 66 -1116 -6 43 1197 609 -1626
$$ packed form
1738A080J142j491r03N4J641O90k334o46J196J908r70k274J134Q94J18p24j761
1755a246J389J878j459r74l97J243J151k404r09J561O22L22j821r11K373M7j140
1772f75j024k71K504k3j809l6Q90P72o57j295l20J804Q43k105n13J725O27o7j921
1791a551j22K107k99o21q13J6K923o26k271J056O57M63q8k356J353K108j249n27
1809A60l07Q32J629j592j550P95J471l3r52o61J171J157j189j404M37O45J150
1826A759j230j877K426M77j710N13j173J194J545k415n59J261J47L99j613o37
1842a493K112l77m90m73o68J656J72k237M25J250K29j58j142n90K109n7j722L39
1860a115L95P77L67k186M11K051o52n45q29M28J958r94j182J110M9J154n88k235
$$ plain form
1878 -1626 86 1421 15 143 -376 62 1911 441 -460 576 1032 1212 546 -380 941 1796 420
1895 420 459 325 842 1800 40 -635 1131 905 586 503 -834 977 1278 -884 -3 -6 -289 1201 -610
1914 -610 -1100 740 -158 -430 -538 -1300 734 -87 -1340 -358 -539 -515 139 -1446 -1173 609 -593 -1203
1932 -1203 -349 -862 -293 131 -1421 -835 -193 -693 -145 -879 -910 765 -629 -521 514 -793 386 427
1950 427 -922 303 436 -337 781 -365 21 1284 -273 297 868 264 1233 1026 -228 1254 656
1967 656 322 794 531 762 1083 446 756 787 160 813 744 -386 500 380 -219 1103 402 -340 559 24
1987 24 -272 150 -599 279 151 -447 249 -352 -755 29 -1224 -817 151 -510 -550 -468 -1259 -228 -16 -996
2007 -996 -1077 -590 -793 98 -1068 -877 476 -456 -833 -271 -718 54 165 -1199 26 180 -44 238 -862
$$ packed form
1878a626J712J335j406J28n19M38J849j470r01J036M56J80o66r26J321Q55j376
1895D20L9j34N17R58j760o75J766k26l19q3j337J811L01k162Q81lk83J490j811
1914f10m90J840q98k72j08p62K034q21j253R82j81K4O54j585K73J782j202o10
1932a203Q54n13N69M24j552N86O42n00N48p34l1J675j394J08J035j307J179M1
1950D27j349J225J33p73J118j146L86J263j557N70N71o04R69k07j254J482n98
1967F56l34M72k63K31L21o37L10L1o27O53o9j130Q86j20n99J322p01p42Q99n35
1987B4k96M22p49Q78j28n98O96o01m03P84j253M07R68o61m0Q2p91J031K12r80
2007i96q1M87k03Q91j166J91J353r32l77N62m47P72J11j364J225J54k24K82j100
$$ plain form
2026 -862 -111 1437 -464 -301 -227 -17 998 595 -229 199 834 621 1322 444 842 1605 438 177 511
2045 511 864 1364 229 -620 1004 1497 299 18 -4 620 1625 -75 -577 372 477 92 -275 -752 764
2064 764 947 -656 -909 -242 496 52 -1331 -1035 222 30 -623 -1573 -776 632 189 -1690 -1105 -113
2082 -113 -79 -404 -1665 -859 558 90 -977 -1238 -138 797 -216 -1391 -391 445 435 -344 -1131 327
2100 327 1192 127 -596 -511 852 1341 -325 -705 630 1346 850 -297 -254 1168 1425 -114 -450 786
2118 786 1653 770 -522 -72 1389 1309 387 -309 -138 1671 1316 -872 -260 1051 1215 533 -634 -309
2136 -309 878 840 -322 -1135 274 858 -106 -1329 -560 583 185 -788 -1134 -201 612 -296 -1480 -869
2154 -869 336 150 -699 -1680 -658 632 -295 -1462 -850 -93 609 -501 -1401 -445 526 131 -1209 -586
$$ packed form
2026h62P51J548j901J63P4K10J015m03q24M28O35k13P01q78L98P63j167k61L34
2045E11L53N00j135q49J624M93j198k81k2O24J005j700n02R49J05l85l67m77J516
2064G64J83j603k53O67P38m44j383K96J257j92o53r50P97J408m43j879N85R92
2082a13L4l25j261Q06J417m68j067k61J100R35j013j175J000Q36j0p79p87J458
2100C27Q65j065p23Q5J363M89j666l80J335P16m96j147M3J422K57j539l36J236
2118G86Q67q83j292M50J461q0r22o96J71J809l55k188O12J311J64o82j167L25
2136c09J187l8j162q13J409N84r64j223P69J143l98r73l46R33Q13r08j184O11
2154h69J205j86q49r81J022J290r27j167O12P57P02j110r00R56R71l95j340O23
$$ plain form
2172 -586 513 149 42 -793 -516 1069 722 -601 -711 747 1492 121 -555 453 927 1041 112 -484
2190 -484 829 1398 567 99 462 916 1252 141 -52 547 1414 540 -218 -20 509 1456 274 -661 728
2209 728 613 487 -290 -666 191 402 -433 -478 -343 331 584 -1025 -650 233 -110 -295 -570 -551 -5 27 -908
2230 -908 -1029 -519 113 -279 -1094 -639 154 -257 -475 -717 -718 202 134 -939 -325 -62 91 413 -653 -268
2250 -268 495 -215 94 -4 -167 878 154 -397 206 252 964 470 100 604 405 117 552 190 520 1068
2270 1068 451 -4 669 406 682 697 16 269 946 516 417 170 33 665 103 -385 566 -166 56 364
2290 364 -575 76 469 -358 13 -350 -442 240 -522 -615 -377 -519 -439 -461 -688 -710 -111 -536 -406 -425 -589 -121
2312 -121 -523 -834 86 -335 -399 15 -1071 -271 436 -661 -154 61 -513 491 -243 -423 178 -177 212
$$ packed form
2172e86J099l64j07q35K77J585l47j323j10J458P45j371o76J008M74J14r29n96
2190d84J313N69q31m68L63M54L36j111j93N99Q67q74p58J98N29R47j182r35J389
2209G28j15j26p77l76Q57K11q35m5J35O74K53j609L75Q83l43j85k75J9N46L2r35
2230i08j21N10O32l92q15M55P93m11k18k42jR20o8j073O14K63J53L22j066L85
2250b68P63p10L09r8j63J045p24n51O03M6P12m94l70N04j99k88M35l62L30N48
2270A068o17m55O73k63K76J5o81K53O77m30r9k47j37O32n62m88R51p32K22L08
2290C64r39O51L93q27L71l63r2O82p62r3K38j42Q0k2k27k2N99m25J30j9j64M68
2312a21m02l11R20m21o4M14j086Q00P07j097N07K15n74J004p34j80O01l55L89
$$ plain form
2331 212 285 -344 624 671 -46 629 181 160 948 223 -52 760 629 474 209 134 592 738 246 515 608 270
2353 270 695 258 -215 775 552 -111 307 -255 852 530 -611 -7 5 215 669 -634 -404 510 82
2372 82 -407 -334 -406 -57 -77 -948 -742 -430 -232 -370 -1103 -765 84 -305 -498 -693 -385 54 -161 -1113 -263
2393 -263 69 -391 -174 -857 0 933 -85 -673 -105 -202 570 3 -952 211 487 79 85 -605 735 835
2413 835 31 55 515 640 827 470 -297 771 1169 -1 441 226 611 854 208 -352 576 692 440 -18
2433 -18 -720 584 861 -360 -130 -169 535 654 -762 -655 403 408 -9 -759 -497 520 38 -879 -636 -170
2453 -170 174 -241 -1006 -614 568 48 -972 -949 -405 399 -315 -1299 -437 65 101 -430 -1252 -362 773 -389
2473 -389 -380 -485 181 564 -439 -481 33 871 316 -279 -754 665 1045 97 -275 144 779 974 -95 -352
$$ packed form
2331B12P3o29R68M7p17O75m48k1P88p25k75Q12j31j55k65p5M58J46m92K69R3l38
2353B70M25m37m73R90k23o63M18n62J107l22j141O04J2K10M54j303K30R14m28
2372H2m89P3p2L49k0q71K06L12J98j38p33L38Q49l89j93j95L08M39k15r52Q50
2393b63L32m60K17o83Q57R33j018n88N68r7P72n67r55J163K76m08Oo90J340J00
2413H35q04K4M60J25J87l57p67J068L98j170M42k15L85K43o46n60R28J16k52m58
2433a8p02J304K77j221K30l9P04J19j416J07J058Nm17p50K62J017m82r17K43M66
2453a70L44m15p65L92J182n20j020K3N44Q04p14r84Q62N02L6n31q22Q90J135j162
2473c89Rj05O66L83j003m2N14Q38n55n95m75J419L80r48l72M19O35J95j069k57
$$ plain form
2493 -352 655 872 329 -6 20 1136 911 -340 -406 885 840 663 -224 -232 1074 556 -218 -693 98 880
2513 880 251 -677 -27 374 303 54 -954 -112 672 -262 -918 -815 128 317 -429 -1036 -392 261 75 -956
2533 -956 -1027 -162 334 -615 -951 -434 151 10 -714 -1036 -262 412 -694 -751 -665 217 514 -791 -979 210
2553 210 527 -176 -446 -130 595 600 -111 -305 81 746 457 -336 -92 787 718 273 -68 298 842 746 -244
2574 -244 -31 758 542 123 -74 343 576 487 121 -11 283 706 -48 -315 189 189 105 -95 -150 14 173 -105
2596 -105 -362 -226 -66 -40 -613 -417 -263 -37 -318 -624 -532 106 -107 -344 -374 -145 -148 -265 -733 -582 0 -452
2618 -452 -429 -437 -190 -153 -241 -367 -500 -234 37 -285 -40 50 77 -260 -120 169 129 409 374 11 565 86 521
2641 521 205 199 345 136 495 366 379 79 484 324 378 229 347 503 183 540 440 199 223 545 -24 -123
$$ packed form
2493c52J007K17n43l35K6J116k25j251o6J291m5j77q87qJ306n18p74m75P91P82
2513H80o29r28O50M01p1k49j008Q42P84r34o56J03R43J89p46o07O44O53j86j031
2533i56p1Q65M96r49l36N17N85j41p24l22P74O74j106n7Q6Q82K97j305j88J189
2553B10L17p03k70L16P25Np11j94L86O65k89p93K44Q79o9m45l41L66N44r6r90
2574b44K13P89k16m19j97M17K33q9l66j32K94M23p54k67N04%q4k00n5J64J59k78
2596a05k57J36J60K6n73J96J54K26k81l06R2O38k13k37l0K29lj17m68J51N82m52
2618d52K3qK47L7q8j26j33K66K71l22K45R0K7l37J40K89m0K80l5l63N54m79M35
2641E21l16oJ46k09L59j29J3l00M05j60N4j49J18J56l20L57j00k41K4L22n69r9
$$ plain form
2663 -123 83 92 249 100 30 115 -86 237 -368 -189 -362 -123 -322 -384 -160 -180 -82 -649 -490 174 -311 -673
2685 -673 -736 -376 -70 -87 -873 -227 -189 -495 -299 -565 -301 118 -229 -410 -232 -102 -23 -54 -307 -278 392 212
2707 212 -98 -203 125 859 180 -148 297 591 306 -63 65 304 692 506 200 222 804 1017 -29 -257
2727 -257 612 980 166 44 -107 620 630 -52 -501 312 683 358 -47 -79 360 165 -110 -333 -266 334 442
2748 442 -770 -260 133 80 -295 -729 -204 504 -52 -474 -785 -185 79 -166 -894 -531 136 -130 -666 -867
2768 -867 -323 436 -319 -471 -570 103 335 -324 -775 -16 360 -45 -13 -470 318 664 -234 -374 -36 346 627
2789 627 98 -517 561 692 -30 -16 194 522 494 4 -221 396 488 626 -239 -59 626 560 -52 26 318
2810 318 413 422 -343 -126 657 73 8 -281 -141 479 39 -710 -215 47 134 -306 -895 -282 249 -67 -484 -523
$$ packed form
2663a23K06RJ57j49p0Q5k01L23o05J79j73K39j99o2K24k0R8n67J59O64m85l62
2685f73o3L60L06j7p86O46L8l06J96k66K64M19l47j81J78J30P9l1k53K9O70j80
2707B12l10j05L28P34o79l28M45K94k85l69J28K39L88j86l06K2N82K13j046k28
2727b57Q69L68q14j22j51P27J0o82m49Q13L71l25m05l2M39j95k75k23O7O00J08
2748D42j212N10L93n3l75m34N25P08n56m22l11O00K64k45p28L63O67k66n36k01
2768h67N44P59p55j52r9O73K32o59m51P59L76m05L2m57P88L46q98j40L38L82K81
2789F27n29o15J078J31p22J4K10L28k8m90k25O17R2J38q65J80O85o6o12P8K92
2810C18R5Rp65K17P83n84o5k89J40O20m40p49M95K62Q7m40n89O13N31l16m17l9
$$ plain form
2832 -523 -429 200 80 -781 -447 -143 45 -349 -813 -227 310 -174 -707 -614 -73 216 -349 -626 -219 419 -15
2853 -15 -394 -457 362 428 -124 -425 -57 322 49 -35 -402 165 527 110 -251 335 699 403 -20 109 579
2874 579 566 488 -193 -28 744 381 165 239 143 739 405 -283 188 371 454 80 18 -28 354 76 -230 -299 102
2897 102 463 -74 -399 -373 7 7 -204 -566 -246 64 -318 -896 -550 -28 -205 -348 -681 -502 97 -165 -691
2918 -691 -532 -178 117 10 -648 -151 103 -9 -353 -426 66 277 -113 -250 -141 255 219 -242 -335 200 231
2939 231 285 15 -159 440 607 -77 -79 269 564 435 -108 11 370 421 233 30 -201 554 531 -256 -175 621
2961 621 297 418 -137 32 303 402 -62 -73 132 350 -186 -352 101 110 241 -239 301 80 283 -100 -721
2982 -721 -164 -201 -590 -285 -429 -428 -332 -102 -283 -529 -402 -248 -107 -614 -250 -157 -79 -430 -131 -212 -333 -193
$$ packed form
2832e23R4O29j20q61L34L04J88l94m64N86N37m84n33R3N41K89n65k77M07O38m34
2853a5l79o3Q19O6n52l01L68L79k73q4l67N67L62m17l61N86L64k96m23J29M70
2874E79j3p8o81J65P72l63k16P4r6N96l34o88M71J83Q3l74o2m6L82k78l06o9M01
2897A02L61n37l25K6L80%k11l62L20L10l82n78L46N22j77j43l33J79N99k62n26
2918f91J59L54K95j07o58M97K54j12l44p3M92K11l90j37J09L96l6m61r3N35L1
2939B31N4k70j74N99J67o84kL48K95j29n43J19L59N1j88k03k31P55k3p87Q1P96
2961F21l24J21n55J69K71R9m64j1K05K18n36j66M53RJ31m80N40k21K03l83o21
2982g21N57l7l89L05j44JR6K30j81k46J27J54J41n07L64R3P8l51K99q1j21J40
$$ plain form
3004 -193 87 52 4 271 -206 64 128 -199 85 197 237 323 330 222 244 390 78 102 362 255 44 435 535
3027 535 618 -2 -69 240 474 513 213 156 347 214 26 222 221 231 305 -220 -81 193 35 -200 98 52 109
3050 109 212 -75 -444 -9 11 -151 -601 -499 106 -85 -570 -334 -331 162 -11 -498 -141 -3 75 -505 -472 -473
3072 -473 216 42 -598 -374 16 -4 -306 -227 -126 246 146 -424 -298 259 161 -116 -227 -60 246 182 151 47
3094 47 447 481 -66 49 206 554 457 183 84 677 836 503 -172 282 717 346 -29 -299 184 480 207
3115 207 -434 -32 466 381 -262 -490 9 365 -158 -476 -218 143 10 -61 -701 -254 271 -17 -670 -508 156
3136 156 295 -336 -815 -454 -10 -72 -557 -692 -95 415 -321 -622 -137 200 -285 -610 -609 -1 429 -19 -591
3157 -591 -125 455 268 -315 -458 423 453 31 -204 -29 496 477 -172 -383 193 845 467 -24 -117 427 871
$$ packed form
3004a93K80l5m8K67m77K70O4l27K84J12M0Q6Pj08K2J46l12K4K60j07k11L91J00
3027E35Q3o20o7L09K34L9l00n7J91j33j88J96jJ0P4n25J39K74j58k35K98m6N7
3050A09J03k87l69M35K0j62m50J02O05j91m85K36LM93j73m87L57J38P8n80L3j
3072d73O89j74o40K24L90k0l02P9J01L72j00n70J26N57r8k77j11J67L06o4l1j04
3094D7M00L4n47J15J57L48r7k74r9N93J59l33o75M54M35l71l75k70M83K96k73
3115B07o41M02M98q5o43k28M99L56n23l18K58L61j33p1o40M47N25k88o53J62O64
3136A56J39o31m79L61M44o2m85j35N97N10p36l01M85L37m85l25JO08M30m48n72
3157e91M66N80j87n83j43Q81L0m22k35J75N25j9o49k11N76O52l78m91r3N44M44
$$ plain form
3178 871 -7 54 98 622 556 -178 113 576 477 114 -185 -15 508 184 -236 -97 194 574 48 -458 -311
3199 -311 337 218 -430 -206 3 299 82 -563 -332 43 -69 -299 -425 63 126 -167 -762 -331 -255 -100 -94
3220 -94 -843 -107 259 -137 -203 -465 -141 38 -479 -451 12 380 100 -246 -129 471 225 33 -441 126 450
3241 450 225 -29 24 216 405 210 -16 23 424 366 -86 -18 306 562 562 213 96 260 349 252 89 96 516
3264 516 122 163 106 129 438 325 -303 -143 91 70 173 -14 -118 134 -97 -533 -168 15 -31 -245 -236 -320 -188
3287 -188 -105 -297 -590 -152 -128 -252 -476 -121 -216 -328 -277 -287 -12 44 -145 -213 -307 -133 -130 189 -261 26 -41 18
3311 18 145 76 263 269 161 -46 43 34 283 230 223 237 145 122 248 -57 456 505 321 88 266 177 273 135 279
3336 279 107 145 177 22 10 257 244 -17 31 149 -31 131 -25 60 -24 111 30 -87 53 -134 -16 -324 -116
$$ packed form
3178H71q78O1M4N24o6p34K91M63r9l63k99J70N23l24m20J39K91L80n26n06J47
3199c11O48j19o48K24K09K96k17o45K31L75j12k30j26M88O3k93n95M31P6J55O
3220i4p49P36L66l96o6k62L24J79n17K8M63L68k80l46J17O00k46j92m74N67L24
3241D50k25k54N3J92J89j95k26L9M01n8m52O8L24K56%l49j17J64Q9r7j63PM20
3264E16l94M1n7K3L09j13o28J60K34k1J03j87j04K52k31m36L65J83m6k14Rq4J32
3287a88Q3j92k93M38K4j24k24L55r5j12N1j0K75N6j89o8r4J74LL19m50K87o7N9
3311A8J27o9J87Oj08k07Q9rK49n3pJ4r2k3J26l05N13M9j84k33J78q9R6j38J44
3336B79j72L8L2j55j2K47j3k61M8J18j80J62j56Q5q4J35q1j17J40j87J18l08K08
$$ plain form
3359 -116 -63 -154 -179 -383 -315 -284 -90 -292 -437 -244 -133 137 -306 -451 -60 47 18 -217 -77 32 4 -198
3381 -198 -138 241 15 116 52 145 101 111 -2 192 -263 115 26 -50 288 -67 310 391 62 103 345 351 27 171
3405 171 28 256 335 92 85 240 327 227 -82 127 250 140 73 -46 119 181 -27 -41 -126 128 177 -17 -106
3428 -106 -120 78 -149 -252 -206 -169 91 -237 -264 -199 -207 -157 -309 -223 -42 11 -38 -239 -477 -82 -33 -243 -425 -7
3452 -7 288 -232 -253 -331 -186 -22 100 -123 1 174 152 -133 -363 254 386 -50 -135 -41 250 291 -63 188 192
3475 192 412 121 -227 254 426 432 78 146 68 752 439 23 -46 490 558 53 -352 -17 523 -68 -318 -53
3497 -53 8 485 121 -520 5 291 81 -270 -283 170 72 -157 -400 -102 70 168 -687 -376 5 21 -432 -595
3519 -595 -462 83 98 -426 -304 -120 30 2 -514 -242 53 117 -362 -182 -73 266 -96 -171 -245 106 495 -241
$$ packed form
3359a16N3r1k5k04O8L1J94k02j45J93J11K70m43j45L91J07k9k35J40J09k8k02
3381a98O0L79k26J01o4R3m4J0j13J94m55L78q9p6L38l55L77Q1l29M1K42Ol24J44
3405A71j43K28P9k43pJ55Q7j00l09K09J23j10o7j19J65O2k08j4q5K54M9j94q9
3428a06j4J98k27j03M6L7K60l28k7O5qN0j52Q6J81N3m9k01k38L95M9k10j82M18
3452gK95n20k1p8J45J64J22k23J24J73k2k85k30O17J32m36q5R4K91M1l54K51M
3475A92K20k91l48M81J72Ol54O8p8O84l13m16o9N36O8n05m05L35N40n91k50K65
3497e3O1M77l64o41N25K86k10l51j3M53r8k29k43K98J72R8q55L11L81J6m53j63
3519e95J33N45J5n24J22J84J50k8n16K72K95O4m79J80J09L39l62p5p4L51L89p36
$$ plain form
3541 -241 -436 307 452 175 -164 -200 -17 393 210 68 31 594 265 -10 94 345 535 32 -149 -69 500
3562 500 581 74 -164 345 234 241 -263 -14 420 638 -455 -140 -78 379 -115 -256 -234 34 278 -214 -500
3583 -500 83 151 -224 -215 -261 -35 -11 -71 -583 -116 215 -459 -398 -352 -72 87 -325 -202 -296 221 19 -312 -252
3606 -252 -33 284 22 -45 -219 143 417 -176 -313 -32 270 33 -73 -111 296 188 250 -79 222 293 419
3627 419 124 94 208 392 251 165 43 257 408 94 113 86 275 223 -241 98 127 150 -40 -12 189 8 57
3650 57 -114 -84 17 -18 36 -51 39 158 -182 -42 -281 68 -118 -376 -204 -356 -224 -250 -122 -63 -238 -181 -187 -190
3674 -190 -141 -266 -336 -99 -135 -95 -384 -10 -21 -68 -135 144 148 192 33 -124 60 254 -123 -33 260 70 119 153
3698 153 105 215 88 -57 125 -331 594 251 -68 186 34 202 12 304 486 -147 220 274 -566 -53 66
$$ packed form
3541b41j95P43J45k77l39l6J83M10j83j42l7N63l29k75J04K51J90n03j81Q0N69
3562E00Q1n07k38N09j11Pn04K49M34K18j093L15O2M57m94j41K2K68K44m92k86
3583e00N83O8l75Rm6K26K4o0n12M67L31o74O1M6K80J59m12J23r4N17k02l31O0
3606b52K19L17k62o7j74L62K74n93j37K81L02k37j06l8M07j08O2l29L01P1J26
3627D19k95l0J14J84j41q6j22K14J51l14J9k7J89n2m64L39K9K3j90K8K01j81M9
3650E7j71L0J01l5N4q7R0J19l40J40k39L49j86k58J72j52J32k6J28N9j75N7ol
3674a90M9j25p0K37l6M0k89L74j1m7o7K79MM4j59j57J84J94l77R0K93j90M9L4
3698A53m8J10j27j45J82m56R25l43l19K54j52J68j90K92J82o33L67N4q40N13J19
$$ plain form
3719 66 -44 -73 382 200 386 355 -148 -57 239 322 -193 -102 9 415 370 -759 -79 -406 29 -276 -526 -246
3741 -246 15 -71 -46 -60 463 471 -369 -429 -192 24 -267 -237 -337 496 -62 -56 -119 114 23 77 -367 -342 243 207 83
3766 83 78 -86 299 31 -10 -234 285 68 114 156 66 329 180 33 288 -24 471 213 154 100 342 111 63
3789 63 -237 159 200 199 -51 195 343 167 12 -268 104 214 277 160 -401 202 168 -367 -298 -92 5 -301 -308
3812 -308 -424 -90 69 -292 -269 -60 -140 -11 -205 -338 -212 -78 -219 -329 -298 11 -124 -303 -432 -143 -65
3833 -65 -128 -357 -267 73 214 -38 129 -35 300 225 -312 -167 143 302 5 -177 100 63 98 -140 -152 112
3855 112 235 378 -29 -150 419 161 134 -4 151 240 216 37 242 300 344 117 -260 -14 338 109 -178 -146
3877 -146 221 -46 -13 -41 -62 -25 -83 -266 -216 16 306 -162 -430 -170 82 309 -403 -197 -203 -11 24 -327 -198
$$ packed form
3719F6j10k9M55j82J86l1n03R1K96Q3n15R1J11M06m5j129O80l27M35l05k50K80
3741b46K61q6K5j4N23Qq40o0K37K16k91L0j00Q33n58Oo3K33r1N4m44K5N85l6j24
3766H3nj64L85k68m1k24N19k17M6M2r0K63j49j47K55l12M95k58n9n4K42k31m8
3789F3l00L96M1jk50K46J48j76j55k80L72J10O3j17n61O03l4n35O9K06R7l06p
3812c08j16L34J59l61K3K09q0J29j94j33J26J34j41j10L1L09j35j79j29K89P8
3833f5o3k29R0L40J41k52J67j64L35p5n37J45L10J59k97j82K77l7L5k38j2K64
3855A12J23J43m07j21N69k58k7j38J55Q9k4j79K05N8M4k27l77K46L52k29k87L2
3877a46L67k67L3k8k1L7n8j83N0K32K90m68k68K60K52K27p12K06oJ92L5l51J29
$$ plain form
3900 -198 37 -217 -50 -276 -264 219 131 -163 -332 -102 -35 -21 -198 -339 250 241 -68 -192 116 276 194 -86
3922 -86 -145 287 98 34 223 12 360 316 -4 122 35 328 236 -94 60 342 164 120 -22 271 313 -104 106
3945 106 68 134 99 -64 -19 137 35 -2 -31 -226 182 -56 -51 -454 -57 25 -36 -414 -193 -242 7 -430 -361 137
3969 137 78 -272 -172 -17 -226 22 -181 -174 4 147 -151 -295 -190 17 -67 -23 -107 138 -156 136 -98 -112
3991 -112 83 191 -25 -112 -161 99 43 -234 127 69 248 156 66 -108 345 184 44 99 -28 360 127 314
4013 314 -39 258 188 340 379 605 137 477 636 -224 147 26 -22 94 -77 119 90 -129 121 189 -98 83
4035 83 -81 -275 -8 -125 -58 -321 -45 19 -84 -172 -274 -63 -148 -67 -251 -197 -373 -281 -137 34 -70 109 -125
4058 -125 -232 -196 -57 110 -91 -58 -213 48 -111 278 -60 -161 93 43 68 18 71 14 96 147 -182 37 451
$$ packed form
3900a98K35k54J67k26J2M83q8k94j69K30O7J4j77j41N89rl09j24L08J60q2k80
3922h6n9M32j89o4J89k11L48m4l20J26q7K93r2l30J54K82j78m4j42K93M2m17K10
3945A06l8O6l5j63M5J56j02l7k9j95M08k38Nm03L97Q2o1l78K21m9K49m37O9M98
3969A37n9l50J00J55k09K48k03PJ78J43k98j44J05K07q4M4q4K45k94K92k34j4
3991a12J95J08k16q7m9K60n6k77L61n8J79r2r0j74M53j61j40N5j27L88k33J87
4013C14l53K97p0J52L9K26m68L40J59q60L71j21m8J16j71J96k9k19K50O8k87J81
4035H3j64j94K67j17O7k63K76O4j03q8j02K11q5Q1j84N4j76R2J44J71j04J79k34
4058a25j07L6J39J67k01L3j55K61j59L89l38j01K54n0K5n0N3n7Q2N1l29K19M14
$$ plain form
4081 451 263 21 -75 375 -11 -134 194 154 208 559 152 108 -149 268 176 -80 206 325 22 -14 -98 45
4103 45 181 52 -348 -240 -94 -12 -170 -455 -179 -140 -195 -166 -238 2 21 -138 -639 -242 -44 -87 -316 -485 -179
4126 -179 -87 -291 -172 26 -55 187 -558 19 20 278 -14 -279 133 202 110 76 -80 182 337 243 -104 -162 345
4149 345 302 26 -18 41 231 459 251 88 32 396 205 -64 48 216 250 -46 -5 302 220 83 -328 -34
4171 -34 126 338 23 -128 -15 120 -258 -41 -146 83 -3 -63 -190 34 227 -23 -231 -259 16 -73 -62 -56 -37
4194 -37 -357 -229 -479 -124 112 -44 -154 -367 90 377 276 29 -160 186 132 -229 -287 -290 181 -79 24 -316
4216 -316 38 245 1 96 -103 93 49 -128 -246 35 168 108 35 256 235 367 5 2 128 292 205 5 140
4239 140 510 290 1 -15 126 372 297 105 161 23 301 -148 -190 -139 -51 -100 -1 -259 -62 -47 -198 -92 -60
$$ packed form
4081D51j88k42r6M50l86j23L28m0N4L51m07m4k57M17r2k56K86J19l03l6q4J43
4103D5J36j29m00J08J46Q2j58k85K76L9n5K9p2K40J9j59n01L97J98m3k29j69L06
4126a79R2k04J19J98q1K42p45N77JK58k92k65M12O9r2l4j56K62J55r4l47n8N07
4149C45m3k76m4N9J90K28k08j63n6L64j91k69J12J68L4k96M1L07q2j37m11K94
4171c4J60K12l15j51J13J35l78K17j05K29q6o0j27K24J93k50k08k8K75q9J1OJ9
4194c7l20J28k50L55K36j56j10k13M57K87j01k47j89L46n4l61n8lM71k60J03l40
4216c16L54K07k44R5j99J96m4j77j18K81J33o0p3K21k1J32l62lJ26J64q7k00J35
4239A40L70k20k89j6J41K46p5j92N6j38K78m49m2N1Q8m9R9k58J97J5j51J06L2
$$ plain form
4262 -60 49 -96 -297 -94 -35 -76 -376 -182 -180 -63 68 -168 -172 -96 -149 250 -321 -250 -14 -34 35 121 -325 108
4286 108 38 -177 -82 -36 142 -41 8 21 0 257 66 -223 -109 165 130 11 30 -232 282 87 -21 117 269
4309 269 -69 42 40 -109 184 158 19 -58 175 122 60 169 365 -117 -298 -84 -111 -124 167 368 103 -162 140
4332 140 -225 -94 -208 -137 291 38 117 -150 -99 32 -76 -194 223 138 -162 -205 -210 -109 -208 -202 -81 -33 -98 -39
4356 -39 -266 -129 -35 212 -228 -140 98 -35 40 -1 -245 13 -21 224 -92 -130 175 141 -7 -227 98 191 177
4379 177 3 -55 -33 59 248 -94 65 376 148 54 -56 130 283 181 -396 155 104 -238 -192 105 -119 108
4401 108 2 -93 -4 -5 2 148 76 32 247 255 -48 40 14 -58 -14 -182 -55 -4 -62 -114 -259 -244 -163 -172 -47 -193 -87
4428 -87 -88 -295 -85 -37 -169 -135 -409 -97 -314 -47 181 -83 -147 -279 -11 0 -109 46 -13 -77 37 71 294
$$ packed form
4262f0J09j45k01K03N9m1l00J94KJ17J31k36mP6n3L99n71P1K36k0O9Q6m46M33
4286A08p0k15R5M6J78j83M9J3k1K57j91k89J14K74l5j19J9k62N14j95j08J38J52
4309B69l38J11kj49K93k6j39p7K33n3o2J09J96m82j81K14k7j3K91K01k65k65L02
4332A40l65J31j14P1M28k53P9k67N1J31j08j18M17q5l00m3nJ01r9OJ21M8o5N9
4356c9k27J37R4K47m40Q8K38j33P5m1k44K58l4K45l16l8L05l4j48k20L25R3j4
4379A77j74n8K2R2J89l42J59L11k28r4j10J86J53j02n77N51n1l42M6K97k24K27
4401A08j06r5Q9jPJ46p2m4K15Ql03Q8k6p2M4j68J27N1n8n2j45J5Q1rJ25j46J06
4428h7jk07K10M8j32L4k74L12k17K67K28k64o4j32K68J1j09J55n9o4J14L4K23
$$ plain form
4451 294 19 92 179 148 16 -122 161 29 314 409 298 176 50 -52 249 182 119 59 379 -10 123 85 128
4474 128 -89 128 -136 165 113 64 -92 -154 83 -1 -74 -22 -19 242 -900 -76 68 -253 392 97 -227 -387
4496 -387 -20 43 101 -297 24 132 -167 -235 -72 17 -86 -145 -240 -62 99 76 104 -145 -102 114 43 -96 -173 -89
4520 -89 103 -292 -32 -295 135 437 405 -479 -349 15 1163 586 257 488 -157 -175 33 204 917 88 -382
4541 -382 5 14 638 -380 -229 -351 140 287 153 -357 136 271 -38 11 -34 198 307 -127 -331 -50 91
4562 91 -225 -15 -183 81 22 -390 -52 -339 37 -426 -154 -111 -204 -131 -250 -157 -22 36 134 -124 -221 227 -112
4585 -112 0 -125 225 318 1 -53 -179 -74 50 5 -86 65 -112 -129 -179 -196 -11 27 38 -133 -33 225 73
4608 73 125 -96 160 239 174 -127 -178 374 59 7 51 -183 320 284 33 92 266 130 170 -53 -143 138 89 -120
$$ packed form
4451B94k75P3Q7l1j32j38K83j32K85R5j11j22j26j02L01o7o3o0L20l89J33l8M3
4474A28k17K17k64L01n2m9j56o2K37q4p3N2LK61j142Q24J44l21O45k95l24j60
4496c87L67O3N8l98L21J08k99o8J63Q9j03n9r5J78J61k3K8k49M3K16p1j39p7Q4
4520h9J92l95K60k63M30L02l2q84J30L64J148n77l29K31o45j8K08J71P13q29m70
4541c82L87RO24j018J51j22M91J47j34n10M93J35l09M9m5K32J09m34k04K81J41
4562I1l16K10j68K64n9m12L38k87L76m63K72M3r3P3j19R3J35N8R8k58r7M48l39
4585a12J12j25L50R3l17n4j26J05J24m5r1J51j77j7n0j7J85L8J1j71J00K58j52
4608G3N2k21K56P9o5l01n1N52l15n2M4k34N03l6k51N9J74j36M0k23r0K81m9k09
$$ plain form
4632 -120 -137 -53 196 -280 -19 255 -12 -171 -265 -14 177 98 -68 -30 -299 -108 8 -245 -74 11 162 -134
4654 -134 -161 -283 18 15 -36 -170 777 26 -428 4 -120 41 91 257 -20 -17 -139 -2 -356 137 -17 -100 -2
4677 -2 8 22 309 233 156 -17 -324 239 204 -86 -11 -75 99 319 -29 48 115 346 172 110 183 61 171 86 130
4702 130 123 90 43 144 75 112 -194 -22 -34 37 -85 -114 -132 23 -172 -31 71 257 105 -292 63 80 -158 138
4726 138 -367 -18 -506 -304 -64 -111 94 364 46 115 -8 -130 -160 -318 144 -113 -296 277 172 -83 36
4747 36 358 44 -79 -26 -480 204 -16 -157 21 -116 16 -23 177 5 -4 87 181 195 219 143 -193 -96 175 314
4771 314 23 426 272 83 -76 271 120 140 -53 191 -69 157 -74 -19 289 208 -270 91 41 -78 91
4792 91 -30 262 49 -166 -320 357 -110 -8 13 -317 -179 129 245 -41 -269 130 278 -51 -202 -184 46
$$ packed form
4632a20j7Q4K49m76K61K74k67j59r4K51J91p9j66L8k69J91J16k53J71Q5J51k96
4654a34k7j22L01ln1j34R47p51m54M32j24J61N0J66k77Lj22J37l54M93j54q3R8
4677bJ0J4K87p6p7j73l07N63l5k90P5o4J74K20l48P7O7K31j74o2P3j22J10q5M4
4702A30pl3m7J01o9L7l06J72j2P1j22k9j8J55j95J41J02J86j52l97L55J7k38K96
4726A38n05L49m88K02K40m7K05K70l18O9j23j22l0j58M62k57j83N73j05k55J19
4747C6L22l14j23N3m54O84k20j41J78j37J32l9K00j72rR1R4J4K4p6l36R7K71J39
4771C14k91M03j54j89j59L47j51K0j93K44k60K26k31N5L08q1m78L61n0j19J69
4792I1j21K92k13k15j54O77m67J02K1l30J38L08J16k86k28L99J48l29j51J8K30
$$ plain form
4813 46 123 -178 -183 -109 -14 362 24 -18 31 694 191 -7 -190 184 119 173 -107 -231 123 215 190 -141 41 138
4837 138 286 263 51 133 199 287 -107 290 45 -109 -132 78 181 307 -21 138 -12 15 88 319 -339 399
4859 399 90 108 -550 -305 751 -117 27 -404 -333 284 -228 154 -102 -71 -9 -661 -195 35 146 -132 -261
4880 -261 -198 -12 151 274 -1002 -230 -31 2 52 -662 566 -207 -16 120 -166 -166 342 461 970 -271 13
4901 13 -361 -359 164 -93 155 -143 54 -414 246 605 -502 160 751 434 243 200 -371 -191 -272 -182 -454 38
4923 38 83 293 -193 78 425 -89 198 -292 -52 -58 21 -32 161 190 308 76 20 259 57 -131 -143 161 204
4946 204 -211 -156 -303 -102 -124 341 -214 88 182 33 156 -504 -53 -16 -497 -317 46 -459 -223 238 -391
4967 -391 -521 -162 629 93 160 -318 314 -119 20 -131 148 48 736 297 234 481 108 47 437 240 480
$$ packed form
4813D6P7l01nP4R5L76l38m2M9O63n03j98j83L74o5N4k80j24L54R2k5l31J82R7
4837A38J48k3k12Q2O6Q8l94L97k45j54k3K10J03J26l28J59j50K7P3K31o58P38
4859C99l09J8o58K45J056q68J44m31P1O17n12L82k56L1O2o52M66K30J11k78j29
4880b61O3J86J63J23j276P72J99L3N0p14J228p73J91J36k86%N08J19N09j241K84
4901A3l74KN23k57K48k98J97m68O60L59j107O62N91l17j91m3n71J80q1R0k72M92
4923C8M5K10m86K71L47n14K87m90K40oP9n3J93K9J18k32n6K39k02j88j2L04M3
4946B04m15N5j47K01k2M65n55L02R4j49J23o60M51L7m81J80L63n05K36M61o29
4967c91j30L59P91n36O7m78O32m33J39j51K79j00O88m39o3K47l73o1L90j97K40
$$ plain form
4988 480 1033 401 -124 -544 298 348 47 640 -125 93 -628 -320 -419 480 91 -97 -262 230 -324 -415 271
5009 271 601 163 324 -252 146 312 -237 -15 122 962 -502 -536 144 -713 337 174 -370 -82 -578 -538
5029 -538 -115 362 -455 -425 614 555 -375 -268 417 -54 -512 -479 125 -445 732 -340 -402 -291 268 574
5049 574 -205 290 419 794 -180 198 495 -331 759 293 -321 153 45 159 -13 164 588 780 -243
5068 -243 -42 -253 407 375 249 272 23 -399 -245 395 -353 -160 -117 -582 395 15 24 -279 11 90 208 -112
5090 -112 122 -525 -277 219 114 -283 -121 -101 77 -148 -159 141 -10 -15 -247 59 2 212 -74 -86 -53 100
5112 100 -301 60 -271 -68 11 -337 -171 -176 -74 -212 -147 36 -124 -46 91 -63 -282 -179 51 230 82 -222
5134 -222 224 160 19 92 217 320 65 -155 -118 314 88 -9 55 31 -73 96 -85 -159 21 54 -339 -284 -30
$$ packed form
4988D80N53o32n25m20Q42N0l01N93p65K18p21L08r9Q99l89j88j65M92n54r1O86
5009B71L30m38J61n76L98J66n49K22J37Q40j464l4O80q57J050j63n44K88m96M0
5029e38M23M77q17L0J039n9r30J07O85m71m58L3O04n70J177j072o2J11N59L06
5049E74p79M95J29L75r74L78K97q26J090m66o14M74j08J14j72J77M24J92j023
5068b43K01k11O60l2j26K3k49m22J54O40p48J93M3m65R77l80Rl03K90P9J18l20
5090a12K34o47K48M96j05l97J62K0J78k25j1L00j51nk32L06n7K10k86j2L3J53
5112A00m01L61l31K03P9l48J66nJ02j38O5J83j60P8J37j54k19J03K30J79j48l04
5134b22M46o4j41P3J25J03k55k20L7M32k26r7O4k4j04J69j81p4J80L3l93N5K54
$$ plain form
5157 -30 -8 44 -144 -115 104 -114 -51 -47 16 229 -213 -43 224 -159 -77 46 150 -56 94 144 -85 -366 -130
5180 -130 62 -83 -141 -189 126 -90 -64 -197 242 -215 105 -65 -179 -22 -183 -415 -692 -60 159 -13 38
5201 38 13 324 57 -79 -36 118 156 -478 -444 422 -22 10 185 -50 98 -202 -275 -104 -16 -82 97 236 242 185
5225 185 314 68 61 222 -11 139 60 -152 261 26 -95 3 162 226 169 -544 2 -236 70 -44 368 211
5247 211 125 617 -20 -281 107 225 76 -443 -562 232 334 -128 -78 -234 508 87 -6 339 282 895 -316
5268 -316 24 799 555 392 -671 -411 5 178 -550 807 641 -320 346 -114 308 32 -16 590 21 -196
5288 -196 -478 257 -482 443 -22 388 -144 296 -240 180 201 120 176 559 -56 142 330 235 220 133 74 378
5310 378 -148 163 -22 256 -39 -170 -112 -11 -441 -85 -92 -13 182 -126 217 -183 -198 537 411 -17 -77 213
$$ packed form
5157c0K2N2j88K9K19k18O3MO3K13m42J70K67l83Q2J23J04k06J50N0k29k81K36
5180a30J92j45n8m8L15k16K6j33M39m57L20j70j14J57j61k32k77O32K19j72N1
5201C8k5L11k67j36M3J54L8o34L4Q66m44L2J75k35J48l00p3J71Q8o6J79J39On7
5225A85J29k46pJ61k33J50p9k12M13k35j21R8J59O4n7p13N46k38L06j14M12j57
5247B11q6M92o37k61L88J18j49n19j19P94J02m62N0j56P42m21r3L45n7O13j211
5268c16L40P75k44j63j063K60M16J73p28J357j66r61O66m60M22k76m8O06n69k17
5288a96k82P35p39R25m65M10n32M40n36M20K1q1N6L83o15J98J88r5j5q7n9L04
5310C78n26L11j85K78k95j31N8J01m30L56pP9J95l08L43m00j5P35j26m28o0K90
$$ plain form
5332 213 142 -32 -165 35 263 -175 128 -347 -44 -213 66 -126 16 117 332 -310 62 -173 -124 95 -216
5353 -216 -322 -65 166 -34 323 7 -18 -241 350 -141 21 -391 -115 136 -237 -93 50 475 -78 360
5373 360 238 155 302 -95 -107 567 231 145 -383 744 -198 -21 -31 -11 -316 1076 150 -298 565 305 512
5394 512 -920 802 -547 46 -62 -29 115 -145 121 34 -79 167 -394 82 -50 1 -119 -217 -202 133 -182
5415 -182 -209 -231 -103 -196 -137 -100 -197 -113 -200 -128 1 -39 48 30 -46 12 1 84 -2 15 111 -59 -66 37 125 136 -45 -189
5443 -189 196 337 564 6 35 149 42 -4 179 367 -166 354 292 170 308 42 -53 54 317 105 103 210
5465 210 135 -89 163 -39 -216 -62 -242 315 47 165 -149 -144 140 -129 -88 27 -66 -647 -177 -291 69 459
5487 459 -388 129 -165 39 101 67 415 331 398 12 -160 -226 -326 -682 -261 117 188 296 -57 163 -56 135
$$ packed form
5332B13p1j74j33K00K28m38L03m75L03j69K79j92J42J01K15o42L72k35M9K19l11
5353b16j06K57K31k00L57l16k5k23N91m91J62m12K76K51l73J44J43M25n53M38
5373C60j22q3J47l97j2O74l36q6n28J127r42J77j0K0l05J392r26m48Q63k60K07
5394E12j432J722j349N93j08L3J44k60K66q7j13K46n61M76j32N1j20r8J5L35l15
5415a82k7k2J28r3N9L7r7Q4q7P2J29m0Q7j8p6N8j1Q3q6J7R6j70pJ03Q8J1j81j44
5443a89L85J41K27n58K9J14j07m6J83J88n33N20o2j22J38k66r5J07K63k12kJ07
5465B10p5k24K52k02j77J54j80N57k68J18l14NK84k69M1J15r3n81M70j14L60L90
5487D59q47N17k94K04O2l4L48q4O7l86j72o6j00l56M21L78P1J08l53K20k19J91
$$ plain form
5509 135 59 -49 -72 -128 -18 66 322 199 -183 -5 -132 175 -48 -1 -63 118 117 63 131 -157 94 336 250 276
$$ packed form
5509A35p6j08k3n6J10Q4K56j23l82J78j27L07k23M7o2J81jn4O8k88K51K42q6K6
$$ [...]
8191b45
##END NTUPLES=NMR FID
##END=
