##TITLE=1H_Patchulol
 CDCl3
 8 sc, 
 11.7.2024
##JCAMPDX= 6.0         $$ Bruker NMR JCAMP-DX V2.0
##DATA TYPE= NMR FID
##DATA CLASS= NTUPLES
##ORIGIN= UXNMR, Bruker Analytische Messtechnik GmbH
##OWNER= root
$$ XWIN-NMR		Version 3.5
$$ Thu Jul 11 14:50:59 2024 Russian Standard Time (UT+4h)  she@DPX200
##.OBSERVE FREQUENCY= 200.1314
##.OBSERVE NUCLEUS= ^1H
##.DELAY= (6, 6)
##.ACQUISITION MODE= SIMULTANEOUS
##.ACQUISITION SCHEME= undefined
##.AVERAGES= 8
##.DIGITISER RES= 18
##SPECTROMETER/DATA SYSTEM= spect
##.PULSE SEQUENCE= zg30
##.SOLVENT NAME= CDCl3
##.SHIFT REFERENCE= (INTERNAL, CDCl3, 0, 15.7039)
##AUDIT TRAIL= $$ (NUMBER, WHEN, WHO, WHERE, WHAT)
$$ ##TITLE= Audit trail, XWIN-NMR		Version 3.5
$$ ##JCAMPDX= 5.01
$$ ##ORIGIN= Bruker BioSpin GmbH
$$ ##OWNER= she
$$ F:/spectra/data/she/nmr/H-F/1/audita.txt
$$ ##AUDIT TRAIL=  $$ (NUMBER, WHEN, WHO, WHERE, WHAT)
(   1,<2024-07-11 14:49:28.17 +0400>,<she>,<DPX200>,
      <created by zg, POWCHK disabled, PULCHK disabled
       configuration hash MD5:
       00 E9 B6 7A A2 85 ED C7 34 08 36 98 17 FE 4E 26
       data hash MD5: 16K
       A5 5E 18 C0 8B 78 29 47 71 26 11 71 74 5B E5 72>)
$$ ##END=
$$ 
$$ hash MD5
$$ 3A D3 10 3B E2 F9 26 11 A1 10 0E F0 12 C8 6D 20
##$RELAX= 
##$RELAX= 
##$RELAX= 
##$RELAX= 
##$RELAX= 
##$RELAX= 
$$ Bruker specific parameters
$$ --------------------------
##$DU= <F:/spectra>
##$EXPNO= 1
##$NAME= <H-F>
##$PROCNO= 1
##$TYPE= <nmr>
##$USER= <she>
##$AMP= (0..31)
100 100 100 100 100 100 100 100 100 100 100 100 100 100 100 100 100 100 
100 100 100 100 100 100 100 100 100 100 100 100 100 100 
##$AQSEQ= 0
##$AQ_mod= 1
##$AUNM= <au_zg>
##$AUTOPOS= <>
##$BF1= 200.13
##$BF2= 200.13
##$BF3= 200.13
##$BF4= 200.13
##$BF5= 200.13
##$BF6= 200.13
##$BF7= 200.13
##$BF8= 200.13
##$BYTORDA= 1
##$CFDGTYP= 0
##$CFRGTYP= 5
##$CHEMSTR= <none>
##$CNST= (0..31)
1 1 145 1 1 1 1 1 1 1 1 1 1 1 1 1 1 1 1 1 1 1 1 1 1 1 1 1 1 1 1 1 
##$CPDPRG= <>
##$CPDPRG1= <>
##$CPDPRG2= <>
##$CPDPRG3= <>
##$CPDPRG4= <mlev>
##$CPDPRG5= <mlev>
##$CPDPRG6= <mlev>
##$CPDPRG7= <mlev>
##$CPDPRG8= <mlev>
##$CPDPRGB= <>
##$CPDPRGT= <>
##$D= (0..31)
0 1.2 0 0 0 0 0 0 0 0.06 0 0.03 0 0 0 0 0.0002 0 0 0 0 0 0 0 0 0 0 0 0 
0 0 0 
##$DATE= 1720694967
##$DBL= (0..7)
120 120 120 120 120 120 120 120 
##$DBP= (0..7)
150 150 150 150 150 150 150 150 
##$DBP07= 0
##$DBPNAM0= <>
##$DBPNAM1= <>
##$DBPNAM2= <>
##$DBPNAM3= <>
##$DBPNAM4= <>
##$DBPNAM5= <>
##$DBPNAM6= <>
##$DBPNAM7= <>
##$DBPOAL= (0..7)
0.5 0.5 0.5 0.5 0.5 0.5 0.5 0.5 
##$DBPOFFS= (0..7)
0 0 0 0 0 0 0 0 
##$DE= 6
##$DECBNUC= <off>
##$DECIM= 24
##$DECNUC= <off>
##$DECSTAT= 4
##$DIGMOD= 1
##$DIGTYP= 9
##$DL= (0..7)
0 120 120 120 120 120 120 120 
##$DP= (0..7)
150 150 150 150 150 150 150 150 
##$DP07= 0
##$DPNAME0= <>
##$DPNAME1= <>
##$DPNAME2= <>
##$DPNAME3= <>
##$DPNAME4= <>
##$DPNAME5= <>
##$DPNAME6= <>
##$DPNAME7= <>
##$DPOAL= (0..7)
0.5 0.5 0.5 0.5 0.5 0.5 0.5 0.5 
##$DPOFFS= (0..7)
0 0 0 0 0 0 0 0 
##$DQDMODE= 0
##$DR= 18
##$DS= 0
##$DSLIST= <SSSSSSSSSSSSSSS>
$$ [...]
##$SUBNAM2= <"">
##$SUBNAM3= <"">
##$SUBNAM4= <"">
##$SUBNAM5= <"">
##$SUBNAM6= <"">
##$SUBNAM7= <"">
##$SUBNAM8= <"">
##$SUBNAM9= <"">
##$SW= 24.0689651099613
##$SWIBOX= (0..15)
0 0 2 0 0 0 0 0 0 0 0 0 0 0 0 0 
##$SW_h= 4816.95568400771
##$TD= 16384
##$TD0= 1
##$TE= 0
##$TE2= 300
##$TE3= 300
##$TEG= 300
##$TL= (0..7)
0 120 120 120 120 120 120 120 
##$TP= (0..7)
150 150 150 150 150 150 150 150 
##$TP07= 0
##$TPNAME0= <>
##$TPNAME1= <>
##$TPNAME2= <>
##$TPNAME3= <>
##$TPNAME4= <>
##$TPNAME5= <>
##$TPNAME6= <>
##$TPNAME7= <>
##$TPOAL= (0..7)
0.5 0.5 0.5 0.5 0.5 0.5 0.5 0.5 
##$TPOFFS= (0..7)
0 0 0 0 0 0 0 0 
##$TUNHIN= 0
##$TUNHOUT= 0
##$TUNXOUT= 0
##$USERA1= <user>
##$USERA2= <user>
##$USERA3= <user>
##$USERA4= <user>
##$USERA5= <user>
##$V9= 5
##$VALIST= <valist>
##$VCLIST= <CCCCCCCCCCCCCCC>
##$VD= 0
##$VDLIST= <DDDDDDDDDDDDDDD>
##$VPLIST= <PPPPPPPPPPPPPPP>
##$VTLIST= <TTTTTTTTTTTTTTT>
##$WBST= 1024
##$WBSW= 4
##$XGAIN= (0..3)
0 0 0 0 
##$XL= 0
##$YL= 0
##$YMAX_a= 374052
##$YMIN_a= -315796
##$ZGOPTNS= <>
##$ZL1= 120
##$ZL2= 120
##$ZL3= 120
##$ZL4= 120
##$ABSF1= 10
##$ABSF2= 0
##$ABSG= 5
##$ABSL= 3
##$ALPHA= 0
##$AQORDER= 0
##$ASSFAC= 0
##$ASSFACI= 0
##$ASSFACX= 0
##$ASSWID= 0
##$AUNMP= <proc_1d>
##$AZFE= 0.1
##$AZFW= 0.1
##$BCFW= 1
##$BC_mod= 2
##$BYTORDP= 1
##$COROFFS= 0
##$CY= 11.3945322036743
##$DATMOD= 1
##$DC= 2
##$DFILT= <>
##$DTYPP= 0
##$F1P= 15.6554695791079
##$F2P= 12.8336369535428
##$FCOR= 0.5
##$FTSIZE= 0
##$FT_mod= 4
##$GAMMA= 1
##$GB= 0.15
##$INTBC= 1
##$INTSCL= 1
##$ISEN= 128
##$LB= 0.24
##$LEV0= 0
##$LPBIN= 0
##$MAXI= 10000
##$MC2= 0
##$MEAN= 0
##$ME_mod= 0
##$MI= 1.114404
##$NCOEF= 0
##$NC_proc= 0
##$NLEV= 6
##$NOISF1= 3.799351
##$NOISF2= 2.8
##$NSP= 1
##$NTH_PI= 0
##$NZP= 0
##$OFFSET= 15.70392
##$PC= 1
##$PHC0= -25679.95
##$PHC1= 23.38748
##$PH_mod= 1
##$PKNL= yes
##$PPARMOD= 0
##$PSCAL= 0
##$PSIGN= 0
##$REVERSE= no
##$SF= 200.130013532006
##$SI= 16384
##$SIGF1= 3
##$SIGF2= 2
##$SINO= 400
##$SIOLD= 16384
##$SREGLST= <1H.CDCl3>
##$SSB= 0
##$STSI= 0
##$STSR= 0
##$SW_p= 3612.71676300578
##$SYMM= 0
##$S_DEV= 0
##$TDeff= 0
##$TDoff= 0
##$TI= <>
##$TILT= no
##$TM1= 0
##$TM2= 0
##$TOPLEV= 0
##$USERP1= <user>
##$USERP2= <user>
##$USERP3= <user>
##$USERP4= <user>
##$USERP5= <user>
##$WDW= 1
##$XDIM= 8192
##$YMAX_p= 0
##$YMIN_p= 0
$$ End of Bruker specific parameters
$$ ---------------------------------
##NTUPLES= NMR FID
##VAR_NAME=  TIME,          FID/REAL,        FID/IMAG
##SYMBOL=    X,             R,               I
##VAR_TYPE=  INDEPENDENT,   DEPENDENT,       DEPENDENT
##VAR_FORM=  AFFN,          ASDF,            ASDF
##VAR_DIM=   8192,          8192,            8192
##UNITS=     SECONDS,       ARBITRARY UNITS, ARBITRARY UNITS
##FACTOR=    0.0002076,     1,               1
##FIRST=     0,             0,               0
##LAST=      1.7004516,     0,               0
##MIN=       0,             -315796,         0
##MAX=       1.7004516,     374052,          0
$$ Real data points
##PAGE= N=1
##DATA TABLE= (X++(R..R)), XYDATA
0 0 0 0 0 0 8 0 0 0 8 -8 8 -8 8 -16 16 -21 24 -25 32 -34 40 -48 54 -61 69 -77 87 -99 111 -123 138 -153
32 -153 169 -188 210 -232 256 -280 311 -344 379 -418 465 -514 572 -636 712 -802 906 -1036 1194
51 1194 -1394 1653 -2005 2498 -3233 4414 -6522 10945 -23466 121062 331741 -315796 5591
64 5591 291377 -298451 10354 257498 -238508 9857 173664 -196951 38113 125032 -139581
75 -139581 64866 60690 -122616 65089 24639 -76630 75532 -18408 -71874 71757 -9771
86 -9771 -33040 64192 -20345 -38514 34384 -2624 -17355 10090 5674 -14233 -19389 24562 15549
99 15549 -19113 25363 -4707 -42343 35154 9418 -35705 27455 -8279 -33802 37341 8826
111 8826 -16544 16842 -6028 -7161 -2263 -7515 21972 -12775 -21708 29657 -16415 -10453 48366
124 48366 -18244 -19981 21718 -26069 7558 20176 -32508 19435 -710 -34188 52182 -2805
136 -2805 -36865 53266 -30844 -37836 66009 -36299 -24628 62538 -52567 -7007 64122 -52760
148 -52760 16159 40903 -74054 35344 24679 -76764 67084 9236 -87830 84445 2707
159 2707 -78769 96892 -17028 -80696 89637 -32291 -55360 95829 -50975 -39303 93930
170 93930 -64104 -16020 96341 -79448 -14587 81853 -84610 2885 80525 -82866 8359
181 8359 69064 -75701 19918 61951 -74273 12908 47297 -67100 13093 44480 -49286 11782
193 11782 32642 -39398 12110 29261 -29921 3935 12246 -28264 8093 17468 -18883 6908
205 6908 10640 -16330 12641 9187 -18514 11677 562 -26234 17940 7261 -23778 22820 7580
218 7580 -28570 20908 11575 -23525 12016 184 -18814 11792 -2558 -1935 14287 -14124 6867
231 6867 14520 -25918 15223 14657 -39196 17699 13952 -40972 33319 18396 -47409 33078 14400
244 14400 -47332 37864 8163 -50853 35764 2521 -40656 44172 -742 -34462 43534 -12512
256 -12512 -29604 45542 -19690 -26141 40118 -27482 -14123 46015 -28092 -6002 39115 -37470
268 -37470 1453 37378 -43129 5071 31241 -45424 13582 32340 -40086 20088 22642 -43135
280 -43135 22877 15009 -40481 27773 3449 -40313 36405 3742 -32909 39545 -5047 -32957
292 -32957 38797 -11113 -28953 37971 -16717 -23688 37712 -16544 -12498 38147 -21593 -12347 29451
305 29451 -24122 -3656 25640 -28596 911 24009 -24854 10613 21422 -28070 9534 15186
317 15186 -28992 11167 13083 -26577 11411 10763 -21132 17796 10492 -21516 12486 3853 -20477
330 -20477 14176 2584 -20370 14556 3183 -15089 18055 2168 -15196 16807 -4183 -18892
342 -18892 18787 -3894 -16655 20474 -6765 -13901 26543 -5720 -13645 21704 -14243 -10949 23188
355 23188 -18334 -6192 23745 -21398 2222 24518 -25593 8289 20525 -34002 11050 16619
367 16619 -34935 20569 13705 -36715 27044 12101 -34110 30231 2017 -35254 30946 -4341
379 -4341 -29289 33505 -9123 -20624 34617 -15169 -12080 33115 -22524 -8983 25880 -27032
391 -27032 1463 24269 -27572 8145 19334 -25121 14962 11358 -26446 15949 3121 -23912
403 -23912 19568 -1540 -16880 23424 -6535 -12375 24108 -10984 -10319 20508 -16403 -8795 20607
416 20607 -13521 -4732 18901 -10923 -2401 15499 -9451 -4534 8232 -7982 -3643 5733 -3329
429 -3329 -213 5354 -643 219 2765 -2185 493 706 -6871 536 3445 -7138 5102 8023 -11349
444 -11349 6022 11292 -17034 4626 11645 -22193 5636 14630 -22340 10063 16296 -22922 11513
457 11513 12259 -24072 14136 5479 -25066 17516 1159 -19881 24548 -4096 -17541 29012 -11340
470 -11340 -16969 30007 -18756 -15148 31488 -21681 -10007 33771 -21763 -4912 30073 -25020
482 -25020 -2703 24816 -26247 596 18936 -24046 7338 16503 -20681 11682 9995 -20173
494 -20173 12694 2903 -18390 14264 -1113 -15335 16966 -1473 -10132 17521 -4736 -10362 14018
507 14018 -6702 -8712 11059 -6659 -5065 10683 -3597 -527 8074 -4577 -384 3989 -6274
520 -6274 -66 2141 -5478 1843 3404 -2902 3334 3565 -3088 400 847 -2997 -1403 -27 -1004 236
536 236 308 2088 2496 -829 1118 1668 -4189 -1678 2541 -4279 -1810 5650 -2396 -1809 8030 -1430 -3546
553 -3546 5774 -3933 -5598 5844 -3869 -4002 7310 -3146 -832 9506 -5634 -1092 8479 -9675
567 -9675 -1308 8795 -11458 830 11072 -11767 3939 11853 -13199 5174 8184 -17043 7052
580 7052 6405 -17985 11296 5564 -17031 16427 4087 -17604 17147 -823 -18370 17834 -5647
593 -5647 -15324 21497 -8646 -11100 24240 -12399 -8224 24203 -18445 -7512 23162 -20348 -4506
606 -4506 21908 -18588 585 19983 -16772 3412 12272 -16200 5382 4573 -14035 10173 -9
619 -9 -10212 14712 -3836 -7627 16185 -8607 -7958 14082 -10332 -5764 11907 -8603 -985 9963
633 9963 -6131 2681 4408 -6817 3796 -1139 -5963 5102 -2753 -2316 6009 -2747 1579 4349
647 4349 -4727 2414 -3 -5803 3814 -1926 -3549 5439 -2667 767 5548 -4847 4109 1506 -9136
662 -9136 6654 -2022 -9532 12580 -3392 -8652 15717 -5218 -6866 15879 -9911 -6108 12897
675 12897 -12110 -634 10302 -12345 7269 6570 -13310 13711 253 -15397 16802 -6191
687 -6191 -14926 20197 -9003 -9623 21265 -12701 -2671 19483 -18265 2655 14598 -23731 8991
700 8991 11865 -24628 16451 8750 -23611 20049 3295 -21228 20798 -4755 -18418 20941 -8991
713 -8991 -9807 21570 -13062 -3367 19025 -16181 1480 13899 -19193 5383 8613 -17463 10602
726 10602 5740 -13046 12156 -365 -9047 12219 -6366 -5817 9200 -10042 536 8846 -9538
739 -9538 4915 5296 -8421 8023 -1372 -7271 9812 -8209 -4446 11982 -9962 821 12386
752 12386 -11571 3558 8493 -11757 5755 1329 -11303 9678 -3388 -6862 13829 -7327 -2325
765 -2325 13473 -12735 959 11235 -15262 4448 6150 -15382 11873 2938 -12595 16637 -5069
778 -5069 -10536 19902 -13739 -8539 22371 -19746 -4532 24605 -20765 994 23304 -22788 2297
791 2297 17472 -21280 6178 9364 -19516 11522 4945 -13402 14749 -3076 -9020 15493 -10539
804 -10539 -5380 14661 -14917 536 13188 -17054 7395 13386 -17541 8398 7484 -17065 10160
817 10160 3048 -14125 10047 -638 -6736 11005 -4698 -1434 9118 -9309 1057 5540 -11394
830 -11394 6256 3189 -12085 9239 3439 -8246 9529 -1263 -7302 7505 -3439 -3324 4413
843 4413 -5471 3129 3054 -6444 7468 1827 -7198 7068 -3368 -6783 8373 -3945 -3490 6865
857 6865 -6292 2350 7735 -8168 4474 3199 -10197 6360 37 -9307 10079 -2108 -7127
870 -7127 11694 -4185 -3763 11143 -8459 -3257 8335 -9587 2064 6351 -10374 6810 4350
883 4350 -9856 10265 28 -11241 10575 -4275 -9756 13455 -5643 -6489 13240 -7625 -2522
896 -2522 13606 -9921 -1840 9208 -11877 1105 8255 -9774 4707 5142 -9251 7085 3584
909 3584 -8560 6682 -1132 -8918 7073 -98 -5429 6229 -629 -2943 4548 -567 -988 1296
923 1296 -2791 -802 -1114 -1069 3359 -783 -785 3149 -1699 713 3288 -3815 -1271 1416 -2926 948 1497
940 1497 -1188 2477 -345 -1426 3082 -1449 -1204 2681 -4449 -2354 4409 -946 -811 3276 -1828 -717
956 -717 2829 -612 -1493 -462 -975 -857 -1150 2375 2072 -1850 2450 1051 -4589 3398 2191 -6870 1017
973 1017 2485 -5105 3726 4268 -5016 1944 3144 -4103 1470 1252 -4232 900 -187 -2437 3009 1099
989 1099 -397 2336 -2130 -735 2758 -2457 -903 1077 -4238 1217 3780 -2540 2078 2191 -4111
1004 -4111 2158 1083 -4523 3437 -690 -5404 4617 361 -3180 7152 -1416 -5742 6187 -1524
1018 -1524 -4887 5553 -2961 -4775 5685 -923 -1785 5608 -1516 -2170 2819 -2403 -476 1358 -2609
1033 -2609 600 -130 -952 4414 -142 -1824 3146 -2547 -2425 3916 -2226 -2587 2956 -1437 -445 2859
1049 2859 264 430 -6 -970 252 -1755 -5 1320 -3162 742 2692 -2379 2322 2321 -4187 943
1065 943 1166 -3787 1820 -86 -2216 2914 -919 222 4205 -2969 353 2563 -5727 1540 3303
1080 3303 -5761 2565 2720 -5223 4851 2396 -5278 4204 -857 -5456 4719 -1869 -3178 5505 -3139
1095 -3139 -1126 5566 -3510 968 4340 -6250 467 2951 -5634 2582 1807 -4457 3926 994 -2766
1110 -2766 4249 -2193 -2094 3000 -4731 195 3752 -4943 2474 3266 -5496 4832 2382 -6406 4065
1125 4065 -453 -6378 5325 -525 -4295 6119 -1255 -2574 5711 -2875 -1796 4180 -5068 -873
1139 -873 3462 -4144 1743 3650 -3666 2174 2112 -2809 1602 -337 -2396 910 -1297 83 1864 -1611
1155 -1611 2704 750 -2722 3751 -378 -3852 3408 -1811 -3813 4478 -565 -1872 4699 -1518 -253
1170 -253 2774 -2834 238 371 -3960 2516 570 -3431 5064 -167 -3977 5076 -1338 -4271 4926
1185 4926 -2415 -3982 4678 -1914 -1339 4574 -2098 -100 2419 -2919 1097 307 -4022 2432 -132
1200 -132 -2695 4596 -664 -2623 5221 -2094 -3185 4815 -2798 -2958 3696 -2762 -1507 4414 -1036
1215 -1036 -424 2539 -1502 74 560 -1988 328 -809 -922 2041 -945 106 3090 -1467 -642 2404
1231 2404 -2488 -653 1905 -1994 -274 1579 -432 1399 723 -888 1353 -1108 -1011 1185 -2114 -600
1247 -600 1902 -1456 -51 2582 -1285 773 875 -2314 531 244 -1901 1225 -598 -1528 3002 308
1263 308 -1063 2795 -1242 -1413 2055 -2088 -1391 1980 -1556 394 1740 -1311 1785 1035 -2242 1311
1279 1311 -844 -2684 3154 -1527 -1981 4095 -1104 -817 4372 -2508 -1205 3421 -3747 -696 3123
1294 3123 -3745 1222 2880 -3264 2562 1714 -3493 2807 -1146 -3837 3714 -1598 -2566 5072 -2500
1309 -2500 -1377 6099 -3189 -1620 4654 -4054 -1226 3365 -4187 856 2644 -3068 2647 899 -2433
1324 -2433 3889 -1838 -3182 3990 -3224 -2488 5722 -3690 -1403 6341 -3276 -964 4599 -3649 -1075
1339 -1075 2790 -2972 -189 1038 -870 1717 -430 94 2419 -2255 555 1730 -4351 1306 1978
1354 1978 -4343 2884 1731 -3557 4217 208 -3839 3888 -2097 -2814 3818 -3879 -385 5056 -4271
1369 -4271 1875 3963 -5787 3254 2418 -6986 3928 1178 -6269 5493 128 -4644 6055 -1119
1383 -1119 -2962 4875 -3478 -1376 3615 -5233 1023 3736 -5038 4027 2280 -5484 5018 395 -5736
1398 -5736 4714 -1967 -4374 5476 -2616 -1487 5593 -3741 947 4481 -6348 1930 2798 -7207
1412 -7207 3701 1915 -6039 5710 690 -4886 5471 -1272 -3806 4652 -3650 -1756 4352 -4142
1426 -4142 1380 3502 -4519 3399 1682 -5358 4569 -797 -4850 5165 -2550 -2797 6034 -3204 -912
1441 -912 5287 -4880 897 4216 -6541 2353 2431 -6072 4341 942 -4896 5926 -624 -3938 5440
1456 5440 -2648 -3090 5007 -3912 -1017 3851 -3780 1906 2505 -3969 3905 -67 -4149 5102 -3199
1471 -3199 -3229 6640 -4727 -1172 7605 -6171 326 6444 -7242 1285 4938 -7923 3025 3087 -6994
1486 -6994 5832 1452 -5685 6569 -1011 -4833 6353 -3477 -3726 6355 -4175 -1336 5951 -4419
1500 -4419 1078 4073 -4892 2118 1421 -4452 3046 -755 -3554 4925 -1641 -1422 5176 -3563 -840
1515 -840 4268 -4960 27 3156 -4810 1587 2335 -3568 3754 690 -2815 3026 -1891 -2085 3340 -3457
1531 -3457 -494 3177 -3970 1556 3144 -3850 2584 1217 -4248 3058 -510 -3228 3200 -1726 -1296
1546 -1296 4037 -2617 979 3429 -4688 1893 2099 -5622 3310 1646 -5564 4966 1129 -4582 5701
1561 5701 -224 -4260 4609 -2085 -2743 4410 -3055 -765 4051 -3580 1338 2781 -4250 2269 1043
1576 1043 -4480 2975 102 -3604 3570 -672 -2303 4240 -1716 -1062 3160 -3247 183 2141 -4008
1591 -4008 1671 2002 -3644 3298 1127 -3816 4224 -439 -4288 3431 -1337 -2907 4046 -1019 -2027
1606 -2027 3698 -1252 -637 2491 -2103 -272 708 -1789 800 888 -1241 1456 485 -546 1366 -396
1622 -396 -471 321 -1454 -189 259 -728 1028 1 -117 1579 -953 -376 1678 -1886 -268 1457 -2202
1639 -2202 891 1993 -1382 1059 1160 -1581 1561 93 -2233 1467 -681 -1128 2585 -1079 -553 2552
1655 2552 -1563 -472 2556 -2395 -283 1686 -2948 624 2141 -2071 1345 1325 -2116 2080 258
1670 258 -2610 1644 -673 -2223 2537 -574 -1823 3666 -395 -2422 2961 -1142 -2189 2567 -1423
1685 -1423 -1881 2318 -736 -727 2071 -842 -411 1255 -1387 -63 501 -1557 861 4 -1451 2484 533
1702 533 -1580 2142 -308 -2224 2013 -603 -2837 1960 -156 -1914 2250 547 -1012 1415 -401
1717 -401 -920 879 -692 -284 -82 -1145 851 577 -684 1413 -261 -1682 1355 -331 -1622 1294
1733 1294 -569 -1582 1663 170 -577 1664 41 -1239 440 -394 -711 141 -444 -470 594 414 473
1750 473 569 -139 -545 218 96 -1038 461 740 -1443 529 1735 -1555 1229 1501 -2863 572 1319
1767 1319 -3245 993 1126 -2900 2116 1492 -2072 2220 246 -2190 1618 -1309 -1397 2594 -1813 -742
1783 -742 2750 -2247 426 3160 -3335 245 2204 -3971 1226 1968 -3644 1945 1532 -3035 2964 355
1799 355 -2355 2921 -1373 -2514 3404 -2070 -1194 3899 -2593 -448 3809 -3057 -138 2697 -3731
1814 -3731 270 2042 -3187 1452 1679 -2640 1863 695 -1723 2182 -642 -1966 1827 -1450 -790
1829 -790 2158 -1251 -169 1834 -1304 307 1175 -1516 116 -104 -1431 543 72 -20 1067 -836
1845 -836 534 753 -1109 464 106 -1848 627 376 -1046 1217 250 -635 715 34 -11 188 -1165
1862 -1165 108 -584 -1082 1801 -210 -863 2325 -936 -869 1995 -1586 -1099 1819 -2292 -48 2219
1878 2219 -1915 1002 1867 -2332 1651 888 -2734 1994 -358 -3073 3187 -718 -2416 4275 -942
1893 -942 -2420 3724 -2027 -1699 3176 -2793 -793 3135 -2523 914 2826 -3222 1252 1723 -3488 1811
1909 1811 1114 -3488 2602 433 -2718 3025 449 -2454 2832 -303 -2039 2445 -1204 -1689 2181
1924 2181 -1451 -201 2293 -1187 406 1520 -2111 423 1376 -2275 349 1153 -1681 1003 1437 -1580
1940 -1580 873 991 -1387 104 842 -1264 -225 713 -420 12 639 285 -280 -77 321 -983 -55
1957 -55 300 -637 -80 224 -155 467 52 199 339 -848 -60 449 -994 109 467 -1132 563 1176 -873
1976 -873 624 623 -1654 451 -363 -1211 796 -39 -703 1812 -283 -403 1917 -1399 -681 2038 -1796
1993 -1796 -710 2111 -2050 244 2494 -2056 681 1986 -2253 601 1150 -3075 1433 723 -2317
2008 -2317 2342 91 -1632 3139 -847 -1886 2812 -1813 -1428 3467 -2461 -985 3802 -2620 14
2023 14 3455 -3008 398 2411 -3383 616 1905 -3328 1860 788 -2745 2750 211 -2504 2982
2038 2982 -837 -2869 2983 -1393 -1816 3008 -1161 -773 2696 -1290 -318 2111 -2108 -287 838 -1975
2054 -1975 1001 667 -1442 1450 223 -1265 1332 -723 -1186 670 -757 -604 777 -194 422 479 392
2071 392 618 -739 144 554 -1676 569 479 -1969 1322 636 -1680 1930 396 -1497 1610 -474 -1660
2088 -1660 1528 -1353 -542 2119 -1561 707 1863 -2681 1482 1096 -3022 1851 434 -3283 3127
2103 3127 292 -2867 3802 -251 -2260 3171 -1797 -1938 2955 -2569 -401 2787 -3099 1288 2469
2118 2469 -3491 1863 1456 -4001 2382 418 -3893 3427 -79 -2428 3821 -1039 -1555 3469 -2365
2133 -2365 -1044 2857 -2903 -72 2924 -3173 1634 2320 -3099 2222 1029 -3261 2040 133 -2516
2148 -2516 2268 -429 -1162 2268 -728 -435 1750 -1495 471 823 -2201 963 351 -1755 1649 33
2164 33 -1254 2160 -574 -819 1240 -1350 -220 748 -1193 936 403 -1155 2023 -575 -1229 2158
2180 2158 -1586 -882 1916 -2288 -270 2082 -2226 808 1707 -2307 1546 190 -2191 2167 -824
2195 -824 -2041 2847 -1857 -1214 3843 -2622 -471 3634 -3550 -189 2847 -3959 668 2724 -3765
2210 -3765 1907 1637 -3204 2668 609 -2800 2900 -1000 -2426 3262 -1891 -1420 3586 -1930 -88
2225 -88 2741 -3082 448 2143 -3118 878 1035 -2438 1956 807 -1801 2069 -293 -1494 2277 -1409
2241 -1409 -1141 2087 -2013 -181 2165 -1938 540 1884 -1797 778 1066 -1694 372 29 -1011 880
2257 880 -51 -390 966 -689 253 381 -1048 439 -83 -1167 752 -55 -265 1338 -521 -93 1002
2274 1002 -1232 517 425 -1946 954 59 -1607 2226 87 -1472 2297 -499 -1432 2131 -1290 -1457
2290 -1457 1900 -1514 -169 2023 -1697 808 1934 -2055 1122 710 -2286 1445 65 -2328 2159
2305 2159 53 -1459 2532 -556 -1272 1934 -1695 -874 1785 -1824 119 1611 -1836 1021 1409 -2155
2321 -2155 1379 758 -2380 1493 16 -2342 1923 54 -1684 2176 51 -1324 1732 -277 -1299
2336 -1299 1037 -617 -444 725 -434 51 956 -443 456 192 -804 536 -43 -941 429 374 -554 547
2354 547 494 -462 267 315 -108 -152 -202 -98 -235 123 392 -62 409 676 -262 -69 222 -317 -187 -136 17 -138
2376 -138 26 486 259 -1 317 66 -689 279 306 -834 527 387 -563 861 550 -612 588 30 -738
2395 -738 331 -394 -652 499 -30 -331 843 43 -13 861 -689 -265 774 -793 -376 790 -839 -183
2413 -183 1194 -384 -68 809 -963 -202 255 -1284 160 139 -747 750 24 -699 1251 -21 -1055
2430 -1055 1119 -658 -1358 1304 -313 -625 1755 -302 -230 1337 -599 -498 1098 -1197 -341 349 -983
2447 -983 646 533 -1023 1052 325 -1308 1248 -268 -1720 1242 -150 -1122 1573 -194 -813 1333
2463 1333 -218 -717 1114 -778 -550 632 -863 180 571 -517 504 118 -473 549 -358 -712 497
2480 497 -324 -606 487 -155 53 462 -177 19 187 -200 296 -531 -354 498 -679 222 916 -646 316
2499 316 882 -1025 274 -18 -917 281 35 -337 860 -207 -86 1211 -808 -422 790 -1499 16
2516 16 906 -1324 451 1031 -1102 960 674 -869 991 -167 -1111 735 -521 -440 1510 -916 52
2533 52 1669 -1559 184 1358 -1826 140 913 -2007 800 955 -1130 1490 492 -1146 1326 -590
2549 -590 -903 1161 -1094 -544 1953 -1075 18 1697 -1298 183 1145 -1358 54 946 -1401 230
2565 230 348 -1105 858 584 -548 779 -240 -393 735 -806 -37 644 -848 450 777 -658 674
2582 674 251 -949 412 49 -814 514 -49 -580 267 -149 218 339 -430 485 288 -998 695 103
2600 103 -572 1256 154 -161 927 -260 -168 513 -478 -315 200 -604 439 126 -521 1066 -209 -857
2618 -857 1177 -491 -861 954 -731 -969 1343 -601 -232 1273 -756 261 830 -1141 6 -57 -1150
2635 -1150 744 431 -814 1345 43 -725 1140 -342 -932 714 -519 -544 889 -588 -68 996
2651 996 -547 313 459 -1079 566 353 -1350 521 29 -1141 879 423 -869 1126 -134 -768 653
2668 653 -179 -814 606 -371 -263 724 -242 178 298 -533 95 -58 -712 743 131 -731 899 10 -457
2687 -457 792 174 -321 393 -227 -551 174 -331 48 183 -8 430 179 -387 722 -253 -737 684 -520
2706 -520 -658 542 -273 131 894 -344 -65 598 -157 209 89 -948 219 -90 -375 753 -166 -26
2724 -26 836 -338 -247 527 -834 -22 695 -676 450 498 -538 944 293 -412 782 -393 -999 661
2742 661 -641 -503 1358 -807 -170 1422 -1143 -60 1143 -1160 -65 764 -1006 377 618 -750
2758 -750 941 131 -678 814 -706 -793 681 -692 -589 1436 -936 -159 1402 -1165 -234 1117 -1101
2775 -1101 -8 724 -1127 684 52 -428 1200 -366 -527 997 -1018 -386 1155 -1042 -117 1285
2791 1285 -1067 230 1182 -825 480 493 -965 338 -413 -756 865 -596 -101 1047 -592 377 877
2808 877 -809 213 466 -1213 554 404 -1101 795 34 -458 1119 -292 -496 664 -985 -51 692
2825 692 -1416 728 940 -1379 1300 633 -1450 1173 -197 -1186 1190 -337 -594 1123 -766 57
2841 57 1239 -1023 288 648 -1189 417 508 -1768 1039 208 -1246 1470 90 -925 1643 -870
2857 -870 -647 1322 -1119 -59 970 -1047 440 806 -1427 1017 287 -1475 1316 59 -1413 1191
2873 1191 -590 -1163 1672 -478 -400 1516 -650 -48 986 -1256 114 340 -1142 843 450 -1275
2889 -1275 1515 -227 -945 1231 -558 -704 1234 -738 -177 749 -847 539 587 -810 506 -78 -1068
2906 -1068 986 -121 -957 1255 -438 -440 1395 -548 -94 1076 -954 159 713 -1472 268 59 -658
2923 -658 1234 -72 -713 1345 -743 -480 1125 -1188 -292 1151 -1246 60 1051 -1248 557 655 -1371
2940 -1371 619 136 -962 1105 -391 -719 1238 -613 22 1458 -913 -108 850 -1458 99 905
2956 905 -1173 232 478 -885 625 -16 -556 838 -293 -455 711 -805 -26 1043 -923 379
2972 379 989 -1032 368 485 -1163 479 172 -851 569 177 -459 622 -60 -234 742 -672 118
2989 118 486 -1101 317 428 -824 639 433 -725 581 360 -718 452 -196 -541 653 -481 -196
3006 -196 383 -362 187 294 -614 315 -21 -1049 470 -236 -862 816 218 -426 895 -38 -20 589 -482
3025 -482 -19 36 -493 349 399 -282 610 222 -636 670 -249 -724 434 -128 -523 327 -89 29 535 -309
3045 -309 13 409 -676 312 -86 -675 418 -34 -641 703 242 -338 594 -99 -729 111 -327 -470 196
3064 196 175 -162 284 53 -56 227 -276 -92 260 -214 -60 -124 -344 291 147 -231 387 163 -262 180 -120
3085 -120 -231 27 4 134 125 -22 391 85 -439 196 -179 -643 490 113 -524 331 206 -223 161 287 -505
3106 -505 14 -236 -299 135 -157 287 221 113 581 173 -146 144 -230 -209 -175 -130 -465 332 238 -320 248 44
3128 44 5 -220 28 129 -285 -39 290 28 -339 428 143 -102 489 -165 -404 569 -316 -581 679 -180
3148 -180 -117 677 -309 123 282 -482 -134 160 -585 312 -181 -417 569 -78 -293 680 -33 -250 372 -396
3168 -396 -240 530 -153 -234 336 -345 362 471 -743 278 -106 -522 485 -122 -465 597 -257 -429 1004
3187 1004 -155 -427 600 -256 -353 597 -559 -110 448 -137 164 361 -12 322 -338 -479 477 -179 -374
3206 -374 684 -316 99 396 -221 85 113 -509 346 43 -588 290 167 -265 385 -139 -70 438 -636 -123
3226 -123 406 -397 -242 896 -425 236 403 -178 208 -107 -299 246 -470 -16 558 -505 216 775 -498
3245 -498 273 661 -788 64 357 -710 435 99 -677 603 -38 -234 761 -290 -19 473 -840 -84
3263 -84 426 -849 156 565 -506 363 643 -535 347 58 -989 433 150 -632 578 -342 -252 667
3281 667 -538 -165 642 -515 180 243 -796 61 384 -599 428 377 -411 437 46 -56 197 -471 -246
3300 -246 374 -263 334 491 -267 587 837 -471 44 170 -734 183 210 -269 289 -100 -63 332 -262 -239 115
3321 115 -219 263 -124 -530 382 176 -378 585 176 -326 214 -267 -420 33 -228 -320 375 -319 298 214 -292
3342 -292 419 -46 -758 297 -242 -644 478 -184 -528 642 -90 -517 650 -68 -153 447 -315 35 503
3361 503 -106 327 -20 -244 478 -170 -484 334 -330 -584 250 -333 -432 809 -1 -152 604 -31 -331 190
3381 190 -481 -115 221 -456 425 427 -502 535 277 -478 508 -245 -585 478 -274 -251 632 -159 -353 504
3401 504 -24 -275 -211 -378 40 269 -225 319 98 -102 348 -364 -101 427 -206 -539 37 -54 -176 362 52
3422 52 314 245 45 225 104 -187 198 -488 -317 239 68 -279 677 -40 -280 312 -407 -217 225 -328 144
3443 144 94 -303 165 26 -154 331 -61 -135 400 -565 -314 609 -310 -248 484 -352 158 213 -352 -159 6
3464 6 -504 61 -73 -202 431 -240 -274 747 -486 -6 750 -794 -354 301 -595 255 703 -532 244 525
3484 525 -512 270 96 -512 299 -192 -178 467 -118 -143 652 -476 -102 805 -618 -103 255 -851 215
3503 215 527 -386 411 -61 -552 524 286 -338 726 -212 -326 397 -402 224 532 -493 222 384 -542
3522 -542 40 54 -662 216 51 -298 463 -274 -259 624 -253 182 101 -715 109 401 -575 250 192 -731 629
3543 629 200 -443 529 7 -125 599 -253 26 399 -519 399 272 -671 400 141 -716 243 147 -466 680
3563 680 -45 -315 724 -235 -188 430 -809 -26 416 -584 319 208 -411 746 355 -873 559 -42
3581 -42 -564 664 -112 -394 557 -328 -226 548 -584 151 437 -658 469 150 -737 644 69 -545 871
3600 871 -363 -315 922 -223 -451 428 -721 -88 634 -285 235 629 -380 666 42 -347 501 -174
3618 -174 -263 340 -418 -201 753 -44 -150 644 -122 186 331 -570 239 -117 -302 148 107 -217 452 -127 -92
3639 -92 664 -468 -189 468 -610 -55 255 -371 297 273 -366 486 -82 -156 525 -338 -407 683 -109 13
3659 13 596 -556 -112 384 -448 111 353 -702 198 -61 -517 591 -163 -111 583 -78 -91 335 -440 -91
3679 -91 433 -604 232 493 -357 50 485 -317 443 230 -167 11 -503 -453 565 71 -199 685 -555 -22
3699 -22 362 -679 -92 405 -444 429 494 -288 166 205 -366 335 -208 -49 194 -256 146 100 -585 327 453
3720 453 -14 62 415 -659 38 30 -446 159 -88 -162 357 -13 -131 110 -386 -233 48 42 104 80 -261 423
3742 423 118 -60 313 -48 -448 171 103 -223 71 -38 42 132 47 228 49 -232 188 -79 -327 -33 -156
3763 -156 -477 440 -133 -179 365 -140 158 298 54 -121 -44 -166 268 127 55 488 74 5 240 234 -211 69
3785 69 -32 -359 178 -208 -70 87 -8 -46 24 -89 -150 -149 -81 -104 -138 -76 88 -21 -202 282 32 -225 140 -194
3809 -194 -443 195 54 -38 157 215 -31 119 165 124 -45 13 -4 -47 -192 54 400 -166 233 311 0 38 247
3832 247 -332 106 -73 12 165 61 -80 30 -101 -37 -71 -276 -58 -60 -236 271 247 -88 264 353 -180 304
3854 304 -105 -638 119 -114 -201 257 250 178 444 42 293 147 -162 114 -97 -541 198 -127 -189 587 -41 -204
3876 -204 421 61 -197 284 -323 -215 68 46 119 -110 -208 368 -163 -303 320 -78 -242 323 -346 -31 476
3897 476 -127 6 217 -112 -312 37 -207 11 -174 28 396 -119 -105 567 -343 -74 533 -118 120 -17
3917 -17 -244 -82 466 -339 37 266 72 74 -113 -204 163 -449 -588 426 -138 -1 491 -476 -13 239 -337
3938 -337 40 219 -186 -451 113 -273 90 291 27 382 -62 -235 -149 -241 -269 300 -133 -354 442 -319 287
3959 287 529 -194 -28 -74 -289 284 196 -252 218 -175 82 404 -240 -9 347 -312 -169 202 -471 354 131
3980 131 -189 280 60 -471 127 -75 -254 313 -210 239 16 -121 96 189 -506 17 392 -641 312 90
4000 90 -267 73 102 -182 274 90 190 96 -413 -95 62 -440 116 110 -577 -46 95 -505 239 238 -337 90
4022 90 -297 -112 -10 -242 172 57 11 250 298 -284 285 -19 -438 103 52 -404 176 -81 -226 190 264 -286
4044 -286 297 83 -6 105 -257 43 449 141 128 315 75 223 -85 -194 356 -4 19 355 124 -98 156
4065 156 127 -50 104 -61 17 -92 -233 210 -30 -82 314 -14 -214 -156 -75 -36 17 -187 -247 346 145 39 243
4088 243 -66 120 -16 -136 364 32 -23 332 -57 -173 301 -52 -35 354 -103 63 136 -168 57 258 57
4109 57 250 62 -55 117 171 -94 138 -79 -249 2 -184 -233 330 127 -72 133 -93 -206 -9 -133 -60
4130 -60 -18 -116 30 -69 -249 22 135 -167 -6 196 -334 -54 69 -34 328 48 -214 311 -98 -104 -68 -308
4152 -308 -144 -33 -345 95 182 -286 279 -361 -299 310 -89 -313 93 -72 41 305 -227 209 -25 -99 201
4173 201 77 -268 -51 -88 -260 366 -238 -243 711 -193 -289 386 -152 -294 173 -165 -311 236 -122 94 81 -346
4195 -346 604 -186 -133 244 -87 -315 321 -437 -100 360 -273 -283 443 -393 203 179 -223 89 58 4 385 -299
4217 -299 -118 305 -280 14 350 -177 -160 112 -557 141 221 -313 420 310 -365 429 137 -395 -37 -105 -1
4238 -1 86 -106 48 190 -122 320 434 -329 100 96 -511 -47 268 -430 225 54 -77 489 -29 -236 142 -310
4260 -310 64 95 -390 230 40 -322 368 185 -252 166 -143 -310 154 -25 -232 321 -291 -193 421 -2 410
4281 410 137 -491 -91 60 -353 294 116 -351 649 442 -7 252 -169 -178 428 -390 -26 99 -168 171
4301 171 560 33 423 -55 -489 111 152 -363 196 -160 -382 492 -126 113 182 -171 -51 167 -231 72 207
4322 207 -348 173 -141 -252 781 360 -334 365 -121 -220 29 -184 -104 336 31 231 436 -60 10 163 -150
4343 -150 246 -159 -190 463 -261 -190 395 -158 92 258 37 -151 154 -442 -16 -24 -244 222 30 -150 376
4364 376 -222 -74 467 -37 -283 708 -298 -48 87 -282 226 -35 -58 94 158 -215 -51 -272 -228 426 -20
4385 -20 204 305 -155 193 211 -353 4 316 -174 303 190 -424 220 78 -65 305 -137 12 -38 -159 -152 92
4407 92 -191 277 151 -246 -68 254 -125 5 119 -45 108 -31 167 37 -132 -123 62 -292 48 245 -191
4428 -191 40 421 158 59 245 -56 -11 21 -53 44 -134 1 27 -203 163 62 19 -36 102 -561 -5 189 -123
4451 -123 -17 93 213 29 184 -110 138 211 117 212 -218 -149 -56 -64 -176 19 34 -54 102 105 71 -212 8 -29
4475 -29 32 -341 -101 -312 150 -13 -148 -99 -10 -348 -45 -41 -216 79 104 -163 -60 159 -197 -101 196 -123 148
4498 148 214 -196 99 242 -13 72 137 91 111 11 -123 30 -175 -78 -202 -331 463 234 -77 -260 214 -37
4520 -37 -30 119 -123 -263 -5 196 228 229 65 -77 -44 -68 -75 -60 70 33 -136 179 161 -129 103 31 -158 55 -130
4545 -130 -66 -71 -212 -17 237 -39 174 77 -156 -23 195 -277 -128 -114 -72 -51 140 21 95 122 264 -33 69
4568 69 -204 61 -234 -220 64 -306 162 299 -207 79 63 -149 -70 -297 -326 -18 76 40 -34 -196 29 -27 24
4591 24 -245 -331 -58 90 -79 -170 307 -29 -210 270 -32 -335 34 -139 -98 287 36 -255 29 90 113 255
4613 255 56 91 269 -118 -46 -224 -161 -86 -227 -48 254 -56 -91 392 -97 -44 -27 -293 -35 -107 -165 274 -236
4636 -236 -103 -23 -374 -450 32 -31 -329 389 -171 -51 154 -29 -156 -126 -257 -17 34 165 -58 -44 78 102
4658 102 -150 14 81 60 -12 171 -367 -103 60 124 429 171 9 -24 109 -386 70 -4 -4 128 -142 153 205
4681 205 -336 -58 123 32 191 111 -205 -77 119 -79 66 1 5 225 -198 89 -23 97 199 289 -67 200
4703 200 84 122 47 2 -376 -16 -87 -92 232 -62 157 255 73 -53 36 -269 -1 36 148 -198 205 -403 301
4726 301 402 -185 -38 -49 -91 -138 136 -145 75 -319 73 77 -187 58 -325 -134 186 298 -278 395 134 -26
4748 -26 308 -7 -85 329 -47 71 181 105 -78 130 -8 193 213 -51 287 123 37 0 280 -187 260 -89
4770 -89 -118 136 -115 -234 164 -257 -64 50 35 258 371 -58 470 93 -127 226 204 -31 20 -60 -85 173
4792 173 3 -242 29 325 -69 61 4 146 -42 -32 179 -110 -271 -79 138 -190 -135 -38 -371 315 -117
4813 -117 -175 415 -366 -126 146 -53 243 44 -157 202 40 -245 -286 -108 -215 143 44 52 116 151 -250 309
4835 309 -29 -249 9 -31 -117 -52 -76 -84 87 -133 235 -190 -229 310 -87 -264 323 79 -255 139 -101 -35 274
4858 274 -70 176 130 79 -70 -69 -443 -106 -54 -118 293 -47 -41 -20 -156 -236 -75 -201 -388 211 -111 -29 -10 -128
4882 -128 97 -105 -117 131 -89 -267 -7 -88 -109 205 -28 22 342 294 124 274 14 -120 136 -150 -75 15
4904 15 81 372 -278 121 320 -265 -38 113 -74 -51 343 -65 -151 423 -439 129 -171 57 20 -131 49 117
4926 117 20 -101 365 -88 173 369 -35 -289 107 -100 -115 215 -72 -110 -24 -73 -70 -21 -246 131 -265 -41 128
4949 128 -260 66 161 -159 -96 262 -256 8 88 -33 -118 2 -109 184 35 -79 250 -308 -134 76 -284
4970 -284 -7 -1 -245 209 28 113 153 97 -224 85 139 -168 -87 -348 40 -61 -274 -148 -90 168 21 1 -156
4993 -156 106 151 -253 -105 -61 -380 29 51 106 -139 -23 -130 236 -264 16 -204 -154 265 54 34 214 157
5015 157 -361 211 -57 -121 -188 -205 -180 256 -206 267 256 3 -120 23 28 -3 -23 -257 -117 12 -196 325 14
5038 14 -160 -3 -48 -136 -114 -299 -135 48 -138 138 -3 367 -37 -144 -87 58 -72 -332 153 73 20 -24 -220
5061 -220 172 -52 -278 -118 178 9 -209 146 -133 201 72 -233 140 -107 88 286 -86 -113 117 -68
5081 -68 -251 126 -224 -73 75 -90 -1 1 -251 158 -313 -112 279 -65 24 369 -173 -114 105 27 285 -174
5103 -174 -30 -25 -112 125 269 274 -21 78 271 -312 -61 -58 -47 13 -140 -214 -85 36 112 66 -124 -174 -98 -171 110
5128 110 -121 -417 -30 -234 -44 109 -54 -88 14 -351 -19 -36 -79 -16 44 -219 44 130 107 56 -241 21 -55
5151 -55 -225 173 212 -46 270 -90 -147 52 101 -57 -34 110 119 -153 19 -60 -132 -6 86 129 -164 -180 -131 20
5175 20 86 32 -79 189 177 26 77 -122 -266 79 -92 -74 -155 11 13 219 315 378 133 -71 216 -58 188 -118
5199 -118 -1 -16 337 17 -183 40 -35 -67 -69 169 7 -234 -246 -164 -188 12 21 154 74 -54 3 -297 3 -233
5223 -233 -61 45 -165 -88 -10 162 -89 61 80 90 -23 64 267 185 39 31 -38 330 261 -115 -80 70 184 -134
5247 -134 -57 147 -222 -15 -144 151 265 338 27 -55 197 -25 38 129 22 -63 -264 131 -78 -35 -292 -5
5269 -5 -315 104 -64 -370 112 71 -104 -133 41 -85 7 -74 126 -142 -268 117 -15 183 188 287 -94 -112 67
5292 67 53 43 56 -52 20 33 -59 26 -240 -22 42 6 42 103 -101 79 -17 -6 34 3 -118 25 -86 106 244
5317 244 -17 6 151 -8 5 -42 -137 63 162 -162 -60 -398 -201 202 -6 202 112 85 -319 30 31 201 203 -252
5341 -252 -13 -11 -26 33 79 -167 153 38 -99 205 99 -85 204 -380 -30 -64 -159 84 29 -95 170 -39 60
5364 60 197 173 -180 -45 -6 -226 375 89 -88 -149 165 -55 320 -107 -41 -218 71 -72 -5 122 202 -26
5386 -26 2 94 26 51 186 -169 216 38 -242 -134 159 -223 50 -185 -175 174 -102 107 -18 -188 25 40
5408 40 -21 120 82 184 29 143 93 -79 -76 -64 -180 -31 19 129 119 47 419 63 60 44 -69 96 94 -198 -193 25
5434 25 -34 65 32 -313 203 11 -36 39 220 119 -62 -156 235 -32 -154 -87 38 -137 -97 177 80 16 138 32
5458 32 139 168 -6 103 -70 -106 304 94 58 91 79 -178 118 -150 27 239 -78 103 203 -127 -40 13 124
5481 124 155 -237 -143 -230 26 52 -134 39 294 59 -218 230 174 103 -151 9 -90 81 197 -74 120 82 138
5504 138 70 226 124 86 -51 277 -99 21 -103 265 -171 11 3 201 169 94 -380 58 -92 -180 76 -61
5526 -61 -156 298 68 -145 21 -98 -186 103 168 -123 -165 -147 93 -106 4 162 185 -40 -125 134 59 151 -44
5549 -44 154 -44 18 -125 60 -208 -64 149 67 264 -40 168 297 -168 -8 -58 19 67 165 -42 -3 -174 141
5572 141 111 -282 -98 -68 -180 -32 -32 87 89 112 129 -274 116 -177 137 134 -289 -64 -16 -49 127 -295 -38 64
5596 64 -148 -40 9 81 -33 -66 -80 -98 -39 58 179 115 -10 230 -347 -162 -16 125 -149 80 91 151 164 11
5620 11 -13 291 -294 -128 91 71 71 106 -58 -155 267 102 143 -71 0 362 191 -2 94 48 86 231 -104 -21
5644 -21 -10 -361 297 189 -44 -285 -102 -23 21 101 -176 104 -238 365 83 94 45 -18 16 -32 134 -35 -10 170
5668 170 36 36 -182 -103 -54 82 157 -158 -350 -69 101 -1 94 196 -228 59 77 -18 -220 123 -37 271 73
5691 73 52 197 124 -133 73 -95 -108 154 -198 196 385 -248 9 -264 -23 104 -15 -48 327 -26 42 192
5713 192 32 -77 133 -38 157 123 -78 224 -41 243 -98 17 -30 -37 217 -89 19 -165 -10 93 -129
5734 -129 30 415 -5 258 -15 12 9 83 -43 -9 -4 -330 24 21 -66 477 71 -9 61 -201 0 46 82 303 -7
5759 -7 64 232 26 -47 -55 -109 -97 92 30 -164 106 -173 85 138 -87 163 -27 -297 -262 -202 -117 276 -63 224
5783 224 242 73 -128 -53 -76 -141 -293 -75 -218 -171 -120 142 -72 34 2 193 -155 205 140 45 206 81 -41
5806 -41 38 76 66 -135 84 62 137 73 72 63 77 329 -48 55 -60 -207 -167 46 -230 -200 -171 112 -189 186 -112
5831 -112 -46 291 -7 190 -107 -63 -121 0 188 -17 -59 -43 -30 -219 81 35 -26 84 -28 -92 -121 -82 63 94
5855 94 75 52 -104 -55 -115 259 -133 3 -116 -47 -149 265 -61 -178 -22 -187 -182 -224 -270 -130 248 91 -34
5878 -34 7 -100 -103 -71 -53 -49 80 -151 105 5 -170 303 25 -344 -91 -20 -174 20 331 -205 308 76 -180
5901 -180 -94 208 -22 20 137 325 134 -197 67 -2 13 123 57 22 -147 181 47 84 65 -101 -107 140 -160
5924 -160 61 -41 138 -14 -87 -171 -147 149 -179 -19 69 73 -129 -61 4 -98 -120 337 118 141 124 -202 -218 93
5948 93 49 114 -117 43 231 -39 63 126 9 -115 54 -243 284 57 -16 -210 24 -29 -160 -56 -38 -176
5970 -176 22 -77 -16 44 39 -23 215 267 -16 -271 -194 99 -223 -16 286 -180 -66 34 -96 1 -281 23 366
5993 366 74 108 -33 -169 262 17 -254 155 172 60 0 142 112 85 106 -282 62 145 -35 112 -154 -60 -83
6016 -83 165 -146 1 44 146 -113 187 -146 161 327 -32 -73 -19 84 -263 46 -68 187 74 113 5 -150
6038 -150 -14 -131 271 11 -47 88 166 -3 36 -115 -95 92 105 127 -347 9 -22 67 -215 67 -164 -29 8
6061 8 61 73 -15 29 8 -129 125 118 -9 184 184 -62 132 48 -12 -164 138 268 -84 65 -171 -86 94 284 17
6086 17 122 -144 128 -274 -377 192 -140 17 -211 135 -222 33 -59 -10 221 -77 -30 -137 242 -2 -257
6107 -257 -162 254 33 212 -222 -338 -91 -143 141 142 95 -117 -64 166 16 22 -193 -30 276 98 0 -166 -62
6130 -62 133 299 263 230 -59 20 -99 195 -67 -253 201 0 -163 344 -253 -72 -24 -240 -51 349 -245 -50
6152 -50 73 -35 104 -129 64 -178 -140 225 -70 -184 -52 -5 -22 2 77 188 58 -66 239 8 -32 -10 58
6175 58 -140 -149 374 -76 -71 -112 35 3 -53 -74 183 -13 -181 -211 -159 135 -93 155 145 -76 50 -160 38 28
6199 28 30 -247 -48 -129 -28 -135 -8 155 82 146 -192 -125 -30 104 66 129 124 -105 -145 -28 72 -86 -43 -169 167
6224 167 -172 -127 154 30 249 -153 -319 209 171 116 153 -150 -29 204 -48 70 -3 -152 -46 39 -84 242
6246 242 -72 6 137 0 -2 -46 11 152 181 26 72 -299 -25 -84 93 0 68 -144 226 255 -126 -15 70 201
6270 201 -126 227 36 251 46 -81 160 91 43 86 -271 -7 3 -64 -126 66 -214 71 -80 -49 193 -48
6292 -48 278 -325 7 71 259 143 -232 58 -19 -2 -21 -41 189 170 -60 -92 -69 -54 252 -226 197 -130 242
6315 242 -141 138 26 -107 221 94 -169 -70 111 -158 -68 -7 73 57 280 66 11 -92 241 -42 -79 -51 -100
6338 -100 65 -64 -209 182 20 83 -100 133 197 192 3 39 -148 251 279 -227 24 34 -219 236 -80 87
6360 87 223 124 -7 -199 78 -8 50 82 198 -53 166 193 -255 -69 52 -67 57 86 48 -10 3 -151 -35
6383 -35 54 75 117 176 -65 -17 41 388 106 139 71 -105 37 8 72 58 181 -316 35 104 -121 -64 182 -191 -209
6408 -209 63 33 196 67 -180 79 -86 -4 172 -61 245 -157 247 386 -72 11 178 -54 -112 -47 23 -148
6430 -148 -93 56 101 272 187 -181 -31 -117 63 -19 -143 42 -168 -77 -167 -14 70 218 -131 -100 -79 201 112 -75
6454 -75 32 -19 216 -64 -2 102 62 -32 -64 0 -191 152 -250 -52 -101 -335 148 72 -140 64 150 44 74 -92
6478 -92 239 -53 -41 -278 -13 -90 -126 5 96 -9 -33 -306 -58 -246 135 19 -12 77 75 142 -172 144 53 36
6502 36 -67 102 14 104 -17 71 10 98 -111 21 -20 -51 111 -316 -154 -233 76 -192 -89 44 -2 -77 35 -46
6526 -46 248 -195 295 277 -300 49 181 135 -33 316 240 -146 -2 -174 326 211 -41 131 -25 281 63
6547 63 -30 -44 -146 -146 -56 223 101 -269 -131 156 101 69 98 56 58 95 -74 -174 -41 -132 -142 -74 -151 44 -120 -174
6573 -174 -132 -299 -42 -216 22 -39 -106 -37 -7 163 -216 -274 -31 140 -123 -94 -14 -51 -185 -150 -204 24 -13 -41
6597 -41 152 57 -31 -55 10 70 -173 -200 116 27 33 -208 -159 43 -154 -134 -63 121 97 -2 161 75 77 -33 -64 -15 147
6624 147 59 110 -13 -128 -85 -8 60 -233 0 -245 54 -293 -68 -205 38 -108 -68 -58 183 -11 -112 -40 -66
6647 -66 -120 6 -64 66 168 56 201 105 -169 -49 -85 -404 8 1 -41 -59 -199 -21 -224 -206 -77 -30 7 -205
6671 -205 93 -139 81 78 88 252 119 46 -66 34 -58 -291 -100 110 144 -39 -23 149 -183 135 70 31 -43
6694 -43 -119 -113 -60 -86 60 230 -153 82 479 10 8 -352 237 -62 -191 -206 -82 84 10 272 147 -40 -99 60
6718 60 -46 165 -90 59 -109 2 28 106 -41 -53 -206 104 -48 302 -332 -140 -79 -167 -92 -70 -65 -218 -183 -92
6742 -92 -156 -114 -276 -11 -22 33 235 -45 99 -279 -101 3 64 66 -41 139 -65 137 6 -91 209 -88 -77
6765 -77 -234 -293 -187 172 -59 26 -203 -13 34 -188 110 45 12 50 -67 73 -103 201 38 -79 62 -66
6787 -66 70 31 -129 -393 -268 -13 -76 118 170 -171 -137 139 -195 97 9 73 -67 69 -129 -17 118 -179
6809 -179 25 2 159 -244 80 -269 57 -139 38 -116 -53 19 258 -46 22 45 -51 -69 156 229 -181 227 -321
6832 -321 27 164 -53 -39 -91 55 85 -129 -10 171 11 25 253 -160 83 -96 -247 -4 200 76 -105
6853 -105 -68 -322 -123 -79 -112 -220 -77 156 -79 83 -73 53 -241 289 -76 224 -73 -114 279 -62 -232
6874 -232 -36 219 152 190 223 -67 -82 -97 -75 45 88 -6 25 50 -16 76 19 -14 -158 161 156 92 -22 -244 -97 44
6900 44 56 168 91 -44 32 13 440 -215 -186 182 4 8 -98 -93 -33 -45 -12 -195 72 130 -132 120 115 -108 -149 -55
6926 -55 -88 60 163 -113 204 -142 -232 63 -95 13 118 -293 4 -54 -265 20 -32 27 23 154 -206 -156 -33
6949 -33 24 -122 93 -80 -91 -165 -69 87 -195 -249 142 -84 -29 4 103 -82 154 103 -64 -95 256 -45 -105 25
6973 25 -234 64 -52 0 -12 -66 -91 -125 15 -197 -18 -204 -197 -114 -180 -33 -18 130 -148 187 74 -1 -59 -270
6997 -270 -138 30 140 -100 206 -42 -125 142 9 -125 63 19 -50 6 -61 186 28 -43 -4 -68 -65 257 -235
7020 -235 34 47 -26 76 -55 95 -5 36 74 124 -122 54 223 34 -177 -87 118 -186 90 101 -178 25
7042 25 366 44 -196 -139 -113 -15 -15 32 54 -59 -90 -38 71 15 231 -54 339 18 -39 -21 68 -159 14 231 -109
7067 -109 35 169 7 204 -48 -119 -10 -2 184 -152 212 115 -188 22 42 -8 -99 -62 36 93 -107 -94 -45 -265
7091 -265 109 90 180 -87 -3 -25 296 -48 152 -312 -67 114 116 26 -17 25 40 -121 62 -215 -106 -196 -297 -20
7115 -20 -72 -139 29 95 52 39 -61 -265 -148 152 -26 -170 -120 12 174 176 100 -469 156 3 -242 -71 -167 158
7139 158 -85 64 -146 31 -136 69 -131 200 -25 -1 -60 -204 -67 245 227 29 -16 -188 -166 -144 205 -291
7161 -291 -29 -48 40 110 -130 132 106 -113 -176 -321 -221 125 288 -27 138 -40 -196 55 -66 52 42 -100
7183 -100 151 145 -201 -46 -138 50 50 237 1 -165 -21 39 -118 -91 8 -28 23 134 164 -236 -8 10 127 -220
7207 -220 -13 133 28 56 -157 -78 -321 -22 366 -232 6 49 -23 -26 66 104 69 51 102 -78 -99 -31 92 -35
7231 -35 -145 -248 -205 -321 -38 86 70 -130 -192 -287 -287 11 85 1 41 -280 -46 9 -32 -63 340 101 -198 185
7255 185 -23 -155 -189 -73 67 -61 -105 -74 -131 -136 11 -264 77 -252 55 1 171 -77 -128 -196 53 -109 -11
7278 -11 62 -112 -21 27 -181 -184 -130 -186 31 145 -14 -38 39 -24 76 20 -71 -3 250 72 47 -230 23 25 -144 39
7304 39 13 -110 113 -223 9 327 -149 -92 -406 -166 -60 -74 -314 5 33 220 87 102 272 160 82 89 208
7327 208 60 -15 99 -48 186 177 -135 -123 -78 -32 238 -151 34 -6 -56 -94 -60 52 -41 -98 -77 299 -212 1
7351 1 36 85 67 32 76 -66 -97 273 170 -249 6 73 166 -25 148 110 -167 43 -134 -39 63 67 -192 -54 200
7376 200 -234 -105 129 97 -80 -77 -245 154 -30 -152 1 -29 -69 -117 97 97 73 -67 79 62 -64 86 -216
7399 -216 251 -29 -55 -311 -4 -15 -56 67 71 27 73 -8 75 -63 57 14 144 -24 129 209 -128 8 -318 179
7423 179 -74 -151 -99 -66 -35 -136 -334 2 -259 91 -32 5 1 -176 -99 -215 108 131 -65 -20 -77 -378 -77 161
7447 161 183 135 -160 15 -247 -90 -164 -12 154 112 -155 -27 -133 -73 -37 -99 -222 -5 -14 102 -29 27 -220
7470 -220 51 104 -81 104 152 308 -11 -2 -175 75 135 69 -62 -122 -94 101 -89 115 -58 -238 89 59 -19
7493 -19 25 -226 210 11 378 -261 -55 -199 -71 46 27 -79 -104 -37 454 -98 -72 102 12 -63 -60 -242 219
7516 219 100 -50 6 -274 158 71 -322 127 -50 -86 138 17 105 -160 8 -18 199 44 119 -174 138 -200
7538 -200 102 -193 28 -120 68 243 -17 124 162 47 68 60 95 4 -87 -244 70 -133 -20 138 -67 65
7560 65 7 214 47 51 -182 -7 -5 -11 86 -236 146 204 79 169 -84 39 -69 -28 -259 42 -54 0 -137 146 -46
7585 -46 -181 79 -222 -59 74 146 -81 24 -81 -267 -51 -366 -5 36 -172 1 151 -108 -51 -219 52
7606 52 -163 -183 168 -101 -243 -109 157 -107 244 -86 -127 -38 137 135 239 -219 -44 -7 -212 -244 185 -244 -317
7629 -317 183 51 -153 45 -10 -27 -113 -149 -98 27 52 40 47 -59 -12 -128 -75 29 117 81 202 226 -26 16 -75
7654 -75 -19 -7 115 -107 -53 261 454 68 63 -203 -88 -17 -14 -168 176 5 -144 49 -68 -157 500 -118 -4
7677 -4 -69 10 99 -46 11 -271 -55 120 -47 278 -55 -118 118 -9 -68 -166 6 109 63 229 105 -66 115
7700 115 69 70 260 198 -14 285 -34 56 -63 -59 43 81 110 -110 -106 241 -48 89 -343 100 18 53 240 -16
7724 -16 23 -58 -31 -16 -58 312 -34 -271 -208 220 -34 -12 -32 109 323 77 -15 -12 -37 295 179 -6 -4 41 228
7749 228 -68 78 -121 81 -25 35 -304 156 88 30 26 -308 245 -53 -6 -4 -223 -117 40 -260 -200 33 -213
7772 -213 -63 -196 -114 102 -142 79 116 200 72 59 -85 205 231 -57 -52 54 40 204 -139 -212 -108 -127 70
7795 70 -115 25 -321 -69 -152 20 -149 225 102 -532 108 -135 58 115 -55 141 -117 157 127 109 49 -71
7817 -71 -206 -44 0 -94 -135 -2 43 96 98 50 -119 -148 52 18 -109 196 -105 -91 -112 -247 -37 250 -347 50
7841 50 17 179 -71 55 165 -23 -256 17 -244 -78 -96 -78 98 157 225 -95 -410 334 0 47 -102 188
7863 188 -21 -62 104 66 292 19 -209 -188 53 120 -83 157 59 36 13 -295 -165 -143 47 -8 -32 60 42 -42
7887 -42 52 -67 67 -378 38 -36 -45 129 158 89 289 43 74 25 334 -156 -99 105 -14 -69 -104 137 184 -117
7911 -117 -297 -108 -14 -150 -18 31 -176 212 -21 -15 137 -79 -7 -154 -5 -59 98 303 -244 -110 190 56
7933 56 -72 -13 -106 45 -149 -245 -308 -165 -155 74 -150 249 122 -149 265 155 72 -168 -122 96 -164 117 -85
7956 -85 112 -18 90 -72 -73 83 -69 231 -91 -126 153 313 -225 -107 147 -194 156 22 -41 -31 60 -28 -314
7979 -314 -87 159 -55 91 61 -44 220 49 25 106 -253 -277 212 -45 208 -108 -155 -30 113 50 -55 206
8001 206 201 61 -55 46 -1 -69 204 -19 233 -92 58 114 -39 137 -4 97 24 -64 28 -26 -54 151 -45
8024 -45 -169 97 -96 77 -58 -135 -176 111 -118 71 88 -57 197 88 -142 -181 70 -467 -193 -110 94 94 -14
8047 -14 -156 -69 -5 -214 -78 -99 270 140 -50 192 169 -180 67 -191 -31 126 -84 1 70 82 48 123 261
8070 261 -31 16 173 115 10 428 20 -159 -112 -95 -13 -40 -9 313 333 -158 -223 -78 -67 132 77 136 190 178 -262
8095 -262 -202 233 -56 132 -37 32 -93 -132 218 -77 123 239 75 -152 -45 162 -205 38 35 15 70 79 -257
8118 -257 -116 -45 105 73 24 28 -226 -51 -72 569 175 -336 -294 -42 -71 -89 178 -12 -85 -156 40 9 116 131
8142 131 7 -28 -54 -1 -281 -187 -66 -160 40 -50 3 -4 -20 -11 91 85 302 130 -24 -138 -168 132 66 -93 91
8167 91 -73 98 69 107 232 -219 11 -288 -18 -119 -141 102 203 -52 6 13 163 8 -52 86 -22 -44 -52 161
8191A61
$$ Imaginary data points
##PAGE= N=2
##DATA TABLE= (X++(I..I)), XYDATA
0 0 0 0 0 0 8 -8 8 -9 16 -24 32 -40 48 -56 64 -80 97 -118 137 -161 191 -222 257 -297 343 -393 447 -509
28 -509 576 -654 736 -828 929 -1037 1157 -1293 1438 -1596 1773 -1964 2175 -2409 2664 -2949
44 -2949 3268 -3623 4022 -4476 4998 -5600 6308 -7153 8182 -9468 11126 -13351 16512
57 16512 -21378 29877 -48878 170473 -151015 -219158 374052 -202345 -141921 309935 -145976
68 -145976 -142456 248470 -138162 -61790 186624 -108260 -31141 121481 -121898 11119 81949
79 81949 -87417 32776 35421 -89824 59497 33501 -58939 45607 3819 -59944 33725
90 33725 13565 -27150 9170 8860 -10873 -10316 19901 23427 -24416 2949 8916 -40669 20439
103 20439 29864 -41836 11955 16751 -35125 29223 24017 -31413 7110 1964 -15961 5259 -3499
116 -3499 12741 915 -26337 25109 6280 -23865 37926 -5193 -41545 24065 -6542 -10268
128 -10268 30614 -25064 -605 23437 -32541 30391 21478 -54804 31818 4432 -57033 57094
140 57094 2226 -54806 60740 -15697 -41818 71926 -28730 -30467 57498 -56712 -6085
151 -6085 61465 -67743 23501 54871 -91512 43856 55760 -97235 54819 36068 -107109
162 -107109 63312 27862 -87452 78676 3665 -80555 88247 -14129 -66848 94607 -38469
173 -38469 -66569 94813 -42377 -45733 98079 -50392 -39896 89843 -50673 -27480 79604
184 79604 -57192 -27763 69017 -48157 -16847 64916 -37059 -15820 47455 -30870 -10028
195 -10028 38272 -26615 -14021 23291 -19733 -1036 27414 -15411 -4341 17668 -13916 863
207 863 14558 -19438 -71 11208 -21641 9809 20944 -22952 9448 18970 -29649 7489 21823
220 21823 -27093 838 12664 -19015 8764 10082 -8354 12424 -6391 -6385 17792 -19442 -2321
233 -2321 24371 -31883 72 32746 -33267 10892 36429 -46442 8078 35800 -48064 13003
245 13003 31822 -52646 16916 31789 -44464 26186 24168 -46521 26536 12368 -44719 33871
257 33871 5207 -43119 36099 -399 -31610 44765 -7937 -30741 40107 -19470 -23664 43686
269 43686 -27091 -19399 44362 -29352 -9518 46962 -31749 -6597 37178 -38843 -287 33879
281 33879 -38972 7645 26729 -40081 19930 27037 -40450 21219 16065 -43602 25329 12005
293 12005 -40468 29314 7019 -35917 33400 4658 -29543 33086 -6060 -30462 30174 -8506
305 -8506 -20114 29646 -14919 -13986 32458 -14738 -7658 27586 -23246 -7743 24662 -23381 -2309
318 -2309 24464 -22264 124 22715 -18690 5002 18318 -23610 766 14058 -20262 5706
330 5706 13625 -19759 7965 14547 -16705 9320 10405 -20264 7656 5987 -21553 13235 9005
343 9005 -20338 15227 6758 -19858 19671 4669 -24260 15799 -1217 -20223 22279 -3725
355 -3725 -17264 25791 -8063 -12925 28234 -16379 -10975 26756 -25563 -6474 30412 -27020 2472
368 2472 29953 -33404 8197 29305 -37017 10632 21004 -40007 16681 18463 -35774 23622
380 23622 12349 -32032 27532 3098 -28799 28681 -7235 -25622 29114 -11245 -14820 31530
392 31530 -16792 -8548 28608 -20448 -2709 21663 -26147 2528 17436 -24105 10944 13875
404 13875 -21285 15912 6232 -21833 18050 -109 -21328 18254 -4141 -16967 22244 -2636
416 -2636 -13772 19452 -4059 -11857 15109 -5378 -11219 9833 -3271 -6231 8635 407 -2293
429 -2293 5521 -496 -2750 1602 -2205 -2116 855 -4311 -357 6598 -3502 714 9555 -8713 -2153
444 -2153 12894 -13021 -5399 16359 -15681 -4128 22228 -15541 -2270 23291 -19291 -2985
456 -2985 20686 -21793 327 17632 -23521 6910 16448 -22307 14497 10283 -25674 19332 3934
469 3934 -28174 23893 -1159 -26911 30210 -3371 -23927 33443 -6585 -22847 30693 -12550
481 -12550 -19543 28925 -14872 -13703 27088 -14602 -6112 24681 -16864 -2196 18151 -19777 1254
494 1254 13050 -19379 6945 10740 -17080 11728 8476 -16071 11392 2835 -16691 10855 1296
507 1296 -13473 10801 768 -8866 11400 582 -5997 7281 -3463 -5316 4556 -4419 -2511
520 -2511 5223 -3363 523 5955 -2363 452 3575 -3863 -2077 1299 -2842 -922 1667 171 724
535 724 1499 1563 1474 -1884 -1393 626 -3186 -2252 3357 -1289 -2412 5925 545 -3550 5983 522 -7003
552 -7003 3333 -493 -6768 5396 1043 -5279 6952 1024 -4626 7574 -2678 -6670 7543 -5346
566 -5346 -6620 10854 -5302 -4346 13979 -6743 -4047 14000 -10016 -4685 12496 -13752 -1337
579 -1337 14186 -14482 3068 14767 -16432 6419 12999 -20238 7509 9455 -21803 11185 7660
592 7660 -19690 16640 5033 -19123 19861 -417 -19645 21067 -6368 -19466 24232 -7652
604 -7652 -15876 25384 -8081 -12000 23347 -11347 -9600 17276 -13275 -4037 12761 -12578 4011
617 4011 9407 -12197 9904 4139 -14301 11743 -1187 -15182 13325 -1873 -11263 13535 -2014
630 -2014 -6925 11515 -3770 -4108 6575 -6603 -606 3284 -6843 3865 2316 -4286 5845 -331
644 -331 -2896 4833 -4264 -1815 2513 -5803 2225 2759 -4494 5027 1186 -3232 5475 -3649 -1465 4117
660 4117 -8559 2422 4815 -9558 8537 4683 -12436 11842 2212 -14282 12238 -2363 -13950
673 -13950 13548 -3929 -7709 14530 -7602 -1638 12556 -12870 3686 8381 -18498 8961 5897
686 5897 -19383 16120 4158 -17670 19055 -1581 -14715 19996 -10154 -11046 20027 -16218 -3657
699 -3657 22007 -19719 3294 20833 -23779 6756 15838 -25513 10446 9253 -24340 15809 5489
712 5489 -18702 19866 -1742 -15005 19735 -8379 -11003 18037 -13482 -5015 17093 -13757 1912
725 1912 14304 -14166 4836 7497 -13412 7800 588 -11565 10172 -2911 -5304 12517 -6202
738 -6202 -1700 9445 -8910 1805 4470 -10646 6907 4 -9051 12724 -2359 -6624 13835
751 13835 -7335 -5286 11885 -10036 -1532 8088 -10818 5429 5393 -9960 11001 342 -10146
764 -10146 12731 -6582 -8101 14505 -10624 -3879 13770 -11982 3872 11910 -15416 8389 5159
777 5159 -17348 14466 -1500 -17906 21925 -5427 -16319 26730 -9039 -14233 26353 -14589
789 -14589 -12514 23415 -14998 -6230 18766 -15979 2178 15011 -15308 7197 6366 -15608 11079
802 11079 -1044 -13329 15734 -5870 -8780 17735 -10453 -3307 18747 -15337 -3027 14658
814 14658 -15827 1793 11807 -15077 5174 7810 -10047 8126 1281 -8125 8589 -5468 -5337
827 -5337 9055 -8207 537 9483 -10683 4009 9475 -10764 4064 3867 -10747 4900 1470
840 1470 -6273 5534 -1582 -668 6099 -5639 2553 5177 -9064 2923 1829 -8988 7250 1324
854 1324 -6903 7645 -1669 -2945 8827 -6535 -2531 6686 -9504 2010 6582 -9341 6374
867 6374 4943 -10064 8860 1804 -9832 9039 -3519 -9099 10245 -4187 -3801 10243 -7539
880 -7539 329 9445 -10182 3275 6058 -13587 5653 4150 -12302 10793 2625 -11554 11981
893 11981 -847 -9666 12579 -4794 -9570 11422 -6531 -4910 12354 -6443 -1526 9623 -8623
906 -8623 1184 7755 -9834 1851 4234 -9323 4951 5245 -6764 4398 2366 -5025 3542 560
920 560 -3429 1212 -1555 -1052 1342 -548 2970 429 -2594 2463 -574 -1872 2835 -2982 -3183 2820
936 2820 -1073 321 3094 -1237 943 676 -2560 2187 -455 -3199 2063 -1602 -2795 5511 1279
951 1279 -2272 2904 -740 -2474 2409 -539 -2777 -60 14 211 353 2159 1995 -2077 -33 2011
967 2011 -4186 679 3592 -6035 -754 5337 -3364 1120 5707 -4510 -1221 4239 -3801 -850 2731
982 2731 -3677 -129 2249 -1580 2712 2433 -2201 979 -1380 -2228 2810 -1161 -2150 2487 -1764 230
998 230 5032 -2163 -1052 3007 -4021 -397 2735 -4128 1262 2599 -4685 3328 3885 -4492 3877 1098
1014 1098 -7660 3952 2025 -6921 4045 1040 -5922 5518 2288 -3993 3815 -291 -4467 1882
1028 1882 -764 -2423 2456 -1131 -167 2027 -760 2909 461 -3843 1708 -755 -3670 3516 61
1043 61 -3631 3420 1048 -1574 2823 17 -1417 -331 -1591 -17 -110 -236 1754 -1275 -119 3918
1059 3918 -1235 -662 2526 -4050 -1362 2890 -3082 446 2020 -2409 2353 970 -1837 3044 -1755
1074 -1755 -2850 2871 -3926 -948 5174 -3968 -21 5578 -4534 1602 4736 -6449 870 2130
1088 2130 -6086 3213 1844 -4547 4947 326 -3725 5393 -1655 -3149 4842 -4593 -2399 5671 -3759
1103 -3759 152 4899 -4016 1702 3331 -4255 1900 113 -4305 3238 -1372 -2181 5252 -2754 -895
1118 -895 5140 -4469 811 4661 -6882 687 3576 -6412 3513 3599 -5992 4453 1829 -5168 4428
1133 4428 -653 -4926 4230 -2297 -3270 5365 -1916 -839 4798 -3057 -397 3377 -3196 -290 887
1148 887 -3164 1078 819 -363 2181 -1372 545 1854 -3375 1136 1185 -4690 2419 1607 -4091 3934
1164 3934 1909 -3607 3185 124 -2984 2824 -1621 -1968 1973 -2514 973 3002 -3545 2594 2251
1179 2251 -5150 2892 1041 -5759 3490 744 -5159 4657 1116 -3132 4236 -674 -3009 2650 -1993
1194 -1993 -1172 1945 -3185 1138 2423 -2884 3223 1668 -4201 3537 56 -5390 3849 -30 -4566
1209 -4566 4086 -84 -2848 4593 191 -2687 2444 -1051 -1576 1138 -1366 -154 870 -291 2015
1224 2015 294 -1210 2334 -1016 -2487 1701 -1256 -1604 2453 -713 -404 2247 -318 316 804 -1699
1240 -1699 297 -339 -1775 1185 -474 -1013 2831 -228 -573 2303 -946 -1180 950 -2156 -441 1545
1256 1545 -1649 840 1320 -1297 2305 1139 -2721 1340 -120 -2753 1730 -470 -2020 2596 -340
1271 -340 -590 2506 -1147 -43 1299 -2864 196 778 -2651 2217 852 -2969 3750 1006 -2791 3116
1287 3116 -1239 -3536 3645 -1819 -2536 4250 -1800 -935 4105 -2392 -307 2885 -3815 390 1466
1302 1466 -4334 2922 1156 -3792 3993 177 -3803 5040 -869 -4349 4480 -2264 -3630 4617 -2011
1317 -2011 -1265 4673 -2241 35 2727 -3216 1533 334 -4391 3444 3 -4029 5313 -532 -4289
1332 -4289 5954 -1070 -4423 4761 -1919 -3340 3589 -1482 -1201 2884 -956 923 655 -1416 1548
1347 1548 -1608 -1706 2427 -2813 -356 3934 -3156 770 3598 -4005 1515 1970 -5066 2393 696 -4183
1363 -4183 3847 -513 -2642 5520 -2435 -2049 4969 -4463 -587 4845 -6243 946 5144 -6095 2959
1378 2959 4186 -5846 3724 2171 -5923 3241 -505 -3795 4643 -2266 -1471 5493 -3468 166 4651
1393 4651 -5790 1097 3488 -6719 2679 2322 -5547 4689 744 -4131 5742 -1618 -3285 4978
1407 4978 -4222 -1496 5371 -5552 427 5459 -5881 2697 4521 -6327 3107 1787 -5946 3657
1421 3657 -144 -3838 4851 -1461 -1533 4990 -3518 -118 3898 -5218 1198 2628 -5599 3480 1681
1436 1681 -4919 5326 -148 -4151 5694 -2648 -3267 5082 -4481 -1094 5341 -5279 1458 4918 -5992
1451 -5992 3179 2599 -6125 3876 565 -5625 4830 -957 -3099 5461 -1926 -1187 4322 -3881 804
1466 804 2238 -5153 3066 541 -5114 5961 -471 -4535 7440 -2809 -4558 7294 -4878 -3318
1480 -3318 7040 -6109 -1029 7061 -6108 1671 5143 -6804 3169 2504 -7393 4558 1076 -5996
1494 -5996 5913 -173 -4569 6531 -1757 -2914 5050 -3988 -1460 4050 -4794 1085 2615 -4179
1508 -4179 3595 1060 -3916 4393 -1186 -3849 4636 -2346 -2601 4806 -3187 -578 4536 -3270 897
1523 897 2646 -3983 1506 549 -3485 2970 -581 -2279 4389 -1659 -616 4006 -3318 -460 2810
1538 2810 -4423 957 2475 -3594 2529 861 -2637 3851 -907 -2082 3618 -3414 -1162 4044 -4523
1553 -4523 824 4627 -5001 2240 3794 -5461 2901 2555 -6369 3237 896 -4640 4235 -62 -3022
1568 -3022 4895 -1791 -1596 3970 -3484 -749 2905 -4538 1072 3183 -3919 2625 1960 -3760 3165
1583 3165 -71 -3697 2738 -1714 -2069 3610 -2289 -150 3856 -3387 1152 2898 -4513 1628 1712 -5041
1599 -5041 2167 1766 -3731 3237 1278 -3189 2993 128 -2525 2020 -1154 -1658 1794 -1049 -285 1842
1615 1842 -997 599 858 -1623 570 -81 -1274 390 -585 -235 1085 -284 480 649 -580 1035
1631 1035 -391 -1306 1294 -946 -1408 1968 -762 -88 2776 -1364 -472 1549 -1625 -177 786 -2260
1647 -2260 756 1043 -1702 1950 550 -1859 2365 -680 -2319 2138 -1377 -1784 2520 -1550 -862 3131
1663 3131 -1564 -223 2083 -2177 155 1472 -2985 471 1482 -2441 1947 1425 -2533 2329 490
1678 490 -2980 1907 329 -3080 1963 226 -2519 2360 861 -1793 1966 42 -1376 1212 -870
1693 -870 -744 760 -860 350 1009 -1364 1364 1145 -2280 994 771 -2854 1242 1067 -2997 1388
1709 1388 1584 -2070 1629 959 -2092 658 287 -1751 616 48 -338 566 31 548 1189 -875 445
1726 445 265 -1837 888 437 -1923 1339 886 -1635 1348 916 -1271 1001 -149 -1805 236 174 -430
1743 -430 553 103 -215 1034 439 -239 28 -389 -691 -617 87 -457 116 1091 -657 187 1847 -1169 -28
1762 -28 1655 -2418 -488 2464 -2000 203 2394 -2064 743 2561 -2233 808 1424 -2675 687 397
1778 397 -2273 2561 163 -1868 3155 -847 -1583 3356 -2356 -1993 3456 -2510 -538 3775 -2871 462
1794 462 3177 -3122 726 2101 -3609 1404 593 -3601 3048 214 -2877 3793 -722 -2641 4155
1809 4155 -1606 -2690 3394 -2652 -1691 3281 -2165 -59 3127 -2488 538 2103 -2581 1113 928
1824 928 -3060 1662 370 -1455 2292 -82 -1419 2073 -692 -958 1529 -1450 -721 782 -817 310
1840 310 625 -314 701 -486 -487 789 -1039 -628 629 -1343 -18 1451 -879 590 883 -924 329
1857 329 187 -616 302 -683 -74 554 -717 1235 547 -1429 1185 -69 -2079 1985 -537 -2227 2445
1874 2445 -457 -883 2659 -1204 -735 2013 -2130 -100 1861 -2799 837 1561 -3008 2267 1742 -3393
1890 -3393 2553 978 -3996 2757 90 -3330 2976 -567 -2373 3523 -1090 -1134 3505 -2268 -798
1905 -798 2772 -3172 -89 2829 -3109 556 2610 -3212 1686 1955 -3451 1716 966 -3241 1546 460
1921 460 -2123 2062 220 -1208 2452 -605 -1344 1733 -1396 -967 1624 -1513 -176 2131 -1265 23
1937 23 1671 -1381 -279 1134 -1342 -420 956 -791 -431 807 -5 -368 722 339 -687 -233 280
1954 280 -599 -127 432 -216 0 642 190 322 39 -462 2 -787 -453 700 -483 -310 1184 -805 11
1973 11 1567 -851 -351 889 -1473 -249 772 -1325 362 990 -1121 1305 444 -1360 1205 -475
1989 -475 -1738 1580 -792 -1496 2441 -570 -1210 2997 -1074 -1286 2454 -1980 -822 1982 -2165 75
2005 75 2272 -1979 1208 1355 -2686 1745 507 -3024 1994 -149 -2951 3399 -471 -2538 3779 -910
2021 -910 -2372 3577 -1670 -2045 3222 -2402 -1074 3056 -2371 153 2529 -2396 970 1894 -3526 1347
2037 1347 898 -3135 2290 533 -2775 3162 494 -2492 2889 -611 -1999 1912 -1051 -1391 1599
2052 1599 -1279 326 1517 -1319 605 963 -1548 664 88 -1709 861 87 -893 857 40 -9 637
2069 637 12 -3 -483 -386 637 -1158 -144 1437 -1355 332 1802 -2108 584 927 -2402 682 625
2086 625 -1916 1491 411 -1391 2138 -460 -839 2248 -2092 -663 2458 -2759 303 2206 -3097
2101 -3097 1563 2267 -3440 1907 1610 -3671 2325 338 -2954 2739 -505 -2207 3465 -1456 -965 3464
2117 3464 -2860 -592 2727 -3709 690 2653 -3974 1665 2430 -3873 2495 989 -3707 2734 -335
2132 -335 -3049 3147 -1254 -1743 3713 -2157 -538 3409 -2635 -299 2648 -3223 133 1932 -3166
2147 -3166 1563 1078 -1979 2016 475 -1489 1459 -976 -984 1528 -1708 229 1391 -1634 936 1114
2163 1114 -1877 1269 260 -1916 1219 -392 -886 1474 -602 440 1363 -1359 1160 393 -1728 1547
2179 1547 -682 -2028 2323 -683 -1433 2525 -1426 -849 2571 -1955 113 1388 -2934 1339 1256 -2696
2195 -2696 2475 408 -2819 3258 -489 -3032 3528 -1670 -2475 4045 -2364 -1123 3966 -2440 -374
2210 -374 3226 -2865 412 2263 -3784 1398 1167 -3338 2488 630 -2770 3319 -672 -2463 3312
2225 3312 -1728 -2136 3035 -1875 -940 2958 -2011 128 2021 -2229 1295 925 -2406 1523 -138 -2219
2241 -2219 2261 -597 -922 2564 -1052 -920 2285 -1717 -648 1834 -1382 -362 1047 -1026 863
2256 863 907 -414 843 158 -618 816 -1171 -253 954 -908 612 617 -616 917 384 -614 907 -876
2274 -876 -726 954 -1461 270 1473 -1712 998 1236 -1998 1107 631 -2249 1560 332 -2059 1735
2290 1735 -227 -1360 2479 -951 -840 1935 -1664 -507 1536 -2473 350 1708 -2133 1174 1253 -2308
2306 -2308 1579 316 -2618 1609 -514 -1827 1879 -621 -807 2397 -1047 -383 2086 -1889 -307
2321 -307 1641 -2386 663 1501 -2137 1168 1676 -2093 1051 1122 -2319 1003 463 -2024 1071 331 -1002
2338 -1002 1413 286 -412 1025 -653 -386 593 -847 -165 389 -1039 344 789 -314 99 549 -54
2355 -54 -403 63 -666 -419 -229 3 271 -186 209 -170 -295 151 -119 -545 -202 -108 -3 73 363 161 -10
2376 -10 184 182 -158 167 126 -619 -147 628 -437 128 821 -413 42 827 -679 -240 264 -423 119 447
2396 447 -411 382 351 -592 684 -40 -709 655 -128 -1188 734 -268 -640 1241 2 -795 1154 -193
2414 -193 -645 869 -532 -699 681 -481 37 764 -357 389 556 -1099 491 264 -1589 724 208
2431 208 -1597 1195 654 -1265 1494 114 -1434 1190 -11 -1259 1003 -248 -788 860 -393 -136
2447 -136 973 -855 335 972 -1756 563 561 -1613 839 987 -1454 1077 405 -1513 571 234 -1179
2464 -1179 907 -68 -839 713 -137 43 884 -384 165 508 -554 22 124 -866 169 114 -564 770
2482 770 -80 -148 418 -5 -235 -96 -263 266 -153 -569 756 -253 -321 1118 -529 -409 644 -1126 -113
2501 -113 700 -841 69 790 -392 613 296 -646 934 -563 -1019 1172 -743 -501 1482 -869 -78
2518 -78 1515 -974 106 779 -1504 115 529 -1344 720 520 -961 1225 -291 -938 1487 -464
2534 -464 -1190 1436 -1396 -559 1770 -1138 -53 1321 -1120 338 1062 -1857 554 464 -1696 849
2550 849 -46 -881 1571 -151 -994 1631 -874 -1133 1629 -821 -649 1453 -998 -192 1301 -756 408
2567 408 691 -966 383 -93 -1025 551 -413 -151 1030 -218 70 1219 -781 -192 821 -729 -284
2584 -284 346 -806 405 295 -284 667 30 20 334 -499 -63 290 -953 185 420 -570 607 587 -546
2603 -546 68 245 -832 96 13 -732 202 -252 263 694 -517 554 410 -1146 662 50 -1135 874
2621 874 -202 -905 1067 146 -973 1293 -268 -827 786 -753 -395 779 -731 269 622 -994
2637 -994 533 630 -1169 623 295 -1170 648 -61 -842 951 -239 -699 989 -392 -565 1008 -885
2654 -885 -167 838 -759 477 911 -806 642 1060 -1137 804 318 -1374 437 281 -935 664
2670 664 671 -521 634 -102 -431 444 -605 -290 198 -586 303 511 -718 568 557 -522 544 398 -659
2689 -659 216 164 -707 289 -21 43 504 -57 248 256 -570 -119 -68 -716 507 121 -737 459 184 -734 951
2710 951 -149 -428 382 -422 -379 293 -446 47 273 -420 636 139 -732 489 -248 -791 409 -408 -532
2729 -532 797 -151 -1 1091 -686 -27 343 -706 81 24 -853 689 140 -752 1142 -145 -904 1410
2747 1410 -766 -968 1317 -867 -444 1144 -809 -190 1033 -850 571 533 -922 534 -69 -1211
2763 -1211 801 -202 -853 1373 -158 -1001 1195 -532 -1015 1009 -955 -196 994 -877 272 698
2779 698 -769 697 308 -935 914 -98 -925 809 -547 -441 1197 -707 -119 1235 -854 -45
2795 -45 585 -953 213 338 -635 588 -33 -479 921 -599 -453 1077 -850 -604 796 -777 8
2812 8 992 -888 349 800 -1044 629 354 -642 1010 -539 -423 1085 -620 -129 1353 -1048 176
2829 176 1238 -1496 336 845 -1484 642 413 -1123 1151 182 -553 1457 -556 -344 985 -1370
2845 -1370 -108 1054 -1385 609 1125 -1336 727 498 -1543 852 -57 -1488 1121 -173 -770 1325
2861 1325 -433 -102 1627 -1004 145 971 -1349 433 778 -1870 682 778 -1317 1077 352 -1338
2877 -1338 982 -556 -1044 921 -883 -584 897 -701 356 962 -818 387 425 -1236 638 78
2893 78 -1276 1059 -117 -819 1216 -333 -184 933 -866 -59 426 -1249 498 517 -1208 1117 246
2910 246 -929 1040 -155 -971 1079 -647 -661 766 -674 90 1014 -1023 807 286 -1354 1026 -125
2927 -125 -1448 1361 -495 -1039 1432 -373 -507 1586 -909 -474 1077 -1251 -27 686 -802 522
2943 522 705 -775 975 -32 -950 1062 -502 -1022 1324 -857 -555 1344 -523 -426 1232 -894 214
2960 214 774 -1253 249 91 -914 595 -110 -434 1110 -601 -272 1184 -935 -288 1179 -1163 -42
2977 -42 1166 -819 276 481 -594 633 150 -756 472 -443 -473 768 -514 -150 1143 -587 55
2994 55 502 -757 -80 442 -942 17 75 -733 564 408 -148 499 -352 -8 350 -693 -71 395 -712
3013 -712 265 420 -688 750 328 -451 582 -40 -551 614 -175 -29 614 -471 338 693 -609 342
3031 342 652 -741 319 357 -804 379 147 -866 438 279 -244 483 -152 -408 167 -712 180 607
3049 607 -740 226 667 -668 691 577 -850 315 277 -568 396 127 -276 126 156 -96 493 44 -142
3068 -142 249 -411 -49 175 -362 192 246 -299 142 297 -209 3 -58 -606 -85 134 -207 -224 88 -43 177
3089 177 75 446 384 -408 93 47 -387 347 201 -135 424 454 -386 369 270 -389 -94 -7 -321 94 257 352
3111 352 322 33 20 80 -193 -63 -124 -335 8 289 -250 41 462 -6 208 65 167 -59 -196 -419 66
3132 66 -241 263 143 -519 283 190 -475 597 170 -497 237 -73 -385 419 201 -207 463 188 -266 144
3152 144 -178 -93 237 -388 126 336 -369 558 508 -612 109 -126 -734 363 33 -851 437 201 -385 675
3172 675 38 -34 411 -485 -146 327 -663 328 460 -667 641 138 -683 405 148 -698 336 -218 -896
3191 -896 370 42 -184 268 -201 -140 413 -383 -102 216 -380 281 88 -268 679 39 -409 223 -64 -500
3211 -500 119 -343 -41 311 -183 355 335 -345 443 103 -458 554 -203 -651 632 -278 -400 903 -160
3230 -160 -53 515 -209 -5 569 -202 4 -184 -425 541 -65 98 706 -322 -43 614 -550 -155 554
3249 554 -576 -237 598 -425 362 402 -401 607 43 -829 441 -315 -581 837 -386 -112 661 -508
3267 -508 -101 701 -769 -135 547 -881 -74 194 -451 468 613 -331 438 -172 -548 495 -374 -527 747
3286 747 -448 -31 756 -409 6 584 -502 85 351 -599 302 -271 -190 495 -129 -225 631 -280 35 617
3306 617 -747 -56 294 -376 228 607 -620 224 274 -90 232 10 -241 114 -231 -286 151 17 281 663
3326 663 -253 224 364 -514 97 236 -547 407 -113 -187 323 43 -104 22 -531 103 308 -666 253 210 -588
3347 -588 456 525 -422 370 64 -839 121 294 -664 183 52 -342 247 103 -60 524 -496 69 127 -654
3367 -654 113 498 -323 287 111 -362 404 199 -577 423 -232 -392 121 -410 29 608 -106 194 446 -431
3387 -431 204 177 -635 98 240 -475 426 481 -291 394 383 -652 460 185 -271 301 -324 -246 293 -44 240
3408 240 215 -13 64 133 -426 -132 164 -450 508 226 -150 280 298 -148 296 -64 -191 87 -351 35 185
3429 185 -360 563 -187 -175 415 177 -402 304 -123 -562 390 -193 -307 330 -17 156 254 -86 -60 121 -616
3450 -616 92 -92 -469 386 -42 -23 505 -392 -35 408 -323 -171 -108 -493 -60 555 -323 363 69 -500 494
3471 494 43 -371 494 -180 -800 727 -113 -343 935 -184 -365 815 -590 -178 217 -635 398 196
3489 196 -722 701 194 -246 605 -210 -357 475 -483 -266 830 -187 -253 687 -120 173 384 -638 132
3508 132 181 -544 426 50 -374 331 -249 -250 726 -295 -453 402 -323 -240 539 -316 -62 506 -463 371 -170
3529 -170 -463 536 -362 -336 505 -449 -25 740 -589 -5 495 -281 -9 426 -535 154 24 -543 544 -33
3549 -33 -256 608 -344 -259 741 -747 124 588 -683 145 645 -715 415 360 -515 479 -114 -668 551
3568 551 -126 -265 367 -630 -223 941 -521 152 746 -722 212 309 -707 318 7 -515 813 -71
3586 -71 -548 537 -131 45 471 -399 -182 231 -728 44 447 -620 603 691 -908 307 122 -583 566
3605 566 -8 -340 480 -154 -64 583 -527 38 884 -692 434 175 -591 300 112 -571 825 100 -654
3624 -654 902 -297 -74 393 -498 78 366 -552 -26 547 -471 490 318 -566 454 -93 -565 507
3642 507 34 -152 496 -470 150 196 -465 102 160 -224 122 -283 -70 797 -52 -185 565 -271 -513 604
3662 604 -531 -213 622 -784 81 268 -483 327 219 -522 545 -111 -312 308 -486 -317 590 -564 -246
3681 -246 561 -337 -208 495 -694 -135 162 -554 190 153 -432 94 -67 -176 511 -142 -565 405 -632 -120
3701 -120 490 -413 -139 622 -308 20 485 -379 118 49 -240 113 -17 -161 385 -114 -282 552 -403 112
3721 112 205 -464 -90 -67 -172 -133 339 -277 -14 177 -7 118 -203 -146 -11 -350 44 120 -261 -10 -12 -272
3743 -272 140 63 -325 -77 90 -189 -192 136 -114 36 181 251 -223 -122 98 32 -359 -240 163 -262 -82 46
3765 46 -154 139 -4 -129 77 -216 -93 60 -220 116 -36 -223 50 321 -260 195 150 -145 198 68 -233
3786 -233 237 373 -138 78 135 -40 -38 -199 -213 176 -105 26 102 -202 77 235 -305 -40 -96 -367 46 199
3808 199 -164 124 352 -85 33 1 -106 197 108 -108 -89 -143 -60 80 -116 446 116 -157 55 284 -317 -186
3830 -186 -224 -293 -34 324 9 -93 293 -153 122 124 -423 132 -99 -63 128 -98 87 246 -65 297 123 -198
3852 -198 -17 211 -460 -135 42 31 227 -56 118 137 -73 -115 182 -107 117 256 -356 218 352 -107 72
3873 72 162 -239 332 54 -261 265 216 -19 361 101 6 350 -107 -79 235 -388 -172 129 -299 316 -144 -399
3895 -399 332 47 -240 37 -68 -119 335 -217 -36 303 -81 255 70 -541 95 -299 -420 269 -149 -312
3915 -312 402 14 -291 476 -169 97 355 -400 -67 324 -202 197 420 -362 492 -125 -308 297 -21 -443
3935 -443 318 -101 -282 316 17 28 212 -167 104 77 -229 141 -40 -500 139 87 -617 592 -67 -100 331
3956 331 -62 -329 280 -95 -426 109 -308 245 253 -112 301 113 -268 349 -89 -238 322 -27 -245 568 -156
3977 -156 -73 316 -232 -304 169 -416 125 -30 -426 471 72 -121 149 -112 -13 332 -436 -118 271 -207 -38
3998 -38 364 -313 -119 334 -95 18 81 67 306 -52 -171 120 -170 26 384 -170 1 268 -594 91 214
4019 214 -436 267 121 -70 294 125 114 109 -69 254 94 -162 -141 277 -296 62 483 -520 70 451 -261
4040 -261 81 360 -344 -180 -15 -198 120 25 -227 358 -128 87 249 -429 -44 199 -129 -180 273 -357 193
4061 193 292 -65 -30 -131 -2 0 -77 -82 139 -178 -176 192 -258 77 213 -147 320 103 -450 -22 9 -314 23
4084 23 22 18 102 -189 -336 206 -10 -28 -91 -31 65 101 -340 385 103 -368 164 -233 -50 -105 121 -318 206 -16
4108 -16 -202 424 -263 -15 -16 -204 -37 104 -149 318 235 -270 305 151 -304 -78 -139 -282 156 -77 -301 77
4130 77 58 -126 100 -52 4 -107 -170 71 367 -363 294 57 -251 104 -50 -218 305 30 -148 285 69
4151 69 -129 111 -25 197 366 62 14 -83 -285 272 -99 -446 -57 54 57 688 -14 -123 386 -31 -202 128
4173 128 -672 -23 420 -225 199 162 -203 197 -16 -226 91 -170 -454 112 -282 -83 604 -87 202 156 -305
4194 -305 -135 17 -178 192 -223 -225 162 153 -76 716 -169 -7 465 -252 -153 -39 -135 61 247 -311 130 247
4216 247 -289 182 -107 102 329 -253 -109 306 -92 -53 310 30 -178 203 -250 -101 288 -335 92 206
4236 206 -152 434 -92 -315 625 -220 -298 442 -273 -122 453 -298 -28 92 -292 176 414 193 -153 -59 -358
4257 -358 174 -400 -247 419 -207 160 242 -312 -496 453 -364 -15 162 -495 184 344 -343 314 -96 -10 309
4278 309 -284 268 217 -183 178 704 -306 354 439 -285 171 100 -630 276 305 -418 231 -289 -116 492 -307
4299 -307 -207 257 -438 143 150 -452 -11 329 -341 129 150 -136 379 21 -306 480 -1 -110 137 -68 68
4320 68 491 -141 -26 231 -495 57 8 -633 260 64 -356 364 -10 -232 270 213 -321 52 -335 -46 -16
4341 -16 -339 -301 237 -37 146 -176 -421 129 -128 -413 430 -270 -341 49 -197 34 425 -293 -250 413 -241
4362 -241 233 124 -263 397 -112 -78 504 -23 -153 417 -248 -109 341 -437 -277 322 -375 168 220 -202 425
4383 425 111 -285 309 -171 -180 205 -132 -170 308 76 45 110 48 -107 -105 -176 -2 168 -151 342 203 -258 133
4406 133 65 130 389 -357 -239 51 -199 65 206 164 33 86 -259 338 136 -77 -92 -73 -74 191 -43 123 395
4429 395 46 -59 170 -69 192 114 -149 -39 156 -91 278 383 -99 345 -224 -11 57 12 34 162 -269
4450 -269 11 127 230 437 218 -68 93 192 -88 90 125 -113 176 -45 86 211 -182 10 -33 -359 -61
4471 -61 53 -154 67 -1 -110 53 145 134 -53 39 144 -23 -132 -96 173 -156 -63 -10 49 -37 154 -208 -258 173
4495 173 -241 -179 486 -120 13 231 53 143 88 -141 -52 -111 -147 96 38 119 412 -58 -128 22 -103 -56 342
4518 342 -257 -145 -9 -53 151 127 130 12 189 32 114 0 -70 -42 63 -17 -134 -1 66 91 72 202 38 -229
4542 -229 -178 54 67 9 -29 -9 127 76 -57 133 -18 209 211 -51 242 165 -111 143 513 -71 -163 -49 287
4565 287 -128 -145 -245 18 104 213 189 35 -78 209 -328 76 27 -427 -11 126 -193 -29 -21 -175 98 91 -79
4588 -79 -12 9 -19 -211 62 84 89 -119 275 -96 -327 26 132 -94 139 224 -216 139 -236 97 76 8 -281
4611 -281 -109 88 -118 230 -19 315 172 -196 237 368 -144 208 -44 1 308 -294 17 147 190 130 277
4632 277 -274 -97 142 -216 181 -223 -307 64 135 -144 3 164 -240 132 45 119 0 93 180 208 -81 108
4654 108 22 39 134 -26 -428 131 -13 48 18 -179 -47 393 162 17 22 -242 103 -94 -248 -78 -53 246 -30
4677 -30 166 134 359 -242 -19 246 -213 -298 217 -7 -110 3 7 53 180 12 32 27 -334 55 8 -84 282 -271
4701 -271 -228 249 -281 67 184 -76 22 -14 49 -355 23 222 46 166 17 350 -119 -206 37 -218 29 68
4723 68 5 276 11 -67 -146 142 -209 8 149 -30 237 -103 -51 30 -102 192 70 -165 13 92 -257 -50
4745 -50 395 -69 92 331 -355 113 -33 102 156 -173 -153 -242 177 -266 237 36 -12 -46 -256 -201 5 -374
4767 -374 180 282 -227 253 129 -249 -99 221 -128 133 73 -187 -73 -261 218 246 -183 185 105 -113 88
4788 88 96 -214 -102 11 -127 -133 120 128 111 166 -27 36 -54 118 242 110 212 181 -48 291 -146 -41 85 140
4812 140 -323 -74 74 142 108 36 190 -117 -319 -76 129 -216 187 209 -175 -14 -186 -174 257 355 -224 141
4834 141 191 -210 2 -65 54 -76 -225 78 319 56 112 114 -246 203 -138 -316 73 72 -67 164 61 -203
4856 -203 -127 -243 58 -234 -16 -142 270 -53 351 -158 -73 63 81 -113 205 192 -332 73 -77 -125 273 246
4878 246 -35 345 -245 7 -183 -110 -23 -160 -158 3 -73 -219 270 -35 -263 87 -11 -416 260 -17 233 128
4900 128 -129 183 104 81 -118 16 -72 165 53 -281 235 -221 -384 -22 -74 -70 -217 36 -21 77 -173 179 57
4923 57 -87 -24 52 5 189 -300 271 448 162 -7 168 -244 -254 328 -207 121 -90 -151 144 194 -359 30
4945 30 -178 5 143 -86 36 369 -101 -17 123 -236 -85 153 -436 -172 106 -367 73 56 71 252 187 -177
4967 -177 159 -290 -11 106 -144 -156 484 -261 -77 162 -264 -190 314 102 5 40 -17 28 -126 -93 96 -142
4989 -142 17 196 -258 91 -84 -180 49 302 -55 47 57 -393 57 -186 -230 318 -240 -298 217 138 -32 507
5011 507 -375 153 -22 -17 -138 52 -173 118 140 -74 28 212 -139 100 -288 -486 109 -106 -71 330 75
5032 75 -70 169 -2 160 209 -156 -77 135 -123 126 19 26 -97 317 43 -87 119 141 118 14 -6 -87 -97
5055 -97 58 -188 -200 290 219 -142 -95 22 52 -146 -228 -287 156 184 61 22 -367 -82 150 -126 96 -51 -328
5078 -328 320 161 60 333 204 -122 -22 -250 -75 -20 -53 53 -81 -220 70 10 -399 352 53 -80 133
5099 133 75 -93 -67 -158 -5 22 -353 232 129 -130 153 -22 -188 -82 -271 121 132 149 -15 256 -187 -148
5121 -148 111 -283 -56 -53 -307 139 -63 205 330 -76 -13 -1 -21 -83 18 -45 250 206 31 -108 84 143 -8
5144 -8 23 88 -248 -44 -34 116 -277 10 16 29 134 98 -92 -56 -26 -218 17 175 87 117 142 178 -176 11 -188
5169 -188 143 -105 -25 150 -177 258 -12 -224 64 -269 -30 -38 -117 -249 -61 154 144 -70 109 -182 24 -15
5191 -15 -39 -109 -34 66 -289 43 -187 -78 -53 118 -43 -14 -131 244 -103 -253 -2 -83 69 152 -169 -95 -62
5214 -62 -185 207 -82 144 170 65 84 56 -165 48 17 -85 109 239 -131 4 89 -142 -78 19 -72 224 -3
5237 -3 -166 -42 255 43 -42 -134 79 43 384 -74 119 -71 168 -55 -123 -163 45 19 -238 42 -101 -64 -51
5260 -51 -54 114 139 37 247 -97 -289 -11 92 -33 -29 -230 -223 -173 -287 -104 -147 -264 -141 -196 -74 -323 45 -162
5284 -162 47 -102 -39 -215 -53 -45 -288 -182 185 304 60 112 289 -227 -75 56 -65 -49 -231 128 175 -339
5306 -339 70 15 -71 33 222 -216 -3 -82 -27 83 -211 144 106 22 -196 238 -116 -13 -240 -37 -230 197
5328 197 28 73 -24 -74 -57 109 21 -165 -35 -10 72 52 90 6 7 29 65 -49 69 -45 -208 -73 -95 -335 38
5353 38 244 -91 141 -80 -91 -64 67 50 150 -95 -32 -197 170 -110 44 179 -357 -119 -356 94 108 -136
5375 -136 -200 -59 -42 17 -122 211 39 -228 266 -5 -130 214 -27 70 88 84 -1 107 227 196 94 125 -128
5398 -128 103 38 -83 33 -145 154 -29 58 -167 -25 -115 114 -238 -84 215 60 -4 144 33 45 43 -181
5420 -181 34 -72 -108 130 79 -90 -61 28 -144 -56 -48 -186 295 -45 -242 200 -52 33 200 50 185 -38 -56
5443 -56 -4 -34 -150 -43 101 -156 68 182 120 71 -13 51 51 -99 238 209 106 370 241 -7 36 7 -90 -157 -17
5468 -17 -54 134 -166 23 -50 -167 -56 147 -203 -20 -177 -130 71 -155 -40 -57 -146 -134 -16 -107 123 -66 118
5491 118 -24 205 -92 -59 -174 -50 -66 399 -13 -20 -53 -80 215 32 61 -95 -87 -183 -80 -25 105 256 -201 -186
5515 -186 -152 -264 -43 101 -200 2 -157 -119 -7 177 27 69 -77 -75 236 -142 187 385 18 188 -80 -106
5537 -106 146 -76 -307 -64 142 185 206 54 6 118 -42 -78 305 -19 -111 169 271 116 46 -215 31 -63
5559 -63 -268 -147 -22 -102 -7 -48 -90 -161 -160 45 206 65 -60 120 19 -25 -43 -91 -92 190 -228 -171 78 -305 9
5584 9 -53 -149 62 -131 110 38 -15 -41 44 249 83 45 -413 8 147 76 81 192 -118 -126 5 -110 5 67 -97
5609 -97 -102 -167 98 10 -133 7 142 -45 -62 -68 -139 99 -191 -225 172 -74 -80 118 -172 88 -242 -72 -264 -257 -134
5634 -134 -62 135 -175 -19 90 -221 137 -171 -176 169 131 156 -93 -389 -107 99 64 -85 -182 -163 103 -212 207
5657 207 102 189 -130 -115 -155 -107 -24 -238 62 59 14 -104 338 65 93 151 8 90 -270 -81 169 15 -79 75
5681 75 -119 -169 159 -82 -70 34 -57 78 -57 71 74 372 -48 -8 -122 -234 186 -281 -125 29 -172 -19
5703 -19 -22 -340 -90 -89 -105 85 269 12 40 55 -76 4 -185 -161 -181 162 6 380 -127 133 -66 95 128 -132
5727 -132 -226 157 -16 -97 75 25 95 66 -192 123 100 -138 95 112 -242 -28 -65 -282 153 112 -70 79 259
5750 259 57 -38 48 -158 170 169 30 270 -62 30 219 -96 326 296 -271 144 -128 -270 -80 42 -115 88
5772 88 -140 -199 52 -145 79 125 -15 -125 87 -387 3 16 -1 125 -86 -23 -83 63 73 91 -14 45 91 -23
5796 -23 65 136 -199 -15 73 -28 158 149 -136 229 -85 -21 -157 8 -87 -6 255 213 58 -141 -97 -124 -93 48
5820 48 428 -97 -86 0 -11 117 -59 341 74 16 32 -64 -17 -120 -59 -49 60 -89 73 27 38 195 159 143 -10
5845 -10 34 -415 -434 9 -151 -82 232 149 -154 182 124 -145 90 -55 -84 109 67 139 193 -25 -204 48 -112
5868 -112 -130 29 -4 -162 51 28 149 172 -255 22 109 -95 -68 54 45 7 133 245 -61 -25 45 82 93 -185
5892 -185 -227 -137 -30 -87 -101 231 -150 208 -70 67 -51 18 320 4 -95 102 112 258 -165 114 120 -59 -70
5915 -70 -111 61 -62 182 50 45 -84 34 216 -26 -35 71 -189 143 -68 -117 30 150 -31 206 -79 -82 17
5938 17 195 -119 226 332 -9 408 370 143 -120 97 -2 41 -115 132 -84 -202 79 150 40 233 52 20
5960 20 152 106 -25 137 -58 -274 -66 -385 -36 -115 260 103 -10 -22 193 -86 -24 -19 119 43 -240 135 -372
5983 -372 -176 -224 163 -31 -102 147 141 -217 -8 -120 -17 221 160 -89 -179 -75 -162 -116 -25 -45 168 -41 -57 220
6007 220 -146 74 37 134 -144 -44 26 51 -102 106 -12 -84 -127 204 -125 -308 -165 -155 -18 107 -26 159
6029 159 60 266 -101 -440 310 -35 -67 -269 161 -171 -114 218 -120 215 68 -227 -8 84 -251 43 -149
6050 -149 61 31 -175 135 -8 -57 4 -90 180 49 3 -79 21 -83 -139 -61 -7 -45 138 -486 40 -201 -359
6073 -359 111 3 11 70 -44 100 182 41 -371 75 171 -197 10 29 181 -18 -172 39 -66 87 214 228
6095 228 -38 97 -412 121 168 114 -203 -146 303 -78 -68 -130 1 -120 103 -258 -394 170 196 62 73 -121
6117 -121 11 111 -193 43 35 -90 41 265 21 115 122 -68 -6 65 -207 -202 67 107 -278 -86 -266 -161 61
6140 61 20 320 240 -109 111 -27 30 -26 -114 67 -248 262 232 -110 -144 -34 -106 106 -24 -5 67 -10 167 168 -111
6165 -111 250 11 -43 355 30 9 -90 11 132 -204 175 213 164 18 -118 -143 -301 395 177 -8 294 -29
6187 -29 56 -165 -34 -71 -222 -27 -190 52 -74 -178 -120 -79 -17 22 -5 37 87 -321 117 113 -187 -130 -140 57 16
6212 16 196 44 89 32 -51 166 0 -143 119 -5 -201 -114 21 -50 154 171 2 -28 -85 37 -210 -54 -231
6235 -231 148 -264 -248 -146 -310 -95 -102 -174 -45 -39 181 183 -157 -196 126 -235 -25 -179 -10 -141 187 103 -105
6258 -105 184 143 -170 -114 149 -181 -306 133 -321 -81 99 98 -21 1 -118 -92 -40 99 96 23 204 367 163
6281 163 -11 38 -85 -138 -64 33 88 21 -97 297 51 -158 26 22 69 63 -130 273 -8 164 34 -48 253 -235
6305 -235 213 31 119 -100 -281 -90 303 -71 -106 154 19 -140 303 33 -171 331 39 74 52 -78 14 -25
6327 -25 134 90 -134 -110 13 110 22 -187 142 -103 -62 -43 88 3 -318 -30 -46 -18 -250 196 -179 -120 97 -56
6351 -56 30 209 263 95 47 -31 59 1 156 -99 -120 -115 -26 -19 -201 -137 220 -30 89 -175 -133 -35 -143 35 313
6376 313 80 -170 -130 -9 -84 26 -412 207 193 -271 23 -133 -78 22 76 215 -61 -222 60 1 -74 -93 -52
6399 -52 184 145 -41 54 -2 212 -24 217 179 116 166 103 165 -132 58 205 -50 23 -110 -17 -167 117 -6 -200
6423 -200 278 -153 82 134 -89 2 -54 80 -132 161 -138 42 108 -45 116 -97 45 77 256 214 -23 25
6445 25 -146 -17 83 -109 -179 80 37 -178 -85 116 52 -143 -201 63 -4 249 165 -191 -99 7 -74 70 14 -88
6469 -88 77 60 -52 -239 145 149 -54 144 -176 -121 390 -74 -369 45 56 -42 53 13 109 -16 273 -165 133
6492 133 173 1 -34 93 -231 123 -268 69 95 -157 -70 -119 49 55 -156 -15 42 -46 -312 -142 -21 -288 178
6515 178 59 -38 -134 86 -177 -222 87 -3 37 -17 154 109 -111 53 -59 171 84 -103 54 118 235 153 -86
6538 -86 -194 -95 -213 105 -123 102 -209 168 43 -222 95 -214 -31 -126 -77 198 -6 -149 140 -226 97
6559 97 -44 -167 -71 -230 40 -28 6 17 -30 -48 94 -27 -163 -89 88 -276 18 1 -20 217 74 -32 -146
6582 -146 -134 101 -39 92 -138 119 112 161 -18 108 250 -36 -177 62 104 -217 -109 -35 327 -9 127 93
6604 93 -1 115 283 -2 -22 22 70 0 145 86 143 309 214 100 -38 -11 92 38 -102 -85 -147 -61 138 62 -93
6629 -93 -174 53 148 75 28 -81 118 169 -224 71 13 142 11 102 -62 22 27 -27 -76 -21 -4 157 21 -43 -186
6654 -186 -194 46 -92 -57 -54 60 -215 -29 -127 -15 194 -278 -72 56 -85 -107 -148 305 55 -16 -70 -186 -41
6677 -41 1 -168 86 157 -77 60 142 20 -7 167 -28 -226 20 226 -363 115 109 228 263 -169 -18 149 -34
6700 -34 268 -25 -144 -40 109 69 -109 179 -58 61 -221 158 -10 5 198 37 131 298 -241 -205 -161 262
6722 262 54 -60 -45 34 -139 126 86 -66 251 -94 0 -297 -297 -88 -114 -265 -134 236 -119 -71 -112 267 -254
6745 -254 72 -312 0 50 -79 -85 45 43 -230 -30 -81 15 135 -256 2 -99 161 -32 -137 117 -69 14 -126
6768 -126 -161 124 -157 61 203 153 -324 -99 28 74 -262 120 37 69 -210 33 48 86 -268 -64 74 43 -69
6791 -69 36 -194 -33 -57 -80 -2 3 86 -41 -7 87 215 -174 -20 -55 -55 163 -219 -102 -31 29 11 -10 46 105 132
6817 132 35 178 -182 0 152 -116 -199 273 -100 -50 152 -65 42 -132 -107 -46 -105 -231 180 39 39 -61 -32
6840 -32 -100 -38 33 106 28 15 189 54 0 60 174 -273 248 -110 -127 -28 80 -13 -60 44 -224 -87 54 -61
6864 -61 -102 97 -22 261 49 -94 -148 109 158 21 160 -135 -173 97 -263 -2 100 -50 -126 -384 -45 201
6886 201 -166 -67 -176 -44 -182 -197 -250 154 -185 32 1 -145 -146 86 223 200 -40 241 30 58 142 -85 -20
6909 -20 -37 -171 -6 145 -100 144 -83 -108 -120 -10 -457 -29 25 227 -124 81 -113 -187 -50 9 140 -101
6931 -101 -186 -14 164 -106 270 43 132 -62 72 171 -17 -114 37 127 78 201 274 -161 253 -37 -146 -28
6953 -28 232 -223 53 -29 97 127 -54 63 -159 -71 -1 269 -184 33 -174 37 -264 -76 112 -121 -85 127
6975 127 6 85 57 64 -170 144 9 -292 -58 -121 -59 -144 -121 92 51 -166 -129 8 -135 436 152 -58 -346
6998 -346 -135 -119 -186 106 40 -125 196 -62 -164 98 -70 -69 -37 -183 162 269 -29 119 -46 -256 7 -229
7020 -229 14 175 86 193 32 52 -9 19 3 -180 54 -14 -46 -120 18 175 175 64 171 -19 -222 48 -171
7043 -171 41 -83 108 -204 -37 -41 52 148 -224 292 -127 39 -46 -126 -137 392 161 78 113 177 19 -53 8 -101
7067 -101 -380 -168 151 -7 -16 141 28 194 0 -69 -204 120 -62 -36 -185 108 66 -108 101 -220 -197 -2
7089 -2 -19 -49 103 175 -17 229 -9 235 117 145 -126 94 25 -125 -2 312 45 -46 99 -18 25 74 59 -152
7113 -152 -7 318 191 -208 213 41 35 -107 2 -25 -267 -33 -31 -129 -60 150 109 -120 136 173 -12 123 -180
7136 -180 -267 24 -53 1 -74 -12 -29 154 36 -83 49 -1 51 -173 33 26 38 209 -28 20 27 -68 337 -74 61
7161 61 -27 -146 -88 -80 36 -115 -65 115 30 -181 -97 -160 51 179 -79 -24 -57 2 -100 -62 -28 -51 -55 -216 -292 16
7187 16 7 -33 -34 -103 -255 -107 -9 -155 -181 -100 40 155 -100 86 -165 -139 87 -147 143 -71 52 38 279 -211
7211 -211 -24 58 -7 4 126 -51 -52 7 -4 -68 39 -57 115 91 -113 -141 -161 -109 -83 -131 14 78 -254 -92 74
7236 74 -137 -187 29 -3 146 279 104 -132 -144 -152 242 -48 -93 116 233 -74 14 -4 57 17 140 32 125 141
7260 141 38 -206 94 177 -53 -121 86 130 55 -64 -424 -49 -39 -20 -29 67 266 133 -235 -5 -43 -96 252 130
7284 130 -251 -141 -289 -368 -110 -124 302 232 186 27 -76 54 191 304 325 98 202 145 32 104 104 112 -253 -198
7308 -198 45 -23 -25 -102 -86 207 -67 -4 23 -39 123 -91 -10 -116 -61 388 -102 -3 -30 297 121 -95 -121 -204 -283
7333 -283 -76 252 146 141 -240 -141 40 127 247 134 23 152 -35 -50 85 -15 -44 109 279 34 -88 130
7355 130 -116 -65 -22 245 -24 -53 96 -131 -238 -74 -113 101 28 194 -36 183 42 -114 21 -39 -237 32
7377 32 -248 -153 202 -221 -206 54 1 -60 -110 93 59 -257 133 -336 -25 38 220 194 37 107 29 -7 187 -91
7401 -91 83 73 47 105 -187 9 -88 -49 -16 -38 -219 92 40 72 -135 -44 -98 69 15 152 39 225 -334 68
7425 68 185 101 30 29 -84 50 105 -125 79 73 159 -20 -191 426 -347 12 -25 -85 48 -35 116 23 7 -45 19
7450 19 -211 80 108 121 126 197 84 -201 91 -343 -125 -65 -163 -55 -141 32 -197 35 -162 -49 61 -65 188
7473 188 86 138 -13 77 -8 215 -15 73 101 -121 330 -242 -1 6 85 -66 -155 -44 84 21 -47 -309 -363 -46
7497 -46 -32 -250 -98 -208 6 55 -436 -20 225 -162 137 173 -7 -158 -250 -78 76 -34 -135 118 104 166
7519 166 50 115 -111 -248 -8 4 -31 -146 -33 -6 -91 66 32 293 -25 -75 219 -27 137 39 24 -72 151
7542 151 -17 -29 42 -111 -83 138 -235 94 -75 -169 30 56 52 -42 -8 -28 -186 -79 20 -87 103 130 15 31
7566 31 33 135 261 -39 -31 26 39 -22 -226 186 75 -15 -335 -137 136 86 329 -87 120 37 252 -1 5 250
7590 250 325 -41 79 69 -17 -129 22 139 -246 176 -28 176 176 115 111 65 17 -100 -23 182 77 -6 -233 25
7614 25 -275 139 -156 60 -105 110 -154 148 19 97 -96 271 14 -248 -25 -291 61 86 -78 46 81
7635 81 -13 -162 -19 25 16 -86 -71 125 -104 271 -7 -78 -56 -78 168 69 -21 144 -111 57 -43 11 6 -56 -371
7660 -371 72 -177 -49 -215 -158 -79 -93 -19 -38 -4 184 -309 34 24 -30 -55 -129 -111 -113 -68 -26 77 -155 38 81
7685 81 -253 -153 85 -150 79 -163 33 247 -25 13 -62 210 5 -144 125 79 152 -98 185 270 92 217
7707 217 8 68 33 -281 103 88 167 -305 120 23 53 130 -71 -17 5 12 198 -140 -70 -66 -37 -12 -178 -145 -45 181
7733 181 -64 -37 80 -2 -187 24 214 -172 91 146 -129 58 66 211 103 -89 -237 -89 27 162 -244 149
7755 149 -138 -35 97 -131 -55 -93 -175 -14 77 -69 127 -151 -89 -93 55 25 232 212 -56 20 144 6 44 -203
7779 -203 -110 -101 -162 -243 -28 402 -42 -134 40 -71 -115 87 -144 -95 13 60 200 -34 105 -83 -210 -105 173
7802 173 -17 -82 57 106 0 -105 139 -52 116 -41 -187 77 170 -50 -17 -96 20 -238 352 137 -153 -175
7824 -175 141 64 41 203 70 -149 -127 -43 23 -124 7 -32 12 -54 130 51 -71 61 95 141 -54 -114 -121 -117 -219
7849 -219 -28 152 105 -92 138 289 -227 168 -334 -199 -45 -48 163 -173 63 -89 64 -26 -160 29 90 49
7871 49 -40 -125 18 22 123 -23 53 -16 -54 229 204 85 -62 27 101 -115 -61 123 -137 -67 27 181 -62 24 158
7896 158 -192 -174 273 -67 22 54 -208 265 115 121 39 195 -20 20 183 26 -76 7 62 -55 -17 46 238 92
7920 92 186 -15 -69 -33 86 81 105 -68 -105 305 -14 -22 23 241 107 58 -207 -85 -176 -190 -256 178 129 26 -59 -231
7946 -231 67 -18 31 -65 68 -3 253 -48 72 -169 -252 132 75 63 -97 -21 134 -52 -101 -6 204 83 4 143
7970 143 173 73 -77 -40 12 112 -259 -63 -248 3 -33 5 -123 342 91 -135 247 94 -54 -10 -84 57
7992 57 -4 84 261 -51 -126 48 -89 -11 -143 222 74 242 -33 93 -89 -60 175 7 -118 -165 103 4 240
8015 240 -13 -197 11 33 181 -157 -91 -168 184 -234 -123 -141 -68 215 -3 -294 -27 182 -114 -294 -42 -56
8037 -56 -238 -37 -137 -99 182 339 70 -332 -25 105 12 -213 -30 41 -10 -214 5 32 69 -35 -178 -159 -122
8060 -122 -106 22 -5 19 135 76 74 274 57 87 -273 -158 13 61 -22 6 427 -283 5 -104 -25 -52 -184 215
8084 215 -239 -103 -70 -27 -135 -37 -276 -14 64 113 -78 48 0 228 121 78 53 115 23 71 -113 -121 41 -110
8108 -110 66 -93 52 203 -129 -142 -51 -19 -217 -243 -38 -3 -106 -221 -33 233 -55 98 72 27 -66 44 153
8131 153 -274 -9 -243 -107 -126 -29 105 182 180 -52 -285 -133 52 16 -211 -161 5 23 173 41 -213 -169 -54
8154 -54 -93 139 81 -296 38 -207 -376 -211 63 83 -130 96 110 -59 13 -31 76 167 -71 -268 -210 56 29
8177 29 -9 -196 89 127 -205 -64 -20 -262 248 -96 -129 155 -137 215
8191B15
##END NTUPLES=NMR FID
##END=
