##TITLE=1H_Lae-PbMe-C1
 CDCl3, 8 sc, 
 17.9.2019
##JCAMPDX= 6.0         $$ Bruker NMR JCAMP-DX V2.0
##DATA TYPE= NMR FID
##DATA CLASS= NTUPLES
##ORIGIN= UXNMR, Bruker Analytische Messtechnik GmbH
##OWNER= root
$$ XWIN-NMR		Version 3.5
$$ Tue Sep 17 16:02:49 2019 Russian Standard Time (UT+4h)  she@DPX200
##.OBSERVE FREQUENCY= 200.1315
##.OBSERVE NUCLEUS= ^1H
##.DELAY= (6, 6)
##.ACQUISITION MODE= SIMULTANEOUS
##.ACQUISITION SCHEME= undefined
##.AVERAGES= 8
##.DIGITISER RES= 18
##SPECTROMETER/DATA SYSTEM= spect
##.PULSE SEQUENCE= zg30
##.SOLVENT NAME= CDCl3
##.SHIFT REFERENCE= (INTERNAL, CDCl3, 0, 15.7039)
##AUDIT TRAIL= $$ (NUMBER, WHEN, WHO, WHERE, WHAT)
$$ ##TITLE= Audit trail, XWIN-NMR		Version 3.5
$$ ##JCAMPDX= 5.01
$$ ##ORIGIN= Bruker BioSpin GmbH
$$ ##OWNER= she
$$ F:/spectra/data/she/nmr/H-F/1/audita.txt
$$ ##AUDIT TRAIL=  $$ (NUMBER, WHEN, WHO, WHERE, WHAT)
(   1,<2019-09-17 16:01:54.85 +0400>,<she>,<DPX200>,
      <created by zg, POWCHK disabled, PULCHK disabled
       configuration hash MD5:
       00 E9 B6 7A A2 85 ED C7 34 08 36 98 17 FE 4E 26
       data hash MD5: 16K
       A7 B3 B6 88 4D 35 C1 90 7E 94 C0 88 B9 9E 75 88>)
$$ ##END=
$$ 
$$ hash MD5
$$ 90 6A 66 F3 75 09 0D 97 FC 3F F1 F9 7F CF 3C 16
##$RELAX= 
##$RELAX= 
##$RELAX= 
##$RELAX= 
##$RELAX= 
##$RELAX= 
$$ Bruker specific parameters
$$ --------------------------
##$DU= <F:/spectra>
##$EXPNO= 1
##$NAME= <H-F>
##$PROCNO= 1
##$TYPE= <nmr>
##$USER= <she>
##$AMP= (0..31)
100 100 100 100 100 100 100 100 100 100 100 100 100 100 100 100 100 100 
100 100 100 100 100 100 100 100 100 100 100 100 100 100 
##$AQSEQ= 0
##$AQ_mod= 1
##$AUNM= <au_zg>
##$AUTOPOS= <>
##$BF1= 200.13
##$BF2= 200.13
##$BF3= 200.13
##$BF4= 200.13
##$BF5= 200.13
##$BF6= 200.13
##$BF7= 200.13
##$BF8= 200.13
##$BYTORDA= 1
##$CFDGTYP= 0
##$CFRGTYP= 5
##$CHEMSTR= <none>
##$CNST= (0..31)
1 1 145 1 1 1 1 1 1 1 1 1 1 1 1 1 1 1 1 1 1 1 1 1 1 1 1 1 1 1 1 1 
##$CPDPRG= <>
##$CPDPRG1= <>
##$CPDPRG2= <>
##$CPDPRG3= <>
##$CPDPRG4= <mlev>
##$CPDPRG5= <mlev>
##$CPDPRG6= <mlev>
##$CPDPRG7= <mlev>
##$CPDPRG8= <mlev>
##$CPDPRGB= <>
##$CPDPRGT= <>
##$D= (0..31)
0 1.2 0 0 0 0 0 0 0 0 0 0.03 0 0 0 0 0 0 0 0 0 0 0 0 0 0 0 0 0 0 0 0 
##$DATE= 1568721714
##$DBL= (0..7)
120 120 120 120 120 120 120 120 
##$DBP= (0..7)
150 150 150 150 150 150 150 150 
##$DBP07= 0
##$DBPNAM0= <>
##$DBPNAM1= <>
##$DBPNAM2= <>
##$DBPNAM3= <>
##$DBPNAM4= <>
##$DBPNAM5= <>
##$DBPNAM6= <>
##$DBPNAM7= <>
##$DBPOAL= (0..7)
0.5 0.5 0.5 0.5 0.5 0.5 0.5 0.5 
##$DBPOFFS= (0..7)
0 0 0 0 0 0 0 0 
##$DE= 6
##$DECBNUC= <off>
##$DECIM= 24
##$DECNUC= <off>
##$DECSTAT= 4
##$DIGMOD= 1
##$DIGTYP= 9
##$DL= (0..7)
0 120 120 120 120 120 120 120 
##$DP= (0..7)
150 150 150 150 150 150 150 150 
##$DP07= 0
##$DPNAME0= <>
##$DPNAME1= <>
##$DPNAME2= <>
##$DPNAME3= <>
##$DPNAME4= <>
##$DPNAME5= <>
##$DPNAME6= <>
##$DPNAME7= <>
##$DPOAL= (0..7)
0.5 0.5 0.5 0.5 0.5 0.5 0.5 0.5 
##$DPOFFS= (0..7)
0 0 0 0 0 0 0 0 
##$DQDMODE= 0
##$DR= 18
##$DS= 0
##$DSLIST= <SSSSSSSSSSSSSSS>
##$DSPFIRM= 0
$$ [...]
##$SUBNAM2= <"">
##$SUBNAM3= <"">
##$SUBNAM4= <"">
##$SUBNAM5= <"">
##$SUBNAM6= <"">
##$SUBNAM7= <"">
##$SUBNAM8= <"">
##$SUBNAM9= <"">
##$SW= 24.0689530833862
##$SWIBOX= (0..15)
0 0 2 0 0 0 0 0 0 0 0 0 0 0 0 0 
##$SW_h= 4816.95568400771
##$TD= 16384
##$TD0= 1
##$TE= 0
##$TE2= 300
##$TE3= 300
##$TEG= 300
##$TL= (0..7)
0 120 120 120 120 120 120 120 
##$TP= (0..7)
150 150 150 150 150 150 150 150 
##$TP07= 0
##$TPNAME0= <>
##$TPNAME1= <>
##$TPNAME2= <>
##$TPNAME3= <>
##$TPNAME4= <>
##$TPNAME5= <>
##$TPNAME6= <>
##$TPNAME7= <>
##$TPOAL= (0..7)
0.5 0.5 0.5 0.5 0.5 0.5 0.5 0.5 
##$TPOFFS= (0..7)
0 0 0 0 0 0 0 0 
##$TUNHIN= 0
##$TUNHOUT= 0
##$TUNXOUT= 0
##$USERA1= <user>
##$USERA2= <user>
##$USERA3= <user>
##$USERA4= <user>
##$USERA5= <user>
##$V9= 5
##$VALIST= <valist>
##$VCLIST= <CCCCCCCCCCCCCCC>
##$VD= 0
##$VDLIST= <DDDDDDDDDDDDDDD>
##$VPLIST= <PPPPPPPPPPPPPPP>
##$VTLIST= <TTTTTTTTTTTTTTT>
##$WBST= 1024
##$WBSW= 4
##$XGAIN= (0..3)
0 0 0 0 
##$XL= 0
##$YL= 0
##$YMAX_a= 281237
##$YMIN_a= -452477
##$ZGOPTNS= <>
##$ZL1= 120
##$ZL2= 120
##$ZL3= 120
##$ZL4= 120
##$ABSF1= 10
##$ABSF2= 0
##$ABSG= 5
##$ABSL= 3
##$ALPHA= 0
##$AQORDER= 0
##$ASSFAC= 0
##$ASSFACI= 0
##$ASSFACX= 0
##$ASSWID= 0
##$AUNMP= <proc_1d>
##$AZFE= 0.1
##$AZFW= 0.1
##$BCFW= 1
##$BC_mod= 2
##$BYTORDP= 1
##$COROFFS= 0
##$CY= 11.3945322036743
##$DATMOD= 1
##$DC= 2
##$DFILT= <>
##$DTYPP= 0
##$F1P= 20.1720416913024
##$F2P= 0.152960286110954
##$FCOR= 0.5
##$FTSIZE= 0
##$FT_mod= 4
##$GAMMA= 1
##$GB= 0.15
##$INTBC= 1
##$INTSCL= 1
##$ISEN= 128
##$LB= 0.24
##$LEV0= 0
##$LPBIN= 0
##$MAXI= 10000
##$MC2= 0
##$MEAN= 0
##$ME_mod= 0
##$MI= 1.114404
##$NCOEF= 0
##$NC_proc= 0
##$NLEV= 6
##$NOISF1= 3.799351
##$NOISF2= 2.8
##$NSP= 1
##$NTH_PI= 0
##$NZP= 0
##$OFFSET= 15.70392
##$PC= 1
##$PHC0= -9572.437
##$PHC1= 12.00096
##$PH_mod= 1
##$PKNL= yes
##$PPARMOD= 0
##$PSCAL= 0
##$PSIGN= 0
##$REVERSE= no
##$SF= 200.130013532006
##$SI= 16384
##$SIGF1= 3
##$SIGF2= 2
##$SINO= 400
##$SIOLD= 16384
##$SREGLST= <1H.CDCl3>
##$SSB= 0
##$STSI= 0
##$STSR= 0
##$SW_p= 3612.71676300578
##$SYMM= 0
##$S_DEV= 0
##$TDeff= 0
##$TDoff= 0
##$TI= <>
##$TILT= no
##$TM1= 0
##$TM2= 0
##$TOPLEV= 0
##$USERP1= <user>
##$USERP2= <user>
##$USERP3= <user>
##$USERP4= <user>
##$USERP5= <user>
##$WDW= 1
##$XDIM= 8192
##$YMAX_p= 0
##$YMIN_p= 0
$$ End of Bruker specific parameters
$$ ---------------------------------
##NTUPLES= NMR FID
##VAR_NAME=  TIME,          FID/REAL,        FID/IMAG
##SYMBOL=    X,             R,               I
##VAR_TYPE=  INDEPENDENT,   DEPENDENT,       DEPENDENT
##VAR_FORM=  AFFN,          ASDF,            ASDF
##VAR_DIM=   8192,          8192,            8192
##UNITS=     SECONDS,       ARBITRARY UNITS, ARBITRARY UNITS
##FACTOR=    0.0002076,     1,               1
##FIRST=     0,             0,               0
##LAST=      1.7004516,     0,               0
##MIN=       0,             -452477,         0
##MAX=       1.7004516,     281237,          0
$$ Real data points
##PAGE= N=1
##DATA TABLE= (X++(R..R)), XYDATA
$$ [...]
2606e552K66K312J026n16j958j150K67J499J159L00j087j649n05R18J426R06k35
$$ -5552 -5286 -2974 -1948 -2464 -4422 -5572 -5305 -3806 -2647 -2347 -3434 -5083 -5588 -4670 -3244 -2338 -2573
2623b573j284j821O6K316J938n31j855j264K29R90J407J172o96j879j257P96K065
$$ -2573 -3857 -5678 -5612 -3296 -1358 -1889 -3744 -5008 -4779 -3789 -2382 -1210 -1906 -3785 -5042 -4246 -2181
2640b181J491n4j859j726j30K082K266j86j216j229n71Q12J333J755J64k032j848
$$ -2181 -690 -744 -2603 -4329 -4459 -2377 -111 -297 -1513 -2742 -3313 -2501 -1168 587 751 -1281 -3129
2657c129O55J849K114k03j832j189k41J231K054R62q91j934l39K53J726J695K59
$$ -3129 -2474 -625 1489 1286 -546 -1735 -1976 -745 1309 2271 1380 -554 -893 -640 1086 2781 3040
2674C040j848j738J4K047J872N9q31j534p24R77J936J472r46j558j003L36J241
$$ 3040 1192 -546 -532 1515 3387 3446 2615 1081 357 1334 3270 4742 3796 2238 1235 1571 2812
2691B812J813M02j469j756k17J816J214L41o51j070p33o5J803J282l13j685q07
$$ 2812 4625 5027 3558 1802 1585 3401 4615 4956 4305 3235 2502 2437 4240 5522 5209 3524 2717
2708B717L80R33R58N27p14j940k82Q17J218P77n79j089j004J85J041J333l67j328
$$ 2717 3097 4030 4988 5515 4801 2861 2579 3396 4614 5391 4812 3723 2719 2904 3945 5278 4911 3583
2726C583p07K36M38M74P75m49j313r83Q98R75O76q39p88j138M28R34O50j37j066
$$ 3583 2876 3112 3550 4024 4799 4350 3037 2054 2952 3927 4603 3764 2976 1838 2266 3200 3850 3713 2647
2745B647n11l99M36O25N99n40j163q16M76J160J02l94q03o64R4O03M75j78l78
$$ 2647 2136 1737 2173 2798 3397 2857 1694 878 1354 2514 2616 2222 1419 755 849 1452 1927 1749 1371
2764A371j020j40N41O95m3o63r30j71M85P10J59n75p95np1K71Q35j14p33r77J02
$$ 1371 351 211 752 1447 1404 741 -189 -360 125 835 994 419 -376 -381 -452 -181 654 540 -193 -1170 -1068
2785a068P62O40l01j095m02J42M49L01K94l64r78n23J18Q17N96P5j252o00k64
$$ -1068 -306 334 33 -1062 -1464 -1322 -873 -572 -278 -642 -1620 -2143 -2025 -1208 -612 -537 -1789 -2389 -2653
2804b653J258P62l96q71n03J88K87L69L70m91p85m10J06J050P13m63j156p94L48
$$ -2653 -1395 -633 -1029 -1900 -2403 -2215 -1928 -1559 -1189 -1680 -2465 -2875 -2769 -1719 -1006 -1469 -2625 -3419 -3071
2823c071J095M07l52j032j24m41N64P31N84o35j261m72O25Q45O09j24r70r19J91
$$ -3071 -1976 -1569 -1921 -2953 -3077 -3518 -2954 -2223 -1639 -2274 -3535 -4007 -3382 -2537 -1928 -2052 -3022 -3941 -3750
2842c750Q05O36k22j55q72l98j77J612Q24q64p75o77J40Q79O37M2m42j357nM89
$$ -3750 -2945 -2309 -2531 -2686 -3558 -3956 -4133 -2521 -1697 -2561 -3336 -4013 -3873 -2994 -2357 -2315 -2757 -4114 -4119 -3630
2862c630J063K38k53r22n66K76J620M15p11p64p66O38O70P21P7n99p81j95O81
$$ -3630 -2567 -2329 -2582 -3504 -4070 -3794 -2174 -1759 -2470 -3234 -4000 -3362 -2692 -1971 -1894 -2493 -3274 -3469 -2788
2881b788P82L17m14q08k92M54J192N25m04n85k80m2M17R38N54n78p39q2O91P48
$$ -2788 -2006 -1689 -2103 -2911 -3203 -2749 -1557 -1032 -1436 -2021 -2301 -2343 -1926 -988 -434 -1012 -1751 -1833 -1142 -394
2901c94L23n32l47Q5o3P93K48L00m49m68K75N94M68L95p00k80M89K16L82L10m31
$$ -394 -71 -603 -950 -865 -928 -135 113 413 -36 -504 -229 365 833 1228 528 248 737 953 1335 1645 1214
2922A214l3K98J34Q3J89K70q1l89L92N90M00Q4p31j30L28O71j22k14p2O2J79L3
$$ 1214 1181 1479 1613 1696 1885 2155 2074 1685 2077 2667 3067 3151 2420 2290 2618 3289 3167 2953 2881 2943 3122 3155
2944C155O88k08l4o06J2M15Q75j27p15j90j39M52M03M45n40l29n52M93L14P08
$$ 3155 3843 3635 3601 2995 3007 3422 4297 4170 3455 3265 3126 3578 3981 4426 3886 3557 3005 3498 3812 4520
2964D520j54o98o65r4P36Q32m19p14l83k10N00O68K1o0p59j098L26J074J026j112
$$ 4520 4366 3668 3003 2909 3645 4477 4058 3344 2961 2751 3251 3919 3940 3880 3121 2023 2349 3423 4449 3337
2984C337p04o29n4P32P67j37p64q27k78K00P43R17p32q34j349L47J062J017n61
$$ 3337 2633 2004 1950 2682 3449 3312 2548 1721 1443 1643 2386 3303 2571 1737 388 735 1797 2814 2253
3003B253j177m34o81Q83P89M99q35j177m30M87Q33M81k15j247j177M3J087J173
$$ 2253 1076 642 -39 844 1633 2132 1297 120 -310 177 1010 1491 1276 29 -1148 -1105 -18 1155
3021A155k36q35j015p85P01J154Q92q16j444j108L53J479P12j15q91j454j92J116
$$ 1155 919 84 -931 -1716 -1015 139 1031 215 -1229 -2337 -1984 -505 207 92 -799 -2253 -2445 -1329
3039a329Q30M99o80j359p04J04J626P90n18j132j169K65R22P03N02p16j438o53
$$ -1329 -499 0 -680 -2039 -2743 -2639 -1013 -223 -741 -1873 -3042 -2777 -1855 -1152 -650 -1366 -2804 -3457
3057c457L68J865P22q86j231q62L04J013J182j73q47j482j18P68J215L08k05j294
$$ -3457 -3089 -1224 -502 -1388 -2619 -3481 -3177 -2164 -982 -1155 -2002 -3484 -3602 -2834 -1619 -1311 -1516 -2810
3075b810j022L97J215J251p01q70j093j04P61J179O16o00j626p07R90Q85P22k42
$$ -2810 -3832 -3435 -2220 -969 -1670 -2540 -3633 -3737 -2976 -1797 -1181 -1781 -3407 -4114 -3124 -2239 -1517 -1759
3093a759r30j013j94J223J428l57r13p41l48N4J045J275l99j369j018R58R84M38
$$ -1759 -2689 -3702 -3896 -2673 -1245 -1602 -2515 -3256 -3604 -3550 -2505 -1230 -1629 -2998 -4016 -3058 -2074 -1636
3111a636K18q09p17l86N23P79O10l25p95o54j41J142J166j54p56r46L22N20L97
$$ -1636 -1418 -2227 -2944 -3330 -2807 -2028 -1418 -1743 -2538 -3192 -3333 -2191 -1025 -1179 -1935 -2881 -2559 -2039 -1642
3130a642P16m43p34l10K67N55J202j69n59o20oO85P16K01j97o21j34JR18N60R
$$ -1642 -926 -1369 -2103 -2413 -2146 -1591 -389 -558 -1117 -1737 -1743 -1058 -342 -141 -338 -959 -1093 -1092 -174 386 395
3151C95l18o66k01J101M56q7k82k41L18j62L13K04M18Jm65N6M95L63K16J48o63
$$ 395 77 -589 -790 311 767 680 398 157 475 313 626 830 1248 1249 784 840 1335 1698 1914 2062 1399
3172A399k6L91K66J35l77P04O2n48K33K82O20j63p00L22k3K39j18M88j68J04O7
$$ 1399 1373 1764 2030 2165 1788 2492 2554 2006 2239 2521 3141 2978 2278 2600 2577 2816 2698 3186 3018 3122 3189
3193C189k73l06O05K53L4k85j89j0L51J0J36K23k13m65l2K19L06O46p29l92k26
$$ 3189 2916 2610 3215 3468 3502 3217 3028 3018 3369 3379 3515 3738 3525 3060 3028 3247 3553 4199 3470 3078 2852
3214B852P8O96J28j96m19n78K56P6L75L61k73q95k59K35Q92M28r21n78o87L73
$$ 2852 2930 3626 3754 3558 3139 2561 2817 2893 3268 3629 3356 2461 2202 2437 3329 3757 2836 2258 1571 1944
3234A944L04M09K8m20p95l91O5R81K80l72j137j30O9L75O39j71l90j027l56P49
$$ 1944 2248 2657 2685 2265 1470 1079 1144 2125 2405 2033 896 766 835 1210 1849 1678 1288 261 -95 654
3254F54O90K59l91j092o70L7Q14P80m60q88q80p0O05P03L00n84j184n65O23R11
$$ 654 1344 1603 1212 120 -550 -513 301 1081 621 -267 -1147 -1217 -612 91 391 -193 -1377 -1942 -1319 -408
3274d08N04o67j041n57K07N62R68j9m69j238o36Q63R31L99k96j414k56K85P59
$$ -408 96 -571 -1612 -2169 -1962 -1400 -432 -451 -920 -2158 -2794 -1931 -1000 -601 -897 -2311 -2567 -2282 -1523
3293a523P87l52n44q08o04N62Q50M20m5j370n26N37Q21M53l4j204l46j39P42Q13
$$ -1523 -736 -1088 -1632 -2440 -3044 -2482 -1632 -1212 -1257 -2627 -3153 -2616 -1795 -1342 -1376 -2580 -2926 -3065 -2323 -1510
3313a510j02l21o34j002O65J240N18m02j173n80L73P38R23m73m07n82m35K27J022
$$ -1510 -1612 -1933 -2567 -3569 -2904 -1664 -1146 -1548 -2721 -3301 -2928 -2190 -1267 -1740 -2147 -2729 -3164 -2937 -1915
3332a915N19o48p15k25K11N64Q84n83n08k47m72M44R21M82k91p91m85J37J190
$$ -1915 -1396 -2044 -2759 -2984 -2773 -2209 -1325 -1908 -2416 -2663 -3135 -2691 -1770 -1288 -1579 -2370 -2855 -2718 -1528
3351a528L55l92o98m91N13K40M54K35l78l98l84L56M58M63L0n73p51L45Q82O60
$$ -1528 -1173 -1565 -2263 -2754 -2241 -2001 -1547 -1312 -1690 -2088 -2472 -2116 -1658 -1195 -1165 -1738 -2489 -2144 -1262 -602
3371f02o96k39k9J52J23M48J22k14m96k53L65N59N73l24n61q5M40N31j1rk40j57
$$ -602 -1298 -1537 -1566 -1414 -1291 -843 -721 -935 -1431 -1684 -1319 -760 -187 -511 -1072 -1157 -717 -186 -197 -206 -446 -603
3393f03J71L50M24L39l33p95L11%O57M57m94r0K59P7L23j93J85J51l20k45O71
$$ -603 -432 -82 342 681 348 -447 -136 -136 521 978 484 394 653 730 1053 860 1045 1196 876 631 1302
3414A302L18K03k33j92r8N96m2M93l40k65K94n5O1M71q5j91l47J33P90J49k29
$$ 1302 1620 1823 1590 1398 1300 1896 1854 2347 2007 1742 2036 1981 2042 2513 2428 2237 1890 2023 2813 2962 2733
3435B733j17m05O1P70J4Lr3Mk50J17M11J93j19l31l46L77K49L47l27k41l06M0
$$ 2733 2616 2211 2272 3042 3056 3059 2966 2970 2720 2837 3248 3441 3322 2991 2645 3022 3271 3618 3291 3050 2744 2784
3457B784K32L34J5N9m56n29N7O83K45p23l50k45N26P6L68j61n85n81r2L87N47
$$ 2784 3016 3350 3365 3424 2968 2439 2496 3179 3424 2701 2351 2106 2632 2708 3076 2915 2330 1749 1657 2044 2591
3478B591O0l03n88m47L71M81n0l25l70k78%K40K72K14o02o14m13Q85k9J81m87
$$ 2591 2651 2348 1760 1313 1684 2165 2115 1790 1420 1142 1142 1382 1654 1868 1266 652 239 1124 1095 1276 789
3499G89q71J66J67Q7L60k44l88n10N1J57L60L48j013l83k04L02N91J6m85l78k63
$$ 789 -82 84 251 338 698 454 66 -444 -393 -236 124 472 -541 -924 -1128 -826 -235 -219 -704 -1082 -1345
3520a345K38m2M84j83k49p12j65M11N13Po59j13l14L05L0M72j66l92m59R2O7N60
$$ -1345 -1107 -1149 -665 -848 -1097 -1809 -1974 -1563 -1050 -1043 -1702 -1815 -2129 -1824 -1794 -1322 -1488 -1880 -2339 -2247 -2180 -1620
3542a620M1m88o01J55N90K3O1n15j29J73o7L09K23j1m60m10J20N52o7j68J75l37
$$ -1620 -1579 -2067 -2668 -2513 -1923 -1900 -1839 -2354 -2483 -2310 -2377 -2068 -1845 -1856 -2316 -2726 -2606 -2054 -2121 -2289 -2114 -2451
3564b451JL66l57M16j80K80l17K9K14J30J0j60n88M52K77k05k66l9L36L82O7k99
$$ -2451 -2450 -2084 -2441 -2025 -2205 -1925 -2242 -2213 -1999 -1869 -1859 -2019 -2607 -2155 -1878 -2083 -2349 -2388 -2052 -1670 -1603 -1902
3586a902L17l18k08Q8K26K70j20k30j0O3J71N16m71l11n2M35m7K47K61k22l51
$$ -1902 -1585 -1903 -2111 -2023 -1797 -1527 -1647 -1877 -1887 -1824 -1653 -1137 -1608 -1919 -1971 -1536 -1583 -1336 -1075 -1297 -1648
3607a648o1K88M37K11l06n74j06L82O29M1j12m62J27p6J45N95L52k92n00j74N48
$$ -1648 -1709 -1421 -984 -773 -1079 -1653 -1759 -1377 -748 -707 -819 -1281 -1154 -1230 -1085 -490 -138 -430 -930 -1104 -556
3628e56O82K79p24l10k79J41P25M17M1m24m59n3N18O63J36J38j046n10P33R94
$$ -556 126 405 -319 -629 -908 -767 -42 375 416 -8 -467 -520 -2 661 797 935 -111 -621 112 1106
3648A106K24j58m24k23K8P8J020K34l47q67m47Q64Q22K65l23q65j97N51N73M10
$$ 1106 1330 1172 748 525 553 631 1651 1885 1538 671 224 1088 1910 2175 1852 987 790 1341 1914 2324
3668B324J22j89j136j87R14R91M34q54p76n86J092N79N15k20j016k25j5N76J174
$$ 2324 2446 2257 1121 934 1848 2839 3273 2419 1643 1057 2149 2728 3243 3023 2007 1782 1767 2343 3517
3687C517J27m92q86o19N67J141K56m73r40n65M84O73O27k5l69j085k99Q17J012
$$ 3517 3644 3152 2266 1647 2214 3355 3611 3138 2198 1633 2117 2790 3417 3392 3023 1938 1639 2456 3468
3706C468L10o73j234j58J23J301K81m43n55o77n8J25J067L34p61j081j01J99R87
$$ 3468 3778 3105 1871 1713 1836 3137 3418 2975 2420 1743 1685 1810 2877 3211 2450 1369 1268 1467 2454
3725B454L71m98r55m45J05L05P47K9m83q74o22M21R80J07l97p34p26O18L63L81
$$ 2454 2825 2327 1372 927 1032 1337 2084 2113 1630 756 134 555 1535 1642 1245 511 -215 403 766 1147
3745A147P0j044k46o52M05O98K60k54j092o17P94N57K07m36o43l51k15M46O54
$$ 1147 1217 173 -73 -725 -320 378 638 384 -708 -1325 -531 26 233 -203 -846 -1197 -1412 -966 -312
3764c12j56j51n43o78K82O36L67n82o58n01N96J53J27J34l23m64l73K38L00N25
$$ -312 -468 -619 -1162 -1840 -1558 -922 -555 -1137 -1795 -2296 -1700 -1547 -1420 -1286 -1609 -2073 -2446 -2208 -1908 -1383
3784a383l46p37k91N60J84L91j05n96J9l01K99L17L6K04m92m84L9N36J75k16l57
$$ -1383 -1729 -2466 -2757 -2197 -2013 -1622 -1727 -2323 -2304 -2605 -2306 -1989 -1953 -1749 -2241 -2725 -2686 -2150 -1975 -2191 -2548
3805b548J89Np6R1L34j25j87k12J20K92K11j31l12M08P1j93rK25J29j62j4j05
$$ -2548 -2359 -2354 -2430 -2339 -2005 -2130 -2317 -2529 -2409 -2117 -1906 -2037 -2349 -1941 -1870 -2063 -2072 -1847 -1718 -1880 -1894 -1999
3827a999J52M62l29L04k97k6j14J47M9P8K01j75P3k40LK78L30L1l17j16N2Q9L87
$$ -1999 -1847 -1385 -1714 -1410 -1707 -1733 -1847 -1700 -1651 -1573 -1372 -1547 -1474 -1714 -1711 -1433 -1103 -1072 -1389 -1505 -1453 -1364 -977
3850i77p1K97j24n43K47M58J86r9n63L27p2M7K16L33Q5l99k46L67J6N81K43m96
$$ -977 -1048 -751 -875 -1418 -1171 -713 -527 -626 -1189 -862 -934 -887 -671 -338 -253 -652 -898 -531 -515 66 309 -187
3872a87o46K42O08J64j09K00m79j57Q9K47O82j7j55o82m87Q12P78J70k98o43j47
$$ -187 -833 -591 17 181 72 272 -207 -364 -275 -28 654 637 482 -200 -687 125 903 1073 775 132 -15
3893a5K45N11N34Q8k73p58k15Q66Q25j92l27m03n80N70P81L71k41m47n12N6M70
$$ -15 230 741 1275 1363 1090 332 117 983 1808 1616 1289 886 306 876 1657 2028 1787 1340 828 884 1354
3914A354J016P1l05q91l50O29J060K10q46l92j58L45L95O13n1k89p53j86L93Q95
$$ 1354 2370 2441 2136 1245 895 1524 2584 2794 1948 1556 1398 1743 2138 2751 2700 2411 1658 1472 1865 2760
3934B760L33o16p57q0N29N08K04r1n50n19k03P49R19J22p92q18mM01Q56K00l66
$$ 2760 3093 2477 1720 1640 2169 2677 2881 2790 2240 1721 1518 2267 3186 3308 2516 1698 1694 2095 2951 3151 2785
3955B785p81o31J64N75M99Q1k66o85m94L63J003K7m81n00o85M04N22J60Q5q36
$$ 2785 2004 1373 1537 2112 2611 2692 2426 1741 1247 1610 2613 2640 2159 1659 974 1378 1900 2060 2145 1309
3975A309k79n16O67L43J40o12n73k70M54N69n1j71o49j83j33O59M2K77o85p31
$$ 1309 1030 514 1181 1524 1664 1052 479 209 663 1232 1181 1010 361 178 45 704 746 1023 338 -393
3995c93k27M52O27K95r88m49j29K84K99o2j4n18n50j6K88M44L22r08k74m23P27
$$ -393 -620 -168 459 754 -234 -683 -812 -528 -229 -291 -305 -823 -1373 -1389 -1101 -657 -335 -1243 -1517 -1940 -1213
4016a213N32k02j76n39k34m6O1P18m51j94l93k15L56N32j83m75o20N95J58P9Q3
$$ -1213 -681 -883 -1059 -1598 -1832 -1878 -1817 -1099 -1550 -1744 -2137 -2352 -1996 -1464 -1647 -2122 -2742 -2147 -1989 -1910 -1827
4037a827k28r9l97K41J13P51n13k51k59J9N20J81j70l39j92M9L20J26K45l5m35
$$ -1827 -2055 -2154 -2551 -2310 -2197 -1446 -1959 -2210 -2469 -2450 -1930 -1749 -1919 -2258 -2450 -2401 -2081 -1955 -1710 -1745 -2180
4058b180l02m8Q71n2j77n43J27L3K25M15m09L04l93j29J81P57K74m97m03kM30
$$ -2180 -2482 -2530 -1659 -1711 -1888 -2431 -2304 -2271 -2046 -1631 -2040 -1736 -2129 -2258 -2077 -1320 -1046 -1543 -1946 -1948 -1518
4079a518J24M98n6l19m23P2O02R6j32j47j64OM03Q3K22k89m67K3M53N52o3o6P9
$$ -1518 -1394 -896 -952 -1271 -1694 -1622 -1020 -924 -1056 -1203 -1367 -1361 -958 -875 -653 -942 -1409 -1386 -933 -381 -444 -510 -431
4102d31o11K37L81M72k90j59k34j03O09L10l32k76j40R9K47L90J84j19j84j21
$$ -431 -1042 -805 -424 48 -242 -401 -635 -738 -129 181 -151 -427 -567 -468 -221 169 353 234 50 -71
4122g1k45O29K79pm51m38L11M40L60Q1m8n06j87J32M46K52R6m40l59L12J53N86
$$ -71 -316 313 592 585 134 -304 7 447 807 888 840 334 147 279 725 977 1073 633 274 586 739 1325
4144A325r3l55J0k35O87K32p2j74l17n32P45K25K38k05m68J00J99L41L22J9m62
$$ 1325 1232 877 887 652 1339 1571 1499 1325 1008 476 1221 1446 1684 1479 1011 1111 1310 1651 1973 1992 1530
4165A530o2o3J05L23L64k07l69O5M1J57O21j06m76l98J81K06M19Q4k33k75j28
$$ 1530 1468 1405 1510 1833 2197 1990 1621 1686 1727 1884 2505 2399 1923 1525 1706 1912 2331 2415 2182 1907 1779
4186A779jK52L72k76qm56L87K55J20m37J05j9j70j32K48L96m11k28j35P6L46j3
$$ 1779 1778 2030 2402 2126 2118 1662 2049 2304 2424 1987 2092 2073 1903 1771 2019 2415 2004 1776 1641 1717 2063 2050
4208B050m04l05K62J18L27k40k95J35m1J0k67J46n4k29q4r0K67K80n51l08O3p
$$ 2050 1646 1341 1603 1721 2048 1808 1513 1648 1607 1617 1350 1496 1442 1213 1129 1039 1306 1586 1035 727 790 783
4230G83o1J35J23k19j09l15j72K87N4j61m82r4K9J77K44n10k00j96N2J94J72k05
$$ 783 722 857 980 761 652 337 165 452 506 345 -137 -231 -202 -25 219 -291 -491 -687 -635 -441 -269 -474
4252d74l58r1j71M9L45j08m10p0l12O47l28L80m46j63n89K73L77Q3k3j97o98J8
$$ -474 -832 -923 -1094 -1045 -700 -808 -1218 -1288 -1600 -953 -1281 -901 -1347 -1510 -2099 -1826 -1449 -1366 -1389 -1586 -2284 -2266
4274b266P36m4M0p30K0k88K77L09M40l47j81o93k6M45M40M35o81m39r4N98L9M77
$$ -2266 -1530 -1574 -1534 -2264 -2244 -2532 -2255 -1946 -1506 -1853 -2034 -2727 -2753 -2308 -1868 -1433 -2114 -2553 -2647 -2049 -2010 -1533
4296a533l56m49j59q4N04L22Jl51n48J52N10N79p4n27l46l73P28K10M82j31o37
$$ -1533 -1889 -2338 -2497 -2581 -2077 -1755 -1754 -2105 -2653 -2501 -1991 -1412 -1486 -2013 -2359 -2732 -2004 -1794 -1312 -1443 -2080
4317b080j00J2O03O51Jj23q32k40P10M78J85j86q85J10L7P80O39l07l18o77N9
$$ -2080 -2180 -2168 -1565 -914 -913 -1036 -1868 -2108 -1398 -920 -735 -921 -1806 -1696 -1659 -879 -240 -547 -865 -1542 -1483
4338a483N35J096k85n32m49j42J99O91M54J47o82o30j5J041K99Q6l25p54L5L67
$$ -1483 -948 148 -137 -669 -1118 -1260 -1061 -370 84 231 -451 -1081 -1096 -55 244 330 5 -749 -714 -347
4358c47P32J90M5n47m97k64J046N54j93k84n41p9M41Q79J38n89K3q15M45J52M19
$$ -347 385 575 620 73 -424 -688 358 912 719 435 -106 -185 256 1135 1273 684 707 -108 337 489 908
4379I08L29p61k28k4M99J167j99p58m82L7M38L79J00N0m20m08n6N76M09J8l56
$$ 908 1237 476 248 224 723 1890 1691 933 451 488 926 1305 1405 1455 1035 627 571 1147 1556 1574 1218
4400A218k98l6M58L70J76k18p07j28L10J03N93L21l45o38k62L63R29k13l86Q2
$$ 1218 920 884 1342 1712 1888 1670 963 835 1145 1248 1841 2162 1817 1179 917 1280 2209 1996 1610 1692
4420A692j92Q4O6L70l0k2l33l55L44O09nj09m88k42N24k9m1J33r1l04K7j78L30
$$ 1692 1500 1584 1650 2020 1990 1968 1635 1280 1624 2233 2228 2119 1631 1389 1913 1884 1843 1976 1885 1581 1608 1430 1760
4443A760L33m8n85j7m2L18K46l13k71n0K40J05q7R5q8j21O8m54L58L08n10j38
$$ 1760 2093 2045 1460 1443 1401 1719 1965 1652 1381 1331 1571 1676 1589 1684 1596 1475 1543 1089 1447 1755 1245 1107
4465A107J23O1m5k01lJ84k24k39j0o9J39P8J25o71KO6j76M5J42j75P0n97j82L93
$$ 1107 1230 1291 1246 1045 1042 1226 1002 763 753 684 823 901 1026 355 357 423 247 292 434 259 329 -268 -450 -57
4489e7J2J08m86j66R6J43Or5j52J52m08j27p9K19L25l41J34n73m3n0L29J04k91
$$ -57 -45 63 -423 -589 -493 -350 -344 -439 -591 -439 -847 -974 -1053 -834 -509 -850 -716 -1289 -1332 -1382 -1053 -949 -1240
4512a240j15m65P4M37J58k12l44p7p0K98L9j29q7k90M4j40L18L50k82l80m82K24
$$ -1240 -1355 -1820 -1746 -1309 -1151 -1363 -1707 -1784 -1854 -1556 -1517 -1646 -1733 -2023 -1979 -2119 -1801 -1451 -1733 -2113 -2595 -2371
4534b371M38K25J27m27l77K40k29L81M28k48m03j65K65L81K02J1o64k32J14L34
$$ -2371 -1933 -1708 -1581 -2008 -2385 -2145 -2374 -1993 -1565 -1813 -2216 -2381 -2116 -1735 -1533 -1522 -2186 -2418 -2304 -1970
4554a970K93K1K59k67l49p3M35N25l94k73j38k14P42K99L41p12l0j97J27N99M9
$$ -1970 -1677 -1656 -1397 -1664 -2013 -2086 -1651 -1126 -1520 -1793 -1931 -2145 -1403 -1104 -763 -1475 -1505 -1702 -1575 -976 -927
4575i27M63o43m06J1N47O53M3l13l34j00J72M40L99l4l73o66%R34L64p9m56m71
$$ -927 -464 -1107 -1513 -1502 -955 -302 -259 -572 -906 -1006 -834 -394 5 -29 -402 -1068 -1068 -134 230 151 -305 -776
4597g76K18K70P73m87J2r1l10N1N70M23j85k92l79J23J64Q17o5n09k92KL42M80
$$ -776 -558 -288 485 -2 10 -81 -391 -340 230 653 468 176 -203 -80 84 901 836 327 35 37 379 859
4619H59J03Rn28j44r5N82O03k39m43k71J05L86J70j2m4j63r1qL94N20k32k41m04
$$ 859 962 971 443 299 204 786 1389 1150 707 436 541 927 1097 1085 1041 878 787 779 1173 1693 1461 1220 816
4642H16J08N54m5K43m30j79L9J2L41M54m68j2p75K22O01P8J70l28k80L58L4K06
$$ 816 924 1478 1433 1676 1246 1067 1106 1118 1459 1913 1445 1433 658 880 1481 1559 1729 1401 1121 1479 1513 1719
4664A719rJ17m83j65j7K39M86R6m27n74K02M79N45m61j22j34l11L65K42n4r3k90
$$ 1719 1710 1827 1344 1179 1162 1401 1887 1983 1556 982 1184 1663 2208 1747 1625 1491 1180 1545 1787 1733 1640 1350
4686A350l12L73j64N84p6n77L20M2l35M81k0k35Kk56L6j65M47P2n79k54K3K98
$$ 1350 1038 1411 1247 1831 1755 1178 1498 1540 1205 1686 1666 1431 1433 1177 1213 1048 1495 1567 988 734 757 1055
4708A055J67j98P6k59J74k52L4N9k07j06j38J82L47j00j60m82m19M04K04q2q4
$$ 1055 1222 1024 1100 841 1015 763 797 856 649 543 405 587 934 834 674 192 -227 177 381 299 215
4729B15k48j10K01R6n9O4n01P5p8j26J85o4m1j59k41J44J10q4J8j07m11m78O91
$$ 215 -33 -143 58 154 95 159 -342 -267 -345 -471 -286 -350 -391 -550 -791 -647 -537 -621 -603 -710 -1121 -1599 -908
4752i08L3M25o11k19K8K63pl11k87Pj40j15K97Q7l7n48J58k04L38K12j22j49l15
$$ -908 -875 -450 -1061 -1280 -1252 -989 -996 -1307 -1594 -1587 -1727 -1842 -1545 -1458 -1495 -2043 -1885 -2089 -1751 -1539 -1661 -1810 -2125
4775b125L83R3k09L98m72r6Kk16K21L58l2pm31K0K39J18O8r6l80K89r4J14M2J80
$$ -2125 -1742 -1649 -1858 -1460 -1932 -2028 -2026 -2242 -2021 -1663 -1695 -1702 -2133 -2113 -1874 -1756 -1688 -1784 -2164 -1875 -1969 -1855 -1813 -1633
4799a633N0o58O15K1L42p33K36k15NL86O37k10k01q0r2L2J92L56k86J88k97q7
$$ -1633 -1583 -2241 -1626 -1605 -1263 -1996 -1760 -1975 -1970 -1584 -947 -1157 -1358 -1438 -1530 -1498 -1306 -950 -1236 -1048 -1345 -1432
4821a432M29K26M0k99l4R9J52J31J21K89k63l29M96p1K36P1l65K55N6K60l9k83
$$ -1432 -1003 -777 -737 -1036 -1070 -971 -819 -688 -567 -278 -541 -870 -374 -445 -209 -138 -503 -248 -192 68 29 -254
4843b54J13M34m53O3K31k4J76o4M6J0O03m63j35N6j08r7N32j51J45K1k10J77Q
$$ -254 -141 293 -160 -97 134 110 286 222 268 278 881 418 283 339 231 134 666 515 660 681 471 648 656
4866F56K86pk18l6K44j1k21L74r4J34j07o1J60K9p0J90j98J43J9K63k71j54K00
$$ 656 942 935 717 681 925 914 693 1067 973 1107 1000 939 1099 1128 1058 1248 1050 1193 1212 1475 1204 1050 1250
4889A250J31l06L64l01ML07ol41K08j3j43n24L34M81K00K7m57k72L48K31M9k57
$$ 1250 1381 1075 1439 1138 1142 1449 1443 1102 1310 1297 1154 630 964 1445 1645 1672 1215 943 1291 1522 1571 1314
4911A314K16k53l01L70O1J61K3m70j33K28L00L55l39m77K00j63K64L8K58q4k74
$$ 1314 1530 1277 976 1346 1407 1568 1591 1121 988 1216 1516 1871 1532 1055 1255 1092 1356 1394 1652 1568 1294
4932A294k26j4N33K77k77m02l43M23j57L58q6Pj87m36N15NM05m99l36l56J0M25
$$ 1294 1068 1054 1587 1864 1587 1185 842 1265 1108 1466 1380 1387 1200 764 1279 1284 1689 1190 854 498 508 933
4954I33L07Nl18j70n14L30M87J10j40l37q56L91L66M29k0o03l03k59M63J73R2
$$ 933 1240 1245 927 757 243 573 1060 1170 1030 693 -163 228 594 1023 1003 400 97 -162 301 474 566
4975E66J36o23m47n2N26N46m51m88j4m11N99L63m72n3n65l10L75K88L58j71p15
$$ 566 702 79 -368 -420 106 652 201 -287 -301 -712 -113 250 -222 -275 -840 -1150 -775 -487 -129 -300 -1015
4996a015k27L6J29N80j31m82n32J5K46L37L11m29l68j69j37M55K61N8m80o10L6
$$ -1015 -1242 -1206 -1077 -497 -628 -1110 -1642 -1627 -1381 -1044 -733 -1162 -1530 -1699 -1836 -1381 -1120 -1062 -1542 -2152 -2116
5017b116L69M81j88m1k47n74M22J74K77K4m55p48L36O17N3M01o17Q7n69K53L82
$$ -2116 -1747 -1266 -1454 -1495 -1742 -2316 -1894 -1720 -1443 -1419 -1874 -2622 -2286 -1669 -1616 -1215 -1832 -1745 -2314 -2061 -1679
5038a679M33j29l88m75j59P16O06k63k29n09m4O05K92ml0l44l1j93L56Q15l85
$$ -1679 -1246 -1375 -1763 -2238 -2397 -1681 -1075 -1338 -1567 -2076 -2120 -1515 -1223 -1227 -1257 -1601 -1632 -1825 -1469 -654 -1039
5059a039k63j49l06P69N4J60O7m73q0P2K41M31J34n11J26l06L97M88p3k77o3m7
$$ -1039 -1302 -1451 -1757 -988 -934 -774 -707 -1180 -1260 -1188 -947 -516 -382 -893 -767 -1073 -676 -188 -261 -538 -601 -648
5081f48J40M80l5J22l92k55L00K53P3M10k84n0j28L21q5J41O8j13J35n6q3O52
$$ -648 -508 -28 -63 59 -333 -588 -288 -35 38 448 164 114 -14 307 222 363 431 318 453 397 314 966
5103I66k78m59L52l6J42J8L81j7k11K03j5j57PK10M6m84L95PJ90K95n20l3L13
$$ 966 688 229 581 545 687 705 1086 1069 858 1061 1046 889 896 1106 1152 668 1063 1070 1260 1555 1035 1002 1315
5126A315j75j98K96j15N41l22q9k25L33K14j69q0l07K38J11m13L63K04j07l5j13
$$ 1315 1140 942 1238 1123 1664 1342 1253 1028 1361 1575 1406 1326 1019 1257 1368 955 1318 1522 1415 1380 1267
5147A267Q3J11j53N48o38j17J94j0Q3r1P0k8j03J6j72N62j31m51k2J20j10M74
$$ 1267 1350 1461 1308 1856 1218 1101 1295 1285 1368 1277 1347 1319 1216 1232 1060 1622 1491 1040 1018 1138 1028 1502
5169A502k55j00K41m29J80l51M90L24j39l14n06M38M4M62l49m57j39M00r0J99
$$ 1502 1247 1147 1388 959 1139 788 1278 1602 1463 1149 643 1081 1125 1587 1238 781 642 1042 952 1151
5189A151p2j41P0n94K35O9N68k34l21l57K96J16J13o2N4m31k56J75M38j79O8n11
$$ 1151 1079 938 1008 414 649 718 1286 1052 731 374 670 786 899 837 891 460 204 379 817 638 706 195
5211A95l27K39L77M6K3m55l97O65o82N64O5q7m17k41J50K45J60P6o05j46l15J76
$$ 195 -132 107 484 530 553 98 -299 366 -316 248 313 226 -191 -432 -282 -37 123 199 -406 -552 -867 -691
5233f91M92n7N7n22m70M42K39K10K7o67m30J78M32R5R1l93k27k77J40J98K05R
$$ -691 -199 -256 -199 -721 -1191 -749 -510 -300 -273 -940 -1370 -1192 -760 -665 -574 -967 -1194 -1471 -1331 -1133 -928 -919
5255i19o15j16J04K70L36l22k65j55l22L71J36K24o4m67k96J23J48P22p7o51k34
$$ -919 -1534 -1650 -1546 -1276 -940 -1262 -1527 -1682 -2004 -1633 -1497 -1273 -1337 -1804 -2100 -1977 -1829 -1107 -1184 -1835 -2069
5276b069J14M62J0j34qj72j71N6J90O76p40pj85L2M10J03k0r4l11O1K33K37K72
$$ -2069 -1955 -1493 -1483 -1617 -1625 -1797 -1968 -1912 -1722 -1046 -1786 -1793 -1978 -1946 -1536 -1433 -1453 -1547 -1858 -1797 -1564 -1327 -1055
5299a055l0n43j63K48N78N3j7n05j01M29K17K85k74k36l3j31N38L12J32l09j14
$$ -1055 -1085 -1628 -1791 -1543 -965 -912 -929 -1434 -1535 -1106 -889 -604 -878 -1114 -1147 -1278 -740 -428 -296 -605 -719
5320g19j74K83M44j63J71l58J5K11K69J30l00J26J48j70K57Q2L77l84k41L7K87
$$ -719 -893 -610 -166 -329 -158 -516 -501 -290 -21 109 -191 -65 83 -87 170 252 629 245 4 41 328
5341C28K05J39r1k6j12j42L18R4J68o9k55q3K46J68J18Mj32O3m9J61K70k12Lj88
$$ 328 533 672 581 555 443 301 619 713 881 812 557 474 720 888 1006 1010 878 941 892 1053 1323 1111 1114 926
5365I26O5K82PJ03j37k53J48J51pj43K42j98J11j13J34L42j88q6j16Q6j80N50
$$ 926 991 1273 1280 1383 1246 993 1141 1292 1285 1142 1384 1186 1297 1184 1318 1660 1472 1386 1270 1356 1176 1726
5387A726l47L5j75oP8K91k35J37l61j76L17J8J99R0n13j21J48M4J73n2K47l52
$$ 1726 1379 1414 1239 1233 1311 1602 1367 1504 1143 967 1284 1302 1501 1591 1078 957 1105 1149 1322 1270 1517 1165
5409A165o1K5o1M5j0k97J06j5R6J27K00m65o8J26j42J56L83n18M5k82M75k48K3
$$ 1165 1104 1129 1068 1113 1103 806 912 897 993 1120 1320 855 787 913 771 927 1310 792 837 555 1030 782 805
5432H05J19l84q6J63J05Q9L5j32j89j50K00k14P3J30r3j35p6K05PJ10p8j54l77
$$ 805 924 540 454 617 722 811 846 714 525 375 575 361 434 564 471 336 260 465 472 582 504 350 -27
5455b7J53J53K20k73m48J45N1M64q2l87r9n2j23J63J27k83K0j65L30j85k06M07
$$ -27 126 279 499 226 -222 -77 -26 438 356 -31 -130 -182 -305 -142 -15 -298 -278 -443 -113 -298 -504 -97
5477i7l69np0O7K48m30K77j95l26o4K00m28N67l27j09j35K8L50j64k2m04L35j98
$$ -97 -466 -471 -541 -474 -226 -656 -379 -574 -900 -964 -764 -1192 -625 -952 -1061 -1196 -1168 -818 -982 -1004 -1408 -1073 -1271
5500a271O1n2K07l63K92j03k57L98l87J95l36J1K7K17j7k67q2O4N36n44K7k62
$$ -1271 -1210 -1262 -1055 -1418 -1126 -1229 -1486 -1088 -1475 -1280 -1616 -1605 -1578 -1361 -1378 -1645 -1727 -1663 -1127 -1671 -1644 -1906
5522a906M26k00Q6J2R2J3m02L81j47M21n0m41k60K47L54L15n59L2K03o9M8j5L28
$$ -1906 -1480 -1680 -1594 -1582 -1490 -1477 -1879 -1498 -1645 -1224 -1274 -1715 -1975 -1728 -1374 -1059 -1618 -1586 -1383 -1452 -1404 -1419 -1091
5545a091n9k59M3L65j56k00K79k8K8N0p8O87k61p9n39L56J70K75J80l52k27J73
$$ -1091 -1150 -1409 -1366 -1001 -1157 -1357 -1078 -1106 -1078 -1028 -1106 -419 -680 -759 -1298 -942 -772 -497 -317 -669 -896 -723
5567g23J51k1N16K2j14j46%K17J49K34k8l73K55O7L59J08l94j96L69m21R28l52
$$ -723 -572 -593 -77 -55 -169 -315 -315 -98 51 285 257 -116 139 206 565 673 279 83 452 31 959 607
5589F07J05j20k46J12o3N95J18n9k86k40J64L35M8J1O6k06r3L03J45Q5k03l33
$$ 607 712 592 346 458 395 990 1108 1049 763 523 687 1022 1070 1081 1147 941 848 1151 1296 1381 1178 845
5611H45j37L71L17J73j51q3k53k4J96J50m3l3l04j37L52K99L35l99m7p65N20M35
$$ 845 708 1079 1396 1569 1418 1335 1082 1058 1254 1404 1361 1328 1024 887 1239 1538 1873 1474 1427 662 1182 1617
5633A617j67M27p63m8l56P73N3L70l73l58l75K93K77J38j76k14j19j36J92M47
$$ 1617 1450 1877 1114 1066 710 1483 1536 1906 1533 1175 800 1093 1370 1508 1332 1118 999 863 1055 1502
5653A502j08k64P9o70N2L20M14l52k09k62K31K4J12L15k69k93j50K83j9O87o41
$$ 1502 1394 1130 1209 539 591 911 1325 973 764 502 733 757 869 1184 915 622 472 755 736 1423 782
5674G82j01n90L76M05J07q1l30m55K37J56K26m6p6k69k50L07k21L67l73K68o19
$$ 782 681 91 467 872 979 898 568 113 350 506 732 686 610 341 91 398 177 544 171 439 -180
5695a80K48o3L36l56L47l40k71J38K59K00k13k11k80J74R2R1J24k85l9j61J78
$$ -180 68 5 341 -15 332 -8 -279 -141 118 318 105 -106 -386 -212 -120 -29 95 -190 -229 -390 -212
5716b12k70L88Q7l85m61R1L58N2l9k54j07NJ4k8J10J79l93p7l14M77Q6q0j50k99
$$ -212 -482 -94 -7 -392 -853 -762 -404 -352 -391 -645 -752 -747 -733 -761 -651 -472 -865 -942 -1256 -779 -693 -773 -923 -1222
5740a222j96L41K58qk76j23J88m32M35j8L52m82k81j17N00l85L32J9n64M69j42
$$ -1222 -1418 -1077 -819 -827 -1103 -1226 -1038 -1470 -1035 -1053 -701 -1183 -1464 -1581 -1081 -1466 -1134 -1115 -1679 -1210 -1352
5761a352l2r3R5k7ok61L63j06O8k52J32r5K70k03MJ11M2J14m14K77NL78l75K41
$$ -1352 -1384 -1477 -1382 -1409 -1415 -1676 -1313 -1419 -1351 -1603 -1471 -1566 -1296 -1499 -1495 -1384 -1342 -1228 -1642 -1365 -1360 -982 -1357 -1116
5785a116k20mq0J55J54r2K91M1l31L76k41K37L5p4r3P0k37J31L84q6o3j28J56
$$ -1116 -1336 -1340 -1420 -1265 -1111 -1203 -912 -871 -1202 -826 -1067 -830 -795 -869 -962 -892 -1129 -998 -614 -700 -763 -891 -735
5808g35K68K08j13k41j39O67m68M89j58j15m7R2J75J31L27j2l79l6L22r3L00M0
$$ -735 -467 -259 -372 -613 -752 -85 -553 -64 -222 -337 -384 -292 -117 14 341 329 -50 -86 236 143 443 483
5830D83N8j79j0J31J20J75n0j54j50K63K49K3j63O9k37L01j60K21J68J1k41k2
$$ 483 541 362 352 483 603 778 728 574 424 687 936 959 796 865 628 929 769 990 1158 1169 928 906
5852I06k2K64K6R3K06m10J91p9RK66m3j64Rk0L18J86k74K46o65N9P3N31K33m77
$$ 906 884 1148 1174 1267 1473 1063 1254 1175 1184 1450 1407 1243 1252 1232 1550 1736 1462 1708 1043 1102 1175 1706 1939 1462
5876A462j86j26L1O5L48O0m63M4k06N9N88j71k55k60m8J74j36L14J6k37j34K55
$$ 1462 1276 1150 1181 1246 1594 1654 1191 1235 1029 1088 1676 1505 1250 990 942 1116 980 1294 1310 1073 939 1194
5898A194o7m1K0n7l06M9K78m0j70J14l64N4j1j5K40m0J52k69l33J28K63K6j46
$$ 1194 1127 1086 1106 1049 743 792 1070 1030 860 974 610 664 653 638 878 838 990 721 388 516 779 805 659
5921F59l8m04K53j61K55m5l52k02L7M91L7j92m1J4n19L69pL02n8p5l34K48m63
$$ 659 621 217 470 309 564 519 167 -35 2 493 530 338 297 311 -208 161 154 456 398 323 -11 237 -226
5944b26K74l8L8m42k53M93l7J78l57l6L9j58J43n4K85j1k12l91N76k40J48j33
$$ -226 48 10 48 -394 -647 -154 -191 -13 -370 -406 -367 -525 -382 -436 -151 -162 -374 -765 -189 -429 -281 -414
5966d14l58j19O81k54m2K2kk62j68J76K80J46k99m0m94M27l30J21K13n05N5M77
$$ -414 -772 -891 -210 -464 -506 -484 -486 -748 -916 -740 -460 -314 -613 -653 -1147 -720 -1050 -929 -716 -1221 -1166 -689
5988f89l09J54k10K38l70J14r4M72l62j29l6k22K78L49j73j83l6j62J69k1L80
$$ -689 -998 -844 -1054 -816 -1186 -1072 -1166 -694 -1056 -1185 -1221 -1443 -1165 -816 -989 -1172 -1208 -1370 -1201 -1222 -842
6009h42o3n94L44j29N8J88m04K16j50j10L03j77O5k4J17k02L82l1J59qj74m87
$$ -842 -905 -1499 -1155 -1284 -1226 -1038 -1442 -1226 -1376 -1486 -1183 -1360 -1295 -1319 -1202 -1404 -1022 -1053 -894 -902 -1076 -1563
6031a563M35oL01j11k29L26l95K43J4K09k21k01o0O4N90J12j60Kk06K01l7J34
$$ -1563 -1128 -1134 -833 -944 -1173 -847 -1242 -999 -985 -776 -997 -1198 -1258 -1194 -604 -492 -652 -650 -856 -655 -692 -558
6053e58j92O76k88o0j09p0M04j97L4K93l70L05J80j08q9P1m2J56K75j22Q9j69
$$ -558 -750 -74 -362 -422 -531 -601 -197 -394 -360 -67 -437 -132 48 -60 -149 -78 -120 36 311 189 278 109
6075A09j57L40K23K90o32J43Q9j50K33K36J14n8p2j33J20J21K23o2l28K38Q2J23
$$ 109 -48 292 515 805 173 316 405 255 488 724 838 780 708 575 695 816 1039 977 649 887 969 1092
6097A092j54L66l41K27O7O5j65L63l2k44k93L07r9NJ63lm2L6j80L0K93k05J83
$$ 1092 938 1304 963 1190 1257 1322 1157 1520 1488 1244 951 1258 1159 1164 1327 1324 1282 1318 1138 1168 1461 1256 1439
6120A439l46K51R5K0j14P1k03p5L24j69J74j06j87K2k28L14q4L12j87j72j14J73
$$ 1439 1093 1344 1439 1459 1345 1416 1213 1138 1462 1293 1467 1361 1174 1196 968 1282 1198 1510 1323 1151 1037 1210
6142A210P4n81L15K13m81J39O0p0N7j58n2L21k78J16j42R8j29P2j59j37J47k51
$$ 1210 1284 703 1018 1231 750 889 949 879 936 778 726 1047 769 885 743 841 712 784 625 488 635 384
6164C84J3j6o7J95N9l77L98n81J46p8L4Q0J96l0m01O3j15Q5J51Q9n89K81O0J59
$$ 384 397 381 314 509 568 191 589 8 154 76 110 190 386 356 -45 18 -97 -12 139 228 -361 -80 -20 139
6188A39j18j08o7J09k23j78o8L52K91k98l12R1K6O2k43J76J39l50J76k88K14J19
$$ 139 21 -87 -154 -45 -268 -446 -514 -162 129 -169 -481 -390 -364 -302 -545 -369 -230 -580 -404 -692 -478 -359
6210c59k6J8l45k18L01L60l38l57L15K14m50J00N6K16m73k85J98M94K58o16J43
$$ -359 -385 -367 -712 -930 -629 -269 -607 -964 -649 -435 -885 -785 -729 -513 -986 -1271 -1073 -579 -321 -937 -794
6231g94j97j26M54l25K68L03l29k92l26K87N76m18k04m4J17j70L02J73m11J35
$$ -794 -991 -1117 -663 -988 -720 -417 -746 -1038 -1364 -1077 -501 -919 -1123 -1167 -1050 -1220 -918 -745 -1156 -1021
6251a021k70Q0K06J54J9j34o9l12L5M56l43J31m7j34K3P7Q5L46o2l36k20K75K99
$$ -1021 -1291 -1211 -1005 -851 -832 -966 -1035 -1347 -1312 -856 -1199 -1068 -1115 -1249 -1226 -1149 -1064 -718 -780 -1116 -1336 -1061 -762
6274g62k39L7k99J41n45O55L87j24k98o1k69M54N6L24k66n7l1J19J56L7P0j85
$$ -762 -1001 -964 -1263 -1122 -1667 -1012 -625 -749 -1047 -1108 -1377 -923 -867 -543 -809 -866 -897 -778 -622 -585 -515 -700
6296g00l24K04K89K77r0k2j92R5J56L66K26o85J33l5J6M61R9k69j6m16J30N94
$$ -700 -1024 -820 -531 -254 -344 -366 -558 -463 -307 59 285 -400 -267 -302 -286 175 274 5 -11 -427 -297 297
6318B97K23o7l28k79j6M50L68l9q2j98J09Jl5M25L16m66j13k12L57M15J06l75
$$ 297 520 453 125 -154 -170 280 648 609 527 329 438 439 404 829 1145 679 566 354 711 1126 1232 857
6340H57M0ok05L45q4K77K8n22K51P5J57L21n56J37j40r3N22j26K7j77k05L98l07
$$ 857 897 891 686 1031 947 1224 1252 730 981 1056 1213 1534 978 1115 975 882 1404 1278 1305 1128 923 1321 1014
6363A014L58J91k39k28J15M1o2J47J73j50l73L50j91j1Q4J7j01l56J91J95n6j3
$$ 1014 1372 1563 1324 1096 1211 1252 1190 1337 1510 1360 987 1337 1146 1135 1219 1236 1135 779 970 1165 1109 1096
6385A096j30o8J78P0k61K43q2j00j78o3K10m1K39n32J56o0N7k13K95r8k79o4j10
$$ 1096 966 898 1076 1146 885 1128 1046 946 768 705 915 874 1113 581 737 677 734 521 816 718 439 375 265
6408B65j3O3K70k73J62j14J73K3j52k50L24j08r9N4l40K00l52j05J5P8J54Lr0
$$ 265 252 315 585 312 474 360 533 556 404 154 478 370 271 325 -15 185 -167 -272 -257 -179 -25 -22 -112
6431a12J01k05J38L6k20J15n0q6j39q2J80k32O1k5J36k84K94k62O4L44k67j88
$$ -112 -11 -216 -78 -42 -262 -147 -197 -283 -422 -504 -324 -556 -495 -520 -384 -668 -374 -636 -572 -228 -495 -683
6453f83j71J17J89K26l79J12K2j60J0O9K5J60n3k91k65M03knl55L90k13o4L99
$$ -683 -854 -737 -548 -322 -701 -589 -567 -727 -717 -648 -623 -463 -516 -807 -1072 -669 -671 -676 -1031 -641 -854 -918 -519
6476e19l75K2k95K63k83M23J54j43j35j1j23K90J15r5j02K3p7P9ML32l59j74o4
$$ -519 -894 -872 -1167 -904 -1187 -764 -610 -753 -888 -899 -1022 -732 -617 -712 -814 -791 -868 -789 -785 -453 -812 -986 -1050
6499a050L8p5J72J0Q9lk62K29PJ21k49O1o2k45K93L01J29l45M9k32J1L46J40k97
$$ -1050 -1012 -1087 -915 -905 -816 -819 -1081 -852 -845 -724 -973 -912 -974 -1219 -926 -625 -496 -841 -792 -1024 -1013 -667 -527 -824
6523h24J22k24Kk0J28K33k12J71j19l2P5K44k69j77J27l10Q18l03K80p6l90K40
$$ -824 -702 -926 -924 -944 -816 -583 -795 -624 -743 -775 -700 -456 -725 -902 -775 -1085 -267 -570 -290 -366 -756 -516
6545e16K41J35N8m98j52K92j06N34j30J33j8j13J76l55M48J31k92J54r0J52J30
$$ -516 -275 -140 -82 -580 -732 -440 -546 -12 -142 -9 -27 -140 36 -319 129 260 -32 122 32 184 314
6566C14l0j8m4J30j92K00L12j27l3j90J38J35KJ28J97o61J35K65J49k18K01n1
$$ 314 284 266 222 352 160 360 672 545 512 322 460 595 597 725 922 261 396 661 810 592 793 742
6588G42J12k4J43r3L59l88P1K43k47L91j23k10J12Km0M4M30l30J22j77j38P12
$$ 742 854 830 973 880 1239 851 922 1165 918 1309 1186 976 1088 1090 1050 1094 1524 1194 1316 1139 1001 1713
6610A713n04o4Q4j66l6k0N10m28p4K35l20K71o7K52K5k29k85L29k70M55k32l31
$$ 1713 1209 1145 1229 1063 1027 1007 1517 1089 1015 1250 930 1201 1134 1386 1411 1182 897 1226 956 1411 1179 848
6632H48Q6j01j3J24r8J82k22j22J47m3n6L82m06k62M45k79J36o7k28O1j82M5J00
$$ 848 934 833 820 944 846 1028 806 684 831 788 732 1114 708 446 891 612 748 681 453 514 332 377 477
6655D77O4j16j75L6m6L82k72M0k56k3L2o8j50K71r4m20L40P6P8Mj58m22J60o4
$$ 477 541 425 250 286 240 622 350 390 134 111 143 75 -75 196 102 -318 22 98 176 180 22 -400 -240 -304
6679c04L4N0J67m34P3q5l48O10j77J0k47k08K43M22J04m35k10L8m6J68j17o2P3
$$ -304 -270 -220 -53 -487 -414 -499 -847 -237 -414 -404 -651 -859 -616 -194 -90 -525 -735 -697 -743 -575 -692 -754 -681
6702f81l6l49L44o6K58k37K04k81NJ8rJ16Q3n26K44L69k67K85m28p5n0P5J46K57
$$ -681 -717 -1066 -722 -788 -530 -767 -563 -844 -839 -821 -830 -714 -631 -1157 -913 -544 -811 -526 -954 -1029 -1079 -1004 -858 -601
6726f01J08l64o9k38M80J33N7k78j08j9J37l2J39j46m49M41o5j47J73J15J2l12
$$ -601 -493 -857 -926 -1164 -684 -551 -494 -772 -880 -899 -762 -794 -655 -801 -1250 -809 -874 -1021 -848 -733 -721 -1033
6748a033j8J7N37r9j81j45j80K51J42j68J07J51k29L5q9L7n0L05k02K48l25K20
$$ -1033 -1051 -1034 -497 -596 -777 -922 -1102 -851 -709 -877 -770 -619 -848 -813 -902 -865 -915 -610 -812 -564 -889 -669
6770f69m5J05J42m14K89J26n0K7J83l14J38P9J61l9LJ1j27rj09J83J5k22K67n
$$ -669 -714 -609 -467 -881 -592 -466 -516 -489 -306 -620 -482 -403 -242 -281 -278 -267 -394 -403 -512 -329 -314 -536 -269 -274
6794b74j91L51N5k2J56n80N17j39L48l04K0K44k43j09J65R2J22j24q9P9K21L45
$$ -274 -465 -114 -59 -81 75 -505 12 -127 221 -83 -63 181 -62 -171 -6 86 208 84 -5 74 295 640
6816F40q2j82J00MN1Pk2O2K57nM9j36j7j57L91o10K26R1%L7L33k0k00j24J90J15
$$ 640 558 376 476 480 531 538 516 578 835 830 879 743 726 569 960 350 576 667 667 704 1037 1017 817 693 883 998
6842I98J21J60m07J81M3K0j20qK53P7k61j96J60K22k1l18J67p8L23l2k69L04j69
$$ 998 1119 1279 872 1053 1096 1116 996 988 1241 1318 1057 861 1021 1243 1222 904 1071 993 1316 1284 1015 1319 1150
6865A150k28p8N9K66O8J11l66j01K40p8J76k92L2k25Q9j38nK18l56K13k2r0J71
$$ 1150 922 844 903 1169 1237 1348 982 881 1121 1043 1219 927 959 734 823 685 680 898 542 755 733 643 814
6888H14J77m02j2Pj60M98k20n2k4k46p1N1J43K63l18Q9n43P6J08o2J40J79k49
$$ 814 991 589 577 584 424 922 702 650 626 380 309 360 503 766 448 537 -6 70 178 116 256 435 186
6911A86k1j53J7k15O05n09k85K14J08o7K73m11k40K32K7J01k34Nl54J62J6M87
$$ 186 165 12 29 -186 419 -90 -375 -161 -53 -120 153 -258 -498 -266 -239 -138 -372 -367 -721 -559 -543 -56
6933e6o5j60j51m35J08N18j25J15m03j27j84K51J51R1J6j73k41q8M51j04J06m24
$$ -56 -121 -281 -432 -867 -759 -241 -366 -251 -654 -781 -965 -714 -563 -472 -456 -629 -870 -958 -507 -611 -505 -929
6955i29L3j66K96J22j6N77o62l73J14J39M65M6o57r2L8J21J67L71l49Mk93J35
$$ -929 -896 -1062 -766 -644 -660 -83 -745 -1118 -1004 -865 -400 -354 -1011 -1103 -1065 -944 -777 -406 -755 -751 -1044 -909
6977i09K00P2J20Mm82K34J11n32P88k61r7J1j46J33M37k76k4k49j30K11j91M42
$$ -909 -709 -637 -517 -513 -995 -761 -650 -1182 -394 -655 -752 -741 -887 -754 -317 -593 -617 -866 -996 -785 -976 -534
6999e34l39J28k09L01k06K29J0J09l11J6J20L42k75J3j84l9K04K62j36q9p4L7
$$ -534 -873 -745 -954 -653 -859 -630 -620 -511 -822 -806 -686 -344 -619 -606 -790 -829 -625 -363 -499 -588 -662 -625
7021f25r3L90k34L20j12j82O6k3O7J42L1k40p1Q9J84j60K09J46j04j29M2O2J53
$$ -625 -718 -328 -562 -242 -354 -536 -470 -493 -426 -284 -253 -493 -564 -475 -291 -451 -242 -96 -200 -329 -287 -225 -72
7044g2J42j84qq5L29j19J70o3P1j11J91J64l32K36j11N2n2N9L3J56k01J40j97
$$ -72 70 -114 -122 -207 122 3 173 110 181 70 261 425 93 329 218 270 218 277 310 466 265 405 208
7067B08M47l43K01K37m71N3K11j07L11j00J43J1j2j88J01m6J56Qj6j81K64j47
$$ 208 655 312 513 750 279 332 543 436 747 647 790 801 789 601 702 656 812 820 804 623 887 740
7089G40K74j74J38l34K87P0k14L51k40j42J87R2k9k4J81k13k2R6J33j03oj1k62
$$ 740 1014 840 978 644 931 1001 787 1138 898 756 943 1035 1006 982 1163 950 928 1024 1157 1054 1048 1037 775
7112G75M26j58j00J68j84j94K60q5J6j66M10j62P2N1l74K37p7j69O0M9k41m0J2
$$ 775 1201 1043 943 1111 927 733 993 908 924 758 1168 1006 1078 1129 755 992 915 746 806 855 614 574 586
7135E86J22K56j69k85J16k92k07M33j0N8j86m49N73Kj60j77j27j18L69j72r2K24
$$ 586 708 964 795 510 626 334 127 560 550 608 422 -27 546 548 388 211 84 -34 335 163 71 295
7157B95m27M6L93l59J09j05l55J05M00k87P8m01P3q0K36j15j04K2L58m23k62K88
$$ 295 -132 -86 307 -52 57 -48 -403 -298 102 -185 -107 -508 -435 -515 -279 -394 -498 -476 -118 -541 -803 -515
7179e15k4JK66l37n4Rk83N69n1J47m77j66L6L01L0n5m79L98p0J12j28OJ8K7r1
$$ -515 -539 -538 -272 -609 -663 -654 -937 -368 -419 -272 -749 -915 -879 -578 -548 -603 -1082 -684 -754 -642 -770 -764 -746 -719 -810
7204h10k01M98k59M8m0l2Lj4k75m1L52n7J76k23P8o9J49R2k74J13J08Oll0M2j52
$$ -810 -1011 -513 -772 -724 -764 -796 -793 -807 -1082 -1123 -771 -828 -652 -875 -797 -866 -717 -625 -899 -786 -678 -672 -675 -705 -663 -815
7230h15K14j71N9k40J44J97k47J00L30k41k81l5K75L08j83J06j45L80m26q7P2
$$ -815 -601 -772 -713 -953 -809 -612 -859 -759 -429 -670 -951 -986 -711 -403 -586 -480 -625 -245 -671 -758 -686
7251f86R5j54K18k53K49L58j4l22K36N3J5o8Lj91L22k25ll6R9J34k52r5K21J07
$$ -686 -591 -745 -527 -780 -531 -173 -187 -509 -273 -220 -205 -273 -270 -461 -139 -364 -367 -403 -304 -170 -422 -517 -296 -189
7275a89Q5J43k71j47p3Q3J15J50j94J90L01k29l27M10J19k26K76k95K16J28k07
$$ -189 -104 39 -232 -379 -452 -369 -254 -104 -298 -108 193 -36 -363 47 166 -60 216 -79 137 265 58
7296E8nJ13k9o1j56K68J85j49j29K07K78k62K54k80p8M03l29K62n2j04L27m44
$$ 58 53 166 137 76 -80 188 373 224 95 302 580 318 572 292 214 617 288 550 498 394 721 277
7318B77J08L1M52Ok37k20J52L79j42J3k2q5M8M8m6K47J08J3l10k02J00M23j56
$$ 277 385 416 868 874 637 417 569 948 806 819 797 712 760 808 762 1009 1117 1130 820 618 718 1141 985
7341I85M00n70k9Np0J06M31j23l53k73L95M37m16J38r2j89q7K95J3r4j51j09J76
$$ 985 1385 815 786 791 721 827 1258 1135 782 509 904 1341 925 1063 971 782 695 990 1003 909 758 649 825
7364H25Q8n1Q1j84j10J72K19j97j36K1R7j83J91k94O29l79k18p7k26J96Rj77K33
$$ 825 913 862 943 759 649 821 1040 843 707 728 825 642 833 539 1168 789 571 494 268 464 473 296 529
7387E29J5k01J56j36o3K91k68K8Q9j93j6R8j45k62o8P6J3J3M0J6l50K05k31L93
$$ 529 544 343 499 363 300 591 323 351 440 247 231 329 184 -78 -146 -70 -57 -44 -4 12 -338 -133 -364 29
7411B9L8l14k63P3N2K15r5O8j43k80J29l65M99n4k09n9j6L6K63R8k50n0k08J29
$$ 29 67 -247 -510 -437 -385 -170 -265 -197 -340 -620 -491 -856 -357 -411 -620 -679 -695 -659 -396 -298 -548 -598 -806 -677
7435f77N7j62J15j17N0Q5m88M36Q8k90J21l32J15K48kRJ23k64k1p9J25q4J80P1
$$ -677 -620 -782 -667 -784 -734 -649 -1137 -701 -613 -903 -782 -1114 -999 -751 -753 -744 -621 -885 -906 -985 -860 -944 -764 -693
7459f93q7l28M28NP0o34J55M45j76l4J39l03K53L6j99L9O6l31P06l34n1M3N08
$$ -693 -780 -1108 -680 -675 -605 -1239 -1084 -639 -815 -849 -710 -1013 -760 -724 -923 -884 -818 -1149 -443 -777 -828 -785 -277
7482b77m07q6J86O9k86J38K49l04L23m93J08K19L29j3M9j80J3l7o7J05q0R4Q0
$$ -277 -684 -770 -584 -515 -801 -663 -414 -718 -395 -888 -780 -561 -232 -245 -196 -376 -363 -400 -467 -362 -442 -348 -268
7505b68n7N6J33r8k30K91k11K36n7r3K52j3k21L7J12j25K41j54j47nK90m9K92
$$ -268 -325 -269 -136 -234 -464 -173 -384 -148 -205 -298 -46 -59 -280 -243 -131 -256 -15 -169 -316 -321 -31 -80 212
7528B12j94L64l58j84l5L99J12k39j8Q5j01l0K82j20K6M6qO6J70J53l76P6j87
$$ 212 18 382 24 -160 -195 204 316 77 59 144 43 13 295 175 201 247 239 305 475 628 252 328 141
7551A41J09K41k42J88o1P2n2j38J21o6K32J10l16k6M24J30l05J3L46m3l20m2K36
$$ 141 250 491 249 437 376 448 396 258 379 313 545 655 339 313 737 867 562 575 921 878 558 516 752
7574G52M0j08j80q5K06J04J03M6j75k80j4N42k06M6p3J2J45j64J39K7O2m41L49
$$ 752 792 684 504 419 625 729 832 878 703 423 409 951 745 791 718 730 875 711 850 877 939 498 847
7597H47J9N3J21l22j48J67k30L19K60j82P7l78j90N71l68J10j17K02j5k98n6N15
$$ 847 866 919 1040 718 570 737 507 826 1086 904 981 603 413 984 616 726 609 811 796 498 442 957
7619I57k6j37n87R9K75Q9O7K0j22j34rr8L90o5j64m35L02j52k22K03o0K5l6J0
$$ 957 931 794 207 306 581 670 737 757 635 501 492 394 784 719 555 120 422 270 48 251 191 216 180 190
7643A90R7j44J51l0k44j25R7j5LJ7k09l04L47M8l7rJ9l09K55L6j97NQJ21n17K96
$$ 190 287 143 294 264 20 -105 -8 -23 -20 -3 -212 -516 -169 -121 -158 -167 -148 -457 -202 -166 -363 -358 -350 -229 -746 -450
7669d50K25m1J05k58j93q0j78J04M70k90l12L13Q7j65k7R5l47N5k8O9l1K42j32
$$ -450 -225 -266 -161 -419 -612 -692 -870 -766 -296 -586 -898 -585 -498 -663 -690 -595 -942 -887 -915 -846 -877 -635 -767
7692g67k98jK04J67m1j12K38r6j93r5M15k69j24J09qR0J76k85Q7j7L6K25k35j8
$$ -767 -1065 -1066 -862 -695 -736 -848 -610 -706 -899 -994 -579 -848 -972 -863 -871 -781 -605 -890 -803 -820 -784 -559 -794 -812
7716h12O9q1M9j55L11rj48J13p0k0j74J83L26J09j34k13o3M76j72l2k93L18j92
$$ -812 -743 -824 -775 -930 -619 -628 -776 -663 -733 -753 -927 -744 -418 -309 -443 -656 -719 -243 -415 -447 -740 -422 -614
7739f14L41l45K37J57q4q6L6k18J96K23j05n4O9M4K15j54J0j11p2K14J01k20k3
$$ -614 -273 -618 -381 -224 -308 -394 -358 -576 -380 -157 -262 -316 -247 -203 12 -142 -132 -243 -315 -101 0 -220 -243
7762b43j14K89k3J74j36l9L62l22J94j6J96l28J48j78J39J03k66P7K07J71k84
$$ -243 -357 -68 -91 83 -53 -92 270 -52 142 126 322 -6 142 -36 103 206 -60 17 224 395 111
7783A11m2L75l11J45k6k8L93p03K76R9n9J31n5k0J63J29j57p9J97r6j69L04k06
$$ 111 69 444 133 278 252 224 617 -86 190 289 230 361 306 286 449 578 421 342 539 443 274 578 372
7806C72k5k4L24j73k9J87k39K59O2p0%l60L33K55j48j2K5k05J80N4j27r5Q4l2
$$ 372 347 323 647 474 445 632 393 652 714 644 644 284 617 872 724 712 737 532 712 766 639 544 628 596
7830E96L2K41r6J15p4j12k65L74J9j15K89k58j01o3J25l2J40k05J92Ok29J82j12
$$ 596 628 869 773 888 814 702 437 811 830 715 1004 746 645 582 707 675 815 610 802 808 579 761 649
7853F49j44K56L2k54J72J63k44K1j57L7J83k04J30m9j74L53o5l50M8K57l29R3
$$ 649 505 761 793 539 711 874 630 651 494 531 714 510 640 591 417 770 705 355 403 660 331 424
7875D24N24l71l65J47k21L00k73K35k64Q8J34l48l6L50o5j55l19L63q9K35l12
$$ 424 948 577 212 359 138 438 165 400 136 224 358 10 -26 324 259 104 -215 148 59 294 -18
7896a8R5J98m83K16m67M99l64jR6m0j36M9J61J8Jj66J39l79L5N3K75k48k34M4
$$ -18 77 275 -208 8 -459 40 -324 -325 -229 -269 -405 -356 -195 -177 -176 -342 -203 -582 -547 -494 -219 -467 -701 -657
7920f57J08k17L16l5n7k45j61J12K38J3J40m82q8j00M93Qj49P0l30MM12j98k1
$$ -657 -549 -766 -450 -485 -542 -787 -948 -836 -598 -585 -445 -927 -1015 -1115 -622 -614 -763 -693 -1023 -1019 -607 -805 -826
7943h26M7j43Q4J53k03L44j68j12r8O8J56J1j18N3K8J3L2L4K11k65l23L61j0K08
$$ -826 -779 -922 -838 -685 -888 -544 -712 -824 -922 -854 -698 -687 -805 -752 -724 -711 -679 -645 -434 -699 -1022 -661 -671 -463
7967d63k23n3L63kk12k3K68j65J2m28K14K91K42J83l75N7J9j97Q2J72K02l35J80
$$ -463 -686 -739 -376 -378 -590 -613 -345 -510 -498 -926 -712 -421 -179 4 -371 -314 -295 -492 -410 -238 -36 -371 -191
7990a91j80K29R4n8J3k43J3M1O9K33L4m11J05j2K25J39o5J09r8n46M73mJ14J14
$$ -191 -371 -142 -48 -106 -93 -336 -323 -282 -213 20 54 -357 -252 -264 -39 100 35 144 46 -500 -27 -31 83 197
8014A97j95j9O9Q0R3l8J88q8j88m9J80J6j74J41k80K93L69j34l28j97K47K22j95
$$ 197 2 -17 52 132 225 187 375 287 99 50 230 246 72 213 -67 226 595 461 133 -64 183 405 210
8037B10K63p3j46J62k75L2N22j3r4k25k97L24K33j62J40J70k52r7Q6o4K95J76
$$ 210 473 400 254 416 141 173 695 682 588 363 66 390 623 461 601 771 519 422 508 444 739 915
8059I15m96MQ3K3j9J33P8k56K76M2m50L06P4l0r5J10j14P5J3lj16N5O7l63K14
$$ 915 419 423 506 529 510 643 721 465 741 783 333 639 713 683 588 698 584 659 672 669 553 608 675 312 526
8084E26L48j95r2J12M2j70N8M0q0J97k0j90r0K31k91J80l25K63Q0p0K3q6k17L38
$$ 526 874 679 587 699 741 571 629 669 589 786 766 576 486 717 426 606 281 544 624 554 577 491 274 612
8108F12k89q1L73N8J60k95j89J20P0J12m75J65M2Nj10J10j05j78J20k2L67p9p8
$$ 612 323 242 615 673 833 538 349 469 539 651 176 341 383 388 278 388 283 105 225 203 570 491 413
8131D13p4q6K21o43K72l4J15j27o1R5j78L86j99l04k8K77j46O4o3k64O9m1O8J78
$$ 413 339 253 474 -169 103 69 184 57 -4 91 -87 299 100 -204 -232 45 -101 -37 -100 -364 -295 -336 -268 -90
8155i0p8j75M16m87j73J94p3r5P9k4k26K0K27k48k3J60j71l5J05J53O2k02J03
$$ -90 -168 -343 73 -414 -587 -393 -466 -561 -482 -506 -732 -712 -485 -733 -756 -596 -767 -802 -697 -544 -482 -684 -581
8178e81j58k12J34K09j19q9q0K15k16N36l91p5K25
$$ -581 -739 -951 -817 -608 -727 -816 -896 -681 -897 -361 -752 -827 -602
8191f02
$$ Imaginary data points
##PAGE= N=2
##DATA TABLE= (X++(I..I)), XYDATA
0@%%%%%%%Qj6J6j6K4l2L2m0N1n9P2q6J00j18J36j53J77k06K33k63L01l42L84m32
$$ 0 0 0 0 0 0 0 0 8 -8 8 -8 16 -16 16 -24 27 -32 40 -46 54 -64 72 -81 96 -110 123 -140 161 -181 203 -229
31b29M86n46O11o80P56q41R34j035J146j269J404j553J720j907K117k354K624
$$ -229 257 -289 322 -358 398 -443 491 -544 602 -667 737 -816 904 -1003 1114 -1240 1384
48A384k935L298l729M248m891N709o784Q272j0476J4060k0850L8033j54315l23501
$$ 1384 -1551 1747 -1982 2266 -2625 3084 -3700 4572 -5904 8156 -12694 25339 -128976 -452477
62d52477M15534L18180k42573k45974J95067J18505k18105q8538K54297R8710
$$ -452477 -36943 281237 38664 -207310 -12243 106262 -111843 -200381 53916 152626
72A52626k13696j01158J50164L7959j10452M8963J55478q5908k25749K7706K36264
$$ 152626 -61070 -162228 -12064 25895 -84557 -35594 119884 33976 -191773 -164067 72197
83G2197M9633j64500o9592Q5759J5878p5116J6282J02473l392j10649l1078P3667
$$ 72197 121830 -42670 -112262 -26503 -10625 -85741 -69459 33014 29622 -81027 -112105 -38438
95c8438K8270l6015J6243M5183n6107r2107M6968J30822N628j04674k7216N3453
$$ -38438 -10168 -46183 -29940 15243 -40864 -132971 -86003 44819 50447 -54227 -81443 -27990
107b7990k037k9095M8160M9144n9772o8176M0359N3346k7273j4534M5309j5179
$$ -27990 -30027 -59122 -10962 38182 -21590 -89766 -49407 3939 -23334 -37868 7441 -7738
119g738q7201K244J05351L1414p4169l2516L1264r811k4545N2568N7615m6143
$$ -7738 -94939 -92695 12656 44070 -30099 -62615 -31351 -41162 -65707 -13139 44476 -1667
131a667o7441K5594M8798k0892j9929M5212K0236o1840l8962N7901O0506k5588
$$ -1667 -69108 -43514 5284 -15608 -35537 9675 29911 -31929 -70891 -12990 47516 21928
143B1928n6313q838K1844J1158J0051J6865p191l6036j5660K7957K4068j3528
$$ 21928 -34385 -43223 -21379 -10221 -170 16695 9504 -26532 -42192 -14235 9833 -3695
155c695r766K2551N727m1369j6445N5299M2052m6538n5228K9708N5462j0900l7474
$$ -3695 -13461 9090 14817 -26552 -42997 12302 54354 7816 -47412 -17704 37758 26858 -10616
168a0616O797J9884j2505p796J8471P8k2317R477K7891j7943l7379J9346M5767
$$ -10616 -3819 16065 3560 -4236 14235 14313 -8004 1473 29364 11421 -25958 -6612 39155
181C9155j2127m5635M578L8095K081k3771M10J6248j270p605K508j147o370J1147
$$ 39155 27028 -18607 -14029 24066 26147 2376 2786 19034 17764 10159 12667 11520 5150 16297
195A6297J8660q663k6115P23K6142L629k6305p588K9523J8833k7226k9429J5414
$$ 16297 34957 26294 179 902 27044 30673 4368 -3220 26303 45136 17910 -11519 3895
208C895L0983p023k3104Q537J8215j4478j4407K3049J6786k8021j8586K8294J7295
$$ 3895 34878 27855 4751 13288 31503 17025 2618 25667 42453 14432 -4154 24140 41435
221D1435k6507n128L6203k790n2277n133N5563J7776l9638j2658K1503j1635k2504
$$ 41435 14928 9800 46003 43213 -9064 -14197 41366 59142 19504 6846 28349 16714 -5790
234e790L1410L8458l1604m7221J9126L8979j3645k0302K3339J3080l5941k0616
$$ -5790 25620 64078 32474 -14747 4379 43358 29713 9411 32750 45830 9889 -10727
246a0727L4533K7942j6351j7334J497r909q987K8200L2354k3356m9224k336L8706
$$ -10727 23806 51748 35397 18063 19560 9651 664 28864 61218 37862 -11362 -13698 25008
259B5008J5953j5569q288N168q008j7491L963K5524J5018j2763k3063j0992N743
$$ 25008 40961 25392 17104 22272 14264 -3227 736 26260 41278 28515 5452 -5540 203
272B03J8371J8417k862k9158k2661J6650L1920J095k4034p996P333p662j0019
$$ 203 18574 36991 34129 4971 -17690 -1040 30880 31975 7941 -55 7278 -384 -10403
285a0403J9865K3268j5299l1991m632J4378M492P753J5541j1660l8057o333L6849
$$ -10403 9462 32730 17431 -14560 -19192 -4814 -322 7431 22972 11312 -26745 -33078 3771
298C771J7712k1273j1258J0338o574j8815J3223L0466o329l2898q117J4484M946
$$ 3771 21483 210 -11048 -710 -7284 -26099 -12876 17590 11261 -21637 -29754 -15270 -10324
311a0324J632J1348k989l0291j4315K3811K2823o029j2598k338q903j1226J1971
$$ -10324 -8692 2656 -333 -30624 -44939 -21128 1695 -4334 -16932 -19270 -28173 -39399 -27428
324b7428K6847K128k3302j5128M239P556P788J2400m58k4253j8935J5452K8259
$$ -27428 -581 1547 -21755 -36883 -32644 -25088 -17300 -4900 -5358 -29611 -48546 -33094 -4835
337d835K463k1644j2404L900M436K180Q531P264j0783j9465k689J5800J4396J505
$$ -4835 -2372 -24016 -36420 -32520 -28084 -25904 -17373 -10109 -20892 -40357 -43046 -27246 -12850 -11345
351a1345o165j1814j1926N293K3042J1882j4867j8044K283J2412L379j089K825
$$ -11345 -17510 -29324 -41250 -35957 -12915 -1033 -15900 -33944 -31661 -19249 -15870 -16959 -14134
364a4134j574r884l879J0375R774j140p453m996l168J237J1685J1675l009j5830
$$ -14134 -15708 -25592 -29471 -19096 -9322 -10462 -17915 -22911 -26079 -24842 -13157 -1482 -4491 -20321
378b0321r591N857J5164R528k740r230p533K90Q020R671L545o036q790k585M688
$$ -20321 -29912 -24055 -8891 637 -2103 -11333 -18866 -18576 -10556 -885 2660 -3376 -12166 -14751 -10063
393a0063Q495O926q0j2233j3280M839J9353J1226r669j4360l704L194O493J0769
$$ -10063 -1568 5358 5278 -6955 -20235 -15396 3957 15183 5514 -8846 -12550 -9356 -2863 7906
407G906Q202p634j6843n192J0836J3163O059j697r578j2739j428J5610J6550k379
$$ 7906 16108 8474 -8369 -13561 -2725 10438 16497 14800 5222 -7517 -8945 6665 23215 20836
421B0836j6408j1167L257J0934R685K436n855j2062r907M261J8516J5599m545
$$ 20836 4428 -6739 -3482 7452 17137 19573 13718 1656 -8251 -3990 14526 30125 25580
434B5580k1948j5577N411K0039J7029o04j7214j7674L08J5854J4145K160o820
$$ 25580 3632 -11945 -6534 13505 30534 29930 12716 -4958 -4650 11204 25349 27509 20689
447B0689j3774j2556N652K3258J2231j3589j9320l020N015N618J2025J1821j2004
$$ 20689 6915 -5641 11 23269 35500 21911 2591 -429 4586 10204 22229 34050 22046
460B2046k6915m797K2780J7440l343q600n394r512k673J5298J6934m423j4490
$$ 22046 -4869 -9666 13114 30554 27211 18611 13217 3705 1032 16330 33264 28841 14351
473A4351n837k192j449J1825J9765k508k7834j5844J5009J9776L088o635o130
$$ 14351 8514 6322 4873 16698 36463 33955 6121 -9723 5286 25062 28150 21515 15385
486A5385j0330p499J0838K0685M566j5753j4910j526N615J0427J4763K502k0439
$$ 15385 5055 -2444 8394 29079 33645 17892 2982 1456 7071 17498 32261 34763 14324
499A4324k2204M579K4689J1250j0222r582k407o145l948J2663J6445o794k0601
$$ 14324 -7880 -3301 21388 32638 22416 12834 10427 4282 334 12997 29442 22648 2047
512B047o463R544O673K457O459k909k0977j1666J8634K2823l230j7400m820L88
$$ 2047 -4416 5128 11801 14258 20717 17808 -3169 -14835 3799 26622 23392 5992 1172 1560
526A560l946N098J5895L732j7578j3473L856P259L629O389k05j7574j4077J1550
$$ 1560 -2386 2712 18607 22339 4761 -8712 -4856 2403 6032 12421 12216 -5358 -19435 -7885
540g885J9137j459j5321l742M257l436j632R709O387j0016j0900L296O638n0L06
$$ -7885 11252 9793 -5528 -9270 -5013 -8449 -10081 -372 6015 -4001 -14901 -11605 -4967 -5017 -4711
555d711L591m327j1259j012J1291M558p323l297K855m235q850M107J2692l06j2556
$$ -4711 -1120 -5447 -16706 -17718 -6427 -1869 -9192 -12489 -9634 -13869 -22719 -18612 -5920 -6226 -18782
570a8782m218N898J665l778J873M358l428m811J932L220j801J105N261m167j0849
$$ -18782 -23000 -17102 -15437 -19215 -17342 -12984 -16412 -21223 -19291 -16071 -17872 -16767 -11506 -15673 -26522
585b6522L243J4732L75j4428k472J1726Q41j3298q87J3330M291r170n930N05O23
$$ -26522 -23279 -8547 -8172 -22600 -25072 -13346 -12505 -25803 -26690 -13360 -9069 -18239 -24169 -23664 -23041
600b3041L656P898k64j0611l497Q935K522n122L031J0048l562j4265j675J4459
$$ -23041 -19385 -11487 -11751 -22362 -25859 -16924 -14402 -19524 -16493 -6445 -10007 -24272 -25947 -11488
614a1488R311n067q015l300J237N300N502p5m452j677l00l339R69J1532Q184r588
$$ -11488 -2177 -7244 -15259 -18559 -17322 -12022 -6520 -6595 -11047 -12724 -13024 -16363 -15394 -3862 4322 -5266
630e266j5368p44J3523R354N6l836n381m971J61Q058Q637L547m720j0701o578
$$ -5266 -20634 -21378 -7855 1499 1555 -2281 -7662 -12633 -12472 -4414 4223 7770 3050 -7651 -14229
645a4229O802J5499P383r433j4268m030Q139J1084N401k694p350q879l490P153
$$ -14229 -7427 8072 15455 6022 -8246 -12276 -4137 6947 12348 9654 2304 -6575 -10065 -2912
659b912J5213Q112q287j6832p424Q878J5133Q624l320j2570j0526K005J2461R857
$$ -2912 12301 20413 12126 -4706 -12130 -3252 11881 20505 17185 4615 -5911 -3906 8555 18412
673A8412Q77n558j0272r455L136J7233J3354p040j7371q810M130J0571J1663L306
$$ 18412 19289 13731 3459 -5996 -2860 14373 27727 20687 3316 -5494 -1364 9207 20870 24176
687B4176j1711j4920j744J1461R519M850N43j1093j8008j037K2734J8368p814
$$ 24176 12465 -2455 -4199 7262 16781 21631 22174 11081 -6927 -7964 14770 33138 25324
700B5324j7938p012J19L754J3432J3230p727k1877p437J0900J1436N942K249q557
$$ 25324 7386 374 493 4247 17679 30909 23182 1305 -6132 4768 16204 22146 24395 15838
714A5838k0544o247K2038K1759n148j8926q772K71L225J1062J4003k131j8832
$$ 15838 -4706 -10953 11085 32844 27696 8770 -2 269 3494 14556 28559 26428 7596
727G596j2683M203J2773J0335N196r162j9986p373J6338J8294j611j2077o288
$$ 7596 -5087 -884 11889 22224 27420 18258 -1728 -9101 7237 25531 23920 11843 5555
740E555l099l113P177J5996M450j5868j6036O80J1431J0406N221n137j5160j0807
$$ 5555 2456 -657 6520 22516 26966 11098 -4938 -4258 7173 17579 22800 17663 2503 -8304
754h304Q472J6940M433q390p355m225m798K539J5554J0028j1377j9929l493J1397
$$ -8304 168 17108 21541 13151 5796 1571 -3227 -688 14866 24894 13517 -6412 -9905 1492
768A492J0830L252l789r473r940K128J1858O673m516n674m011n916j04J2418J1714
$$ 1492 12322 15574 11785 2312 -7628 -5500 6358 13031 8515 2841 -1170 -7086 -7190 5228 16942
783A6942p384j8889n424J0140R322J560k899m273p503l762N093Q653L092m710
$$ 16942 9558 -9331 -14755 -4615 4707 6267 3368 -905 -8408 -12170 -7077 1576 4668 -42
797d2q674o218K850J0610N895o210j0822l711M841O405J994r69m002n931k674
$$ -42 -8716 -14934 -12084 -1474 4421 -1789 -12611 -16322 -11481 -5076 -3082 -4051 -8053 -13984 -16658
812a6658L403O707L492m596q155l286M462O633R85m632m655j124K993K495K77
$$ -16658 -13255 -6548 -3056 -7652 -15807 -19093 -14631 -7998 -7013 -11645 -16300 -17424 -14431 -11936 -11659
827a1659j751m7j059l386J58N458L362n019n591K374M839m50k520M11N82j862
$$ -11659 -13410 -13457 -14516 -17902 -17744 -12286 -8924 -13943 -19534 -17160 -12321 -12771 -15291 -14880 -14298 -16160
843a6160J12L591j34k664J84Q88j665l53M888J868n238l503M323M536j944j801
$$ -16160 -16048 -12457 -12591 -15255 -15071 -14183 -15848 -16201 -11313 -9445 -14683 -18186 -13863 -9327 -11271 -13072
859a3072Q94j133j254M562L940k771m623J855K400k515J718P221k70r634k922
$$ -13072 -12178 -13311 -14565 -10003 -6063 -8834 -13457 -11602 -9202 -11717 -9999 -2778 -3048 -12682 -15604
874a5604Q441O065k647l250J27j560l55N693N042l674n127J89J937J389M459L797
$$ -15604 -7163 -1098 -3745 -6995 -6868 -8428 -8783 -3090 1952 -1722 -6849 -6660 -4723 -3334 1125 4922
890D922m286p761Q87P387K378q23J040q03o675j636Q841P865l600p932j864K867
$$ 4922 636 -7125 -6238 1149 3527 2704 3744 2941 -3734 -5370 3471 11336 7736 -196 -2060 807
906H07K614M045L840k709q328k831N572P428K306k433m826m567j49P114P170q15
$$ 807 3421 7466 11306 8597 269 -2562 3010 10438 12744 10311 5485 918 769 7883 15053 14238
922A4238o910n886R91N170N923K624m600p839l375N878Q487K113n054n621j957
$$ 14238 7328 1442 2433 7603 13526 16150 11550 3711 336 6214 14701 16814 11760 6139 4182
937D182J501M521M442N23n221n130k0M222L973J961j274n886n537L218Q319L524
$$ 4182 5683 10204 14646 15169 9948 4818 4798 9020 12993 14954 13680 7794 2257 5475 13794 17318
953A7318m867n661n23M73J450M020L700l177p506k453N434N231P72k478l812m003
$$ 17318 12451 6790 6267 6740 8190 12210 15910 12733 5227 2774 8208 13439 14211 11733 7921 3918
969C918K55O405N320l004o306k069J278J577L585L771k541q654l475P051O736
$$ 3918 4173 10578 15898 12894 6588 4519 5797 7374 10959 14730 12189 3535 60 7111 13847
984A3847j581m794j366j438q09L250N833j021o868l254K230K960J577K296j738
$$ 13847 12266 7472 6106 4668 3859 7109 12942 11921 5053 1799 4029 6989 8566 10862 9124
999I124p329k963N968N962j875l669o53j779k490L143P141n16q444m715L309N047
$$ 9124 1795 -1168 4800 10762 8887 5218 4565 2786 296 3439 10580 10064 1620 -3095 214 5261
1015E261J833k20l002n434k039N011N493r83l170l390k658p98N435O297k290r343
$$ 5261 7094 6874 3872 -1562 -3601 1410 6903 5920 2750 -640 -3298 -4096 1339 7636 5346 -3997
1031c997m521M531N206J763j454l013m743k939M269O911J124n174o479j723L268
$$ -3997 -8518 -3987 1219 2982 1528 -1485 -6228 -9167 -4898 2013 3137 -2037 -8516 -10239 -6971
1046f971N332L022k477p115m839K451O014L119r00m011n515k936L557P761L599
$$ -6971 -1639 1383 -1094 -8209 -13048 -10597 -4583 -1464 -2364 -6375 -11890 -14826 -11269 -3508 91
1061I1n881q799k164M359N417L218j108n991p089N41P441O080j434m964n212k958
$$ 91 -5790 -14589 -16753 -12394 -6977 -3759 -4867 -10858 -17947 -17406 -9965 -3885 -5319 -10283 -15495 -18453
1077a8453K635Q614N538n788r710k922M301N637M059R13n245q934k622Q054R720
$$ -18453 -15818 -7204 -1666 -7454 -17164 -20086 -15785 -10148 -6089 -5176 -10421 -19355 -21977 -13923 -4203
1092d203R13o483p725k828M476Q648M928m126p785l785J966N456O158L043n271
$$ -4203 -3290 -9773 -17498 -20326 -15850 -7202 -2274 -6400 -14185 -17970 -16004 -10548 -4390 -1347 -6618
1107f618j0414l128Q492J0222J280n749o294l498J279P671Q161j63q789p564J517
$$ -6618 -17032 -20160 -11668 -1446 -166 -5915 -12209 -15707 -14428 -6757 1404 1241 -7548 -15112 -13595
1122a3595O620P338K843m044q905l527N715Q289K941j719m926m661j973O136R932
$$ -13595 -6975 363 3206 -838 -9743 -13270 -7555 734 3675 1956 -2970 -7631 -9604 -3468 6464
1137F464K498p763q929q8N963P024L897k658q141n725M274Q373L926j124l595
$$ 6464 8962 1199 -7730 -7818 -1855 5169 9066 6408 -1733 -7458 -3184 5189 9115 7991 4396
1152D396m617l784L866R661M543n374q020j955L791N401M372M3o034n990M36O402
$$ 4396 -221 -4005 -139 9522 14065 8691 671 -1284 2507 7908 12280 12323 6289 299 735 7137
1168G137N147Q93l148n744m086L158Q192M563m781o782j535K325K957L122K654
$$ 7137 12284 13177 10029 4285 199 3357 11549 16112 11331 4549 3014 5339 8296 11418 14072
1183A4072j913o908l976M861P414K057m801m915j545K231L998K782j378m382k108
$$ 14072 12159 5251 1275 6136 13550 15607 10806 5891 4346 6577 10575 13357 11979 7597 5489
1198E489J531J284J133K364P4m860m442L039N994J81l941j003O23j337p65L365
$$ 5489 7020 8304 9437 11801 11875 7015 2573 5612 11606 11787 7846 6843 7466 6129 5364 8729
1214H729K743k471l366N32J324j355J204K661j639m485N99L911l92k798R64J639
$$ 8729 11472 9001 5635 6167 7491 6136 7340 10001 8362 3877 4476 8387 7995 5197 6161 7800
1230G800k490k049K141K834k145k231J705P79k782m33L143M27k900l19K003o92
$$ 7800 5310 3261 5402 8236 6091 3860 5565 6344 3562 3129 6272 6699 3799 3480 5483 4791
1246D791l051P24L674N01k931j851k3j99J830J973m64m000j546J666J135M60P78
$$ 4791 1740 2464 6138 6639 3708 1857 1834 1635 3465 5438 4974 974 -572 1094 2229 2689 3467
1263C467R5k876m009J711N198R27l147k658o74K33Q59K931J539l193m929j052
$$ 3467 3562 686 -3323 -1612 3586 4513 1366 -1292 -1966 -1733 -874 2057 3596 403 -4526 -5578
1279e578K838L420J512j294l768m712o44N443N066r51n330l910o05K599L721K708
$$ -5578 -2740 680 2192 898 -2870 -7582 -8226 -2783 2283 1332 -3998 -7908 -8513 -5914 -2193 515
1295E15j572n435l923J011N160M289j02n843p325m77P867O527j924o709l778o88
$$ 515 -1057 -6492 -10415 -9404 -4244 45 -57 -5900 -13225 -13702 -5835 692 -1232 -7941 -11719 -12407
1311a2407J265M298N656n54q289o723J836P460N154l66n994n976r30M920N950
$$ -12407 -11142 -6844 -1188 -1742 -10031 -16754 -14918 -7458 -2304 -2670 -8664 -14640 -15570 -10650 -4700
1326d700J086l104m321l334o41N068P367J134q044p864P77O910N409P56l783n595
$$ -4700 -3614 -6718 -11039 -14373 -15014 -9946 -2579 -1445 -9489 -17353 -16576 -9666 -4257 -3501 -7284 -12879
1342a2879l204K098O626M359p65n041n937j713N243R745K915p344q569p93O583
$$ -12879 -16083 -13985 -7359 -3000 -3765 -8806 -14743 -16456 -11213 -1468 1447 -5897 -14466 -15259 -8676
1357h676N224J776r13m361n828l11P157P747o77o508n519q92M417P731L645m845
$$ -8676 -3452 -1676 -2589 -6950 -12778 -13089 -5932 1815 1138 -5370 -10889 -11781 -7364 367 4012 -833
1373h33p788k195M687M664L458J739k834p827l174O929R563J229o057n700j475
$$ -833 -8621 -10816 -6129 -1465 1993 3732 898 -6929 -10103 -3174 6389 7618 1561 -4139 -5614
1388e614K946P056M098l309o639j677K507K409L362L969j991q754l997O979Q567
$$ -5614 -2668 4388 8486 5177 -1462 -3139 -632 1777 5139 9108 7117 -1637 -5634 1345 9912
1403I912O53m350l733k795J034N261N719o67o104l000J217K451L231L407j546
$$ 9912 10565 6215 2482 -313 721 5982 11701 11034 4930 1930 3147 5598 8829 12236 10690
1418A0690o296l213L562N591J423k363k491l143o94L777N058K4m394l824k43K836
$$ 10690 4394 1181 4743 10334 11757 9394 6903 3760 3066 6843 11901 11925 7531 3707 3464 6300
1434F300L479K385j119m639l312J711N180K020j179l022k530k72J871K940J301
$$ 6300 9779 12164 11045 6406 3094 4805 9985 12005 10826 7804 5274 5002 6873 9813 11114
1449A1114k344l280j602J534L415J371j311l825k637J554M171K135k521k949m68
$$ 11114 8770 5490 3888 5422 8837 10208 8897 5072 2435 3989 8160 10295 7774 4825 4357
1464D357O29J21J558K314r84m039j729K326K447L92p50j917k614K84L244J409
$$ 4357 4986 5107 6665 8979 7995 3956 2227 4553 7000 7392 6642 4725 2111 2395 5639 7048
1480G048k390k837L39J367O7M12J105j012k967j045K154K838k83j640j935p82
$$ 7048 4658 1821 2160 3527 3594 4006 5111 4099 1132 87 2241 5079 4796 3156 1221 439
1496D39N97K481R21k049k033L54N79M60k65O53o51k845q60K884K509j083l277
$$ 439 1036 3517 4438 2389 356 710 1289 1749 1484 2137 1486 -1359 -2219 665 3174 2091 -1186
1513a186j680J120J143J485P20j644l015n67J799J772O88k45j890k587m49L050
$$ -1186 -2866 -1746 -603 882 1602 -42 -3057 -3624 -1825 -53 635 390 -1500 -4087 -4536 -1486
1529a486L127j963l446j364J171Q14O45J435j331l345j454K005K683N26j008k311
$$ -1486 1641 -322 -3768 -5132 -3961 -3147 -2502 -1067 -2398 -5743 -7197 -5192 -2509 -1983 -2991 -5302
1545e302k644l43M212L424k112l952r13R34K92J277K317q26l579k661J793L183
$$ -5302 -7946 -8289 -4077 -653 -2765 -6717 -7630 -6696 -6404 -5127 -2810 -3636 -7215 -9876 -8083 -4900
1561d900R82j029k504k556k26L414K902q84l608j307p7J351K209J904q60m780
$$ -4900 -3918 -4947 -7451 -10007 -10233 -6819 -3917 -4801 -8409 -9716 -9793 -8442 -6233 -4329 -5189 -9969
1577i969j591K186L888P07j174j641j968n88K375K862R6k078k493l76J535J974
$$ -9969 -11560 -9374 -5486 -4779 -5953 -7594 -9562 -10150 -7775 -4913 -4817 -6895 -9388 -9764 -8229 -6255
1593f255J422j101k659j496K153L034L94p21j711q08o0J099K921J654j763k897
$$ -6255 -4833 -5934 -8593 -10089 -7936 -4902 -4508 -5229 -6940 -7748 -7808 -6709 -3788 -2134 -3897 -6794
1609f794o96K316K438M93p34r05j151m72K127K323J25j973j622R6K011K109J031
$$ -6794 -7490 -5174 -2736 -2243 -2977 -3882 -5033 -5505 -3378 -1055 -930 -2903 -4525 -4429 -2418 -309 722
1626G22j696k823J97L168J878p1m64o90j248J14K550K919n64k828o11J032J281
$$ 722 -974 -3797 -3600 -432 1446 1375 911 221 -1027 -913 1637 4556 3992 1164 553 1585 2866
1643B866J076P42q80k296M8K476J518n52j274k66k20j02J943K415p87l032q97
$$ 2866 3942 4684 3804 1508 1556 4032 5550 4998 3724 3458 3238 3136 5079 7494 6707 3675 2778
1660B778J955K359O29k13r42j743l45K348K279j63j613j240j203P66K543K077
$$ 2778 4733 7092 7721 7508 6566 4823 4478 6826 9105 8942 7329 6089 4886 5652 8195 10272
1676A0272j977l909p28L029K565n52j118j368j565j1K507L135l41l516k163k99
$$ 10272 8295 4386 3658 6687 9252 8700 7582 6214 4649 4638 7145 10280 9939 6423 4260 3961
1692C961K451K912J177k391l743j046K199K534M18m87k129k721n17L003L349n61
$$ 3961 6412 9324 10501 8110 4367 3321 5520 8054 8472 7985 5856 3135 2618 5621 8970 8409
1708H409l820k714N7K194K205J188j544l364k106J194L338K506k84l435l692n41
$$ 8409 4589 1875 1932 4126 6331 7519 5975 2611 505 1699 5037 7543 7259 3824 132 -409
1724d09L307L926O12l479l628j335J547L073K041q20l978l479N26L973L209l50
$$ -409 2898 6824 7436 3957 329 -1006 541 3614 5655 4835 857 -2622 -2096 1877 5086 4736
1740D736l742l737m44K648L822J849k501m535k515J984L847K791n87l764m304
$$ 4736 994 -2743 -3187 -539 3283 5132 2631 -1904 -4419 -2435 1412 4203 3616 -148 -4452
1755d452p19M075M181j98k911l424j831J233L986L278j763n271k605J381L667
$$ -4452 -5171 -1096 3085 2887 -24 -3448 -5279 -4046 -60 3218 1455 -3816 -6421 -5040 -1373
1770a373K532N56l175m610j638L739M788O42k394l472k451K50L908M037m71m788
$$ -1373 1159 1715 -1460 -6070 -7708 -3969 819 1461 -933 -4405 -6856 -6606 -2698 1339 868 -3920
1786c920l401L96K622K255J725j746m389k015J731M080J254j214k766k268r00
$$ -3920 -7321 -6925 -4303 -2048 -323 -2069 -6458 -8473 -6742 -2662 -1408 -2622 -5388 -7656 -8556
1801h556L058L877K38l452l214m20J619K963J881n64l751l223N97L420K957n21
$$ -8556 -5498 -1621 -1383 -4835 -8049 -8469 -6850 -3887 -2006 -2570 -6321 -9544 -8947 -5527 -2570 -3091
1817c091k360k548j350K123K773J540j958k451j497R32K401K052L64k744k687
$$ -3091 -5451 -7999 -9349 -7226 -4453 -2913 -4871 -7322 -8819 -7887 -5486 -3434 -3070 -5814 -8501
1832h501P6L183K053k21j177k073j107L23K846J934m51k618j834P65J114K146
$$ -8501 -8425 -5242 -3189 -3410 -4587 -6660 -7767 -7444 -4598 -2664 -3115 -5733 -7567 -6802 -5688 -3542
1848c542P10j029k180r3J580J308J61Q7k16r90r34J711K515R6j795q93N65J009
$$ -3542 -2832 -3861 -6041 -6134 -4554 -3246 -3085 -2998 -3214 -4204 -5138 -3427 -912 -816 -2611 -3504 -2939 -1930
1866a930Q24M41R6j355o24Q25Q67P14K65P29r71j533J222J849N64j186MJ006K06
$$ -1930 -1106 -665 -569 -1924 -2548 -1723 -856 -142 123 852 -119 -1652 -430 1419 1983 797 801 1807 2013
1885B013j043O34J302M02m09j92J98L44K12M85J13k42k40Q11k22n64N56J709m44
$$ 2013 970 1604 2906 3308 2899 2707 2905 3249 3461 3946 4059 3817 3577 4388 4166 3602 4158 5867 5423
1904E423j953m4J437J581n95m56N6l50m93R87J518R52j570p19p82j61J926K069
$$ 5423 3470 3426 4863 6444 5849 5393 5449 5099 4606 5593 7111 8063 6493 5774 4992 4831 6757 8826
1922H826n48k675j778J839J427m64J53N06r81k361K72L042J096j448j828j328
$$ 8826 8278 5603 3825 5664 7091 6627 6780 7286 6305 3944 4216 7258 8354 6906 5078 3750
1938C750K40J884K294M4k832k247P08J590J186P77O0k515k929N09K949K341r37
$$ 3750 3990 5874 8168 8212 5380 3133 3841 5431 6617 7394 7454 4939 2010 2519 5468 7809 6872
1955F872k536k206r42J826K774M75k498k329p80J040J560J964O0k936l126L16
$$ 6872 4336 2130 1188 3014 5788 6263 3765 1436 656 1696 3256 5220 5280 2344 -782 -466
1971d66L010K726o06j821l018j340J339K767K002j457k977k277K15K380K265O11
$$ -466 2544 5270 4664 2843 -175 -1515 -176 2591 4593 3136 159 -2118 -1903 477 2742 3353
1987C353k262l395j065J629L385J107k139k730j440N07K438K551J55k876l104
$$ 3353 1091 -2304 -3369 -1740 1645 2752 613 -2117 -3557 -3050 -612 1939 2094 -782 -3886
2002c886l48K340K699J167j625l429k514J210M185J781j731k774j824m22J503
$$ -3886 -4234 -1894 805 1972 347 -3082 -5596 -4386 -201 1580 -151 -2925 -4749 -5171 -3668
2017c668L020J495k510l979k81J685K076K112p06l318k487O65M046J782j382k369
$$ -3668 -648 847 -1663 -5642 -5923 -4238 -2162 -50 -756 -4074 -6561 -5896 -1850 -68 -1450 -3819
2033c819j119r04M76L315K238k053l897j322R16K635J776J76k420l621M04L397
$$ -3819 -4938 -5842 -5366 -2051 187 -1866 -5763 -7085 -6169 -3534 -1758 -1582 -4002 -7623 -7219 -3822
2049c822J352o21r19q44j966j22L235K433j183l386j450J360J854J219L45j896
$$ -3822 -2470 -3091 -4010 -4854 -6820 -6942 -3707 -1274 -2457 -5843 -7293 -5933 -4079 -2860 -2515 -4411
2065d411k284k83J952J628L24n55j564j841K84K283K383r70k271j320P58J612
$$ -4411 -6695 -6978 -5026 -3398 -3074 -3629 -5193 -7034 -6750 -4467 -2084 -3054 -5325 -6645 -5887 -4275
2081d275N76O27k80j539j071Q79J659J420p28j531j351P46J517J565l11j738p61
$$ -4275 -3699 -3072 -3352 -4891 -5962 -5083 -3424 -2004 -2732 -4263 -5614 -4868 -3351 -1786 -2097 -3835 -4596
2098d596K48J591O73r1L14j171r30J39K229J065n36j345k94R61P94R18l07p20
$$ -4596 -4348 -2757 -2084 -2175 -1861 -3032 -3962 -3823 -1594 -529 -1065 -2410 -2704 -1743 -949 -31 -338 -1058
2116a058j79J30J322J26L69j56o43p32O80J966M45r42j136L52Q21M44L08N49p44
$$ -1058 -1237 -1107 215 341 710 554 -89 -821 -141 1825 2270 1328 192 544 1365 1809 2117 2666 1922
2135A922n12N26P33O85L49n91m24k10Q81J538Q9j229r08O55P59N37N5J71m06j050
$$ 1922 1410 1936 2669 3354 3703 3112 2688 2478 3359 4897 4986 3757 2849 3504 4263 4800 4855 5026 4620 3570
2155C570J00J756J060o13j897n7J065L20J075L20j295j186M66Q21J014K1n97n01
$$ 3570 3670 5426 6486 5873 3976 3919 4984 5304 6379 6699 5404 4218 4684 5505 6519 6540 5943 5442
2173E442j053P08J261R37j322j418rM24K93R09K94q13j977m16J384J194J55r05
$$ 5442 4389 5097 6358 7295 5973 4555 4546 4970 5263 6172 6466 5653 3676 3260 4644 5838 5993 5088
2191E088p40q94L1J655M92n68j401o10J96M03R51R54j309k403j73J190J158J50
$$ 5088 4348 3454 3485 5140 5632 5064 3663 3053 3249 3652 4603 5557 4248 1845 1672 2862 4020 4170
2209D170o43j378j185M51R94P02m7j419j166l02M04J416O91j340j275n59R89J040
$$ 4170 3527 2149 964 1415 2409 3111 3064 1645 479 177 581 1997 2688 1348 73 -486 503 1543
2227A543K46q64j229p93J16R23Q11k22j006j219j29J146P87j51j075r30n95Q21
$$ 1543 1789 925 -304 -1097 -981 -58 753 531 -475 -1694 -1823 -677 110 -41 -1116 -2046 -2641 -1820
2245a820O86L91k09j098q12k17J061R13J36j145j332J63J108O55l75l86o60k61
$$ -1820 -1134 -743 -952 -2050 -2862 -3079 -2018 -1105 -969 -2114 -3446 -3283 -2175 -1520 -1895 -2281 -2941 -3202
2263c202p5O50Q48o93o90r13N19N85O65N1j098r50M42M80M02j62j33k65n18J99
$$ -3202 -3277 -2627 -1779 -2472 -3162 -4075 -3556 -2971 -2306 -2255 -3353 -4303 -3861 -3381 -2979 -3141 -3274 -3539 -4057 -3858
2283c858J030L40p99p46m69R05M46M27m24j068l21M33P44K29p6o69l43l27Q33
$$ -3858 -2828 -2488 -3287 -4033 -4502 -3597 -3151 -2724 -3148 -4216 -4537 -4104 -3360 -3131 -3207 -3876 -4219 -4546 -3713
2302c713R19k8j181r84N45R84N2k8J64p47m64K13R47P21l57j123n15L74P00J178
$$ -3713 -2794 -2822 -4003 -4987 -4442 -3458 -3406 -3434 -3270 -4017 -4481 -4268 -3321 -2600 -2957 -4080 -4595 -4221 -3521 -2343
2322b343rj376j233O44J115N72o7k69p90r82P36J545J161q52j385p87P96J453
$$ -2343 -2352 -3728 -4961 -4317 -3202 -2630 -2697 -2966 -3756 -4738 -4002 -2457 -1296 -2148 -3533 -4320 -3524 -2071
2340b071J153l86j069j078k61J549J183M29l97j665j108J054K095J531j103j925
$$ -2071 -918 -1304 -2373 -3451 -3712 -2163 -980 -551 -948 -2613 -3721 -2667 -572 959 -144 -2069
2356b069l28L52J257J641M88j109j739n48J357J808J459j408j481j165Q81K347
$$ -2069 -2397 -2045 -788 853 1341 232 -1507 -2055 -698 1110 2569 1161 -320 -1485 -604 1743
2372A743J562o96j818j231L94J266J839J229j350k304r60J475K449J258m20j950
$$ 1743 3305 2609 791 -440 -46 1220 3059 4288 2938 634 -326 1149 3598 4856 4436 2486
2388B486j547K68J956K119K29j760j351n84J092K487J387j259k438j524J132K307
$$ 2486 939 1207 3163 5282 5511 3751 2400 1816 2908 5395 6782 5523 3085 1561 2693 5000
2404E000J866n38j795j724m43J591K136J261j504k144j310R57K559J727r36k505
$$ 5000 6866 6328 4533 2809 2366 3957 6093 7354 5850 3706 2396 3353 5912 7639 6703 4198
2420D198j663Q51J580J786L95j641j929j153P42K777J555j258k957j446R48J967
$$ 4198 2535 3386 4966 6752 7147 5506 3577 2424 3166 5943 7498 6240 3283 1837 2785 4752
2436D752J326k54j675j855r91J699J604J253j003k453j362M63J945J999p71k323
$$ 4752 6078 5824 4149 2294 1303 3002 4606 5859 4856 2403 1041 1504 3449 5448 4677 2354
2452B354j370k15J298J082P46n72k474j197L08K441J229j217j499j942K56J521
$$ 2354 984 769 2067 3149 3895 3323 849 -348 -40 2401 3630 2413 914 -1028 -772 749
2468G49J565m39j158j397r44N64J621J161o39k308j223M36J994M59m36o96j762
$$ 749 2314 1875 717 -680 -1624 -1060 561 1722 1083 -1225 -2448 -2012 -18 441 5 -691 -2453
2485b453m45R14J599L93j133j393n17J96R61Q28J0j409j335M34J234N24j65k01
$$ -2453 -2898 -1984 -385 8 -1125 -2518 -3035 -2839 -1878 -1050 -1040 -2449 -3784 -3350 -2116 -1592 -1757 -1958
2503a958q16j111L12J304O27j016n19o33K8O81O78P3n36o43k94O21K44J02j88
$$ -1958 -2774 -3885 -3573 -2269 -1642 -2658 -3177 -3810 -3782 -3101 -2423 -2350 -2886 -3529 -3823 -3202 -2958 -2856 -3044
2522c044k31l55l82P64M14k54m06j55M25j75j09K42K05k87k92M26jk36J36N4k22
$$ -3044 -3275 -3630 -4012 -3248 -2834 -3088 -3494 -3649 -3224 -3399 -3508 -3266 -3061 -3348 -3640 -3214 -3215 -3451 -3315 -3261 -3483
2543c483N0P9lj66L0P26J46n43o90L49K78K19K4M55q8r67l93Q42O73J92p79l06
$$ -3483 -3433 -3354 -3357 -3523 -3493 -2767 -2621 -3164 -3854 -3505 -3227 -3008 -2984 -2529 -2617 -3584 -3977 -3135 -2462 -2270 -3049 -3355
2565c355k2M60P04M88o47p09j42j44J110L59N75m83j762k02J285J345J17j197
$$ -3355 -3377 -2917 -2213 -1725 -2372 -3081 -3223 -3367 -2257 -1898 -1323 -1806 -3568 -3770 -2485 -1140 -1023 -2220
2583b220k56k00k25J046J514j27j311p19j56R24J336Q88j033j686p22J272J815
$$ -2220 -2476 -2676 -2901 -1855 -341 -468 -1779 -2498 -2654 -1730 -394 494 -539 -2225 -2947 -1675 140
2600A40K97k39q74q02k20J131J589J090j730j969r9J851J044J024m96k011m19
$$ 140 437 198 -676 -1478 -1698 -567 1022 2112 382 -1587 -1686 165 1209 2233 1737 -274 -693
2617f93M53J725J296j59j111j179k44R79K218J089j337k160o12J363J486J094
$$ -693 -240 1485 2781 2622 1511 332 88 1067 3285 4374 3037 877 265 1628 3114 4208
2633D208m43j117j305k40J620J863N32r06j982j073J230K463J169r43k235q12
$$ 4208 3765 2648 1343 1103 2723 4586 5118 4212 2230 1157 2387 4850 6019 5076 2841 2029
2649B029O55J375J575j93q45j508p86J137K110Q29j231j716j311P72J862J544
$$ 2029 2684 4059 5634 5441 4596 3088 2302 3439 5549 6378 5147 3431 2120 2892 4754 6298
2665F298m16j723j273%J069J809N03j171j916j297J326J965R08r41j640j046p0
$$ 6298 5882 4159 2886 2886 3955 5764 6267 5096 3180 1883 3209 5174 6082 5141 3501 2455 2385
2682B385J276J663K5j354k038j40Q06J520Q20j250j434j352P92J627P15n04j675
$$ 2385 3661 5324 5349 3995 1957 1817 2623 4143 4963 3713 2279 927 1719 3346 4061 3557 1882
2699A882j057l80R01J601O59j616j976j60P27J292O51p82j231j228K18J039J022
$$ 1882 825 445 1346 2947 3606 1990 14 -146 581 1873 2524 1742 511 -717 -499 540 1562
2716A562m02j205j173k42P66J273M67j066j517m31M64N88J124j07j439j173k82
$$ 1562 1160 -45 -1218 -1460 -694 579 1046 -20 -1537 -1968 -1504 -916 208 101 -1338 -2511 -2793
2733b793R75J174l12r91p78k60O22R91m4m13j043m44L44O84J44J75p40r71O8R59
$$ -2793 -1818 -644 -956 -1947 -2725 -2985 -2363 -1372 -1416 -1829 -2872 -3316 -2972 -2288 -2144 -1969 -2709 -3680 -3612 -2653
2753b653P55n00p23p24J05O15M80J83k48q71m03J72N17J013k95q45n80M53O64
$$ -2653 -1898 -2398 -3121 -3845 -3740 -3125 -2645 -2462 -2710 -3581 -3984 -3812 -3295 -2282 -2577 -3422 -4002 -3549 -2885
2772b885M54l29p15n55L04L91O45O12r20m22o62N90J108K74o36j019p1N33N92
$$ -2885 -2431 -2760 -3475 -4030 -3726 -3335 -2690 -2078 -2998 -3420 -4082 -3492 -2384 -2110 -2746 -3765 -3836 -3303 -2711
2791b711N77m41j92p50K94O19L02L70q28l34o76O05J486K14p98q66nM88P92N59
$$ -2711 -2134 -2575 -2767 -3517 -3223 -2604 -2302 -1932 -2760 -3094 -3770 -3165 -1679 -1465 -2263 -3129 -3134 -2646 -1854 -1295
2811a295l08p62o18O5Q19R46m8o93o54j99R04Q80K33p45p37m26R11P71N69j81
$$ -1295 -1603 -2365 -2983 -2918 -2099 -1153 -1201 -1894 -2548 -2747 -1843 -963 -730 -1475 -2212 -2638 -1727 -956 -387 -568
2831e68n35r30P9R82Q76q9k86j119k66P06J431J12l19o81p43L35Q64P50M55j229
$$ -568 -1103 -2033 -1954 -972 -96 -185 -471 -1590 -1856 -1150 281 393 74 -607 -1350 -1015 -151 599 1054 -175
2851a75n93L9R24J050p3o09m38l07L39P36Q06k84n27n31K00Q77R16J89r85r59
$$ -175 -768 -729 195 1245 1172 563 125 -182 157 893 1699 1415 888 357 557 1434 2350 2539 1554 595
2871E95N05N86O76K34j49p51o45N58R92Q74o50k37p62J94R30O70M9q29k64P9O10
$$ 595 1100 1686 2362 2596 2447 1696 1051 1609 2601 3475 2825 2588 1826 2020 2950 3620 3669 2840 2576 2655 3265
2892C265L43K19J04n54o21k02R73R53m49q09r3M65k29Q48L9m97k67j99K02N07
$$ 3265 3608 3827 3931 3377 2756 2554 3527 4480 4031 3222 3129 3594 3365 4213 4252 3755 3488 3289 3491 3998
2912C998M22l45o06l59J26O55N03o33m30j35J39J55L9Q6j08n39l53M06L35M05
$$ 3998 4420 4075 3469 3110 3236 3891 4394 3761 3331 3196 3335 3490 3529 3615 3507 2968 2615 3021 3356 3761
2932C761n12o89j81M22R4J23m23l96j47j97L75L23j97o26l45j3L67M68m38r11
$$ 3761 3249 2560 2379 2801 2895 3018 2595 2199 2052 1855 2230 2553 2356 1730 1385 1372 1739 2207 1769 858
2952H58k69K55L21J92n47r2n17l26K59M37K73q43p82l80O22M88M14o13j202k17
$$ 858 589 844 1165 1357 810 718 201 -125 134 571 844 1 -781 -1161 -539 -51 363 -250 -1452 -1669
2972a669M51L47L04m31o31m53n64Q35J035k64q23q23m39O85Q85Q1m30r68n93O13
$$ -1669 -1218 -871 -567 -998 -1629 -2082 -2646 -1811 -776 -1040 -1863 -2686 -3125 -2440 -1555 -1474 -1904 -2872 -3465 -2852
2992b852M84M84J50q29q21n44R30J116m6r76m55o61L85R12P67k90j180n43j42
$$ -2852 -2368 -1884 -1734 -2563 -3384 -3928 -2998 -1882 -1928 -2904 -3359 -4020 -3635 -2723 -1956 -2246 -3426 -3969 -4111
3011d111J105R40L40j101j010p83Q86J617N42q60j171l80K75N92R52L34r92j108
$$ -4111 -3006 -2066 -1726 -2827 -3837 -4620 -3734 -2117 -1575 -2435 -3606 -3986 -3711 -3119 -2167 -1833 -2825 -3933
3029c933k70J159J373N1m01j507m03M81J312R68l34r85r32j37Q35J670L15r34
$$ -3933 -4203 -3044 -1671 -1620 -2021 -3528 -3931 -3450 -2138 -1170 -1504 -2489 -3421 -3558 -2723 -1053 -738 -1672
3047a672j503m70J061J409N06l48j216p98oJ194J576K06j208j518J61R06J294
$$ -1672 -3175 -3645 -2584 -1175 -669 -1017 -2233 -3031 -3037 -1843 -267 -61 -1269 -2787 -2626 -1720 -426
3064d26Q00j146j144j111R20J164Q57K3q12r53o86J248J567M40p11j499l51J118
$$ -426 374 -772 -1916 -3027 -2107 -943 -86 -63 -875 -1828 -2514 -1266 301 741 30 -1469 -1820 -702
3082g02P46M58J19p34j323J39J429R99K28r10j190n52R99J567M80q09r38l28j18
$$ -702 44 502 621 -113 -1436 -1297 132 1131 1359 449 -741 -1293 -294 1273 1753 944 6 -322 -440
3101d40P72J166P20p60j687k72J569J050J99o33r38l47L72J146O94j40n94p56
$$ -440 332 1498 2218 1458 -229 -501 1068 2118 2317 1684 746 399 771 1917 2611 2471 1877 1121
3119A121l97Q18J156N54o46j322k19P43R23L17j59p39l15j96O38J234M7j94j064
$$ 1121 724 1542 2698 3252 2606 1284 1065 1808 2731 3048 2889 2150 1835 1639 2277 3511 3558 3364 2300
3138B300l85O62N43M51r6p88l36K11K54N74J84j86l22m21N6Q32L93k64n52k92
$$ 2300 1915 2577 3120 3571 3475 2687 2351 2562 2816 3390 3574 3388 3066 2645 2701 3533 3926 3662 3110 2818
3158B818l7M04K30PM9n40k02K12K82J62M1k46q61q1Q68J79n12j16q3J43m55j0
$$ 2818 2781 3185 3415 3422 3471 2931 2729 2941 3223 3385 3426 3180 2319 2238 3106 3285 2773 2657 2574 2717 2262 2252
3180B252K9K86l35o08R0J70p7L11l63k2n35J31K04n39K60L62m52o72l05M76M23
$$ 2252 2281 2567 2232 1624 1714 1884 1807 2118 1755 1733 1198 1329 1533 994 1254 1616 1164 492 187 663 1086
3201A086j03l87j4n42n15J13N73J91l40n59l76j09M29M65m92k74p02k3K60L14
$$ 1086 983 596 582 40 -475 -362 211 402 62 -497 -873 -982 -553 -88 -580 -854 -1556 -1579 -1319 -1005
3221a005J49j39j004n77L75N74N23l44n75m70m64L14P39O6m1q40l78J38K75N67
$$ -1005 -856 -995 -1999 -2576 -2201 -1627 -1104 -1448 -2023 -2493 -2957 -2643 -1904 -1838 -1879 -2719 -3097 -2959 -2684 -2117
3241b117J52p20p16rN41J049k63o38n61k65J72N46P73j75p63p38r6R75O35j19
$$ -2117 -1965 -2685 -3401 -3410 -2869 -1820 -2083 -2721 -3282 -3547 -3375 -2829 -2056 -2231 -2994 -3732 -3828 -2853 -2218 -2337
3261b337j12j072l59N53Q45N94k81p93p62L1P63R94J08o26j049k4O62J106L76
$$ -2337 -2449 -3521 -3880 -3327 -2482 -1888 -2169 -2962 -3724 -3693 -2930 -1936 -1828 -2454 -3503 -3527 -2865 -1759 -1383
3280a383n78o99m48J5Q95P98Q5q85n58j30O10N80P19n65n80l87L70P61O82Nn14
$$ -1383 -1961 -2660 -3108 -3093 -2198 -1400 -1315 -2200 -2758 -2888 -2278 -1698 -979 -1544 -2124 -2511 -2141 -1380 -698 -693 -1207
3301a207j447M28R49J034J7q41o96j74P05O52N88j95j000j32l51J036J030N8p33
$$ -1207 -2654 -2226 -1277 -243 -226 -1067 -1763 -1937 -1232 -580 8 -187 -1187 -1319 -1670 -634 396 454 -279
3320b79r18l07Q28R42M63l91p27m40J03O02J175M2q58q57l3Q92P76K77l89o40
$$ -279 -1197 -1504 -676 266 729 338 -389 -829 -726 -124 1051 1093 235 -622 -655 237 1013 1290 901 261
3340B61m73M87Q15K37L8n78n28LL16J341l3n05j167K72O71L60J64l16j38k59J25
$$ 261 -212 275 1090 1327 1365 787 259 262 578 1919 1886 1381 214 486 1157 1517 1681 1365 1227 968 1093
3361A093M77R42n0m28n19p68J069Q75O7m58p63p0M68L44L65l17j97k40k80Q57
$$ 1093 1570 2512 2462 2034 1515 747 1816 2691 2758 2300 1537 1467 1935 2279 2644 2327 2130 1890 1610 2467
3381B467M25J54n23l11j7L82L38K12n56j66m8J50J71L60J52m22n34J20P57J81
$$ 2467 2892 3046 2523 2212 2195 2577 2915 3127 2571 2405 2357 2507 2678 3038 3190 2768 2234 2354 3111 3292
3401C292m67o03J33K77J74p4nlj59l20Q9K36L84O8q22j81K30M25J04m58j41j40
$$ 3292 2825 2222 2355 2632 2806 2732 2727 2724 2565 2245 2334 2570 2954 3022 2200 2019 2249 2674 2778 2320 2179 2039
3423B039K06m60N97j87k97k18m7K58J51j85l25m83P8M07J1J89n05j34n48k25L51
$$ 2039 2245 1785 2382 2195 1898 1680 1633 1891 2042 1857 1532 1049 1127 1534 1545 1734 1229 1095 547 322 673
3444F73M12L47r11l75m0L32L73p21k31l1Ml24J45M58m96l15q32N37J89M06j77
$$ 673 1085 1432 521 146 106 438 811 90 -141 -172 -168 -492 -347 111 -385 -700 -1532 -995 -806 -400 -577
3465e77r75m53K69M01k15J86j91n63o5J76L89L27n96l30n91K41M16L63k67n12
$$ -577 -1552 -2005 -1736 -1335 -1550 -1364 -1555 -2118 -2183 -2007 -1618 -1291 -1887 -2217 -2808 -2567 -2151 -1788 -2055 -2567
3485b567l74r8N53J42k2k07l28k55l3N37L12M3q82k17J46P77j76J64m39j48k48
$$ -2567 -2941 -3039 -2486 -2344 -2366 -2573 -2901 -3156 -3189 -2652 -2340 -2297 -3179 -3396 -3250 -2473 -2649 -2485 -2924 -3072 -3320
3506c320N8O99J81k47j63k49k11P52L43k54m03k05J8M66M67p4j07q9p31L37M92
$$ -3320 -3262 -2563 -2382 -2629 -2792 -3041 -3252 -2500 -2157 -2411 -2814 -3019 -3001 -2535 -2068 -2142 -2249 -2338 -3069 -2732 -2240
3527b240O80m40k65l50K67P21N4J52l51R4k24Q2L42K50j22k64r7J77N40J39j74
$$ -2240 -1560 -2000 -2265 -2615 -2348 -1627 -1573 -1421 -1772 -1678 -1902 -1820 -1478 -1228 -1350 -1614 -1711 -1534 -994 -855 -1029
3548a029k52k03K10L12K15L39j54l69l0L77L32K23j78j44NjM62j65k2O9L15n5
$$ -1029 -1281 -1484 -1274 -962 -747 -408 -562 -931 -961 -584 -252 -29 -207 -351 -346 -347 115 -50 -72 -3 312 257
3570B57j82R4M30l44n9J92K08M15l60p9k04K06L32j44J47k01L36L7j53J55L24
$$ 257 75 169 599 255 196 388 596 1011 651 572 368 574 906 762 909 708 1044 1081 928 1083 1407
3591A407J5n35K03L6M57k20j42j99m0L12L00p8mL4l44J88K24M53j18l66k06o4
$$ 1407 1422 887 1090 1126 1583 1363 1221 1022 982 1294 1594 1516 1512 1546 1202 1390 1614 2067 1949 1583 1377 1313
3613A313P55J86Pn44j88O2M41K19K59k2n77l70p3J069K62k63o18m35M13K63N33
$$ 1313 2068 2254 2261 1717 1529 1591 2032 2251 2510 2488 1911 1541 1468 2537 2799 2536 1918 1483 1896 2159 2692
3634B692L1l75j07m38O2O56N96l71n67l87o2O13R60o85l58l96P5k4O71J60j4p46
$$ 2692 2723 2348 2241 1803 1865 2521 3117 2746 2179 1792 1730 2343 3303 2618 2260 1864 1939 1915 2586 2746 2732 1986
3656A986n36M36P36L11k39m45j051P0P85Q73l85m11p05k78o8R75O56m06j005p54
$$ 1986 1450 1886 2622 2933 2694 2249 1198 1268 2053 2926 2541 2130 1425 1147 1079 2054 2710 2304 1299 545
3676E45J53J168K61j82p31r67L9M13P00M53k76r83j199J97J532L09j58j327n67
$$ 545 698 1866 2127 1945 1214 247 286 699 1399 1852 1576 593 -606 -409 1123 1432 1274 -53 -620
3695f20j2M79N40L27p59p51n87M18N43R71m44p93j050j18R39M08K06q23q90l93
$$ -620 -632 -153 387 714 -45 -796 -1383 -965 -422 549 105 -688 -1738 -1856 -917 -509 -303 -1126 -2016 -2409
3715b409P41M96N05k79j116o10J4Q35J051l41r89r57J94M90K91N46j96p24o99
$$ -2409 -1668 -1172 -667 -946 -2062 -2672 -2658 -1823 -772 -1113 -2102 -3059 -2865 -2375 -2084 -1538 -1734 -2458 -3157
3734c157k62Q35P68j62n46j235L70O23O27R4l08j246L73J47N58N05p5o80r48K98
$$ -3157 -3419 -2584 -1816 -1978 -2524 -3759 -3389 -2766 -2139 -2045 -2353 -3599 -3226 -3079 -2521 -2016 -2091 -2771 -3719 -3421
3754c421P34Q08K41o04r55K23P9O49M55O5j048J6P9K67O56P0n26o90P8O75L61
$$ -3421 -2687 -1879 -1638 -2242 -3197 -2974 -2895 -2246 -1791 -1726 -2774 -2758 -2679 -2412 -1756 -1686 -2212 -2902 -2824 -2149 -1788
3775a788J69l3l99n77L51O34Q28q8m31n48J6M63N28L69n08j07k15m7P59o0Q3p7
$$ -1788 -1619 -1652 -2051 -2628 -2277 -1643 -815 -903 -1334 -1882 -1866 -1403 -875 -506 -1014 -1121 -1336 -1383 -624 -684 -601 -678
3797f78m83L61K47M14r4j96r4j36J69L82K41K4Q9n2l80M6M34K61q4K7q7J65K24
$$ -678 -1161 -800 -553 -139 -233 -429 -523 -659 -490 -108 133 157 246 194 -186 -140 294 555 471 498 411 576 800
3820H00j41M3K83j39j56O2L2L20K01j84o1K22j28j19NR9J01M1p1M3M2N09m2l06
$$ 800 659 702 985 846 690 752 784 1104 1305 1121 1060 1282 1154 1035 1040 1139 1240 1281 1210 1253 1295 1804 1762 1456
3844A456k98L48K8j34J37K80k59n9o57J034J71M2k43n10l11M11N27O0J39k55j63
$$ 1456 1158 1506 1534 1400 1537 1817 1558 1499 842 1876 2047 2089 1846 1336 1025 1436 1963 2023 2162 1907 1744
3865A744k09o4N76M40j93n05l93K66M72L4J99q69M50k26j7Q42rk96o63j00J54
$$ 1744 1535 1471 2047 2487 2294 1789 1396 1662 2134 2168 2367 1498 1948 1722 1705 2547 2538 2242 1579 1479 1633
3886A633N37L84L2p57m90L3N28L32K1k65l00m57K73O63M67k91q40m69J37P31L66
$$ 1633 2170 2554 2586 1829 1339 1372 1900 2232 2253 1988 1688 1231 1504 2167 2634 2343 1503 1034 1171 1902 2268
3907B268K64r13m95j52N22M46K3O7p67p47K81N95P94l39r40m31r2P05O09l15n0
$$ 2268 2532 1619 1124 972 1494 1940 1963 2030 1263 516 797 1392 2186 1847 907 476 384 1089 1698 1383 1333
3928A333p78n90K78M95O27j3q71r95J43O53O65n7r59m84j4N31J40M67k79j058
$$ 1333 555 -35 243 738 1365 1352 481 -514 -371 282 947 890 -69 -553 -567 -36 104 571 292 -766
3948g66l65J58O87L16j01o55p38j6K37P58L14n33q78l70J84M95N74l63r89m20
$$ -766 -1131 -973 -286 30 -71 -726 -1464 -1480 -1243 -485 -171 -704 -1582 -1952 -1768 -1273 -699 -1062 -2051 -2471
3968b471j83O89O73N1o68m79m60L27N14N48m15n01n08N6P52O9n2l58n36J28M37
$$ -2471 -2654 -1965 -1292 -1241 -1909 -2388 -2848 -2521 -2007 -1459 -1874 -2375 -2883 -2827 -2075 -2006 -2058 -2416 -2952 -2824 -2387
3989b387L24J56n18l94m77J17Q35K40j74n89j20J64K10M47Q1l64j20n08O01J35
$$ -2387 -2063 -1907 -2425 -2819 -3296 -3179 -2344 -2104 -2278 -2867 -2987 -2823 -2613 -2166 -2085 -2449 -2569 -3077 -2476 -2341
4009b341L58k39k06l67J43O16M84l68j69k99K4L78N62J28l26j05m58K85N70L96
$$ -2341 -1983 -2222 -2428 -2795 -2652 -2036 -1552 -1920 -2089 -2388 -2364 -1986 -1424 -1296 -1622 -1727 -2185 -1900 -1330 -934
4029i34j56m08l51M31L71K61Q4q7k25k06k0Q37J63k94k95j00O04L16k24n1r5o5
$$ -934 -1090 -1498 -1849 -1418 -1047 -786 -702 -789 -1014 -1220 -1240 -403 -240 -534 -829 -929 -325 -9 -233 -284 -379 -444
4051d44N84L0L2K2j77j7j53M28K86M11l59j68k83L12Q15j83k66n60L59nN84p8
$$ -444 140 170 202 224 47 30 -123 305 591 1002 643 475 192 504 1319 1136 870 310 669 664 1248 1170
4073A170K04l64k40r7O60N8O7m87L9K28N3O9L36k42j71k07L40L77R2L33r90l22
$$ 1170 1374 1010 770 673 1333 1391 1458 971 1010 1238 1291 1360 1696 1454 1283 1076 1416 1793 1885 2218 1228 906
4095I06L57O53J26r6l19p0k24K42K59L47j8o18m84L19N34L01m19j41n74N49R8
$$ 906 1263 1916 2042 1946 1627 1557 1333 1575 1834 2181 2163 1545 1061 1380 1914 2215 1796 1655 1081 1630 1728
4116A728M41k76m53M07o10K54M88L80n81m92J73oN56R9j73n22j08O3L18L37j48
$$ 1728 2169 1893 1440 1847 1237 1491 1979 2359 1778 1286 1459 1453 2009 2108 1935 1413 1305 1368 1686 2023 1875
4137A875l02n66K74K41L47K10m47m20L7k08M67L85m68O6m27O5J03N26j17j88n28
$$ 1875 1573 1007 1281 1522 1869 2079 1632 1212 1249 1041 1508 1893 1425 1491 1064 1129 1232 1758 1641 1453 925
4158I25j84J42N47Q1j29l44l70J79MN60k60j88j83n77L34M31r9j77k21j92J40
$$ 925 741 883 1430 1511 1382 1038 668 847 851 1411 1151 963 780 203 537 968 869 692 471 279 419
4179D19J24Q6m3l91k06k68K87J6J14k66l69l24K60K59q9J89m30k52K97l1K27n10
$$ 419 543 629 586 195 -11 -279 8 24 138 -128 -497 -821 -561 -302 -391 -202 -632 -884 -587 -618 -391 -901
4201i01R1l25J6K04p2N5m08K2kk2R4l28j05O2k05J49k02J90j15j73r1M6K43k0
$$ -901 -810 -1135 -1119 -915 -987 -932 -1340 -1318 -1320 -1342 -1248 -1576 -1681 -1619 -1824 -1675 -1877 -1687 -1802 -1975 -2066 -2020 -1777 -1797
4225a797k58l99K93lK35n0lk74j96m4L0L39K2j39n87K43K89K58l4j87k69m4N13
$$ -1797 -2055 -2454 -2161 -2164 -1929 -1979 -1982 -2256 -2452 -2496 -2466 -2127 -2105 -2244 -2831 -2588 -2299 -2041 -2075 -2262 -2531 -2575 -2062
4248b062j96K23K5o74K60J74L03Q3K33n30l12m7P99K49j87k19m47K79K57M23Q2
$$ -2062 -2258 -2035 -2010 -2684 -2424 -2250 -1947 -1864 -1631 -2161 -2473 -2520 -1721 -1472 -1659 -1878 -2325 -2046 -1789 -1366 -1284
4269a284j03m28J5Q1O97L72m84l04k70L67O81O5k08j79J4q9L44M09J63r9m48j52
$$ -1284 -1387 -1815 -1800 -1719 -1022 -650 -1134 -1438 -1708 -1341 -660 -595 -803 -982 -968 -1057 -713 -304 -141 -240 -688 -840
4291h40O52K08R6M23o02l56LP34J40J48j78m39l05M68M49P14l82n10k76K66O21
$$ -840 -188 20 116 539 -63 -419 -416 318 458 606 428 -11 -316 152 601 1315 933 423 147 413 1034
4312A034N42n5o78l61K19K37N08J24j62n45m13O55O43J63J43p25n55kL15Q50K16
$$ 1034 1576 1521 843 482 701 938 1446 1570 1408 863 450 1105 1748 1911 2054 1329 774 772 1087 1937 2153
4333B153k69r30j63M94Q76r9j53n46k95K14K03O99L46o88n73m03M07Q89K55k69
$$ 2153 1884 954 791 1285 2161 2062 1909 1363 1068 1282 1485 2184 2530 1842 1269 866 1273 2162 2417 2148
4353B148p61m18K25P28J97m9m48o07J17J30P17L28n01o05l61J76R10L91k76n94
$$ 2148 1387 969 1194 1922 2119 2070 1622 1015 1132 1262 1979 2307 1806 1201 840 1016 1926 2317 2041 1447
4373A447m48j6L40L57M36l64m27n61L49M54O45k51n71q49L53O58J33J47n50m20
$$ 1447 999 983 1323 1680 2116 1752 1325 764 1113 1567 2212 1961 1390 541 894 1552 1685 1832 1282 862
4393H62j18L15L80L34r3o91l16OL28N06k02l50l88J73LM61m7k5l47n21j8P16l48
$$ 862 744 1059 1439 1773 1680 989 673 679 1007 1513 1311 961 573 746 749 1210 1163 1138 791 270 252 968 620
4416F20L91o44m00J1K08L63R4j55l36m35J09N50K14k19n79O7l85M30j41K12j40
$$ 620 1011 367 -33 -22 186 549 643 488 152 -283 -174 376 590 371 -208 -141 -526 -96 -237 -25 -165
4437a65n56lj14K82K11J03n82m05L11K86r6L84o30lj98k00J53R4l5l4r1l77K82
$$ -165 -721 -724 -838 -556 -345 -242 -824 -1229 -918 -632 -728 -344 -974 -977 -1175 -1375 -1222 -1128 -1163 -1197 -1288 -1665 -1383
4460a383L9J17k78J62m84J96J03l55J53O6l23K00l41L79j38J4J32j76k78M89j93
$$ -1383 -1344 -1227 -1505 -1343 -1827 -1631 -1528 -1883 -1730 -1664 -1987 -1787 -2128 -1749 -1887 -1873 -1741 -1917 -2195 -1706 -1899
4481a899N5k81k25M06m11J37J00K59n5l66N4M4K85k09J84K9l8k96p8M34K62j63
$$ -1899 -1844 -2125 -2350 -1944 -2355 -2218 -2118 -1859 -1914 -2280 -2226 -2182 -1897 -2106 -1922 -1893 -1931 -2227 -2305 -1871 -1609 -1772
4503a772k10j96J6L00L15R0j60Q4k59J10K61m5M48l15m18K77O5N89k19J01n06
$$ -1772 -1982 -2178 -2162 -1862 -1547 -1457 -1617 -1533 -1792 -1682 -1421 -1466 -1018 -1333 -1751 -1474 -1409 -820 -1039 -938 -1444
4524a444J85P7K65P8K16j11l10pO05M03j1j94n70K87K67J22J93J2j15p1L2L66
$$ -1444 -1259 -1182 -917 -839 -623 -734 -1044 -1051 -446 -43 -54 -248 -818 -531 -264 -142 51 63 -52 -123 -91 275
4546B75L24J56l49j59l09L20N58M40l65M3l90O1J98O20J6m44l35k96N56M77J06
$$ 275 599 755 406 247 -62 258 816 1256 891 934 544 605 803 1423 1439 995 660 364 920 1397 1503
4567A503l20l89M4M81K49J0K46l21l51r1K85P40J29o46j95p8j02P21J33ol43l74
$$ 1503 1183 794 838 1319 1568 1578 1824 1503 1152 1061 1346 2086 2215 1569 1374 1296 1194 1915 2048 2042 1699 1325
4589A325j55J85P74k24qo59l3M22oP00p52O9j87j86J46L75L9J58r60K9L13M16
$$ 1325 1170 1355 2129 1905 1897 1238 1205 1627 1621 2321 1569 1638 1451 1265 1411 1786 1825 1983 1023 1052 1365 1781
4611A781M76m34p75J03J13J09K90j10K8m93l92O16L97J49l01o22J69j89N17J16
$$ 1781 2257 1823 1048 1151 1264 1373 1663 1553 1581 1088 696 1312 1709 1858 1557 935 1104 915 1432 1548
4631A548k05k95m04J56J6L96Q7k55l00m80O03K32J57q2n18k03K02J27J84N8k57
$$ 1548 1343 1048 644 800 816 1212 1299 1044 744 264 867 1099 1256 1174 656 453 655 782 966 1024 767
4652G67m92l3J52M14M4k85l30l38K21M47l0l1m08o6K12p5K12K76m70k46k31K39
$$ 767 275 242 394 808 852 567 237 -101 120 567 537 506 98 32 244 169 381 657 187 -59 -290 -51
$$ [...]
8191b62
##END NTUPLES=NMR FID
##END=
