##TITLE=1H_LacPbMe-C2-m-f4
 CDCl3, 8 sc, 
 25.10.2019
##JCAMPDX= 6.0         $$ Bruker NMR JCAMP-DX V2.0
##DATA TYPE= NMR FID
##DATA CLASS= NTUPLES
##ORIGIN= UXNMR, Bruker Analytische Messtechnik GmbH
##OWNER= root
$$ XWIN-NMR		Version 3.5
$$ Fri Oct 25 14:07:18 2019 Russian Standard Time (UT+4h)  she@DPX200
##.OBSERVE FREQUENCY= 200.1315
##.OBSERVE NUCLEUS= ^1H
##.DELAY= (6, 6)
##.ACQUISITION MODE= SIMULTANEOUS
##.ACQUISITION SCHEME= undefined
##.AVERAGES= 8
##.DIGITISER RES= 18
##SPECTROMETER/DATA SYSTEM= spect
##.PULSE SEQUENCE= zg30
##.SOLVENT NAME= CDCl3
##.SHIFT REFERENCE= (INTERNAL, CDCl3, 0, 15.7039)
##AUDIT TRAIL= $$ (NUMBER, WHEN, WHO, WHERE, WHAT)
$$ ##TITLE= Audit trail, XWIN-NMR		Version 3.5
$$ ##JCAMPDX= 5.01
$$ ##ORIGIN= Bruker BioSpin GmbH
$$ ##OWNER= she
$$ F:/spectra/data/she/nmr/H-F/1/audita.txt
$$ ##AUDIT TRAIL=  $$ (NUMBER, WHEN, WHO, WHERE, WHAT)
(   1,<2019-10-25 14:06:04.26 +0400>,<she>,<DPX200>,
      <created by zg, POWCHK disabled, PULCHK disabled
       configuration hash MD5:
       00 E9 B6 7A A2 85 ED C7 34 08 36 98 17 FE 4E 26
       data hash MD5: 16K
       65 7E 22 E3 C9 C4 C7 3F 07 FD 8B F8 72 FB 9C 0C>)
$$ ##END=
$$ 
$$ hash MD5
$$ ED 17 71 DD 38 D6 4C 24 4E 12 7F 65 D2 37 F9 E6
##$RELAX= 
##$RELAX= 
##$RELAX= 
##$RELAX= 
##$RELAX= 
##$RELAX= 
$$ Bruker specific parameters
$$ --------------------------
##$DU= <F:/spectra>
##$EXPNO= 1
##$NAME= <H-F>
##$PROCNO= 1
##$TYPE= <nmr>
##$USER= <she>
##$AMP= (0..31)
100 100 100 100 100 100 100 100 100 100 100 100 100 100 100 100 100 100 
100 100 100 100 100 100 100 100 100 100 100 100 100 100 
##$AQSEQ= 0
##$AQ_mod= 1
##$AUNM= <au_zg>
##$AUTOPOS= <>
##$BF1= 200.13
##$BF2= 200.13
##$BF3= 200.13
##$BF4= 200.13
##$BF5= 200.13
##$BF6= 200.13
##$BF7= 200.13
##$BF8= 200.13
##$BYTORDA= 1
##$CFDGTYP= 0
##$CFRGTYP= 5
##$CHEMSTR= <none>
##$CNST= (0..31)
1 1 145 1 1 1 1 1 1 1 1 1 1 1 1 1 1 1 1 1 1 1 1 1 1 1 1 1 1 1 1 1 
##$CPDPRG= <>
##$CPDPRG1= <>
##$CPDPRG2= <>
##$CPDPRG3= <>
##$CPDPRG4= <mlev>
##$CPDPRG5= <mlev>
##$CPDPRG6= <mlev>
##$CPDPRG7= <mlev>
##$CPDPRG8= <mlev>
##$CPDPRGB= <>
##$CPDPRGT= <>
##$D= (0..31)
0 1.2 0 0 0 0 0 0 0 0.06 0 0.03 0 0 0 0 0.0002 0 0 0 0 0 0 0 0 0 0 0 0 
0 0 0 
##$DATE= 1571997963
##$DBL= (0..7)
120 120 120 120 120 120 120 120 
##$DBP= (0..7)
150 150 150 150 150 150 150 150 
##$DBP07= 0
##$DBPNAM0= <>
##$DBPNAM1= <>
##$DBPNAM2= <>
##$DBPNAM3= <>
##$DBPNAM4= <>
##$DBPNAM5= <>
##$DBPNAM6= <>
##$DBPNAM7= <>
##$DBPOAL= (0..7)
0.5 0.5 0.5 0.5 0.5 0.5 0.5 0.5 
##$DBPOFFS= (0..7)
0 0 0 0 0 0 0 0 
##$DE= 6
##$DECBNUC= <off>
##$DECIM= 24
##$DECNUC= <off>
##$DECSTAT= 4
##$DIGMOD= 1
##$DIGTYP= 9
##$DL= (0..7)
0 120 120 120 120 120 120 120 
##$DP= (0..7)
150 150 150 150 150 150 150 150 
##$DP07= 0
##$DPNAME0= <>
##$DPNAME1= <>
##$DPNAME2= <>
##$DPNAME3= <>
##$DPNAME4= <>
##$DPNAME5= <>
##$DPNAME6= <>
##$DPNAME7= <>
##$DPOAL= (0..7)
0.5 0.5 0.5 0.5 0.5 0.5 0.5 0.5 
##$DPOFFS= (0..7)
0 0 0 0 0 0 0 0 
##$DQDMODE= 0
##$DR= 18
##$DS= 0
##$DSLIST= <SSSSSSSSSSSSSSS>
$$ [...]
##$SUBNAM2= <"">
##$SUBNAM3= <"">
##$SUBNAM4= <"">
##$SUBNAM5= <"">
##$SUBNAM6= <"">
##$SUBNAM7= <"">
##$SUBNAM8= <"">
##$SUBNAM9= <"">
##$SW= 24.0689530833862
##$SWIBOX= (0..15)
0 0 2 0 0 0 0 0 0 0 0 0 0 0 0 0 
##$SW_h= 4816.95568400771
##$TD= 16384
##$TD0= 1
##$TE= 0
##$TE2= 300
##$TE3= 300
##$TEG= 300
##$TL= (0..7)
0 120 120 120 120 120 120 120 
##$TP= (0..7)
150 150 150 150 150 150 150 150 
##$TP07= 0
##$TPNAME0= <>
##$TPNAME1= <>
##$TPNAME2= <>
##$TPNAME3= <>
##$TPNAME4= <>
##$TPNAME5= <>
##$TPNAME6= <>
##$TPNAME7= <>
##$TPOAL= (0..7)
0.5 0.5 0.5 0.5 0.5 0.5 0.5 0.5 
##$TPOFFS= (0..7)
0 0 0 0 0 0 0 0 
##$TUNHIN= 0
##$TUNHOUT= 0
##$TUNXOUT= 0
##$USERA1= <user>
##$USERA2= <user>
##$USERA3= <user>
##$USERA4= <user>
##$USERA5= <user>
##$V9= 5
##$VALIST= <valist>
##$VCLIST= <CCCCCCCCCCCCCCC>
##$VD= 0
##$VDLIST= <DDDDDDDDDDDDDDD>
##$VPLIST= <PPPPPPPPPPPPPPP>
##$VTLIST= <TTTTTTTTTTTTTTT>
##$WBST= 1024
##$WBSW= 4
##$XGAIN= (0..3)
0 0 0 0 
##$XL= 0
##$YL= 0
##$YMAX_a= 152649
##$YMIN_a= -235491
##$ZGOPTNS= <>
##$ZL1= 120
##$ZL2= 120
##$ZL3= 120
##$ZL4= 120
##$ABSF1= 10
##$ABSF2= 0
##$ABSG= 5
##$ABSL= 3
##$ALPHA= 0
##$AQORDER= 0
##$ASSFAC= 0
##$ASSFACI= 0
##$ASSFACX= 0
##$ASSWID= 0
##$AUNMP= <proc_1d>
##$AZFE= 0.1
##$AZFW= 0.1
##$BCFW= 1
##$BC_mod= 2
##$BYTORDP= 1
##$COROFFS= 0
##$CY= 11.3945322036743
##$DATMOD= 1
##$DC= 2
##$DFILT= <>
##$DTYPP= 0
##$F1P= 19.5091578491511
##$F2P= -0.509923556040331
##$FCOR= 0.5
##$FTSIZE= 0
##$FT_mod= 4
##$GAMMA= 1
##$GB= 0.15
##$INTBC= 1
##$INTSCL= 1
##$ISEN= 128
##$LB= 0.24
##$LEV0= 0
##$LPBIN= 0
##$MAXI= 10000
##$MC2= 0
##$MEAN= 0
##$ME_mod= 0
##$MI= 1.114404
##$NCOEF= 0
##$NC_proc= 0
##$NLEV= 6
##$NOISF1= 3.799351
##$NOISF2= 2.8
##$NSP= 1
##$NTH_PI= 0
##$NZP= 0
##$OFFSET= 15.70392
##$PC= 1
##$PHC0= -9568.826
##$PHC1= 11.20083
##$PH_mod= 1
##$PKNL= yes
##$PPARMOD= 0
##$PSCAL= 0
##$PSIGN= 0
##$REVERSE= no
##$SF= 200.130013532006
##$SI= 16384
##$SIGF1= 3
##$SIGF2= 2
##$SINO= 400
##$SIOLD= 16384
##$SREGLST= <1H.CDCl3>
##$SSB= 0
##$STSI= 0
##$STSR= 0
##$SW_p= 3612.71676300578
##$SYMM= 0
##$S_DEV= 0
##$TDeff= 0
##$TDoff= 0
##$TI= <>
##$TILT= no
##$TM1= 0
##$TM2= 0
##$TOPLEV= 0
##$USERP1= <user>
##$USERP2= <user>
##$USERP3= <user>
##$USERP4= <user>
##$USERP5= <user>
##$WDW= 1
##$XDIM= 8192
##$YMAX_p= 0
##$YMIN_p= 0
$$ End of Bruker specific parameters
$$ ---------------------------------
##NTUPLES= NMR FID
##VAR_NAME=  TIME,          FID/REAL,        FID/IMAG
##SYMBOL=    X,             R,               I
##VAR_TYPE=  INDEPENDENT,   DEPENDENT,       DEPENDENT
##VAR_FORM=  AFFN,          ASDF,            ASDF
##VAR_DIM=   8192,          8192,            8192
##UNITS=     SECONDS,       ARBITRARY UNITS, ARBITRARY UNITS
##FACTOR=    0.0002076,     1,               1
##FIRST=     0,             0,               0
##LAST=      1.7004516,     0,               0
##MIN=       0,             -235491,         0
##MAX=       1.7004516,     152649,          0
$$ Real data points
##PAGE= N=1
##DATA TABLE= (X++(R..R)), XYDATA
$$ [...]
2199d1N0Q33K24j018K25O05l44m93j86Q81J09n83N7Q5l52L91M32m08p96K09L92
2220B72J13j27R1M25j143n49M21J211O2l91q59p00L87R58O11o56n30n08L4J90
2240f88L11Q24L06j621q94K85J411J045n40j223p73N83M36N95K47M8p00j215l74
2259a937J319J699j89j884r84P78Q38Q82j39o72m24n29j26R47J419M56j720j981
2277b247N28K266R91r23j051o22M24K18O44J194K95j764j588m0J816J923j06k077
2295a19j457P54J588j8l03L50k51j382o91J744K329l27k405j528R36J782Q01l73
2313A430o07n95q24K01P31J323L25j183k378K8K584J407j226j733k51P40%L8J169
2332A179J050j596j904j57K137J560n97j528j296L14J083J104m01r51q1m91p44
$$ plain form
2199 -41 9 842 1066 48 273 878 534 41 -145 736 845 262 319 404 52 443 875 467 -329 -120 272
2220 272 385 258 349 774 -369 -918 -497 714 776 385 -474 -1174 -787 171 782 126 -404 -912 -878 -688
2240 -688 -377 447 753 -868 -1762 -1477 -66 979 439 -784 -1557 -974 -538 57 304 352 -348 -1563 -1937
2259 -1937 -618 1081 892 -992 -1976 -1198 -360 522 383 -289 -713 -1242 -1368 -421 998 1454 -266 -2247
2277 -2247 -1719 547 1538 615 -436 -1058 -634 -416 228 1422 1717 -47 -1635 -1675 141 2064 1958 -119
2295 -119 -1576 -822 766 748 445 795 544 -838 -1529 215 2544 2217 -188 -1716 -780 1002 1803 1430
2313 1430 823 228 -596 -395 336 1659 1984 801 -1577 -1549 1035 2442 1216 -517 -768 -28 -28 10 1179
2332 1179 2229 633 -1271 -1428 709 2269 1672 144 -1152 -838 245 1349 948 -3 -84 -575 -1319
2349a319O87K002N29k468j924J080K128K96p54n71j80m46k5R65J123n30q61j080
2367a348j32J064J790m60j768q54O91J103L2L4J24o16j420J44J594J101r00j196
2385a017m15J31Q77Q42k11p21p24J09O20O01K53K16q51j053j05J740M32l14r38
2404e28l01MJ055K61k00o39q1k77J56Q03N07J26j356p30L93J338P14n51r94m22
2424g22L91Q18J46k81M88o21n76L67N86J260j175r46o87J141J111J08q37m64m13
2443c06K87M97M88J54k28p82j115N78J854N64j597j000K32N83O01l8j12k97o49
2462b86l88N23J012N13l22j886o56J589J603p96j505o5P21k51j3J64J069o29j721
2481a324k88J294J421j00j109j493J96J286N88l71m60L58n54r96N20J716O17j547
$$ plain form
2349 -1319 -632 1370 1899 -569 -2493 -1413 715 1011 257 -314 -494 -940 -965 0 1123 593 -268 -1348
2367 -1348 -1480 -416 1374 914 -854 -1708 -1017 86 118 152 276 -340 -1760 -1616 -22 1079 179 -1017
2385 -1017 -1432 -1301 -424 418 207 -514 -1238 -1129 -509 92 345 561 -290 -1343 -1448 292 724 410 -528
2404 -528 -829 -825 230 491 291 -348 -429 -706 -550 253 760 886 -470 -1200 -807 531 1245 694 -300 -722
2424 -722 -331 487 633 352 840 219 -357 10 596 1856 681 -265 -952 189 1300 1408 571 107 -306
2443 -306 -19 478 966 1120 892 110 -1005 -427 1427 1991 394 -606 -374 209 810 772 660 363 -286
2462 -286 -674 -151 861 1374 1052 -834 -1490 99 1702 906 -599 -664 57 -194 -207 -43 1026 397 -1324
2481 -1324 -1612 -318 1103 1003 -106 -1599 -1403 -117 471 100 -360 -2 -556 -1552 -1032 684 1301 -246
2499b46k090O83J730O24r35m73K77m27o63Q02Q37P44r41j711j97J414J631m77
2517E82j398o00O22Q08N7l23M52L40j593q78J480J696j25j840o16N76R74K44j15
2536C43J7l43n79%L92R52K31p91j382l62J513J682o28j330K0N49m31j1O15J003
2556A460o53j427J17R81Q67N1j261k27l6N10M08k07j1j54m03p30Q66R37Ro90r07
2577e00P15K87L95j80m55l4o5j36L29j16L73kr28J87L78N5j32l36Q5J09J64Q3
2599B76k79l02M1O13j66l51R0J2J60p62L67J97Q0k57n29L80M80N2k67m76l8M58
2621b21K86j65m63J68K98l33l75N22N07l69j254O8J022O37k85o79j17m9K35N26
2641d1K75J97l70j378r7O98J470J06j293j022J76J062K62l0nO7p01k47n9J513
$$ plain form
2499 -246 -2336 -1653 77 701 -234 -707 -430 -857 -1520 -718 119 863 -78 -1789 -1986 -572 1059 582
2517 582 -816 -1416 -794 14 71 -252 200 540 -1053 -1931 -451 1245 1120 -720 -1336 -760 214 458 343
2536 343 360 17 -562 -562 -170 782 1013 222 -1160 -1522 -9 1673 1045 -285 -265 284 -147 -158 457 1460
2556 1460 807 -620 -503 478 1345 1396 135 -92 -128 382 790 583 572 418 15 -715 151 1088 1097 407 -500
2577 -500 215 502 897 717 262 228 163 27 356 240 613 611 -317 -130 248 303 171 -165 -80 29 193 276
2599 276 -3 -305 -264 349 183 -168 -78 -66 94 -668 -301 -104 -24 -281 -810 -430 50 102 -165 -641 -679 -221
2621 -221 65 -100 -563 -395 -97 -430 -805 -283 224 -145 -1399 -1331 -309 328 43 -636 -753 -802 -567 -41
2641 -41 234 431 61 -1317 -1414 -716 754 860 -433 -1455 -1279 -217 45 15 10 77 -624 -871 -930 583
2661E83R37p56k047k63J272J423n10p01j83o2j01J7J088J014j024j616l83J228
2679h4J609K47j767j018M11J146K67l99O76J81j658j095J382K427O7j997j793
2696a398N24J477L68K54k04n97j266r4R07J426O56r48j797p49J458J705p0j529
2714A23n07j57j57K29J299J011q96j878j167J844J757Q1j284p33n72M87N75O26
2732F81R8o57q81l67O5J592J130j258j928n12J805J077o8r51j39p89n12P44J780
2751I10M4j374j007n62J397J333M57r61j351q99R29J095K50M59l72j322q20M37
2769a357K328L74j269j312k06N14P73P27O85j700o86L5Q95O64L99m32o43r80K18
2788i73J485M70l69r72o5L16k75P91J89l3r43l83M96J137L79n82j107K06Q3P57
$$ plain form
2661 583 1520 764 -1283 -1546 -274 1149 639 -62 -245 -307 -408 -391 697 1711 687 -929 -1312 -84
2679 -84 1525 1772 5 -1013 -602 544 811 412 1088 1269 -389 -1484 -102 2325 2392 395 -1398
2696 -1398 -874 603 971 1225 1021 424 -842 -936 -29 1397 2053 1105 -692 -1441 17 1722 1652 123
2714 123 -384 -541 -698 -469 830 1841 945 -933 -2100 -256 1501 1582 298 -435 -1007 -520 55 681
2732 681 779 122 -759 -1126 -1061 531 1661 403 -1525 -2037 -232 845 777 -174 -313 -1102 -1614 -870 910
2751 910 954 -420 -1427 -1989 -592 741 1198 237 -1114 -2013 -1084 11 261 720 348 -974 -1794 -1357
2769 -1357 971 1345 76 -1236 -1442 -928 -155 572 1257 -443 -1129 -1094 -199 465 864 432 -211 -1191 -973
2788 -973 512 982 613 -359 -424 -108 -383 408 597 564 -379 -762 -266 871 1250 668 -439 -233 -150 607
2808F07N06m22o29l58O12J15J28J89L77r53j219Q00J739L9j142p44K72J75N7P4
2828B23Q79m73l98l53J82O04N05k67p23q18K77J657n82p96L4Q96n18j225O09J252
2848I65k73j011m58J001N08k63o37m95N97Q0L96p53j68M22J5m31k09P71Q43j062
2868a62j518P64J590j0j307l00P79L47o47j85O22L05p96m80L37R66j43j27j196
2887a161J36J000N83p55p72L00M67J84j174N82J244n60j065l99J725N55p44r33
2905g87M5R88j22o2J15j9j25m63l53P55L53M80r26j076M77J276J94q00k06L29
2925G3k5n06N44J017q1j002r02N71R73O1k76o12R8K38J93n1L28j34l37n85N5Q82
2947E22P89o13o82o76M98Q55J76l72j95n04R7J03L59N14k92o63l28J00P71LL35
$$ plain form
2808 607 1113 691 62 -296 316 431 559 748 1125 172 -1047 -247 1492 1531 389 -355 -83 92 149 223
2828 223 1102 629 231 -122 60 664 1169 902 179 -639 -362 1295 713 -83 -49 847 329 -896 -287 965
2848 965 692 -319 -777 224 732 469 -168 -663 -66 14 410 -343 -511 -89 -74 -505 -714 57 900 -162
2868 -162 -1680 -916 674 664 -643 -943 -164 183 -464 -649 -27 278 -518 -998 -661 305 162 35 -1161
2887 -1161 -1025 -25 558 -197 -969 -669 -202 -18 -1192 -610 634 74 -991 -1390 335 890 146 -787
2905 -787 -742 246 124 62 177 158 33 -430 -783 -28 325 805 -121 -1197 -720 556 750 -50 -256 73
2925 73 48 -458 86 1103 1022 20 -882 -311 662 723 447 -165 -67 171 364 313 641 507 170 -415 -360 522
2947 522 1311 698 16 -660 -162 693 869 497 302 -202 -105 -2 357 871 579 -84 -412 -312 459 462 797
2968G97n75o23J99M62K73k55j36l6p59K08N14M90j67n33m10l0N94N56mj060J1
2989d84J6M52j4o0K3p0q34J09R87M69n00o01k44J98N86j09j48k36j82K00k3J35
3011c30O08o8q92n05M40J118R3r12q01Q90O3K36l32L28o0k75l97R3P32N70m59
3032A40j092K84P38Q88q01n83k15R19o7o31P97M93l55j186j60J293M65r5j284
3051d52Q6J73P46m07j5K43K04l60o32N03R93K38j376n82N14R92Q1p86j70K60r9
3072A54k44l4Q22L90o58j022n1J168Q33o60j157j31Q83M10m23n4L14j73p81q7
3092e01Q19R52j07j681l81Q83M91J94m41j33m04m26L85K84Q47o3j057j005N09
3111h35J611L71p22j332j62O44J80N66Q3j13o91j212N70R98R19n90o19p85J92
$$ plain form
2968 797 222 -401 -202 260 533 278 142 106 -653 -445 69 559 392 -141 -551 -581 13 569 565 -495 -484
2989 -484 -468 -16 -30 -90 -67 -137 -971 -862 125 594 94 -507 -751 -553 33 -76 -224 -460 -642 -442 -465 -330
3011 -330 278 210 -682 -1187 -747 371 464 -448 -1249 -359 -296 -60 -392 -64 -124 -399 -796 -703 29 599 140
3032 140 -952 -668 70 958 157 -426 -641 278 211 -420 377 870 515 -671 -831 462 927 832 -452
3051 -452 -366 -193 553 146 131 374 578 218 -414 89 1082 1320 -56 -638 -124 868 949 163 -7 253 154
3072 154 -90 -124 698 1088 430 -592 -643 525 1358 698 -459 -590 293 703 280 226 540 367 -414 -501
3092 -501 318 1270 1163 -518 -899 -16 475 669 228 95 -309 -735 -350 -66 781 718 -339 -1344 -835
3111 -835 776 1147 425 -907 -1069 -425 -245 321 404 291 -400 -1612 -1042 -44 875 285 -334 -1119 -927
3130i27J099J48o0o62K5o98J51Q45O81j66j425p16M90J161N86kp71o17J04L58
3150c96P80K01l27p68o21Q7J024Q42j32j006o54J15O71Q84j53o42k94k81J54N97
3170H1P59j4q63q89J11P62P46N26j032p64k8N40Q37O6j02j92p32k98K38J411J80
3191A343j215k78j78O85L19o8M3m10n91L06K22L44M35k91j049l08Q78R72m84o96
3211b1j45L51o4j10K85Q23q19p10k07N96Q67q5l82n23l94O40K29j81K40k51k96
3232a57k77l33J079Q14r51j008j36J412l9q59R6P10j47q69j48O63K94p7p11m41
3252a085M92R25k95p50J46N67J30l49p80Q23N10p45n37J89Q47L53r46r2M82L00
3272A85n67q0L0Q39l25n82j15M52K24o9o55K74N32J59n88l21M95M08m4q94L13
$$ plain form
3130 -927 172 320 260 -402 -377 -1075 -924 -79 602 436 -989 -1705 -1215 -54 532 530 -241 -858 -754 -396
3150 -396 384 585 258 -510 -1131 -1044 -20 822 690 -316 -970 -855 -184 700 547 -95 -389 -670 -516 81
3170 81 840 826 -37 -926 -815 -53 693 1219 187 -577 -605 -65 772 838 736 544 -188 -486 -248 1163 1343
3191 1343 128 -150 -328 357 676 608 651 241 -350 -44 178 522 957 666 -383 -691 187 1159 675 -21
3211 -21 -166 185 121 11 296 1119 300 -410 -617 -21 846 761 379 -144 -538 102 331 150 390 139 -157
3232 -157 -434 -767 312 1126 175 -833 -969 443 404 -455 -359 351 204 -665 -813 -150 144 67 -644 -1085
3252 -1085 -593 332 37 -713 -567 0 130 -219 -999 -176 334 -411 -948 -759 88 441 -505 -597 -115 185
3272 185 -382 -462 -432 407 82 -500 -615 -163 61 -8 -663 -389 143 302 -286 -607 -112 296 252 -642 -329
3293c29P02L49o54o32N58J83l78J71J01N68k12p47k14N92M79J87m98j25l9M23
3313D85j7l84M49K85k39j019K90M32Q80o88o20j04N42J75j75J45J00n67j24M63
3333C09M25k22K35o19n30j43Q34M87N1q34j41J15J0k33P02K64o91m18R9N67K27
3354D94k85k17m85k0M55P97m93q59R4M26m24K78M00M56p45q53J10Q49O08m25m86
3375c25j35j30J46L37L06l8l83n16j65J92J232n5o09p25K7P27p3%o5jK1o47L61
3398e18Q07K18o24r78M65O81N7k49k51ML42q6q1K20L88j96n34k77O09O58j60j065
3420e70j04Q09K75n56J83L69J1m85o69Q73Q72k08r17l10L17O08K7l90P3j96K42
3441B54q2k62N57O88n88r66n70J592L51l93r24L03N48k93l48J51P03k34n02m38
$$ plain form
3293 -329 373 722 68 -564 -6 177 -201 -30 71 639 427 -320 -534 58 537 724 226 101 62 485
3313 485 468 84 533 818 579 -440 -150 282 1162 474 -146 -250 292 467 292 437 537 -30 -154 309
3333 309 734 512 747 128 -402 -545 289 776 827 -7 -148 -33 -23 -256 446 710 19 -399 -300 267 494
3354 494 209 -8 -493 -513 -58 739 246 -613 -519 -93 -517 -239 161 617 -128 -981 -871 -22 586 161 -325
3375 -325 -460 -590 -444 -107 199 161 -222 -738 -903 -711 521 466 -143 -868 -841 -114 -187 -187 -252 -253 -232 -879 -518
3398 -518 289 507 -117 -1095 -630 51 108 -141 -392 -388 -46 -132 -213 7 395 199 -335 -612 -3 655 495 -570
3420 -570 -674 135 410 -146 37 406 417 -68 -737 136 1008 800 -117 -427 -110 498 525 135 208 12 254
3441 254 172 -90 467 1155 567 -399 -969 623 974 581 -343 -40 508 215 -133 18 721 487 -15 -453
3461d53J148j61k86q1k51J39N96o8p53j34M54J90l23k18P94j3r47J02K20M86N53
3482I94j344J81K07J88l17q4M22k54j9o30Q4L69O48l35k56q48R63L86n52l36r
3503e42M45j78p03O44O11k56o72k04O55M24l36j90p8k6Q6L91K4l34j08j75M22
3524a00r1J59L66k80r25K03O24L40j06l00j26j86K6M20J49K86m41k64Q6M14J41
3545C95J89l43l05n35P86M62l98l18J41K76p85L43O16K30j40q39k01L84O88j25
3565E21j33k91l0L6K13K90k51K48l42l09m26R29J019r68q30L63L70J15j44K7j9
3586C88l2l81j48N21J53k64l18m05N28M11J41n18J45RK5o21M1O85L34o03q51L52
3608d08R99J6n81l75K54Q1k77j18N17K46k63q62J50N84M56k08p25l49O47M58m61
$$ plain form
3461 -453 695 534 248 167 -84 55 651 583 -170 -304 150 340 17 -201 593 580 -367 -265 -45 441 994
3482 994 -350 -169 38 226 -91 -175 247 -7 -26 -656 -572 -203 445 110 -146 -994 -31 355 -197 -533 -542
3503 -542 -97 -275 -978 -334 277 21 -651 -855 -200 224 -112 -302 -380 -406 -320 71 95 -239 -347 -522 -100
3524 -100 -191 -32 334 54 -871 -668 -44 296 190 -110 -236 -422 -396 24 173 459 18 -246 -160 254 395
3545 395 584 241 -64 -599 187 649 251 -67 74 350 -435 -92 524 754 614 -225 -426 -42 646 521
3565 521 388 97 67 103 316 606 355 603 261 -48 -474 455 1474 506 -324 39 409 524 380 407 388
3586 388 356 -25 -173 348 501 237 -81 -486 42 453 594 76 221 230 255 -366 -325 360 694 91 -760 -408
3608 -408 591 607 26 -349 -95 -14 -291 -409 108 354 91 -771 -621 -37 419 211 -514 -863 -216 242 -219
3629b19j34J84M94r02k05K92J031l92n59p21R24L04n8m89J03M08m01n1k9Q12K7
3650D19q41m57L38L09P29o16k07K49J73q4o42L19O85K53j129k43P68L47j72k06
3670hj90K41N1j19K23k10J70jn18j53Q45M98q71j27K43M61l89k08K65J15o2j86
3692G0j66L45L59j88n56J4J46L19Q6J03k12l29K57m97O61L5J76j16q39L76NM95
3714E44k30l04K37Q1k32j35M16J53J7n76j20k90M19N06k87m14QJ70L0r6J02K9
3736B8j85j63J37m0M95l82j97k31K91L65K31l78r7j87o3K31o7k03P28k94q30N6
3758g55M66N43k02m30j15j42M89j02j5O53m36k69j99NO58qj36p10J12O01k3l48
3780c63Q1K69Q3n42k80R25M13n73m72M3M06M81J33j039L67oN2J44k36N56p7m80
$$ plain form
3629 -219 -353 -169 325 -577 -782 -490 541 149 -410 -1131 -207 97 39 -450 -347 61 -340 -391 -420 392 419
3650 419 -422 -879 -541 -232 497 -119 -326 -77 96 12 -630 -311 374 627 -502 -745 23 370 198 -8
3670 -8 -198 43 94 -25 198 -12 158 157 -361 -514 331 829 -42 -169 74 535 146 -62 203 318 256 70
3692 70 -96 249 608 420 -136 -122 24 343 429 532 320 -9 248 -249 412 447 623 507 -332 44 49 544
3714 544 314 10 247 328 96 -39 377 530 547 -29 -149 -439 -20 486 199 -215 -207 -37 -7 -103 -1 28
3736 28 -157 -320 -183 -223 272 -110 -307 -538 -247 118 349 -29 -126 -313 -376 -145 -212 -415 313 19 -811 -755
3758 -755 -289 254 52 -378 -493 -635 -146 -248 -263 390 -46 -315 -514 -509 149 141 5 -705 -593 8 -15 -363
3780 -363 -282 -13 70 -472 -752 173 586 13 -459 -416 -10 471 604 -435 -68 -74 -22 122 -114 442 365 -115
3802a15o84R32O16l70o31K60K11O2l31J35K49L27o93m63K21Q92J31o09k71J85
3822E4M13l3m8l7m2N9m09j93J53P89N9r31j78P41N7j99l01J81K28k16j20k05M92
3845C14M81o83p08O53Q6K27k40m5J08p9J45m30M63M22o56n52P6N02N97m56n83
3866c58k33P35N8l29N8K62j66k06n94J51P65n7k34m85J60O88k29r6m9L4m9j23
3888b97M7L75k6j63m90J46J72R5J52l57j16K65M2l15M57Pkk95j07J71K30K21m37
3911b25L41k40K3K1J99jO4q6j22k05J44K33M77m51p22N70L27k35m7k84K63L57
3933D01N3j50p7j3Lo2m30M69N02j49n35k19P81r4j78j33p0L62j66j10k14L58J77
3956E06m29n9J3K37M3ol77K95L72l29n5l05N92N3l83p00Q67L43m07p24L49P16
$$ plain form
3802 -115 -799 133 749 379 -252 8 219 281 -50 85 334 661 -32 -495 -274 618 749 140 -131 54
3822 54 467 434 386 349 307 366 -43 -236 -83 706 765 -166 -344 397 454 255 -46 135 363 147 27 -178 314
3845 314 795 112 -596 57 143 370 130 85 193 114 259 -171 292 714 58 -494 -418 84 681 225 -358
3866 -358 -591 144 202 -127 -69 193 27 -179 -773 -622 143 86 -148 -633 -473 215 -14 -110 -159 -125 -174 -297
3888 -297 -250 125 99 -64 -554 -408 -236 -141 11 -346 -462 -197 -155 -470 -13 -6 -8 -303 -410 -239 -9 212 -225
3911 -225 116 -124 -101 -80 119 118 182 96 -26 -231 -87 146 623 172 -550 20 347 112 65 -219 44 401
3933 401 454 304 227 214 217 155 -275 194 696 547 12 -207 574 480 302 169 99 461 295 185 -29 329 506
3956 506 77 18 31 268 311 305 -72 223 595 266 211 -94 498 551 168 -532 335 678 271 -453 -104 612
3978F12n40l2l4JK78k70p3j62R5L70m7m29L67Q4n02n8k43P59j41j82m55O41J66
4001B05q8m77K1Q41j63p82m79R01L62l42k22m38O39q7M0o9l24O42j51n62j92O69
4023e6K58k32o64N50J36j13l06M39K80m19k52l1J45M87k88l45K39K81l50L59l19
4044b01P0K80J09k44j93N01n4j90m17K0Q56j25n13k89L28O64m48j83M96k50k02
4065A5j84M91K4J64j4n23j83J26M10J19l48K33MJ17m03J58K77J32n64r2J69J70
4087B98r2J20N6j70j95o7J72K65m09J77o7j19m3M15N7l77o5q8K09k0j46K45j36
4110B0k71k01L52L11k38N4j62l9k51M41R5j20j65K51l16K7j69N01k3m60k95M96
4132a62M47K4n87q7o2M57j51k3K77J02m71k05K38O0K58k17m67L7K59N27m08l65
$$ plain form
3978 612 72 40 6 7 285 15 -58 -220 -125 245 198 -231 136 220 -282 -340 -583 176 35 -147 -602 39 205
4001 205 117 -360 -339 502 339 -443 -922 -21 341 -1 -223 -661 -22 -109 -69 -138 -462 180 29 -533 -725 -56
4023 -56 202 -30 -694 -144 -8 -121 -427 12 292 -127 -379 -410 -265 222 -66 -411 -172 109 -241 118 -201
4044 -201 -131 149 258 14 -179 322 268 78 -339 -319 537 412 -101 -390 -62 602 154 -29 467 217 15
4065 15 -169 322 346 510 496 -27 -210 -84 326 445 97 330 334 451 48 206 483 615 51 -41 128 298
4087 298 206 326 382 212 17 -50 122 387 -22 155 88 -31 -74 341 398 21 -44 -132 77 57 -89 156 20
4110 20 -251 -452 -100 211 -27 27 -135 -174 -425 16 111 -9 -174 77 -239 -212 -381 120 97 -363 -658 -162
4132 -162 285 309 -278 -365 -427 30 -121 -144 133 235 -236 -441 -203 -143 115 -102 -569 -532 -273 254 -154 -519
4154e19L26N00k28q67O62K51Q5m76j74L46J83k25R6j45K78K8k36k6K58M8j32k15
4176a82q3N21K9K43m46j47M93j96l18k5O58k00m99l56O33K42J79p72K75K74j31
4197A92k3j82L53M05n31m42r3M49P89k68p50O4N16k01j40p5M25p7l73l18K28O93
4219F41j44n40m00N06K29m0k05J28j76J76o56J91L58L3p1l82K03J80J42k82k24
4240c33K15L14j9n45L88L72r5q20J20M40M7N6j89n57K45j46K60M31k56Jk05j87
4262d63J23J62N73j67q90N15L2k61K07J88K91p68J07O9K66J36K66n38j45n9N46
4283A90L23k98l70k48K14n6K98L03r0q4m18j31M55K19j31J5p36M36M6K54J11j53
4305A49J03P2o21K60M44q0l10k92PP13j57Lm22M22N6n28J77J99K70l73k94l38
$$ plain form
4154 -519 -193 307 79 -788 -126 125 210 -266 -440 -94 89 -136 -40 -185 93 121 -115 -141 117 165 33 -182
4176 -182 -265 256 285 528 82 -65 428 232 -86 -111 547 347 -152 -508 125 367 546 -226 49 323 192
4197 192 169 -13 340 745 214 -228 -321 128 917 649 -101 -37 479 278 138 63 488 411 38 -280 -52 641
4219 641 497 -43 -443 63 292 252 47 175 -1 175 -481 -290 68 101 30 -352 -149 31 173 -109 -333
4240 -333 -118 196 177 -368 20 392 297 -523 -403 37 84 140 -49 -606 -361 -507 -247 184 -72 -71 -276 -463
4262 -463 -340 -178 395 228 -662 -147 -115 -376 -169 19 310 -458 -351 -282 -16 120 386 -152 -297 -356 190
4283 190 513 215 -155 -403 -189 -245 53 356 266 182 -236 -367 88 307 176 191 -545 -109 -63 191 302 149
4305 149 252 324 -297 -37 407 327 17 -275 -268 445 288 291 -131 291 347 -181 -4 195 465 92 -202 -540
4327e40O43P27j16n26n65L54J39J61o9j5J20k10l24j2O41k0j60m61J04M47o1j88
4349F9r0L47j68l18o0M79J50Oq27j71N10M42j61m34j61J9M91l1J63P6J04m93p20
4372g78L53N75L31m12l13J2J50J32l17J28N5R9m55j75P52j17j40l35L1J47L79
4393A02j81m42O31k47j61J76R1rK5m31K70LK90J65o58m7L54J81k18O7JM32n38
4416a44k33K44L55r7l66M08m85J69K90k15K93j59J44k68Q8L2q2K37l46K08K00
4437B73m83L71k51j46M22Q9m03n1O06J05n09L3k7J43L05k07Q8j18J69R9k48l3
4459B27J8j85l1NN6P5P9j33l36M70PJ3l79K32K29j82j14k58M70j48p4l41J98j0
4483a12J42J05m01M35j89j34o7l6mM46L3o4o3m34L83l08j64P01j79k80J90l63
$$ plain form
4327 -540 103 830 714 188 -377 -23 116 277 208 193 313 103 -221 -233 408 388 228 -233 -129 318 257 69
4349 69 -21 326 158 -160 -220 259 409 415 -412 -583 -73 369 208 -226 -387 -368 123 92 255 331 435 -58 -778
4372 -778 -425 150 481 69 -244 -232 -82 50 -267 -139 -84 15 -440 -615 137 20 -120 -455 -424 -277 102
4393 102 -79 -521 110 -137 -298 -122 -31 -40 -15 -446 -176 -173 117 282 -376 -423 -69 112 -106 -39 -38 394 -144
4416 -144 -377 -133 222 125 -241 167 -318 -149 141 -74 219 60 204 -64 24 56 -26 211 -135 73 273
4437 273 -210 161 -90 -236 186 275 -128 -179 427 532 23 56 29 172 477 270 358 240 409 508 260 227
4459 227 245 60 29 34 90 165 244 111 -225 245 252 265 -114 118 347 165 51 -207 263 115 41 -300 -102 -112
4483 -112 30 135 -266 169 -20 -154 -221 -257 -261 185 218 154 91 -343 40 -268 -432 269 90 -190 0 -363
4505c63J27M70J39m93j83L17j20q7k3j37o6p3J32K97R3K13m13l92L32p9N18p30
4527e21L27L91l47p0j95M23J01l93j30jM34j4k06l16L28L24n1k08j5L91r4m71
4549c13k10L76J00O24q81k1K43M53j77m88L85L22n08P7j52N32o3k00J9k41L30
4570B07K85l15k69K6J53K01m7j46O11j05o90j70L41K85j36m34J10O25l80m6k71
4591a65N70J29m13k31K83N00j84m87j92K83K24j9m02q7N67j82r1l57L06Q4J02
4612B38n72M15J12o1k21k64L24K92j78j56q7J98P3m38K41J56J10m45J14J53K84
4633B88m9j57m06J90K70r5l33J68J23ll75Q0p4L48J78l77l3j11L11K10l92k1k8
4656b88j0M24k89J26j72K65o10K67O71p5n91K49j13J71J07n2J81q9k91N00m86
$$ plain form
4505 -363 -236 234 373 -120 -303 14 -106 -193 -216 -353 -419 -492 -360 -63 30 243 -170 -562 -230 -309 209 -521
4527 -521 -194 197 -150 -220 -415 8 109 -284 -414 -415 19 5 -201 -517 -189 135 84 -124 -139 252 158 -313
4549 -313 -523 -147 -47 577 -304 -325 -82 371 194 -294 91 413 -95 -18 -170 362 299 99 118 -123 207
4570 207 492 177 -92 -66 87 288 241 95 706 601 -89 -259 82 367 231 -203 -93 532 152 106 -165
4591 -165 405 534 121 -110 173 673 489 2 -190 93 317 298 -104 -191 376 194 103 -254 52 136 238
4612 238 -334 81 193 132 -89 -353 -29 263 85 -71 -158 40 113 -325 -84 72 182 -263 -149 4 288
4633 288 239 82 -324 -134 136 41 -292 -124 -1 -4 -379 -299 -373 -25 153 -224 -257 -368 -57 153 -239 -260 -288
4656 -288 -298 126 -163 -37 -209 56 -554 -287 384 309 -282 -33 -146 25 132 80 261 172 -119 381 -105
4677a05K30k08M40j79n29nO37K76p27m0M72j76j26J37J88j30k30l56R7O78l05
4698C9K20l99j03K65K84K80m39p8J44nn84R8J035k28m47m08K87M63R1m17J43k55
4720a4Q0j60L6K33k28J1j02k6O26p7K25r00m13N82O11l63j4l27J36l40N9M16J92
4743B43J9o31O4L10R6j89L04l44j54m06M57k8N41nn98l08j04J025K8m16k42J28
4765b10J86N9m21N42R7l25m27m4M79J72q6l28j88L36K65Mo8l06L6J45J4k59N76
4788B49J29p56o7K69L36J67m14j19O4o3L5L27k70M89kn65k0K18J93J34k43k93
4810b02J47L20j06m3q4K90q0m93J13O25r9q5n26K27J22J80K27l10l0j76j99K02
4832B0J37K78N4k19k05k6L32j06k06j33L72O2m07j35L31k4k78L68j42J4L29m33
$$ plain form
4677 -105 125 -83 357 178 -351 -356 281 557 -170 -210 262 86 -40 97 285 155 -75 -431 -334 344 39
4698 39 259 -140 -243 22 306 586 147 69 213 208 -376 -278 757 529 82 -326 -39 424 515 98 241 -14
4720 -14 66 -94 -58 175 -53 -42 -144 -170 456 379 604 -296 -709 -127 484 121 107 -220 -84 -424 -365 51 243
4743 243 262 -369 -305 5 101 -88 216 -128 -282 -688 -231 -259 282 277 -321 -629 -733 292 320 -96 -338 -210
4765 -210 -24 35 -386 156 253 -72 -499 -543 -64 108 22 -306 -494 -158 107 111 43 -263 -227 -82 -68 -327 249
4788 249 378 -378 -445 -176 160 327 -87 -206 -142 -205 -170 157 -113 376 374 -191 -211 7 200 334 91 -202
4810 -202 -55 265 159 116 32 322 242 -251 -138 487 388 303 -223 4 126 306 533 223 193 17 -182 20
4832 20 157 435 489 270 65 39 371 265 59 -74 298 360 -47 -182 149 125 -153 215 73 87 416 -17
4854a7k22K28j7L21j59q0l89N03R6m12N8K51j62q2k67O31k36j28j27o3K48p7m2
4877a44Q1k75M87k89k6k81l6M68m45L88m1J5r7J63j66J15L24l97l95L54j23L30
4899A0k33J77K33k35j57O9kr9M32m63pPO09l65j61k06J53L86k73L3J18L91o20
4922b03j56j07N88L48l91m6j71J36J75k08J08J41k85j76J58M87p9k08m27J71K62
4943A17K13Q5m63J22K48j16k19J00L94j72l9l21l6L43N9ol16O3j32J91M9J7L34
4966E15l66j65N6o1J95k8k43j52K13P2J56k23K60m6j7n43K97L39j13j83l50K06
4988a81J54R6j83k16J15NK3m4J88M39n44j93L78K19qj07k84M6J37j12j52L17k06
5011a13K68p31M03M60R2l13n16L27j37K48N1J07k97L16o21K12K96j10L01l99m85
$$ plain form
4854 -17 -239 -11 -28 293 134 54 -335 168 264 -148 -90 161 -1 -83 -350 281 45 -83 -210 -273 -25 -102 -144
4877 -144 -63 -338 149 -140 -166 -447 -483 -15 -460 -72 -113 -98 -195 -32 -198 -83 241 -156 -551 -197 -320 10
4899 10 -223 -46 187 -48 -205 -136 -138 -237 195 -268 -275 -268 341 -24 -185 -391 -238 148 -125 -92 26 417 -203
4922 -203 -359 -466 122 470 79 33 -138 -2 173 -35 73 214 -71 -247 -89 398 319 111 -316 -145 117
4943 117 330 415 -48 74 322 206 -13 87 481 309 270 -51 -87 256 315 309 -7 56 -76 115 164 181 515
4966 515 149 -16 40 -21 174 146 -97 -249 -36 36 192 -31 229 183 166 -377 -80 259 146 -37 -387 -181
4988 -181 -27 69 -114 -330 -215 -210 -187 -231 -43 396 -148 -341 37 256 248 141 -143 -97 40 -72 -224 93 -113
5011 -113 155 -576 -173 287 379 66 -450 -123 -260 -12 39 146 -151 165 -456 -244 52 -58 243 -156 -641
5032f41M74L4L17k3k69l84K80K71j44K55J39m22j9M2L15p3K97o19P2j43K92L57
5054D08k73j17j95O16n89K46O7J15r8k8j19p0K31Pl60P2K14P1k06O0J10l1l50
5077b19M12p6M01l07k18k10L24J90j29L51o91J58M54n43M7J87L7k98J8QL46K24
5099D66l70j09k51M08M4j55l7J47k28M17m15J53L5N9l10j33N7L94L16p65N4J00
5121a23M09l64k6J06p1j33R8N6K58Ln58o1K61J45k92L49n3Q3k24j99J57J69L07
5144B97l52m70O6M06J92l30q1j39K91R5k15K00P7O1k44j93K20L87l78L9j39K02
5166hK20k95j01K31Mj3j04j23O36k87l2k18J87K08j49j55m61O84j45l30L30K49
5188C28j83j50j33J08J37J76m00L03k73J19L72m89J99j67R1m31N04Mj50M30l74
$$ plain form
5032 -641 -167 -133 184 161 -108 -492 -212 59 -85 170 309 -113 -132 -90 225 152 449 -170 -98 -241 51 408
5054 408 135 18 -177 439 -150 96 163 278 180 152 33 -37 194 201 -159 -87 127 198 -8 52 162 131 -219
5077 -219 193 117 518 211 -7 -217 107 297 168 519 -172 -14 440 -103 -56 131 168 -130 -112 -104 242 466
5099 466 96 -13 -264 144 188 33 -4 143 -85 332 -83 70 105 164 -146 -279 -222 172 488 -277 -223 -123
5121 -123 286 -78 -104 2 -69 -202 -104 -48 210 213 -345 -406 -145 0 -292 57 4 87 -137 -336 -179 -10 297
5144 297 -55 -525 -459 -53 139 -191 -272 -411 -120 -25 -240 -40 37 98 -146 -339 -119 268 -110 -71 -210 -8
5166 -8 212 -83 -184 47 51 38 -66 -189 447 160 128 -90 97 305 156 1 -460 224 79 -251 79 328
5188 328 145 -5 -138 -30 107 283 -117 186 -87 32 404 -85 114 -53 38 -393 111 115 -35 395 21
5209B1J40k7K72j77J77m26jL46l58Q5L01K77l35m91n9L99k01Qk06M3L25P8Lj03
5233I1k67M91j26jk42ML76j22n64K06j07J53P3J03m19O69m21k8j2K23J8j59j31
5256a92l3q4K82rk73J63Q4k21n9r2L08L23k88O8j37l6P0j25j14M21k00j42O7J72
5280d7J92k77Q9l03K00J60j52K50k8j25m3j03j33M92J34m07p7j05L66M7k91j73
5302c34N89k81Jj42K78J24K5p13K30L15K77j75k96j76M48p0j79J83J77N6l32k43
5324b38M40J69l9j27m58J13k3K36j1m9M2J07k86J23K50Q6k8n96K90N43j94n6k84
5347A0jM20o61M32J8Q2k10n62P3L50J40K90o03j4L17kj59J34L3J57m27k6P2N99
5371D62j94j93j60j35P2R1k6l5J01j45K9j2K97j42K57l36l15K53M27k75k01j00
$$ plain form
5209 21 161 134 406 229 406 -20 -21 325 -33 52 353 630 295 -196 -255 144 -57 -49 -255 -212 113 191 194 91
5233 91 -176 315 189 188 -54 -50 326 204 -360 -154 -261 -108 -35 68 -351 318 -103 -131 -143 80 98 -61 -192
5256 -192 -225 -309 -27 -36 -309 -146 -62 -283 -342 -434 -126 197 -91 -23 -160 -196 -126 -251 -365 56 -144 -286 -219 -47
5280 -47 145 -132 -43 -346 -146 14 -138 112 84 -41 -84 -187 -320 172 306 -101 -178 -283 83 130 -161 -334
5302 -334 255 -26 -25 -167 111 235 260 -453 -223 92 369 194 -102 -278 170 100 -79 104 281 337 5 -238
5324 -238 202 371 332 205 -253 -140 -163 73 62 13 55 162 -124 -1 249 335 307 -289 1 544 350 294 10
5347 10 9 429 -232 200 218 300 90 -472 -399 -49 91 381 -222 -236 81 79 -80 54 87 244 -183 -209 -137 462
5371 462 268 75 -85 -220 -148 -57 -83 -118 -17 -162 -133 -145 152 10 267 -69 -384 -131 296 21 -180 -280
5393b80J98k3k07K94N8o5k81K4J48K64o0m4q1l18K22J45K11l86k6pJ95p8P3K31
5417B07R8m34k39L67J17J29m30K04j01j27K2R0M88l92k91N1K45m9K89j19k74L72
5439B23q7J88k60j50J5M39m69O9R6K19k18N5k75K5K27K18N2k73j57n6J30M90j59
5462C42k42J10j24m49R91k88m1m65P3L12M30m41l24R9J98m18P6K29R8j57k30R
5484b12L27K20N0m41J60M2q8p8K2J26M1j07m86L87K11N3n39o5L89j8l5Kk73N80
5508B68k58R6m31N94k33j45j41K2L26j5O3p13L65K72j40Pj39J81O3j87r8J17N48
5531D22k74j84l33L98M7l05P7l6O9J21m52L43J68J58k92o4QK68J83l34n3M4M5
5554B4K7K5k73J22Q7j21Q4J49l7oj21k4n3L12m41J10J02J98k4j60R0m0q1q8l97
$$ plain form
5393 -280 -82 -105 -312 -18 40 -25 -306 -282 -134 130 70 26 -55 -373 -151 -6 205 -181 -207 -214 -19 -97 -24 207
5417 207 305 -129 -368 -1 116 245 -185 19 -82 -209 -187 -97 391 -1 -292 -241 4 -45 244 125 -149 223
5439 223 136 324 64 -86 -71 368 -101 -32 64 283 65 120 -155 -130 97 315 367 94 -63 -119 11 501 342
5462 342 100 210 86 -363 628 340 299 -166 -93 219 649 208 -116 -17 181 -237 -161 68 166 9 -221 -212
5484 -212 115 335 385 -56 104 146 58 -20 2 128 169 62 -424 -37 174 227 -312 -377 12 -6 -41 -39 -312 268
5508 268 10 106 -325 269 36 -109 -250 -228 98 83 146 -567 -202 70 -70 -63 -202 -21 42 -145 -243 -126 422
5531 422 148 -36 -369 29 76 -229 -152 -188 -119 2 -450 -107 61 219 -73 -137 -129 139 322 -12 -65 -21 24
5554 24 51 76 -197 -75 12 -109 -25 124 87 81 -40 -64 -117 195 -246 -136 -34 164 140 -20 70 30 -51 -139 -536
5579e36P47j91K19k16M1J26k11L20k97K04l24J22J24j81PJ39K39k79j95K47o5
5600D0K57l42k61O92l75K90l10J93j21j56J42J08j48Oj30L40k62o8J50l1K13m12
5622a85L39k98j71O4K70K85m20m3J28J68m3r2j63J25Q0Q2l20J62j40j23J2O7K03
5645a3J28j14m56N14r9L69m83j02L20p7k44J38k50N21l20Q2j76k0O43n98Q6L8
5667a13K49p1k70j17M48j87O8l92N29j89J36l37k5M74J02k78k67K82J4K22n29
5688b51N17j38K54l96K7j61K44O0k12k22K43K94j8M5l64K41k8p2JP9K57k36qj65
5712iL92k01p9K8K9P9J9k19O8p8o3k29K69J22L28l75j90q0K26K77m31J20j6M2
5736B9k06j74O26k47K94m44j77j32L46L76l79k02M0K58m38K73J94r1l4q4R2J10
$$ plain form
5579 -536 211 20 239 23 64 190 -21 299 2 206 -118 4 128 -53 -46 93 332 53 -142 105 40
5600 40 297 -45 -306 386 11 301 -9 184 63 -93 49 157 9 15 -115 225 -37 -105 45 14 227 -185
5622 -185 154 -144 -315 -251 19 304 -116 -159 -31 137 94 2 -161 -36 44 126 -194 -32 -172 -295 -283 -216 -13
5645 -13 115 1 -455 59 -40 329 -154 -256 64 -13 -257 -119 -369 152 -168 -86 -262 -282 361 -237 -151 -113
5667 -113 136 65 -205 -322 126 -61 7 -385 144 -45 91 -246 -271 203 305 27 -240 42 56 278 -251
5688 -251 266 128 382 -14 13 -148 96 156 -56 -278 -35 259 241 286 -78 163 135 63 64 143 400 164 156 -9
5712 -9 383 182 103 131 160 239 258 39 107 29 -34 -263 6 128 456 81 -109 -189 37 314 -117 3 -13 29
5736 29 -177 -351 275 28 322 -122 -299 -431 -85 291 -88 -290 -250 8 -430 -157 37 -54 -88 -172 -80 30
5758C0K34n48j35K44k64K67L94j25j83J07J43j76l5j44J38J90k54j31J15M09p7
5779A99k66l04M12j91L57l95J84k41Q2j93J57J04J62r2l43J69N07k98L07k60J56
5800B13j57k10J19L62p7n37J86J42L5j73K15r0k21J13K46k23J80j38K10j81J06
5821A20Q0Kl10J78j93q3L38l11M68l26N22m24k35K32k88N91m56N3l27P15J14l21
5843A39q6J40J5l15K46J76k6k44Ol42L24q0j25P4J54M6j04J59j13J50k28jj55
5866a90m1K33K51l51m4k74M89O4j9l9k01K92k80M4J50k52j14N8K24j43K12k07
5888a38J36n2n2l4OKJ90k96n4j48K17J83L7k69K50J46k87J07j8J89o0q2R1L07
5912C71k54J31k99k81J63jM18k61k15K03J22M1l44K77L51n61pn7N57m69J71m41
$$ plain form
5758 30 264 -284 -419 -175 -439 -172 222 97 -86 21 164 -12 -47 -191 -53 137 -117 -248 -133 276 199
5779 199 -67 -371 41 -150 207 -188 -4 -245 -163 -356 -199 -95 67 -25 -368 -199 308 10 317 57 213
5800 213 56 -154 -35 327 250 -287 -101 41 76 -97 118 28 -193 -80 166 -57 123 -15 195 14 120
5821 120 200 202 -108 70 -123 -206 132 -179 289 -37 485 61 -174 58 -230 361 -95 -42 -369 346 460 139
5843 139 53 193 208 -107 139 315 289 45 51 -291 33 -47 -172 -98 56 102 -2 157 44 194 -34 -35 -190
5866 -190 -231 2 253 -98 -142 -416 73 137 118 79 -122 170 -110 -66 84 -168 -282 -224 0 -143 69 -138
5888 -138 -2 -54 -106 -140 -134 -132 58 -238 -292 -440 -223 -40 -3 -272 -22 124 -163 -56 -74 115 55 -27 64 371
5912 371 117 248 -51 -332 -169 -170 248 -13 -228 -25 97 138 -206 71 422 -139 -146 -203 354 -115 56 -385
5934c85O60k86K4kj70M53l5l7k61L61j67l23K27k47K80L55m75o8J63K0J24m33
5956b22L58J23l00K6pq3K56n6Q1k64K45j26J58k00O7K49k85J90m55M70J68l84
5978IK24l41oJ60J83l13J2J57k76oP3K13J08j99kj16J67R4k69K75o4Nj97J06k25
6003b28L05k35L9rl9K23J67j27j10j07J34p4k53K33J54K77m26l68J73L05%j84
6025a50pj44O35n29J03J56n8j20m1J0J11J22j72l9O2J67j09L8n0j48J94L8m65
6048c96J14L2M46j93j77K61j36L7Q1m08L56L41l23nK34Qk18L35m63M00m96L19
6070A49m80M71l39K40k42M5L23J29J35n35m9K83l7k30J37J87j26K1l58L68J90
6091B82l07k1L0KJ07j92nn3J62O3j91J89L4M28m89j93K07Pl6M9k02RO02l25l17
$$ plain form
5934 -385 275 -11 13 11 -159 294 259 222 -39 322 155 -168 59 -188 92 447 -28 -96 67 87 211 -222
5956 -222 136 259 -41 -15 -22 -105 151 95 176 -88 157 31 189 -11 56 305 20 210 -245 225 393 9
5978 9 233 -108 -114 46 229 -84 -72 85 -191 -197 -124 89 197 -2 -4 -120 47 141 -128 147 83 88 -109 -3 -228
6003 -228 77 -158 -119 -128 -167 56 223 96 -14 -121 13 -61 -314 -81 73 350 -76 -444 -271 34 34 -150
6025 -150 -157 -301 334 -195 -92 64 6 -114 -155 -145 -34 88 -84 -123 -61 106 -3 35 -15 -163 31 69 -396
6048 -396 -282 -250 196 3 -174 87 -49 -12 69 -339 17 358 35 30 264 272 54 389 -74 326 -170 149
6070 149 -331 140 -199 41 -201 -156 167 296 431 -104 -153 130 93 -137 0 187 61 82 -276 92 282
6091 282 -25 -46 -16 -14 93 -99 -104 -157 5 68 -123 66 100 528 39 -154 53 60 24 73 -129 -120 482 157 -160
6116a60P2L96k51k17K36l55L49j13J6l28K57L17j66k22K63k02K77k20p1J58j97
6137a61n7K81j58J6J49j93k88L35K78l05j82K81k37M42j41l56J50M47j91l30K52
6158C2k95K04j24j36J48K25J99l36K0k19K74J23l4J05n46O20k06j90J38j78K66
6179I0J05k87j17K61k29L9L25j12j58J17q7L05j03J77n22J25J29J23J00R3j41
6200B33j50j20Q4k73M77R8l97k84N64k50J13q7j13j03K08J80p9j66J88J14m55
6221b18L41nP9k99J03k39L96j73K89l37J74L27m67j53K25K61j26l63K18p6J68
6242A25q1j25K73p3k21j31jL20J13m77j5J93KQ6j50Kk22M31k45j38M04j63J35
6265D2l22O9J14L3k70J35j38L28J85l53K4Q8P7j82J07J54j93R0J2r5k06M04P7
$$ plain form
6116 -160 -88 308 57 -160 76 -279 70 -43 -27 -355 -98 219 53 -169 94 -108 169 -51 -122 36 -161
6137 -161 -218 63 -95 -79 70 -123 -411 -76 202 -103 -285 -4 -241 201 60 -296 -146 301 110 -220 32
6158 32 -263 -59 -183 -319 -171 54 253 -83 -63 -282 -8 115 81 186 -360 260 54 -136 2 -176 90
6179 90 195 -92 -209 52 -177 -138 187 75 -83 34 -53 252 149 326 -196 -71 58 181 281 374 233
6200 233 83 -37 47 -226 251 349 -48 -332 232 -18 95 8 -105 -208 0 180 101 -65 123 237 -218
6221 -218 123 118 197 -102 1 -238 158 -15 274 -63 111 438 -29 -182 43 304 178 -185 33 -43 125
6242 125 44 -81 192 119 -102 -233 -234 86 199 -278 -293 -100 -98 -12 -162 -160 -382 49 -196 -334 70 -93 42
6265 42 -280 -211 -97 -64 -334 -199 -337 -9 176 -177 -153 -65 12 -170 -63 91 -102 -12 0 -95 -301 103 180
6288A80k94L5r5K06p9J10k57J99r9n6j67J28M00M5j66l24K81k15L77k06k4J50
6310A29o3l71K93K52m0j00r4J1P4M2k17L85m12L3r8M2L4K89q1p6j18r7M50j52
6334A15J9j30O0j0j5m0J29J09m54J61j59N54mj40j67j49L75r6l02L30p0l5m7k9
6358Ek45M72O7k26n48M36q4J4Q5J63m8l7m5l5K45m97J95J75k19P1N9p6L5JL94
6383C57n99J91r6N3O3j0k27L8L11k78L46m55J54L14k42k41q6L70Q4r7k50K24M73
6406C97k17l36o4L5J46l1l7N2K53n09L24j88R4N22n98k44L89L3O9k52N7J65J07
6429A67l02rL06k98Q6m3J64r3P8k32r3K02L17k24j41J65M16n25P2k27o8K86p5
6452g1L53l79N7J31L41p10N07n4k6j64k12L16R6l05J06N2l24L64K41l90J60J14
$$ plain form
6288 180 -114 -79 -174 32 -47 63 -194 5 -94 -150 -317 -189 211 256 90 -234 47 -168 209 3 -21 129
6310 129 66 -305 -12 240 200 100 6 17 91 133 -84 301 -111 -78 -176 -134 -100 189 108 32 -86 -183 267 115
6334 115 134 4 64 54 39 -1 128 237 -217 -56 -215 339 335 195 28 -121 254 158 -144 186 116 81 34 5
6358 5 -240 232 299 73 -475 -39 -123 -109 -24 139 91 54 9 -26 219 -278 -83 92 -127 -56 3 -73 -38 -37 357
6383 357 -242 -51 -147 -94 -31 -41 -268 -230 81 -197 149 -306 -152 162 -80 -321 -407 -37 47 -50 -300 -76 397
6406 397 180 -156 -220 -185 -39 -70 -107 -55 198 -311 13 -175 -81 441 -157 -401 -12 21 90 -162 -105 60 167
6429 167 -135 -144 162 -136 -50 -93 71 -22 56 -176 -269 -67 250 26 -115 50 466 -59 13 -214 -282 4 -71
6452 -71 282 -97 -40 91 432 -278 229 175 149 -15 -227 89 185 -120 -14 38 -286 78 319 -71 89 203
6474B03K64l88Mk26J13K47j98l8QK70l63J0K85k52J39j53O5J62N6m63Q9K69J87
6497B90k39k93p9L75j46K09J43k1j95K24m58R9L67m14L52k47J80mk06j7J52j45
6519g3k2L23j13p8j01Q6l48L11p0n1J32m34N39j32j7L9O2j43R2K9n8RK37l02M6
6544c7j90J31l4M9n3J04J81Rk13k35J89J53J77n36M0K14K13m3j91O9k9n0O7j82
6568a97N17k77J10l30L26J26k74O8l1J41k33M02m79K47k33L99j82j82p9M15j05
6589A49q5l75M01j49P4j58K26K94l25m3J27k73K30l8k46J44J27L68m52M7L5J40
6611B18k66Q4O9P1j87J60k21N8J63Oj29J82m05O1J82p0Q1K31l7k77J3K6K1j38
6635a04J01j70N43l80m3r7oK96k56nL07j23m0k09N6r4K21j32r1R7J91r0k40L16
$$ plain form
6474 203 467 79 83 -143 -30 217 19 -19 -11 259 -104 -94 191 -61 78 -75 -10 152 208 -255 -166 103 290
6497 290 51 -242 -321 54 -92 117 260 239 44 268 -190 -91 276 -138 214 -33 147 143 -63 -80 72 -73
6519 -73 -95 228 115 37 -64 22 -326 -15 -85 -136 -4 -438 101 -31 -48 -9 53 -90 2 31 -27 -18 219 -83 -37
6544 -37 -227 -96 -130 -81 -134 -30 151 160 -53 -288 -99 54 231 -305 -265 -51 162 119 -72 -3 -32 -82 -15 -197
6568 -197 320 43 153 -177 149 275 1 69 38 179 -54 348 -131 116 -117 282 100 -82 -161 254 149
6589 149 64 -311 90 -59 15 -143 83 377 52 9 136 -137 93 55 -191 -47 80 448 -4 43 78 218
6611 218 -48 36 105 176 -11 149 -72 -14 149 155 26 208 -197 -136 46 -24 57 288 251 -26 -13 13 34 -104
6635 -104 -3 -173 370 -10 -53 -150 -156 140 -116 -121 186 63 23 -186 -130 -224 -3 -135 -226 -129 62 -28 -268 48
6659D8K30j33r6r6P2J15k48n5n5L77J87n90o5K56L87j49j79j08P8J05j87K03p0
6682B7l5O5j80N3p7K8J82Mq3K95k84l14L01j28K62J87n84L09K65J27%p69K06K66
6706A23j97K13j29q3J38L00m28L5K9L12m72r4M47r8l5J11j44j40L45j30K30o18
6728b85M02j14r7Q2K64p4Q7j40K14m66K86j28j41J87K79l40j23J82K97j79j54
6749C9j15J74m6j09J66j66ok85K25M9J67M8N9m32K52j6K03j54J24l45K18J3j01
6772c8j00k2L02k08j80J41j01K18Q9k90K06l02K97o7ln7J88Nj27O6J29j28J8k25
6796a89K50m8k70K72m7J59j45k1j82L86J3K8m68J34L69l04L32l3l98mK54m15M24
6819I7J80l38J48J22l33J28l4j61JJ60J41r1O2j00j40l8L91j19R2k2j38o7K22
$$ plain form
6659 48 278 145 49 -47 25 140 -108 -163 -218 159 346 -244 -309 -53 334 185 6 -102 -24 81 -106 97 27
6682 27 -8 57 -123 -70 -147 -119 63 67 -16 279 -5 -319 -18 -146 116 303 -281 28 293 420 420 -349 -143 123
6706 123 -74 139 10 -73 65 365 -63 -28 1 313 -159 -253 194 96 61 172 28 -112 233 103 333 -285
6728 -285 117 3 -94 -12 252 178 265 125 339 -127 159 31 -110 77 356 16 -107 75 372 193 39
6749 39 -76 98 52 -57 109 -57 -63 -348 -123 -74 93 141 200 -232 20 4 207 53 177 -168 50 63 -38
6772 -38 -138 -160 142 -66 -246 -105 -206 12 101 -189 17 -285 12 -55 -58 -115 73 78 -49 17 146 18 36 -189
6796 -189 61 13 -257 15 -32 127 -18 -39 -221 165 178 206 -262 -128 241 -63 269 236 -162 -166 88 -327 97
6819 97 277 -61 87 209 -124 4 -30 -191 -190 -30 111 20 82 -18 -158 -196 195 76 168 146 8 -59 163
6842A63J84j69k32P9PR5j44J5P5R2k87L0K68j91J58j80J54k58N6o9j90M10J31
6865A97Q5k44k18O7K84j22j3J2j31j0J39Lk84L11j38n5n6K85k1j40M8O5k80M26
6889B10J0k93K14j91j20R3o8J70r4j79J1J51K14J46n1l57K13k37P6O5R5j52J04
6912C0l68L68l06K49J35k26J63k78L53q2j15J25J7j77j95K47LK39j06j95P5q1
6934a25L96j38k58K01k26J68J14K35j18K0j96j89K41J53k21r9P2P1k6j99L62K3
6956B61k00j04J19J31L0J27L4l21J11j03l7n9l8K43k23J54k38J98j55K59m12m
6978b27J96l7j40J70O3j46K27k32N2P6j3K53k13k60M58p0j48pk51M44p9q1j95
7001a60J38N6Mm11M15m8J89l4k78Q8QL44o23R8L14j06K4K46p8K9k97l09M82kk6
$$ plain form
6842 163 347 178 -54 25 32 127 -17 -2 73 165 -122 -92 176 -15 143 -37 117 -141 -85 -154 -344 66 197
6865 197 282 38 -180 -113 171 49 36 48 -83 -93 46 49 -235 76 -62 -117 -173 112 91 -49 -1 64 -216 210
6889 210 220 -73 141 -50 -170 -77 -145 25 -69 -248 -237 -86 128 274 223 -134 79 -158 -82 -17 78 -74 30
6912 30 -338 30 -276 -27 108 -118 45 -233 120 38 -77 48 65 -112 -307 -60 -57 182 76 -119 -44 -125
6934 -125 271 133 -125 76 -150 18 132 367 249 269 73 -116 125 278 57 -42 30 101 75 -124 238 261
6956 261 61 -43 76 207 237 364 398 77 188 85 48 -11 -49 194 -29 125 -113 85 -70 189 -223 -227
6978 -227 -31 -68 -208 -38 25 -121 106 -126 -74 2 -11 242 29 -231 227 157 9 2 -249 195 116 35 -160
7001 -160 -22 34 38 -373 42 -6 183 149 -129 -41 -33 311 -312 -214 100 -6 18 264 186 215 -82 -391 91 89 63
7026F3k28M3J87k7k84K95l02L11n39N36l5k44K67L7k20q3M50j60K37l50l4Q9R4
7049A03k03K10l5k43r8N20k83o0j19J20J59P0j76k6J2J49j25K4j65J18J85j13
7071B4J24k69NK54n1l57M70j30J32Q4l6n35N09j41k13oLJ09K08k10l5K91k75l10
7095c55N56j16M9j83K28k59K6J09j37K85m86O09k09j95J77j54L9K1M8k5q9J14
7117E3j07L3k27K08K94l32l65K10J3L02k72K26k02J13r6K24k5K07o5l59M8J66
7139D7k07N3r6K17R4J4j75J28r6k63K52j2J2J23p8j36J75M6M1j85j13M6L33l46
7163a26J69m80N74j90l05L42Qj4L9Jl1k33L46j87J18R2k96K04j23k39L54l39K38
7186g8n2j53L77Q2j57k37L07m5j92L54k72k3J85r3J34k65L24k16J9K23j10J12
$$ plain form
7026 63 -165 -122 65 38 -246 49 -253 58 -481 55 20 -224 43 80 -140 -223 227 67 304 -46 -80 9 103
7049 103 -100 110 75 -168 -266 254 -29 -89 -208 -88 71 141 -35 -61 -49 100 -25 -1 -166 -48 137 24
7071 24 148 -121 -116 138 87 -270 200 70 202 286 250 -285 224 83 -130 -136 -133 -24 184 -26 -61 230 -45 -355
7095 -355 201 85 134 -49 179 -80 -54 55 -82 203 -283 326 117 -78 99 -55 -16 5 53 28 -61 53
7117 53 -54 -21 -248 -40 254 -78 -443 -233 -220 82 -190 36 -166 -53 -149 75 50 257 192 -167 -119 47
7139 47 -160 -107 -203 14 108 122 -53 75 -21 -284 -32 -44 -32 91 13 -123 52 98 139 -46 -159 -113 220 -126
7163 -126 43 -437 137 -53 -358 -16 -8 -22 17 18 -13 -246 100 -87 31 123 -173 31 -92 -331 23 -316 -78
7186 -78 -130 -283 94 176 19 -218 89 44 -148 206 -66 -89 96 3 137 -128 196 -20 -1 222 112 224
7208B24j81j35J98J26j48k5k0J83j28J00L4q7L8l46J79M7R2j64L63j71k4j56Q4
7231H3j23N1J73l63J02J62J9K5J37k21q5N8J55j15k05K59l0j92N0O9j15j55L01
7254D0l9q4O9n6M3j3J93j46r7J0J13j40L08l16p3J52R5N6K51k12l98K92j02J50
7278I6k03J43k07R7j42J50J54j50k63K97l91K14R3K59j60K4q0q7K82M8K63n79
7300a42J20J55k29O1r2J88k1K1j73K8J40l51K98j38M7L43j51q4O3m60K36K32N9
7323A50r5j01M03k73Lj26L9j33rJ64l88K87K06J38j04o7K9K4j21o0L26m30L6k00
7347c02L68j1q5N0K04k09J95j99j8K47k82K00k81j32M46k85K03k30J12j1Q6l63
7369b97N80o5k57k7O3J72k96J32j30k8L8J80k3j13K33j17k65L13K8%L2l14p4L21
$$ plain form
7208 224 43 -92 106 232 84 59 39 222 94 194 228 141 179 -167 12 59 151 -13 350 179 155 -1 83
7231 83 -40 11 184 -179 -77 85 104 129 266 45 -40 18 173 58 -147 112 82 -110 -60 9 -106 -261 40
7254 40 1 -83 -14 -70 -27 -40 153 7 -90 -80 33 -107 201 -115 -188 -36 59 115 366 154 -244 48 -54 96
7278 96 -107 36 -171 -74 -216 -66 88 -62 -325 -28 -419 -205 -112 147 -13 11 -69 -156 126 174 437 -142
7300 -142 -22 133 -96 -35 -127 61 40 61 -112 -84 56 -295 3 -135 -88 255 104 20 83 -377 -141 91 150
7323 150 55 -46 357 84 87 -39 0 -133 -142 22 -366 -79 127 265 161 94 123 147 26 -34 292 -138 -102 -302
7347 -302 66 55 -30 20 224 15 210 11 -7 240 -42 158 -123 -255 191 -94 109 -121 -9 -20 66 -297
7369 -297 283 218 -39 -66 -3 169 -127 5 -125 -153 -115 65 42 -71 162 45 -220 93 121 121 153 -161 -235 86
7393H6j7k02m5K38J46r2j24j41M36m75J98k25J57Nj09J25J75k13J29L5j0k06J51
7416B2P3k4k46Q4M43j95j53k73p7J94J95j31j76M36l46M51m74K10K66k11Nj38
7438f5L5m4J82P9l95M00P0l70J56J23j20J3JP7m47J94J25k0J56k43K67n3p3j0
7462C8M5m9P7j28J19k24K82j52J02K09k14L0j7j10j81J38K69j23l52J07J06q4
7484a12J32k22K35j32L21K48p54L00l48L02K5m5j35L22J31k67k77L30J3l13L63
7505A17j66Q1j97L09k75K83k12K50l15J57kl65N48l54oL26p9j97n3L75n7l20K37
7528H5N6k81n4K43k75M17k04Rk28l8L41J45n8l99Q4l5J73Q8J41J0o3Q2k90j41
7552a92K42m32M58K7j27N8J87m42K6J51p7Q0Q2J01L7pk13k25K83K22k31K00k60
$$ plain form
7393 86 69 -133 -178 60 206 114 -10 -151 285 -190 8 -217 -60 -55 -164 -39 136 -77 52 87 77 -129 22
7416 22 95 71 -175 -91 352 157 4 -269 -346 -152 43 -88 -264 172 -174 277 -197 13 279 68 73 -65
7438 -65 -30 -74 108 187 -208 192 262 -108 48 171 51 64 65 142 -305 -111 14 -6 150 -93 174 121 48 38
7462 38 83 34 111 -17 102 -122 160 8 110 319 105 135 118 8 -173 -35 234 111 -241 -134 -28 -112
7484 -112 20 -202 33 -99 222 470 -284 16 -332 -30 -5 -50 -185 137 268 1 -276 54 67 -246 117
7505 117 -49 32 -165 144 -131 152 -60 190 -125 32 30 -335 213 -141 -147 179 100 -97 -150 225 168 -152 85
7528 85 141 -140 -194 49 -226 191 -13 -4 -232 -270 71 216 158 -241 -157 -192 -19 69 210 220 157 239 -51 -192
7552 -192 50 -382 76 103 -24 34 221 -221 -195 -44 -121 -41 41 142 179 172 -41 -266 17 239 8 208 -52
7575e2N4K8p6L9j5j65O00l96J59N8rl45J67l0p7J43j55L10j51j38O9M02n14J56
7599F2J05j84M73l09k32J64r5k0L08k83J22k58P8K23j85l5j15L39j12N9j60m12
7621d67M08j6J66j64M4P6q7m7J29k13L37k14k11K66r6K42k80k10L85k82M01l76
7643b09Om2J57J3kL37p7o37N13Jn5j31J09M7J9q8j23L53k58J3K69k97J86K21m31
7668a06K5j94J54j05J76J85k55O6Q9Q5m4j72K82j31P7k70K36J40j16K7j07K59
7690C01k81K8q9J64R9k52j45j17L93J6mK25k22l2M9m0J00o0J24l73M6j6j23K28
7714A9K2l4j2k9j32P6O2J25l7J02j61R9p0j70J59k26K68J4k30j56M19j44M31m84
7738h9M01m99L51j33j57J47k56J85J62j74J45J4N4n0o1m7J87O3j40q6j08p3J5
$$ plain form
7575 -52 2 30 -46 -7 -22 -187 413 17 176 234 225 -120 47 17 -60 83 -72 238 87 -51 18 420 -94 62
7599 62 167 -17 456 147 -85 79 -16 -36 272 -11 111 -147 -69 154 -31 -66 -181 158 46 105 -55 -467
7621 -467 -59 -75 91 -73 -29 47 -40 -87 42 -171 166 -48 -259 7 -89 153 -127 -337 48 -234 167 -209
7643 -209 -203 -245 -88 -75 -77 260 183 -454 59 60 5 -126 -17 30 49 -39 -162 191 -67 -54 215 -82 104 325 -106
7668 -106 -81 -275 -121 -226 -50 135 -120 -54 35 120 76 -96 186 55 132 -138 98 238 122 149 42 301
7690 301 20 48 -41 123 222 -30 -175 -292 101 117 113 338 116 84 133 93 193 133 257 -116 -70 -86 -209 19
7714 19 41 7 -5 -34 -166 -90 -28 97 60 162 1 100 30 -140 19 -207 61 75 -155 -311 108 -36 395 -89
7738 -89 312 -187 164 31 -126 21 -235 -50 112 -62 83 97 151 101 40 -7 180 243 103 17 -91 -164 -149
7761a49J63R2k83p2K3j49N60k46p1J53O5J5l61RK16J16j31p4Q1J49k07J35m26
7784c92K74J21l02M80q0k13P1r4M4K41l58K68q5o6j18M43k91K70l0J1k57j40K21
7807A8p6P4J63n79Q0M26K6m1J31k52K5M08l13l7O6k94N5NJ09K37j04L8j65P7J26
7832B03k27j88N39l56J25j33J1R1L23m13R6l23p1P50l45l21M36j43m5j83J80j37
7854a31J79k83J69j22J14Q2L33k73j68q4J65L11j18O4k81j80M28j39K4J66k67
7875a1j40J77J01l16N27m58K4n1r4J28m6K31j00j7p1J99k83L40j78O9j41JK69
7898A60j9j18j14j08K05J5k5k38J99Q4q4J10K3j74J69Q9m74M33l42J71J24j91
7920a05K31j64j94L38p8j14J06Jj33K1R1p4L06j45j66J63n9k75L85k6kk59k9K18
$$ plain form
7761 -149 14 106 -177 -249 -226 -375 185 -61 -132 21 86 101 -260 -251 -35 81 -50 -124 -43 106 -101 34 -392
7784 -392 -118 3 -299 181 101 -112 -41 -135 -91 150 -208 60 -25 -91 -209 234 -57 213 183 194 -63 -203 18
7807 18 -58 16 179 -400 -320 106 132 91 222 -30 -5 403 90 53 119 -175 -120 -115 -6 231 127 165 0 77 203
7832 203 -24 -212 327 -29 96 -37 -26 65 388 -25 71 -252 -323 427 82 -239 197 54 9 -174 6 -131
7854 -131 48 -235 -66 -188 -74 8 341 68 -100 -184 -19 292 174 238 -43 -223 205 66 90 256 -11
7875 -11 -151 26 127 -189 338 -120 -96 -147 -241 -113 -159 72 -28 -45 -116 83 -200 140 -38 31 -110 -109 160
7898 160 141 23 -91 -199 6 21 -4 -242 -43 41 -43 67 90 -84 85 174 -300 133 -209 -38 86 -105
7920 -105 126 -38 -232 106 28 -86 20 21 -112 -91 0 -74 232 87 -79 84 25 -250 135 109 107 -152 -181 37
7944C7J70j86k2K41m15J73J12j67P9J62l6j76J30j99N1j89L87k27L4J18j1J30
7966A96k31J64k00K06m1k95L13l9j27r6L99k02lk69L95j57j69l6L52l00K8j49
7988b61J4L19p2J49k93O1m3L13l09J43lJ6q8L26k31L19l84o9m8J51Jj18n2K54
8012I5J25k46J54k21J48J01j97P5o1N2J2j09q1J9L5P1J82l5j28k8l7k54J54K94
8036A20j52j37N51j10j24l23K31p5k17L25Q6k31J83r5M7j12J13K78l27J5J84l75
8058a45j9j16L96j55n5l4o2J04J43j53o1K21j31K3NJ85j77k14N70j95N8Q6l43
8081f9M9oJ91j45k9r7K46l55J30J32J7K04o55J48M90k43p0J07j09J85J4j16o3
8104d4J0L47j32l90L68r7K22l47J79j07P2J2J96k84L45k97oo31O55rj0q8J05k19
$$ plain form
7944 37 207 21 -1 240 -175 -2 110 -57 22 184 148 -28 102 -97 -46 -235 152 -75 -41 77 66 196
7966 196 -35 129 -71 135 94 -201 112 73 -54 -150 249 47 44 -225 170 13 -156 -192 160 -140 -112 -261
7988 -261 -247 72 0 149 -144 -83 -126 187 -122 21 18 34 -54 272 41 360 -24 -93 -141 10 11 -107 -159 95
8012 95 220 -26 128 -93 55 156 -41 34 -27 25 37 -72 -153 -134 -99 -28 154 119 -9 -37 -74 -328 -174 120
8036 120 -32 -169 382 272 148 -175 56 -19 -236 89 175 -56 127 32 79 -33 80 358 31 46 230 -145
8058 -145 -164 -280 116 -39 -94 -128 -190 -86 57 -96 -157 64 -67 -44 -39 146 -31 -245 325 130 188 274 -69
8081 -69 -20 -26 165 20 -9 -106 140 -215 -85 47 64 268 -387 -239 251 8 -62 45 -64 121 135 19 -44
8104 -44 -34 313 181 -209 159 62 284 -63 116 9 81 93 289 5 350 53 47 -584 71 62 52 -36 69 -150
8128a50J41Q7j34o7K34p2k76K09q3k7O8j63N4K54M1k99K91k42L91m20J79J24q1
8151E9p9K08Oj50j06j68K00j04mJ13k43N51j11j53j90J76J86r5k46p0K69Q1q7
8174D3p5q9K67n9k19J22nj23L2J07P3j50J82k8j01KK56
$$ plain form
8128 -150 -9 78 -56 -123 111 39 -237 -28 -111 -138 -70 -233 -179 75 116 -183 108 -134 257 -163 16 140 59
8151 59 -20 188 194 44 -62 -230 -30 -134 -138 -25 -268 283 172 19 -171 5 191 96 -150 -220 49 130 43
8174 43 -32 -121 146 87 -132 -10 -15 -138 -106 1 74 -76 106 78 -23 -21 235
8191B35
$$ Imaginary data points
##PAGE= N=2
##DATA TABLE= (X++(I..I)), XYDATA
0@%%%%%%%%%%qJ6j6J6j6K3l1L2l7M5n3O1o9Q1r5J08j23J40j56J76k00K24k51K80
34A47l10L44l84M28m74N25n79O40p09P85q71R66j075J200j342J508j708J947k242
53a204K622l123L818m851O548r791J8097p4824j72783K07744J80396j15282j34768
66i7401R2770P0333j05540n7311J18218O2078q8487n3398N6750J3287m1448L2391
78B242O9881m3566j00487J0159R4765K3513n0583k0608J4908j1887j9989K3124
90h528L4625j0298l2841o068J1834j73K476K3417Q859l9717l6933K9211N9867
103C5731N512m5420k0852J6328O797n374J8392J9779j8990l0075L481J6831m27
116A713O629J6675j7530m4665L603N3404J7556l7754k0670J5264J331j2834J7934
$$ plain form
0 0 0 0 0 0 0 0 0 0 0 0 -8 8 -8 8 -8 15 -16 16 -21 24 -29 32 -37 44 -51 57 -66 74 -82 94 -106 118 -133 147
34 147 -163 181 -203 225 -249 276 -303 337 -372 413 -458 508 -567 633 -709 799 -909 1038 -1204
53 -1204 1418 -1705 2113 -2738 3810 -5981 12116 -62708 -235491 -27747 152649 37367 -97401
66 -97401 -4631 65702 -39838 -97149 21069 83147 -5340 -58738 -1988 11299 -30149 2242
78 2242 72123 28557 -71930 -61771 32994 56507 5924 -14684 224 -11663 -31652 -8528
90 -8528 26097 15799 -17042 -23110 -11276 -11449 -8973 14444 23303 -16414 -53347 -24136 35731
103 35731 41243 -4177 -25029 -8701 -1904 -7278 11114 30893 11903 -18172 -14691 2140 1713
116 1713 8342 25017 7487 -37178 -33575 19829 37385 -369 -21039 -5775 -4444 -17278 656
129F56K8410j3709l1609L436J9235n202m353K1496P616l1747k0530K8205L1492
142C3396j3586l0508j212J6638L254o132L048O247o885j2905J19J0196O126l085
156D711j704j753q215p28J6948J0083j8875j9656J3720K5307m523k2966q74J7934
170I409K450j4523o027Q533R592J053q008j2957j148J6575J0291j3605j5772N676
184h461J2624O21n957j863j965J06P654J135j3097l986J8743J0367j8889j7054
198b0022J3871J9914o403j9805k918J6394J2718o109j8536q039J5967J6813q837
211E008j8923J275J5840K181r562j265K984j613j20L154l939k467J2831P279j9573
226f910j6490J8658K2439j1837j9238Q052J1985q367m222J2105Q92j5650p03J5235
$$ plain form
129 656 29066 15357 -16252 -12816 6419 1217 -3136 18360 25976 -5771 -26301 1904 33396
142 33396 19810 -10698 -11910 4728 7982 1850 4898 11145 4260 -8645 -8526 1670 7796 4711
156 4711 3007 1254 -6961 -7689 9259 19342 467 -19189 -5469 19838 15315 -7651 -8525 9409
170 9409 11859 -2664 -8691 -158 9434 10487 2479 -10478 -11626 4949 15240 1635 -14137 -8461
184 -8461 4163 4784 -1173 -3036 -5001 -4895 2759 3894 -9203 -13189 5554 15921 -2968 -20022
198 -20022 -6151 13763 7360 -12445 -15363 1031 13749 7640 -10896 -18935 -2968 13845 5008
211 5008 -13915 -12640 3200 5381 -4181 -5446 -2462 -4075 -4195 -1041 -4980 -7447 5384 12663 -6910
226 -6910 -23400 -4742 17697 5860 -13378 -5326 6659 -1708 -5930 6175 7067 -8583 -9286 5949
240E949o29r702P508R041j5816j4160J5287J6007r020p870Q790k796j6089O781
254f719K4194l942k6162n11K1771J953j4017M105J1936r089j6198N199J4919M805
268A2244m86n020j3907p178J7218J7700j1466j8810O372J4309o806j1260R239
281B149J2849r406j8190J018J6157J0622m126j2363r452K317J0357O686l518m490
295F10J1j92k501N56M636L972k225p506n658N366J2809L238j1487j2174L45P503
311b697P311K852k895r734n010O390M682l899l9O739j354j2175j384J4476O364
326I627r318q759Q13K825M861Q961K52j5060q390R939J0217n322n508M958K572
341B668p212m428N778M619j202k960l995l279N630J3071q89j6984p522J3493J2644
$$ plain form
240 5949 5320 -4382 3126 12167 -3649 -17809 -2522 13485 4465 -3405 5385 2589 -13500 -6719
254 -6719 17475 13533 -12629 -13140 8631 10584 -3433 672 12608 3519 -12679 -7480 7439 12244
268 12244 11758 6738 -7169 -14347 2871 20571 9105 -9705 -3333 10976 4170 -7090 2149
281 2149 14998 5592 -12598 -11580 4577 15199 11073 -1290 -10742 -8425 1932 8618 5100 610
295 610 621 429 -2072 -1516 3120 7092 4867 -2639 -8297 -2931 9878 13116 1629 -10545 -10200 -2697
311 -2697 4614 7466 4571 -5163 -10173 -3783 899 -3000 -3039 3700 2346 -9829 -11213 3263 9627
326 9627 309 -8450 -7637 -4812 49 9010 9262 -5798 -14188 -4249 5968 646 -4862 96 2668
341 2668 -4544 -8972 -3194 1425 223 -2737 -6732 -10011 -4381 8690 7801 -9183 -16705 -3212 9432
356I432n082q613K029M691k912l302M327M968k159n265j806J834M194L820k217
371C939q073n063N799R574Q29q000m489L342K318p92J344M372j206o730k198O284
387A250N574j19k291l242m682Q22P679N371l764n577k259j692R90P669O315p962
403D082j1716J420Q646J693q07L303k990j2438k713J4599J1571n232j0613n164
417f359r3N504J1818K384j2754q218P124M219o227L858J2966o064k2846l159K2660
432D813J1213j2035r733O54j650q70J0462P274q555q858K697J472l700P843J3644
447A4671p797k2289j879K0055R039p777l922l56q271n458J3352J4171o660j4068
461g189k294L873Q89M594P659k634j4141n174R278R390J440k347m732q316l451
$$ plain form
356 9432 4350 -4263 -2234 2457 -455 -3757 570 5538 3379 -1886 -3692 -1858 2336 6156 3939
371 3939 -4134 -9197 -3398 6176 7005 -995 -5484 -2142 176 -616 728 5100 3894 -2836 -5034 1250
387 1250 6824 6705 4414 1172 -3510 -2688 4991 10362 6598 1021 -1238 -2930 -1940 5729 12044 4082
403 4082 -7634 -6214 2432 4125 3318 6621 3631 -8807 -11520 3079 14650 9418 -1195 -6359
417 -6359 -6452 -948 10870 13254 500 -7718 -594 3625 -2602 1256 14222 8158 -14688 -17847 4813
432 4813 16026 3991 -5742 -5088 -6738 -7608 2854 10128 1573 -7285 -4588 -3116 -6816 1027 14671
447 14671 6874 -15415 -17294 2761 11800 4023 101 -255 -8526 -13984 -632 13539 6879 -7189
461 -7189 -9483 -5610 -4721 -127 7532 4898 -9243 -14417 -5139 4251 5691 3344 -1388 -9704 -13155
476a3155R723J4276N37j2214r608K151P344L202Q80K322k247r873o234R757J5444
491A2305m32j3663r617K038Q180Q343M222o685j2859k925R062P320n24pK30p775
507b787p464O906J3306J494j0011n967N11J976N060P335j302j0785n777M674N410
522B579J614L278M78p938q329L057J0460L473l350l851l820k885M394Q474J697
537I331p340o998J111L815K832K942J207n101p278j305O781O527L85m434n041
552b566j738K144N014K876l380o259j106N463L023k896j680K158p69n106q44N586
568h0M531j662l880l690j297L759O099m64p262q29O040o60o020J633Q952j582
584C588r939j586Q359L341l991k050M33r09n33K704n1k578L220L866o544p983
$$ plain form
476 -13155 -3432 10844 11381 -833 -10441 -8290 -946 2256 3136 5458 3211 -6662 -12896 -3139 12305
491 12305 11873 -1790 -11407 -9369 -1189 7154 11376 4691 -8168 -11093 -2031 5289 4765 4758 4988 -2787
507 -2787 -10251 -3345 9961 11455 1444 -4523 -4012 -2036 3024 10359 9057 -1728 -7505 -2831 2579
522 2579 4193 7471 7949 11 -8318 -5261 5199 8672 5322 1471 -2349 -5234 -840 7634 9331
537 9331 1991 -5007 -3896 -81 2751 5693 6900 1799 -5479 -6784 -3 6524 6909 2475 -2566
552 -2566 -4304 -2160 2854 5730 2350 -3909 -5015 448 3471 575 -1105 1053 284 -4822 -5666 -80
568 -80 4451 2789 -1091 -4781 -6078 -2319 3780 3316 -3946 -4775 1265 605 -5415 -3782 5170 3588
584 3588 -6351 -7937 422 3763 -228 -2278 -1845 -2754 -3287 -583 -634 -3212 8 3874 -2670 -10653
600a0653O156J0625k849q738R14N837j927m039L920M611k806m547L04J616J466
615a10L424L33n548k236M838P28l596J981O387k511j0176j9R789L917o736l808
631c343J952J528K3J662O77j081o5p89l002J98Q437L934q982q037M835Q458j064
648E341l934P23N34m090j911N677M511j360m279m712k405M634Q906J329q837o008
664e881L063L774K80J900L235l217p197j563O091N578M43l729m795k854K071N834
680C033L538j753m899m709j407M341O106J057m350n045j529J720M206L888j249
695B948n478l293J230L764L624J881l026o990k949O408O620k01m158l358k235
710e213j2M317N438j070o567l808J333L267L719K806k635p829l315N511O509J851
$$ plain form
600 -10653 -4497 6128 3279 -5459 -4545 1292 -635 -4674 -754 3857 1051 -3496 -3192 -1576 -110
615 -110 3314 3647 -1901 -4137 701 1429 -2167 -186 6201 3690 -6486 -6505 3284 7201 465 -3343
631 -3343 -1391 137 160 1822 2499 1418 1353 564 -2438 -2240 6197 10131 1149 -6888 -2053 6405 5341
648 5341 1407 2130 2664 -1426 -3337 2340 6851 5491 1212 -3500 -5905 -1271 7635 8964 127 -5881
664 -5881 -2818 956 1236 3136 6371 3154 -4043 -5606 485 6063 6506 2777 -2018 -4872 -2801 3033
680 3033 6571 4818 -81 -4790 -6197 -1856 4250 5307 957 -4088 -5617 -3897 309 4197 2948
695 2948 -2530 -5823 -4593 -829 2795 4676 1650 -5340 -8289 -1881 4739 4538 380 -2978 -5213
710 -5213 -5225 -908 4530 3460 -3107 -6915 -5582 -2315 1404 4210 1575 -6254 -9569 -4058 2451 4302
726D302k154k801m768k219N114P337J139m988l823j867N14L901O064K73p667n549
742g192K333O085K339o55j208l726l546Q41O841M432l287n525j689J945K802K654
758C444R17k580l811o34M558K585o09j459k139l486N39O728M484o122o423K151
774a857M623j803j846N111K548p517o051N844O978q31l966j658j553J58M576L666
790F422l868m405K967J145m972l03R421K695j0998o205P602P047m265m588J907
805c98J435j859K06J910o14j144J398j468l851L147O982k764r225J085Q579Q12
821D231p019q02N204o95m661J330M952o43m479j548J486K047K406P8m259l121
837e493K968L356q66j278J534n85l510p46M434L622k476m674j517K946M369n3
$$ plain form
726 4302 2148 -653 -5421 -7640 -2526 4811 5950 962 -2861 -4728 -4214 -313 5751 6024 -1643 -7192
742 -7192 -4859 1226 3565 2910 1702 -2024 -5570 -4729 2112 6544 3257 -2268 -3957 -2012 790 3444
758 3444 4361 1781 -2030 -2664 1894 4479 3870 2411 272 -3214 -2675 4053 8537 2415 -4008 -1857
774 -1857 2766 963 -883 4228 6776 -741 -6792 -948 6030 5199 1233 -425 -1978 -1820 2756 6422
790 6422 2554 -1851 1116 2261 -2711 -3014 6407 9102 -1896 -8101 -499 6548 2283 -2305 -398
805 -398 1037 -822 -616 1294 680 -464 934 -534 -4385 -1238 5744 2980 -6245 -5160 3419 4231
821 4231 -2788 -3590 1614 919 -3742 -2412 2540 1897 -2582 -4130 -2644 -597 1809 1887 -2372 -5493
837 -5493 -2525 831 -35 -1313 221 -364 -3874 -4620 -186 3436 960 -3714 -5231 -2285 2084 2031
853B031l212j759J415J063j496Q54K947q49m014j093L890K440j273j257p82j427
869b522J003L482R38l027q54R88j223j551M287L682l279n815R31M038P49k58J898
886C467j714n165N1N894K697l488j474R72k194k123N107N111l601o708P59M429
902B020l30n68K553k7n452j792N052L656k339k628J50m99j389K398M133j689m495
919a246p63K682Q65p17P95J350k682l585J758M162J440k982k744k66Q49J931J656
936B503j217k055o91R45q55J33K806J822m110m452K329N541l27m151l27K255p93
953f44j983J321K996r28k349r17J80Q99J744J494l053k624J892K789j760j938
969b881K486K243l954k789L140L804j882k721N23J113K8L15K02n91k02J332k95
$$ plain form
853 2031 -1181 -2940 -1525 -462 -1958 -1104 1843 994 -3020 -4113 -223 2217 944 -313 -1095 -2522
869 -2522 -1519 1963 2901 -126 -980 8 -1215 -2766 1521 5203 1924 -3891 -2960 1078 1827 1569 3467
886 3467 1753 -3412 -3361 2533 5230 1742 268 1240 -954 -3077 2030 7141 3540 -3168 -2409 2020
902 2020 1690 1122 3675 3648 -1804 -3596 1456 5112 2773 145 295 -204 -1593 805 4938 3249 -1246
919 -1246 -2009 673 1538 821 1616 2966 284 -3301 -1543 2619 4059 1077 -1667 -1933 -1084 847 2503
936 2503 1286 -769 -1460 -515 -1370 -1237 1569 3391 -719 -5171 -2842 2699 2372 -1779 -2106 149 -644
953 -644 -2627 -1306 1690 762 -1587 -2504 -2324 -1425 319 1813 -1240 -3864 -1972 817 -943 -2881
969 -2881 -395 1848 -2106 -4895 -1755 2049 167 -2554 -2031 -918 -890 -575 -373 -964 -1166 166 -129
986a29k395L13M324k46m489k69M007P68m263J8M769O19m394j788K909K177l49
1003A582j272r40n72R25K069p81p08J248R16l431j838L578L782j249m525q94K974
1020H64J635p81q79L51L57j219j510P39L966J575m203m260J629M652O28k164j062
1037C18O79j559p34J993K685j45k195k637j171K530M344M82m908k065K248Q56
1053G21j380K007L390k575o576j99N910L197k286l025o86j000r8L826J994k059
1069A161k365p33p15k29M304L095l863n517K00M309J625n92N69j586l698q12L745
1086a102L932q73k641j697k159P24M914L117l204m770n26J998J663J190J807j870
1102E03m723p42L274L092O13l80k479l881k54N678L631k227m113j148J408K53
$$ plain form
986 -129 -2524 -2211 2113 1867 -2622 -2891 1116 1884 -2379 -2361 2408 3027 -1367 -3155 -246 1931 1582
1003 1582 310 -630 -1202 -277 1792 1011 303 1551 2467 -964 -2802 776 4558 3309 -1216 -2110 864
1020 864 2499 1718 839 1190 1547 328 -1182 -443 3523 5098 895 -3365 -1736 2916 3544 1380 318
1037 318 997 -562 -1296 697 3382 3237 1042 -1595 -2766 -236 4108 4590 -318 -2383 -135 721
1053 721 -659 1348 4738 2163 -4413 -4612 1298 4495 2209 -816 -1502 -2502 -2600 1226 3220 1161
1069 1161 -1204 -1937 -2652 -2881 1423 4518 655 -4862 -4662 -353 1272 680 1249 -337 -4035 -4847 -1102
1086 -1102 2830 1957 -684 -2381 -4540 -3816 1098 4215 1011 -3759 -4285 -2287 -624 566 2373 503
1102 503 -4220 -4962 -1688 1404 2017 1637 -842 -4723 -4977 701 4332 2105 -2008 -3156 -1748 -1495
1118a495J736K842n47m114k904K067M156J675p25k590k796l80L187L175m01k053
1134H33j394p45o60J639M146J281m989m457J927M763R80j520k76q47j976p44L339
1151A300L145n66l524j842o29K270L885J038l938l544J566K558q52m31K449P87
1167C672m976l413M596N357j387n002q64J513J022P41O60J98j368j752r86O68
1183a321L171K349k817m671N9M412J584k472j284J453l07k293q40L556K196j898
1199H77l959r60K946K675k47k343p65J278l19j515R40K554L65k857j895Q12K030
1216c83J701o32k498j464J923J579j126l44K048J9l703j185L672K680k308k486
1232b507R93J080n97J84J372o90j256O17K61o07J305J872j181l662R00L685k86
$$ plain form
1118 -1495 241 3083 2536 -1578 -4482 -2415 1741 3416 2691 101 -2695 -3075 112 3287 2886 833
1134 833 -561 -1306 -1966 -327 3819 5100 111 -4346 -2419 2344 3324 1804 1528 681 -1295 -2039 1300
1151 1300 4445 3879 355 -1487 -2116 154 4039 5077 1139 -2405 -839 1719 867 436 2885 3672
1167 3672 -1304 -4717 -121 5236 3849 -1153 -2017 -504 518 1259 1919 2117 749 -1003 -1989 -1321
1183 -1321 1850 4199 1382 -3289 -3230 1182 2766 294 -990 463 156 -2137 -2977 579 2775 877
1199 877 -3082 -4042 -1096 1579 1332 -1011 -1776 -498 -817 -2332 -1392 1162 1527 -1330 -3225 -2413 -383
1216 -383 1318 686 -1812 -3276 -1353 226 -900 -1244 804 823 -2880 -4065 -393 2287 -21 -2507
1232 -2507 -1514 -434 -1031 -847 525 -165 -1421 -804 -543 -1150 155 2027 846 -2816 -1916 1769 1483
1249A483k348O23J998k008k469K599K460j231j772J053O9j910J206L334j326l111
1265a350O39K062q76r97K744J029l802j825L242J549k078kK781j130l673N71L730
1282B614K89k781M51J344k068j170K979K243k944l016J994K008j167n68J107K24
1298A539k136p24K058P29n48o99j14m60l49J729J164j987j925J311K275j256j808
1315a201J421J672j856k880J151L295J1k803r66J785j00r86J48J810K8k012l20
1332a803P45J85J205N47j124k752R11K584J63k235L62J852m91l075N00K838J458
1349A870l005j923R03K408k2j546m45R55J232o69j835Q4K520L60j737j521J176
1366a195K054m24j732J78K122J003k581j716K046K345j297k367O43K702m71k861
$$ plain form
1249 1483 -865 -242 1756 -252 -2721 -122 2338 1107 -665 388 457 -1453 -247 3087 1761 -1350
1265 -1350 -711 1351 475 -522 2222 3251 -551 -2376 866 2415 337 335 3116 1986 -1687 -1116 2614
1282 2614 2903 122 573 1917 -151 -1321 1658 3901 957 -2059 -65 1943 776 208 1315 1539
1298 1539 -597 -1321 737 1466 918 219 105 -355 -704 1025 2189 202 -1723 -412 1863 607 -1201
1315 -1201 220 1892 36 -2844 -1693 1602 1613 -1190 -2156 -371 -471 -1457 -1309 501 529 -1483 -1803
1332 -1803 -1058 -873 332 879 -245 -2997 -2086 498 661 -1574 -1212 640 149 -2926 -2426 412 1870
1349 1870 -1135 -3058 -2155 253 231 -1315 -1760 -805 427 -242 -2077 -1993 527 887 -850 -2371 -1195
1366 -1195 859 435 -1297 -1119 1003 2006 -575 -2291 -245 2100 803 -1564 -921 1781 1310 -1551
1382a551l03K722J095j685j076K79J468L60p27j337J42J969R80j984j735K244
1398H61J977j764k298K102K233j962k262J479J902n46j042j67k77m22J106Q02
1414A722j460K04J182m66l058M36M198O25l574j076K333J81j665L84K370n18k758
1431i40l21J759N46q3P03q94k542j25L069mj683M08J550k507j733J714L005j583
1449C39k248Q86Q96l89k06R22K7k106L56J700p1k80r2k79j068j35J521R33p58
1468e2r61k59J76n33J304P15r85j038K23O72k06O42J141r89k284rK064J331m53
1487D99q26l35n30k67J022J146J37j57j047j335R4K300J666j288k464k7J343L84
1505C15r8R74O13j577k187N56K277J182o12j708j46O06N34J49M3N3j42n17l77
$$ plain form
1382 -1551 -1854 868 1963 278 -798 -519 949 1309 582 -755 -613 1356 2336 352 -1383 861
1398 861 2838 1074 -1224 878 3111 1149 -1113 366 2268 1722 680 513 236 -186 920 1722
1414 1722 262 466 1648 1182 -1876 -1440 2758 3383 -191 -1267 1066 1247 -418 -34 2336 1818 -940
1431 -940 -1261 498 1044 961 1664 770 -1772 -1897 1172 1168 -515 -107 1443 -1064 -2797 -1083 1922 339
1449 339 -1909 -1023 -127 -516 -722 200 227 -1879 -1523 177 106 -174 -266 -545 -1613 -1748 -227 706 -52
1468 -52 -1013 -1272 -1096 -1629 -325 390 -595 -1633 -1410 -738 -944 -302 839 -150 -2434 -2443 -379 952 499
1487 499 -327 -662 -1192 -1459 -437 709 846 689 -358 -1693 -1599 701 2367 1079 -1385 -1412 -69 315
1505 315 217 1191 1804 227 -1960 -1404 873 2055 1443 -265 -411 195 729 878 921 974 832 315 -62
1524f2M62J599N64j745j962J94K773Q65j820j295J015R13j393p55K085K006k349
1541A095k302J42K471Q48r69j614l55M22R87nk22M76P80j694k130Q97L407R83
1559C217l159j879J651J461j433r80J852J246k033k416P53K326J111j092k386
1574a761p2J210Q73l75o6pK11j395o41O39K785K34k300k742J623K911m0k138J08
1593i43J105p28j921O15L504L52l162j809J202J286P52J24l71j521l11J119K99
1610d08l69J499M16l021k027L110L808j321l394O3J721m70r11K264J561k207k586
1627b272J054J540N3J087L14k647j554J862K313p64j052O81l22k073M74L143J563
1644C400k264k257M61L70L89K026J090k234k255O79J985j32K09K79q63k318K54
$$ plain form
1524 -62 400 1999 2563 818 -1144 -950 1823 2688 868 -427 588 1501 108 -647 1438 3444 1095
1541 1095 -1207 -1065 1406 2254 1285 -329 -684 -262 725 720 498 974 1754 60 -2070 -1173 2234 3217
1559 3217 58 -1821 -170 1291 -142 -1122 730 1976 -57 -2473 -1720 606 1717 625 -1761
1574 -1761 -1833 -623 250 -125 -191 -198 13 -1382 -2023 -1384 1401 1635 -665 -3407 -1784 1127 1087 -1051 -943
1593 -943 162 -566 -2487 -1872 1632 1984 -1178 -2987 -1785 -499 253 377 6 -1515 -1826 -707 -408
1610 -408 -777 722 1138 -1883 -3910 -800 3008 1687 -1707 -1644 77 -393 -1304 960 2521 314 -2272
1627 -2272 -1218 322 375 1462 1776 -871 -2425 -563 1750 986 -66 615 293 -1780 -1306 1837 3400
1644 3400 1136 -1121 -660 -290 99 2125 3215 981 -1274 -595 1390 1258 1467 1746 883 -1435 -1181
1661a181K715J224r75k017n19m13J099J463P30j118j341l39N47K38J353Q66j010
1678A322k574m95K338J749l52j752j124J42L45K98J403P61j083l048o59K160K265
1695A696k35j507j615l24J026J456M7k40r27n74j063Q50K363J602k171l545L47
1712b814L146J065j530k11K12r43r40L13J763Q84j318j412r26J083K202Q92j947
1729d81j705R82O72n4l96J712N50k033k305J641K873J95j976j395O75J123L69
1746D47m98mN67m37j287n3J778J629j159k388j52J488J505n56j189N63P24q03
1764A75j194O22J953L43k210r31J502J567m53j092ML05j2l17L43j3P53J6j468
1783a07q61J591J823j125k042K13K268n69k106N36K087k94j830K71R82J73p88
$$ plain form
1661 -1181 1534 2758 1783 -234 -753 -1166 -67 1396 2126 1008 -333 -672 -125 113 1466 2332 1322
1678 1322 -1252 -1747 591 2340 1988 236 -888 -746 -401 -103 1300 2061 978 -2070 -2729 -569 1696
1695 1696 1461 -46 -1661 -1985 -959 497 544 304 -623 -1197 -2260 -1410 953 2555 384 -3161 -2814
1712 -2814 332 1397 -133 -344 -132 -1075 -2015 -1702 61 945 -373 -1785 -2711 -1628 574 1466 -481
1729 -481 -2186 -1204 -532 -586 -982 730 1280 -753 -3058 -1417 1456 1651 -325 -1720 -1045 78 447
1746 447 -51 -55 512 75 -1212 -1265 513 2142 983 -1405 -1557 -69 1436 880 -309 254 978 175
1764 175 -1019 -397 1556 1899 -311 -1242 260 1827 1374 282 286 591 579 262 605 592 1345 1361 -107
1783 -107 -968 623 2446 1321 -721 -508 1760 1191 -915 -379 1708 1414 -416 -145 837 1010 222
1800B22M04R2q37N60P25p37j013J318J041j936j294J596J434j486j433R18J559
1817A133j497q97J251Q60j065q37M59k47j31J052P07j089j248J254O18j272K41
1834g08J037K12j771n19J415R53o52j019M41n07k1Q32O25k27j470P1L31K3M81
1853d73Q64l95j949j83J376J287j62p56m68r2Q4J057M95l08q35m53o9M60J042
1872E22J092j090j813k03J587R09j18n16l77l63L6l29R11J538q85j896k76J055
1890b16J436L71q77j092l9J118r3J57j21R62o87j863k29K842R23j352k021N17
1908b64J669m6r44N3O50o33q62N0J115J220o57j979p77J387K196l87k312q9J541
1927I31r5j218o4K031L69k563j325J762K126J16k355p40O92N71r9l30L28O71m36
$$ plain form
1800 222 626 718 -119 441 1166 429 -584 734 1775 -161 -1455 141 1575 89 -1344 -426 1133
1817 1133 -364 -1261 -10 850 -215 -1052 -593 -840 -971 81 788 -301 -1549 -295 323 -949 -708
1834 -708 329 541 -1230 -1749 -334 619 -33 -1052 -611 -1118 -1139 -307 318 91 -1379 -1308 -977 -954 -473
1853 -473 391 -4 -1953 -2136 -760 527 365 -391 -859 -951 -867 190 685 377 -458 -911 -980 -520 522
1872 522 1614 524 -1289 -1492 95 1004 886 370 -7 -370 -334 -663 248 1786 901 -995 -1271 -216
1890 -216 1220 1591 714 -378 -417 701 608 765 644 1606 919 -944 -1173 1669 2592 1240 -781 -264
1908 -264 1405 1359 415 468 1118 485 -377 -327 788 2008 1351 -628 -1405 -18 2178 1791 -521 -610 931
1927 931 836 -382 -446 1585 1954 -609 -1934 -172 1954 2070 -285 -1025 -333 238 139 -191 137 808 372
1946C72j569k32J531J015j201k002P37J733O76j603j172R00J354j136p66O83J627
1963I47p57j676j3J604N64j273o60M03O78N7N23r78m04J27O00p85J04J349L99
1982H09k097j747K030K430j008j935Q01Q75q77j84J727L45j470p38P78J91k75
1999c45J197M17k037j198K017J470j172j425J261J75j514L75K332l0k371o98J484
2016f2Q16lM70Q5j506j370J627K005o19j142K00l00j008P10K106Q58k730j440
2034a303N88J600K45L82R4j612j333M10J880Q40m90n58j133j052O81K430J205
2051B874j868j944j25J401M68L66K75m20k005o91J029K431J19j874j438j42Q77
2068f67J469O92j144j511l63P41J077r8L86J30k338j079J292L408K54k641k062
$$ plain form
1946 372 -1197 -1429 102 1117 -84 -2086 -1349 384 1060 -543 -1715 -815 539 -597 -1363 -680 947
1963 947 190 -1486 -1499 105 669 -604 -1264 -861 -183 -126 397 -581 -985 -858 -258 -1043 -939 410 809
1982 809 -1288 -3035 -1005 1425 417 -1518 -717 158 -719 -903 824 1169 -301 -1039 -261 -70 -345
1999 -345 852 1269 -768 -1966 51 1521 349 -1076 185 360 -1154 -779 1553 1523 -848 -1546 -62
2016 -62 754 751 1221 1306 -200 -1570 57 2062 1443 301 501 201 -807 -97 2009 2867 137 -1303
2034 -1303 -715 885 1130 1512 1606 -6 -1339 -929 951 1791 1301 743 -390 -1442 -761 1669 2874
2051 2874 1006 -938 -1063 338 806 1172 1447 1027 -978 -1669 -640 1791 1910 36 -1402 -1544 -667
2068 -667 802 1494 350 -1161 -1524 -783 294 196 582 712 -1626 -2705 -1413 1995 2249 -392 -2454
2085b454J009N80Q18O89N77j266k139j2J336J647O69r40k599j122J658K780K75
2102A506k024p90J38j17n73J724K099n22l105j345K095K160k86j008p19k52N25
2119d94O6Q44K29r0j118j086P1K111J610r64k787l22K365R27j446M1J050o38j756
2138a387j22K754J415k072j739J53J408Q16J10m93q09m48L97N11k06J133N71j765
2156B27k158J393K660L3j910r09J271k2r70P34J235k50j163q04O33O27O84J42
2174A453j171j024O50J234n54q47J034L18j329n40J172N97k59j272L10O11Jk91
2192I3l89m6J22N36j67n85J42R68l78j143Q5O45P9p67K72M72R6k42k64Q6J17P3
2214a95J15m94l79L42P20n8r43L92L28r52o5R28M11J42q36n62k10N82R40M07j190
$$ plain form
2085 -2454 -1445 -865 -47 642 1219 -47 -2186 -2198 -862 785 1454 514 -2085 -3207 -1549 1231 1506
2102 1506 -518 -1308 -1170 -1287 -1860 -136 1963 1441 -1664 -3009 -914 1246 960 -48 -767 -1019 -494
2119 -494 -428 416 645 555 -563 -1649 -1578 533 2143 1179 -1608 -1930 435 1362 -84 -43 1007 369 -1387
2138 -1387 -1509 1245 2660 588 -1151 -998 410 1226 1336 843 34 -414 -17 494 288 1421 1992 227
2156 227 -1931 -538 2122 2155 245 -664 607 585 -385 349 1584 1334 171 -633 0 627 1311 1453
2174 1453 282 -742 -92 1142 588 -259 775 1093 -236 -776 396 993 734 -538 -228 383 384 93
2192 93 -296 -342 -220 316 149 -436 -294 674 296 -847 -762 -117 -38 -805 -533 -61 35 -207 -471 -385 -268 -195
2214 -195 -80 -574 -953 -611 109 51 -892 -500 -172 -1124 -1189 -261 150 292 -544 -1106 -1316 -734 206 613 -577
2235e77n10K43M44j32L34P76k01j438o69J167J594M56j285j316kN07Q00L84J20
2254F95m84q62n24N05J322J079j053j735l04J545R43J60n90p28j81j92J92J148
2272I36J053m30j529j600J224K099K93j453j254M5R81O15j6N31o44j236q82Q57
2290d10J676J393j518j987p14J480J735j03p87k05m28q13n3J697J752r19k975
2307a179p74J866J419M08j141q61o22L15K92Q99Q10l72j725j694Q37K596R91j930
2325A35j772L36J412l39J72Q31j02j686j337R12K656O33j583j900n23J138J472
2342D55J0n61q95k90j09L15Q64J327j86k716j134K094K004k84j101p46n8k59P72
2361d98J029L49p94j049o56P33J285R31q88j578m88J118J545o89m68P6n10j030
$$ plain form
2235 -577 -1087 -844 -400 -532 -198 578 377 -1061 -1730 -563 1031 1487 202 -1114 -1116 -609 191 575 695
2254 695 211 -651 -1175 -670 652 1731 678 -1057 -1361 184 1127 1287 697 -31 -212 -404 -212 936
2272 936 1989 1559 30 -1570 -346 1753 2046 593 -661 -616 365 980 964 1495 851 -385 -1267 -410
2290 -410 1266 2659 1141 -846 -1560 -80 1655 1552 765 560 132 -681 -734 963 2715 1796 -1179
2307 -1179 -1953 -87 1332 1740 599 -262 -884 -569 -277 622 1432 1060 -665 -2359 -1522 1074 2065 135
2325 135 -1637 -1301 111 -228 -56 775 673 -1013 -2350 -1438 1218 1851 268 -1632 -2155 -1017 455
2342 455 465 -96 -991 -1281 -1390 -1075 -211 1116 930 -1786 -2920 -826 1178 894 -207 -953 -1011 -1270 -498
2361 -498 531 880 86 -963 -1619 -886 399 1330 442 -1136 -1624 -506 1039 350 -118 -42 -552 -1582
2379a582Q24J851O22j789j025Q7R56N43N31k15j004o64P63Q28J65j09l08n24p47
2398g97P30J595L39j426q08M6N23O92Ol03o43j42M85M27N4K17l29q86o94J112
2418A98J485m38j149n03QJ044M83j71o05l33J92m30P5J045K54j077r52m9J809
2437H86L03l64j018m85P3O58M70j12k63R7r70l29Q53J306K1k145o19Q04J054K42
2457D62m57n7l45p00L89M64O88j26q02j296L03J370J272q93j836K91R69R7l57
2476e64M02N49r22j292M89J380R10p07j619l76J196J166r8q18l15M27k89n51Q50
2495a82J661l20k304j003J061K327q7j443n67O45l06r8O65Q10n2j364p64Q08J361
2514H48P51o11j581n34J012P56M08o40J17k37o38m67J383J691r23j834o06J654
$$ plain form
2379 -1582 -758 1093 1715 -74 -1099 -1012 -56 487 1018 803 -201 -865 -102 726 891 782 474 -50 -797
2398 -797 -67 1528 1867 441 -367 -321 202 894 900 597 -46 -188 297 724 778 995 666 -220 -914 198
2418 198 1683 1245 96 -407 -399 645 1128 957 352 19 211 -219 -144 901 1155 78 -874 -923 886
2437 886 1189 825 -193 -678 -605 53 523 411 148 245 -725 -1054 -201 1105 1126 -1019 -1638 -834 220 462
2457 462 5 -52 -397 -1097 -708 -244 444 318 -484 -1780 -1477 -107 1165 272 -1564 -1273 -304 -207 -564
2476 -564 -162 387 -535 -1827 -1338 42 952 245 -1374 -1750 -554 612 514 -304 -619 -192 -481 -1032 -182
2495 -182 1479 1159 -1145 -2148 -1087 1240 1153 -290 -857 -212 -518 -616 49 859 807 -557 -1321 -513 848
2514 848 1599 988 -593 -1127 -115 641 1049 409 526 289 -349 -816 567 2258 1335 -499 -1105 549
2532E49Q25m16p10p2k82k53M87P62O02n01o97j151J60J695Q44r43j437K60O07
2551C29M24m76N97P5r83n29r1J615N52p89j222R0L63M18K3k98J85n9n95m29Q89
2572H9N06k38o74p26P59O32P0o54l13J81M73k35m5j67L88j88n70K33K63M51r69
2593g34O3J79K37l8n8l19k21M25P9K92o12lj91N42l80J94O82j17q85K61L09L23
2615B8K55o65m20J27M48N27m86l05l6N42K4m99N24N18q05q18P57O35M31m98o61
2636c77o4K22K73N53j56R1m33o97J96R76J141l96j657q12R42J338J72o54l11j10
2656B37l02k55Q04Q79L58j510j236K48J464J370j344n88K11O3j40l76J065O13
2674A561j123j341K87J408O89M7j944p69R35J094L1n58J43j86j277l75J749J511
$$ plain form
2532 549 1374 958 248 176 -106 -359 128 890 1492 991 294 -857 -697 998 1842 899 -538 -278 329
2551 329 753 277 874 949 -34 -563 -654 961 1513 724 -498 -408 -45 373 396 98 283 224 -371 -800 89
2572 89 595 357 -317 -1043 -284 348 418 -236 -549 -368 105 -130 -175 -342 46 -142 -712 -479 -216 235 -734
2593 -734 -671 -492 -255 -293 -351 -670 -891 -466 -387 -95 -707 -710 -901 -359 -739 -545 137 20 -865 -604 -295 28
2615 28 283 -382 -802 -675 -227 300 -186 -491 -527 15 39 -460 64 582 -223 -1041 -284 351 782 284 -377
2636 -377 -441 -219 54 607 451 542 109 -588 -392 584 1725 1329 -328 -1140 -198 1140 1312 658 347 237
2656 237 -65 -320 484 1363 1721 211 -1025 -777 687 2057 713 125 336 399 259 -117 948 1561
2674 1561 438 -903 -616 792 1481 1528 -416 -1185 -250 844 875 317 460 274 -1003 -1378 371 1882
2692A882l60k311j281J229J654L90o17j078k28k54K99J305O54j13j577j475M0
2709a841J979J781q34k106o78O89N63K60P61L98r03k347Q5K237J548r00j570p03
2727a581R8J047O90L52o28p97o17M14M89J215L19j115k001K04K452O63r76r92
2745g64J2K85l31R93J190k08k094r54R87J167J000n40n24j497o9J350J111j89
2763I25q28j08p41j31O63K116J44k317q89O08R47N64P09q80j042o84P28Q13P09
2782A306j36j204l77k28Q69J333j80j008r93K15R08J16J35O0l30n17m18J036M23
2801A010M0j461j34K77O00L20K26n80q46M52K56L26J27L1m64r02p41J343J521
2820A401m42j417n22O91O24m15K52L15m26l49k58K47N96O1J1j046o54R78J021
$$ plain form
2692 1882 1522 -789 -2070 -841 813 1203 586 -492 -720 -974 -675 630 1284 1171 -406 -1881 -1841
2709 -1841 138 1919 1085 -1021 -1699 -1010 -447 -187 574 972 69 -2278 -2193 44 1592 692 -878 -1581
2727 -1581 -1483 -436 254 606 -22 -819 -1436 -1022 -533 682 1001 -114 -2115 -1911 541 1204 228 -764
2745 -764 -752 -467 -798 195 1385 1177 -917 -1871 -884 283 1283 743 219 -1278 -1347 3 1114 925
2763 925 97 -11 -752 -883 -220 1896 2040 -277 -1166 -558 389 953 1662 782 -260 -944 -216 597 1306
2782 1306 1170 -34 -411 -639 230 1563 1383 375 -618 -403 505 621 756 816 486 -31 -449 587 1010
2801 1010 1050 -411 -545 -268 332 652 878 298 -548 -96 160 486 613 644 180 -722 -1463 -120 1401
2820 1401 959 -458 -980 -289 335 -80 172 487 61 -288 -546 -299 297 358 369 -677 -1331 -353 668
2839F68n70j083J40J085o19m65L94Q98N2j399k0Q61L92m28o16R2n1Q10k18l70
2859d47j40M79l8k36m64R27J56r94o01O95J507m64j443j44J314N5k89m11O36K98
2879C96o99m73K97J141j85n90o33L36P15N69p54p72K72J072l94n32J98J198q42
2898C20r12N58Q60M54r31j097N00Q43j17q6j56J34k60l79J13Q92J13k4r19o65
2918g59Q56J287l35q91p76P84qj93N2Q22K4j121j93K96J055R1p35p74Q4N43K96
2939D05K5L6k62k77l90L48O84K25n17j004J20M11O07J5m56l75j41K38K48K39Q5
2960B64l02p83J50L55O81l40O9n09o38N22P07j84j90m47j77K02J49L82L18l10
2980h1q07j51M74O45L85l94p57O5K25N17m17N3P0j95m30k2Q43M79n39r06K18O69
$$ plain form
2839 668 98 -985 -845 240 -379 -844 -450 448 500 -899 -919 -58 334 -94 -710 -618 -669 141 -77 -447
2859 -447 -587 -108 -146 -382 -846 81 237 -757 -1358 -663 844 380 -1063 -1207 107 162 -127 -538 98 396
2879 396 -303 -776 -479 662 477 -113 -746 -410 305 874 120 -652 -380 692 298 -234 -36 1162 320
2898 320 -592 -34 826 1280 349 -748 -248 595 478 392 236 370 110 -269 -156 736 849 825 -94 -759
2918 -759 97 1384 1049 158 -618 166 158 -35 17 839 863 -258 -451 -155 900 991 256 -518 -434 109 405
2939 405 430 466 204 -73 -463 -115 569 794 277 -727 -607 -196 411 426 -30 -405 -546 -308 -60 179 264
2960 264 -38 -821 -671 -316 365 25 94 -415 -1053 -531 176 -8 -198 -645 -822 -620 -471 -89 229 -81
2980 -81 -888 -1039 -565 80 465 71 -686 -621 -396 121 -296 -243 -173 -368 -798 -820 23 502 -37 -943 -725 -56
3002e6L67Q4n78K77l32J72m4J52M51k07l19l75N8J168n2j029n31R31K17J8o44
3023b72N41L52o48j98M18P34n5n62r77L86J058M82j074m01R7Q89l51k93L96N81
3043A103m09j256J31J093O07p22q59l10J113M43m26n04j16M27j77l96O85P31k01
3062I57j303o93J073J219o12q57m82M19M09l15J62O21N4j110n56N58J110M81j042
3081I3j173L43Q38L03l95k23J79k71p18O88O05L77o91j607L67J364M33j29r77
3100e94p5K82k25K49M66N43p36j066k33Q55J000K60j132r60K49O98K31K31M0J04
3120A87j047k85O67Q54M35n60j180l06J071P41P9n36o84p8J56N51M33P75r02j066
3140f95l03Q96R98K03p89n89k16J96P38M47j30o34m20j52L77J207K35p69o59p18
$$ plain form
3002 -56 311 395 -183 94 -238 -66 -110 42 493 286 -33 -408 -350 818 766 -263 -794 137 354 372 -272
3023 -272 269 621 -27 -225 193 927 872 310 -667 -281 777 1259 185 -216 -119 770 419 126 522 1103
3043 1103 694 -562 -431 662 1269 547 -312 -622 491 934 508 4 -112 315 138 -258 427 1158 957
3062 957 -346 -1039 34 1253 641 -216 -698 -279 130 -185 -23 598 652 -458 -1014 -456 654 1135 93
3081 93 -1080 -737 101 404 9 -214 -35 -306 -1024 -336 269 646 -45 -1652 -1285 79 512 383 -594
3100 -594 -669 -387 -612 -363 103 646 -90 -1156 -1389 -534 466 726 -406 -1366 -1117 -419 -188 43 83 187
3120 187 -860 -1145 -478 376 811 251 -929 -1235 -164 577 656 120 -564 -642 -486 65 498 1273 371 -695
3140 -695 -998 -102 896 1099 310 -279 -495 -299 439 886 756 122 -298 -450 -73 1134 1369 600 -59 -777
3160g77N74Q62O69p72m38n08J91K83O18M18n24q57q32R73R84p7p8p65m07R2P35
3181C64L18K39n36m59l54L3Q31Q87l32j558j72N35R72l34k10q8k45l53l0N80K95
3202C83M9o67o15j94J019Q78l97r78k78N63n9J03J52L63l69r34k42J313P39o25
3222B04p87n36L88Q45Rl94k74K46j90l72P2Q49N49j039r85M79J440k01o23l92
3242g12P66k62n30L30O49N00o11n06l59N23J004q42l57J37L99J04o17J1P90L25
3262G42n05q40M77Q12j6j114l01J159J1l20m70N86L10k30o31J52O03K55m13J34
3282D01o13O35K92p54p2J15R97p06q22N12O15Qo87M4L18N34q66L2M16K63n46o41
3304e25M65M57J13J19n97m18L12O94l70K5q4K11l14m67J38R68o8r14l2j10M19
$$ plain form
3160 -777 -203 659 1328 556 118 -390 -199 84 702 1120 596 -261 -1093 -120 864 787 709 -56 -463 -371 364
3181 364 682 921 385 -74 -428 -395 436 1323 991 -567 -739 -204 768 434 224 136 -109 -462 -492 88 383
3202 383 432 -235 -850 -1044 -25 853 456 -522 -800 -237 -296 -193 -41 322 -47 -981 -1223 90 829 204
3222 204 -583 -1119 -731 114 123 -271 -545 -299 -489 -861 -789 60 609 -430 -1415 -936 504 303 -320 -712
3242 -712 54 -208 -738 -408 241 741 130 -376 -735 -212 792 -50 -407 -270 129 233 -384 -373 417 742
3262 742 237 -603 -126 686 670 -444 -745 414 425 105 -365 221 531 301 -330 -178 425 680 267 401
3282 401 -212 423 715 -39 -111 4 1001 295 -527 -15 600 608 -79 -35 283 817 -49 -17 399 662 116 -525
3304 -525 -60 397 510 629 32 -386 -74 620 250 275 191 402 88 -379 -241 727 659 -255 -287 -397 22
3325B2J72k15L04Oo75l92M38L58j38L1j12n76L28N87J30n86k35q0N30k85K51K86
3347A49k42l35k22J82L52J83l60n00K57P7N96K94o59l22j15M32K0J2M12K12r71
3368e48m75M09Q25K51l99p17n3J08L42N59k59R5m39k06k19O01P69J9q63q48P78
3389b70Q26ln23j20J54r9k33J79J088r6r88n45L16Q99j14j24m55j1M77j4O9k03
3411B10L30m34k47j39O86O21l36j374J64J049M55o66k34L20p2n54j85J020N52
3430A166k55j174k98P84K37M73n97m73K2K33m02M15J53K92l65p95k8J196M38j127
3450a05q29P99M77j10p15J19L87l5k32k32N91R0m03l55J44K63L37k06m80P2L95
3471b8k2k16k17O38J88r03k59K51J106m17p24k14P96J86l19m24M46N3m25k66K95
$$ plain form
3325 22 194 -21 283 289 -386 -778 -340 18 -120 -89 -201 -777 -449 138 268 -318 -553 -633 -103 -388 -137 149
3347 149 -93 -428 -650 -468 -116 67 -293 -793 -536 -459 137 431 -228 -550 -665 -233 -213 -201 211 423 -548
3368 -548 -1023 -614 211 462 63 -654 -707 -599 -257 302 43 138 -301 -507 -726 -125 644 663 -200 -1048 -270
3389 -270 556 553 30 -90 64 -35 -268 -89 999 903 -85 -630 -314 585 471 347 -108 -119 358 344 413 210
3411 210 540 106 -141 -280 406 1027 691 -683 -519 530 985 319 85 405 333 -221 -406 614 1166
3430 1166 911 -263 -561 223 460 933 336 -137 -115 118 -284 131 284 576 211 -584 -612 584 1022 -105
3450 -105 -934 -135 342 232 -483 -364 23 -12 -244 -476 115 205 -198 -553 -409 -146 191 -15 -495 -423 -28
3471 -28 -50 -266 -483 155 343 -560 -819 -568 538 121 -603 -817 -21 165 -154 -578 -132 -79 -504 -770 -475
3492d75K40L45j52l08l2K10P86q05n2p0M32k01K43j85K83j05o98J1Q91J90j29
3513D19q88L63J73p4k6N30o78O1P2m9L76q8K74l10m15M33L36J52n54k45j22J4
3535b46N92J04q5K18n79k14L68L6M32l22J15l13l28N22N08l22m64J52M2j41n5
3556B0M88L70o72n13j3Q99k0k40j40o01K70K36P2kn6j16J24k08J47M95J20r53
3578b93l29L35M13J52m28%M45o69k43L54O11j3n93m98j02P82M37l60n25J93J79
3599a52R8l87P4O72j99p07q25P96R98j33o81n99Q22O7j13p4L96k64q9n05K49P19
3621A63M80l92r24n7N92L41k72l43O29j05o57L95L01N93m86o76j87O14N45m76
3641G8n39J72L68L44m54N7J59O16q07l67L62P80m89k00m25L70O49l31k89J29K97
$$ plain form
3492 -475 -235 110 -42 -350 -382 -172 614 -191 -243 -313 119 -82 161 -24 259 154 -544 -533 358 548 419
3513 419 -469 -106 67 -7 -33 497 -181 -120 -48 -97 279 191 465 155 -260 173 509 661 107 -138 -260 -246
3535 -246 346 450 365 583 4 -210 158 194 626 304 419 106 -222 300 808 486 22 174 216 75 20
3556 20 508 878 206 -307 -320 579 559 319 179 -422 -152 84 156 154 98 -18 106 -102 45 540 660 -293
3578 -293 -622 -287 126 278 -150 -150 295 -374 -617 -263 348 335 -258 -756 -858 -76 361 1 -524 -331 -152
3599 -152 -54 -441 -367 305 106 -601 -1426 -630 368 235 -446 -1045 -223 -156 -269 -343 53 -211 -300 -805 -556 163
3621 163 643 251 -673 -730 -138 203 -69 -412 217 112 -545 -150 151 744 258 -418 -605 9 554 78
3641 78 -461 -289 79 423 -31 26 185 801 -6 -373 -11 769 280 80 -345 25 674 343 54 183 480
3662D80l05l13j36P54L57n11m21Q8L22K56k15k89M1M71m47k13M6P97j54l85l29
3683a06J00M63o3l45K04qo1l87ML39K81l06m1k51lM13R8l92J33j37Q3k84J12M05
3707B51p8l2o97J29N45J23n10P7q5L59l0k53K09k36J36n68L03O00n39K74j37k35
3729c94k97N96n3l07M34l05J15j08j9L17jP3l85o6L1L50J29j67l46J59Ml9K75
3752dp2L84l97n72K17Q81J25m21p32L51K14n2J47k87J17j3L4k64N70O42k90r37
3774c59m4K77P58n9m33J01j24j69J16R0M35K1o10k82N1N56O10o00n67N25%Q2l12
3797F3K66K56j73o62k73O76M58J14p53P0m9P57o33j69M84J7l35k70P6P19k8o25
3819a4n41N17K23J19m90j89L07J42k91l65P30M23m82q84K59P69l4q6j89m18J67
$$ plain form
3662 480 175 -138 -274 480 837 326 -95 -7 315 571 356 67 108 579 132 -81 -35 762 608 223 -106
3683 -106 -6 457 394 49 253 245 184 -203 -199 140 421 115 74 -177 -180 233 331 -61 72 -65 18 -266 -154 251
3707 251 173 141 -556 -427 118 241 -269 -192 -277 82 52 -201 8 -228 -92 -660 -357 243 -296 -22 -159 -394
3729 -394 -691 -95 -148 -455 -21 -326 -211 -319 -338 -21 -22 51 -334 -400 -369 -19 110 -57 -403 -244 -240 -279 -4
3752 -4 -76 308 -89 -661 -444 437 562 141 -591 -240 -26 -78 69 -218 -101 -114 -80 -344 226 868 578 -359
3774 -359 -403 -126 632 573 140 241 117 -52 64 154 589 610 0 -282 -231 325 935 335 -232 293 293 375 63
3797 63 329 585 412 -250 -523 153 611 725 -28 42 -7 750 117 -52 432 449 114 -156 -80 639 611 -14
3819 -14 -555 -38 185 304 -186 -375 -68 74 -217 -582 148 571 89 -795 -536 233 199 113 -76 -494 -327
3840c27P3p7L38L69l55k51k92J72J124n20o01n2R2K19R3l23K60K26l01m97M2N38
3862e0J24j26n99L7O52k47J28k14K01J2j17l96P04L39l98k84m63L94O29n4l45
3883g3k87K53q1L37k33K01N0k1k08k19L35L24o1l15j71K15R1k9o5K83j79j70j78
3906b01N32k47L20l08j47o8P1O51l82m33M09J2K08k64j72M28l5l85j28L93J00
3927C54j80J23k90M22j94l45J35J06M3j6K72l39l4M65l43l64K24K63M2p0m94J84
3949c6M90m65k78J7N28k11k28M8L42r9J3l64r0Q9L35j79l93K38O53m14n42k06
3971g52P72M91p55k38K58K92P7n61J30O1K63n12j83O07J78j56m31m9K01N66k39
3992B0m05J89M66j79l63l38J86P44o91k17L74O62l17m92j84M68K24l75k05K54
$$ plain form
3840 -327 -254 -331 7 376 21 -230 -522 -350 774 254 -347 -399 -307 -88 5 -318 -58 168 -133 -630 -588 -50
3862 -50 74 -52 -651 -614 38 -209 -81 -295 -94 -82 -199 -595 109 448 50 -234 -697 -303 326 272 -73
3883 -73 -360 -107 -188 149 -84 117 167 146 -62 -281 54 378 317 2 -169 46 137 108 43 326 147 -23 -201
3906 -201 331 84 404 96 -51 -119 -48 603 221 -212 197 209 417 153 -19 409 374 -11 -139 254 354
3927 354 174 297 7 429 235 -110 25 131 174 158 430 91 57 522 179 -185 39 302 344 274 -220 -36
3949 -36 454 -11 -289 -272 256 45 -183 -135 207 108 121 -243 -333 -244 91 -88 -481 -243 410 -4 -546 -752
3971 -752 20 511 -244 -482 -224 68 145 -416 -286 -225 38 -474 -657 -50 128 -28 -459 -508 -307 259 20
3992 20 -385 -196 270 91 -272 -610 -424 320 -371 -588 -214 448 131 -361 -545 -77 147 -228 -433 -179
4012a79L46J61k70k52J01K31r7j45j45O37P6l78l20L18N20k36m76J59L64l6n54
4033a75K50K36M1k37j29j3K58J31l1l60K22L71Lm29K25j9M9o27n4M12O89m14o73
4056b74K60K72K36m46K2K60k69K8k45L48K00n9k85m10J55L20L91m6n68l2K25k28
4078a45l6L4M86o0m71l73M67J75P6m97M46l99K5k5L1L47l05J02k53l57O31K40
4100A39k16l39p3L78J66k50l74M40l4N5l80M09J45p7%k32l2J74J08k25j68o8K99
4123a55L58n06K47m7K66o78j50O07L67mo71o5J90L38k15L30k33k5m12J38J58N15
4145C53K81n66k42O9p6N38J2j76K69l09K12o18M98N11l23m09n9L25o5j87K13j84
4167F7L86k30m10K91L08P9j65j02j94L36L1l28m21L26N51j67n55OM74Rm18P5L52
$$ plain form
4012 -179 167 328 58 -194 -93 138 41 -104 -249 388 464 86 -234 84 604 368 -108 51 415 379 -175
4033 -175 75 311 352 115 -14 -27 231 362 331 -29 193 564 567 138 363 344 393 -234 -288 124 813 399 -274
4056 -274 -14 258 494 48 70 330 61 89 -156 192 392 333 48 -362 -207 113 504 458 -110 -142 83 -145
4078 -145 -181 -147 339 279 -192 -565 -98 77 153 -344 102 -297 -272 -297 -266 81 -224 -122 -375 -732 -101 139
4100 139 -77 -416 -489 -111 55 -195 -569 -129 -163 -108 -488 -79 66 -11 -11 -243 -275 -101 7 -218 -386 -454 -155
4123 -155 203 -303 -56 -103 163 -515 -665 -58 309 305 -366 -431 -241 97 -118 212 -21 -46 -458 -320 -162 353
4145 353 634 68 -174 -105 -181 357 369 193 462 153 365 -253 245 756 433 24 -35 290 225 38 251 67
4167 67 453 223 -187 104 412 491 326 224 30 366 397 69 -352 -26 525 358 -197 -191 283 292 -126 -51 301
4190C01J68l02j39k51L94J29m40j88M01j7j57l41L83J47L03m10m75K9P43j47m62
4211c31K15J90o3n58J38L71O42m12o75J67J61k17M41j40j14J26j02l2j63L67J37
4232A48l04m07J95L47J81n69M0k8L34j11q0J40N03l86m56q9N30L24k21o59J46
4253d22j84R12j49l34M49j21k3o59M52K05N0k71j06j49N43m5J2j5j64N7j7p1J39
4276H9M09Po11P0P7L63l8o5l56l8L69j93M36k60q9Km51K56L27J61J05o41R1j16
4300i6M24j13j05K65o50M18k22J85L48l0k50m46L84N80p8m63l03Q6J48j7K0L01
4322C86m5m79J1p4M36J76j39k24l52L52Q2J51k70q7J18l46O1O6N24m3p28k25K40
4345d09P15k40m09p9K94j65m09N48L03k00o9l3j29J32L15j68m13L1L03K30k57
$$ plain form
4190 301 469 167 28 -223 171 300 -140 -328 73 56 -101 -442 -59 88 391 -19 -494 -465 278 131 -331
4211 -331 -116 74 11 -547 -409 -38 604 192 -483 -316 -155 -372 69 -71 -185 -59 -161 -193 -356 11 148
4232 148 -156 -563 -368 -21 160 -409 -369 -397 -63 -174 -254 -114 389 3 -453 -542 -12 312 91 -568 -422
4253 -422 -606 306 157 -177 272 151 128 -531 -79 126 176 -95 -201 -350 193 148 160 145 -19 38 21 -50 89
4276 89 498 505 -106 -36 41 404 366 301 -55 -93 276 83 519 259 170 172 -279 -23 304 465 570 -71 20 -96
4300 -96 328 215 110 375 -275 143 -79 106 454 424 174 -272 112 692 614 151 -152 -66 82 65 85 386
4322 386 341 -138 -127 -201 235 411 272 48 -304 48 130 281 11 -76 42 -304 -243 -177 347 304 -424 -649 -409
4345 -409 306 66 -343 -422 -128 -293 -702 -154 149 -51 -120 -153 -282 -150 165 -3 -416 -385 -82 148 -109
4366a09l14N68q8l18k52L77L62J64r45K17j20N14j19m6j8L39l44k5J14K59L32
4387E48q79J8m8N37J91m18J99j42j49J5J32L52P5m4n54q2K59K86P1n87K7L12J88
4410C07j49k36N59l88k60RP6M24K08o14j20j5P52j1p96J63L31J68l26q0J96J90
4432C88m44l4J90K40J60k58m20Q9L06N4k32j11K15O4l74N5P0L76l85l42L58M7
4454A2K7J08k55K3M20k10J8k19k15J40J14r7n5K24J03j20k18k87M59J24q9m36
4476d29O07l75j30K8L66k58M6q5J50j17Q6J3l60Q4J22K22l4m91R0L82l07J67P2
4499a51Q4L02l24K0j42J39K06J92m43j46L10R5k4k42K82l34N1qP2M34k9n49p8
4522b83K94P21o15l29J27J03K06k08O1K62Q0n50J66n5M43Rn02p4J65M52M9m31
$$ plain form
4366 -109 -423 145 57 -261 -513 -136 226 390 -555 -338 -458 56 -63 -109 -127 212 -132 -157 -43 216 548
4387 548 -331 -313 -361 176 367 -51 148 6 -143 -128 4 356 431 387 -167 -249 10 296 367 -220 -193 119 307
4410 307 158 -78 481 93 -167 -158 -82 342 550 -64 -184 -199 553 542 -254 -91 240 408 82 2 198 388
4432 388 -56 -90 100 340 500 242 -178 -89 217 271 39 -72 143 207 -167 -112 -42 334 -51 -393 -35 12
4454 12 39 147 -108 -85 335 125 143 -76 -291 -151 -37 -134 -189 35 138 18 -200 -487 -28 96 7 -429
4476 -429 178 -197 -327 -299 67 -191 -145 -230 -80 -197 -111 -98 -458 -374 -252 -30 -64 -555 -465 -83 -390 -223 -151
4499 -151 -67 235 -89 -69 -211 -72 134 326 -117 -263 47 142 118 -124 158 -176 -125 -133 -61 373 344 -205 -283
4522 -283 11 732 117 -212 -85 18 224 16 77 339 419 -131 35 -20 423 432 -70 -144 21 473 522 91
4544I1q2L02On40j37O70J77j70l64j08N78K59n75l49N13R0m82K5L23K4J46m37
4566d0n9M3L97Lk32k30L46P6k96j39O26n00Oj08k91M01K70j27o59N16K05K5m02
4589a69J13J28q2r6k10J59L28l25k71J42J12K57J95n00j71L77j93K17n23M88j91
4610b15j66j01L44L96j46l32j38L41r6J62m33kJ91J22l35L15j29K68q8l29O1N30
4632B20n7m26k81M61R0J37l67m6L87J34k02j02j72N28m19r9J18q8L19n5j33Q6
4654C3k4P7P4m2M4k42Q9k06L91j69M68l08l44L04K23m1J43j02l88J0J18N6K62
4677D26n4m8k70m5j21M95l8m66K1J31L33m21K18J16j29l98K55j70M84J67m34l87
4699c35J41J56O18k50l18J22L7m43m3M62K41j48l69m27L78N26q3n08J79k8o6J84
$$ plain form
4544 91 9 311 317 -223 -360 310 487 317 -47 -155 423 682 107 -242 271 361 -121 -96 227 251 397 -40
4566 -40 -99 -56 341 344 112 -118 228 304 8 -131 495 -5 1 -107 -398 3 273 146 -513 3 208 233 -169
4589 -169 -56 72 -10 -106 -316 -157 171 -154 -425 -283 -171 86 281 -219 -390 -13 -206 11 -512 -24 -215
4610 -215 -381 -482 -138 258 112 -220 -358 -17 -113 49 -384 -386 -195 -73 -408 -93 -222 46 -42 -371 -310 220
4632 220 163 -263 -544 -83 7 144 -223 -269 118 252 50 -52 -224 304 -115 -214 -96 -184 135 80 -53 33
4654 33 9 86 160 118 162 -80 9 -197 194 25 493 185 -159 145 368 327 470 368 -20 -10 108 164 426
4677 426 372 324 54 9 -112 383 345 -121 -100 31 364 -57 161 277 148 -250 5 -165 319 486 52 -335
4699 -335 -194 -38 580 330 12 134 171 -272 -315 147 388 240 -129 -556 -178 348 265 -243 -64 -92 -158 26
4721B6k14L10j81k00l04J95M39j40L22p17j57M23J68m40P8J7L9j76J46K07P34
4742E75p44k66k85N96M05Pk33j7k44L9J66p8K67j12k98l76Q6N70N57p58m19K70
4764b92O62l96j23Q3L21m00j35J54M18M9j94k25j94J00N44k17jk79L01k60J57
4785G3o2M05m4n56j16K32N12k6k60O8j37r4M88k90K51k5k67k98R0L10L44o49J18
4808F7J09o4J14J83k84J4p7J52n10N08r0L1j97j99L13J74n02M64o7M9k16o7j57
4831b52N57l41K2l00J49Q1J12j68k8N2J30Pmj23j5M16n20jJK32j4m71L44l6j31
4856c01L07jr7r5J03K26n4j44P0Q9n07L46J64p5j29j20K11k06R6o1L6m8L28k23
4880h5j63l3N7K29P0j66KK24L9k04j94L68K62m83j54m17R41j05j68r2J01K08l39
$$ plain form
4721 26 -188 122 -59 -259 -563 -368 71 -69 253 -464 -621 -198 -30 -470 -392 -375 -336 -512 -366 -159 575
4742 575 -169 -435 -720 -124 281 288 55 38 -206 -167 -1 -79 188 76 -222 -598 -512 58 615 -143 -562 -292
4764 -292 370 -26 -149 -66 255 -145 -280 -126 292 341 147 -78 -272 -172 372 155 154 -125 176 -84 73
4785 73 11 416 372 -184 -300 -68 444 418 158 226 89 -5 483 193 444 419 152 -146 -56 254 598 -51 67
4808 67 176 112 226 409 125 139 62 214 -296 212 122 153 -44 -243 70 244 -258 206 139 188 -28 -95 -252
4831 -252 305 -36 -14 -314 -165 -84 28 -140 -168 -116 14 21 17 -106 -121 295 -225 -226 -225 7 -7 -478 -134 -170 -301
4856 -301 6 5 -92 -187 -84 142 88 -56 14 103 -404 -58 106 31 -98 -218 -7 -213 -117 -178 -142 -190 138 -85
4880 -85 -248 -281 -224 5 75 -91 -89 135 174 -30 -224 144 406 -77 -231 -648 293 188 20 -72 29 237 -102
4903a02k03M08L73l98l76P2J34J42K46l94J10K42P2L6l23J69Q3j68k17N5O72r2
4925E41k08q07O85M2k39J08j90K71j33k77M03l04N16j64p33K45J80K27m0j5J11
4946B19l59J8J5N34m8k17j87l98L60L00qj02m21M3J14p8N7J60K27k64k26k44M49
4969e6N72k89n13j44N48n4j16j04K4M07m62O2L35l0j78m37J98J04K51J0l41o8
4991b81J25J32j26r5L18o6p4k05K48M2L39k84l36n6M64r2R2l4k7j2k56J13O1k3
5015c3J9j45k06K94K25Jk47k8j17Q9K79o7no7J66n67O18K9K91k18q06L35L11K29
5039C80k38J61l20J07o6j51L14K05l24j18k11K82P5L95k64q0j74J44J27Q5j10
5060B19j93r4M06l55L3M35k35L2m09L19NL80k75l88J58N6k50K48K37m2k36k01
$$ plain form
4903 -102 -305 103 476 78 -298 -226 -92 50 296 -98 12 254 326 362 39 208 291 123 -94 -39 633 541
4925 541 333 -474 211 253 14 122 -68 203 70 -207 196 -108 408 244 -489 -244 -64 163 123 108 219
4946 219 -140 -122 -107 427 379 162 -25 -423 -63 237 229 127 -294 -251 -137 -215 -158 2 229 -35 -261 -505 -56
4969 -56 516 227 -286 -430 118 64 -52 -156 -132 275 -187 -125 210 180 2 -435 -237 -133 118 128 -213 -281
4991 -281 -156 -24 -150 -245 73 7 -67 -272 -24 18 357 73 -263 -319 145 53 145 111 84 72 -184 -71 -10 -33
5015 -33 -14 -159 -365 -71 154 155 -92 -120 -237 -148 131 64 59 -8 158 -409 209 238 529 311 -495 -160 151 380
5039 380 142 303 -17 90 24 -127 187 392 68 -50 -261 21 96 491 227 147 -27 117 244 329 219
5060 219 26 -68 338 -17 16 451 216 248 -161 158 163 543 268 -120 38 94 -156 92 329 287 51 -150
5082a50nJ85M60q54L54k89L97k9j65O6o6K40l79k60P17Nm97k37O01K2jk06k55
5105c46L27j12r5j05M53Jk49l47L7L78M41m38L8j77K10k20o1l5M72k46k01M4J20
5128a11J08K25m81j28J41M25q3m14O1M40N7o63K66M19P3l79j56j07O12j10k23
5149b8k06j00M70k93K29Pj00L55n66p3O10k1k84k80K60j51L38k21j58M41j75O4
5171A18P4k44L15j33J04m03k12Q21j13K64p34L64j10j09J51J99N8n51J5K2J17
5192A3M01j94l53Q9K66k92M15j85L3k15j68K45OJ69M5k10n75L85K51l7j96LL0
5215g4K65l80M9J71J49j79q9j98K57R7K9l74l12O01N9j41k26M0Lm3J51m5L16k14
5239h8r4k48L63N6J00k55M1O6m1J86l15J29m2N1k4m4L5L73k47j85J37j08K92k15
$$ plain form
5082 -150 -155 30 490 -364 -10 -299 98 69 -96 -30 -96 144 -235 -495 222 227 -270 -507 94 116 115 -91 -346
5105 -346 -19 -131 -226 -331 122 123 -126 -473 -436 -58 383 -55 -17 -194 16 -204 -265 -300 172 -74 -275 -231 -111
5128 -111 -3 222 -259 -387 -246 179 96 -318 -257 183 240 -423 -157 262 335 -44 -200 -307 305 195 -28
5149 -28 -234 -334 136 -157 72 79 -21 334 -232 -305 305 284 0 -280 -20 -171 167 -54 -212 229 54 118
5171 118 192 -52 263 130 234 -169 -381 440 327 591 -143 221 111 2 153 352 410 -141 -126 -104 13
5192 13 414 220 -133 -44 222 -70 345 160 193 -22 -190 55 61 230 275 65 -510 -125 126 89 -107 -104 -74
5215 -74 191 -189 -140 31 180 1 -88 -286 -29 68 97 -277 -589 12 71 -70 -296 -256 -253 -296 -145 -190 126 -88
5239 -88 -182 -430 -67 -11 89 -166 -125 -59 -100 86 -229 -100 -142 -91 -115 -159 -124 249 2 -183 -46 -154 138 -77
5263g7n40M85L26l79P9n6K1Q6K9j90RJ85J59k84K62l98L12N7pk33N35k53%l12
5287a84J26K72j86k81J14L15M8j29N5k37N04k85j54n2n1L27k08j75L43r9J2m63
5309c88M71K67K63m70m20K21K13K6l96M72P7j81m7m04K07L44k53M3o4Q8j1K67
5331C25j47o1l1p5Kk54M12N74p21n13L46K39O4q7k07p1j8L7P3m5K97l20l34J44
5355c71M40R4j65j97J17%J75Jk66k32K47j11J7K35M44o9o88m4J86J89K95n42K7
5378b18J96l13j88N83J95m0M5l87o7M0M13j79Rl70J85J7j18J4K2r6O4J87j13M64
5402C45N6n79k43L43L62r9n8q0o4k83M3M01q4J77k84k21K58Q5L49j17l94L1j53
$$ plain form
5263 -77 -617 -132 194 -185 -106 -162 -141 -55 -26 -216 -207 -22 137 -147 115 -283 29 86 79 -154 381 128 128 -184
5287 -184 -58 214 28 -253 -139 176 224 95 150 -87 417 132 -22 -74 -125 202 -6 -181 162 63 75 -388
5309 -388 83 350 613 143 -277 -56 157 183 -213 259 336 155 108 -296 -89 255 2 45 -19 69 58 325
5331 325 178 117 86 11 13 -241 171 745 24 -489 -143 96 160 73 -134 -205 -223 -186 -113 -158 139 -181 -515 -371
5355 -371 69 163 -2 -199 -82 -82 93 94 -172 -404 -157 -268 -251 -16 428 359 -329 -373 -187 2 297 -245 -218
5378 -218 -22 -335 -523 60 255 215 260 -127 -194 -154 259 80 89 -281 -96 -79 -197 -183 -161 -257 -193 -6 -119 345
5402 345 401 -178 -421 -78 284 185 127 47 -17 -300 -257 144 60 237 -47 -268 -10 75 424 307 -87 -56 -209
$$ [...]
8191D8
##END NTUPLES=NMR FID
##END=
