##TITLE=1H_LacPbMe-C2-m-f2
 CDCl3, 8 sc, 
 25.10.2019
##JCAMPDX= 6.0         $$ Bruker NMR JCAMP-DX V2.0
##DATA TYPE= NMR FID
##DATA CLASS= NTUPLES
##ORIGIN= UXNMR, Bruker Analytische Messtechnik GmbH
##OWNER= root
$$ XWIN-NMR		Version 3.5
$$ Fri Oct 25 14:02:44 2019 Russian Standard Time (UT+4h)  she@DPX200
##.OBSERVE FREQUENCY= 200.1315
##.OBSERVE NUCLEUS= ^1H
##.DELAY= (6, 6)
##.ACQUISITION MODE= SIMULTANEOUS
##.ACQUISITION SCHEME= undefined
##.AVERAGES= 8
##.DIGITISER RES= 18
##SPECTROMETER/DATA SYSTEM= spect
##.PULSE SEQUENCE= zg30
##.SOLVENT NAME= CDCl3
##.SHIFT REFERENCE= (INTERNAL, CDCl3, 0, 15.7039)
##AUDIT TRAIL= $$ (NUMBER, WHEN, WHO, WHERE, WHAT)
$$ ##TITLE= Audit trail, XWIN-NMR		Version 3.5
$$ ##JCAMPDX= 5.01
$$ ##ORIGIN= Bruker BioSpin GmbH
$$ ##OWNER= she
$$ F:/spectra/data/she/nmr/H-F/1/audita.txt
$$ ##AUDIT TRAIL=  $$ (NUMBER, WHEN, WHO, WHERE, WHAT)
(   1,<2019-10-25 14:00:57.92 +0400>,<she>,<DPX200>,
      <created by zg, POWCHK disabled, PULCHK disabled
       configuration hash MD5:
       00 E9 B6 7A A2 85 ED C7 34 08 36 98 17 FE 4E 26
       data hash MD5: 16K
       06 EE 1A AC FB CF 3F 80 DB 3E 48 79 2C 44 5E 1F>)
$$ ##END=
$$ 
$$ hash MD5
$$ 60 98 07 6F 93 3A A5 B9 22 D0 8E 9D 37 74 0F 54
##$RELAX= 
##$RELAX= 
##$RELAX= 
##$RELAX= 
##$RELAX= 
##$RELAX= 
$$ Bruker specific parameters
$$ --------------------------
##$DU= <F:/spectra>
##$EXPNO= 1
##$NAME= <H-F>
##$PROCNO= 1
##$TYPE= <nmr>
##$USER= <she>
##$AMP= (0..31)
100 100 100 100 100 100 100 100 100 100 100 100 100 100 100 100 100 100 
100 100 100 100 100 100 100 100 100 100 100 100 100 100 
##$AQSEQ= 0
##$AQ_mod= 1
##$AUNM= <au_zg>
##$AUTOPOS= <>
##$BF1= 200.13
##$BF2= 200.13
##$BF3= 200.13
##$BF4= 200.13
##$BF5= 200.13
##$BF6= 200.13
##$BF7= 200.13
##$BF8= 200.13
##$BYTORDA= 1
##$CFDGTYP= 0
##$CFRGTYP= 5
##$CHEMSTR= <none>
##$CNST= (0..31)
1 1 145 1 1 1 1 1 1 1 1 1 1 1 1 1 1 1 1 1 1 1 1 1 1 1 1 1 1 1 1 1 
##$CPDPRG= <>
##$CPDPRG1= <>
##$CPDPRG2= <>
##$CPDPRG3= <>
##$CPDPRG4= <mlev>
##$CPDPRG5= <mlev>
##$CPDPRG6= <mlev>
##$CPDPRG7= <mlev>
##$CPDPRG8= <mlev>
##$CPDPRGB= <>
##$CPDPRGT= <>
##$D= (0..31)
0 1.2 0 0 0 0 0 0 0 0.06 0 0.03 0 0 0 0 0.0002 0 0 0 0 0 0 0 0 0 0 0 0 
0 0 0 
##$DATE= 1571997657
##$DBL= (0..7)
120 120 120 120 120 120 120 120 
##$DBP= (0..7)
150 150 150 150 150 150 150 150 
##$DBP07= 0
##$DBPNAM0= <>
##$DBPNAM1= <>
##$DBPNAM2= <>
##$DBPNAM3= <>
##$DBPNAM4= <>
##$DBPNAM5= <>
##$DBPNAM6= <>
##$DBPNAM7= <>
##$DBPOAL= (0..7)
0.5 0.5 0.5 0.5 0.5 0.5 0.5 0.5 
##$DBPOFFS= (0..7)
0 0 0 0 0 0 0 0 
##$DE= 6
##$DECBNUC= <off>
##$DECIM= 24
##$DECNUC= <off>
##$DECSTAT= 4
##$DIGMOD= 1
##$DIGTYP= 9
##$DL= (0..7)
0 120 120 120 120 120 120 120 
##$DP= (0..7)
150 150 150 150 150 150 150 150 
##$DP07= 0
##$DPNAME0= <>
##$DPNAME1= <>
##$DPNAME2= <>
##$DPNAME3= <>
##$DPNAME4= <>
##$DPNAME5= <>
##$DPNAME6= <>
##$DPNAME7= <>
##$DPOAL= (0..7)
0.5 0.5 0.5 0.5 0.5 0.5 0.5 0.5 
##$DPOFFS= (0..7)
0 0 0 0 0 0 0 0 
##$DQDMODE= 0
##$DR= 18
##$DS= 0
##$DSLIST= <SSSSSSSSSSSSSSS>
$$ [...]
##$SUBNAM2= <"">
##$SUBNAM3= <"">
##$SUBNAM4= <"">
##$SUBNAM5= <"">
##$SUBNAM6= <"">
##$SUBNAM7= <"">
##$SUBNAM8= <"">
##$SUBNAM9= <"">
##$SW= 24.0689530833862
##$SWIBOX= (0..15)
0 0 2 0 0 0 0 0 0 0 0 0 0 0 0 0 
##$SW_h= 4816.95568400771
##$TD= 16384
##$TD0= 1
##$TE= 0
##$TE2= 300
##$TE3= 300
##$TEG= 300
##$TL= (0..7)
0 120 120 120 120 120 120 120 
##$TP= (0..7)
150 150 150 150 150 150 150 150 
##$TP07= 0
##$TPNAME0= <>
##$TPNAME1= <>
##$TPNAME2= <>
##$TPNAME3= <>
##$TPNAME4= <>
##$TPNAME5= <>
##$TPNAME6= <>
##$TPNAME7= <>
##$TPOAL= (0..7)
0.5 0.5 0.5 0.5 0.5 0.5 0.5 0.5 
##$TPOFFS= (0..7)
0 0 0 0 0 0 0 0 
##$TUNHIN= 0
##$TUNHOUT= 0
##$TUNXOUT= 0
##$USERA1= <user>
##$USERA2= <user>
##$USERA3= <user>
##$USERA4= <user>
##$USERA5= <user>
##$V9= 5
##$VALIST= <valist>
##$VCLIST= <CCCCCCCCCCCCCCC>
##$VD= 0
##$VDLIST= <DDDDDDDDDDDDDDD>
##$VPLIST= <PPPPPPPPPPPPPPP>
##$VTLIST= <TTTTTTTTTTTTTTT>
##$WBST= 1024
##$WBSW= 4
##$XGAIN= (0..3)
0 0 0 0 
##$XL= 0
##$YL= 0
##$YMAX_a= 924367
##$YMIN_a= -1168316
##$ZGOPTNS= <>
##$ZL1= 120
##$ZL2= 120
##$ZL3= 120
##$ZL4= 120
##$ABSF1= 10
##$ABSF2= 0
##$ABSG= 5
##$ABSL= 3
##$ALPHA= 0
##$AQORDER= 0
##$ASSFAC= 0
##$ASSFACI= 0
##$ASSFACX= 0
##$ASSWID= 0
##$AUNMP= <proc_1d>
##$AZFE= 0.1
##$AZFW= 0.1
##$BCFW= 1
##$BC_mod= 2
##$BYTORDP= 1
##$COROFFS= 0
##$CY= 11.3945322036743
##$DATMOD= 1
##$DC= 2
##$DFILT= <>
##$DTYPP= 0
##$F1P= 20.1720416913024
##$F2P= 0.152960286110954
##$FCOR= 0.5
##$FTSIZE= 0
##$FT_mod= 4
##$GAMMA= 1
##$GB= 0.15
##$INTBC= 1
##$INTSCL= 1
##$ISEN= 128
##$LB= 0.24
##$LEV0= 0
##$LPBIN= 0
##$MAXI= 10000
##$MC2= 0
##$MEAN= 0
##$ME_mod= 0
##$MI= 1.114404
##$NCOEF= 0
##$NC_proc= 0
##$NLEV= 6
##$NOISF1= 3.799351
##$NOISF2= 2.8
##$NSP= 1
##$NTH_PI= 0
##$NZP= 0
##$OFFSET= 15.70392
##$PC= 1
##$PHC0= -9566.362
##$PHC1= 6.400833
##$PH_mod= 1
##$PKNL= yes
##$PPARMOD= 0
##$PSCAL= 0
##$PSIGN= 0
##$REVERSE= no
##$SF= 200.130013532006
##$SI= 16384
##$SIGF1= 3
##$SIGF2= 2
##$SINO= 400
##$SIOLD= 16384
##$SREGLST= <1H.CDCl3>
##$SSB= 0
##$STSI= 0
##$STSR= 0
##$SW_p= 3612.71676300578
##$SYMM= 0
##$S_DEV= 0
##$TDeff= 0
##$TDoff= 0
##$TI= <>
##$TILT= no
##$TM1= 0
##$TM2= 0
##$TOPLEV= 0
##$USERP1= <user>
##$USERP2= <user>
##$USERP3= <user>
##$USERP4= <user>
##$USERP5= <user>
##$WDW= 1
##$XDIM= 8192
##$YMAX_p= 0
##$YMIN_p= 0
$$ End of Bruker specific parameters
$$ ---------------------------------
##NTUPLES= NMR FID
##VAR_NAME=  TIME,          FID/REAL,        FID/IMAG
##SYMBOL=    X,             R,               I
##VAR_TYPE=  INDEPENDENT,   DEPENDENT,       DEPENDENT
##VAR_FORM=  AFFN,          ASDF,            ASDF
##VAR_DIM=   8192,          8192,            8192
##UNITS=     SECONDS,       ARBITRARY UNITS, ARBITRARY UNITS
##FACTOR=    0.0002076,     1,               1
##FIRST=     0,             0,               0
##LAST=      1.7004516,     0,               0
##MIN=       0,             -1168316,        0
##MAX=       1.7004516,     924367,          0
$$ Real data points
##PAGE= N=1
##DATA TABLE= (X++(R..R)), XYDATA
$$ [...]
$$ plain form
2986 5484 8239 4982 -2363 -4075 874 4497 6366 7743 4764 -4499 -6492 3622 11667 7082 71
3001 71 -1650 -516 -215 3560 8004 6538 -316 -4445 -2728 2417 7581 8192 1728 -5762 -4484 3331
3017 3331 6977 5097 2766 962 -3060 -3744 2519 8718 7200 -242 -4976 -4046 1398 6744 6592 736
3033 736 -4563 -3330 -680 1424 4296 5496 716 -7026 -7165 1921 8034 5148 -992 -4579 -4323 -1044
3049 -1044 3823 5136 2205 -2083 -4734 -4734 -398 5580 6097 -1620 -9016 -7338 1055 4902 2067 -1325
3065 -1325 -3443 -6053 -5477 -301 5211 3641 -3313 -7840 -6322 -222 4916 4363 -2186 -7700 -6156
3080 -6156 -1371 1822 2020 525 -2374 -7501 -8591 -1484 5326 3057 -4576 -9154 -6557 -1733 1512
3095 1512 1948 -1391 -5041 -6494 -4776 -1219 3112 3552 -2454 -9159 -8105 -226 4381 2152 -3377
$$ packed form
2986E484K755l257p345j712M949L623J869J377k979r263j993J0114Q045m585p011
3001G1j721J134L01L775M444j466o854m129J717N145N164O11o464p490J278P815
3017C331L646j880k331j804m022o84O263O199j518p442m734R30N444N346j52n856
3033G36n299J233K650K104K872J200m780p742j39R086O113k886o140l587K56L279
3049a044M867J313k931m288k651%M336N978N17p717p396J678Q393L847k835l392
3065a325k118k610N76N176N512j570o954m527J518O100N138n53o549n514J544
3080f156M785L193J98j495k899n127j090P107O810k269p633m578K597M824L245
3095A512M36l339l650j453J718L557M331M40o006o705J054P879M607k229n529
$$ plain form
3110 -3377 -5524 -5665 -4654 -712 2676 1329 -4305 -7905 -6981 -1978 3727 4110 -3135 -9085 -6274 545
3126 545 2313 904 1047 -1251 -6275 -6899 112 6402 3725 -3059 -6353 -5123 -1366 3753 4548 -1182
3142 -1182 -5991 -4379 -993 63 1886 4768 625 -7102 -6587 2416 7443 3822 -1224 -2241 -2059
3157 -2059 -779 3411 5693 3264 -231 -2583 -2191 303 6069 7341 551 -5860 -3156 3273 4850
3172 4850 3806 2737 1089 -2889 -2036 3041 7165 6902 2776 -1948 -3029 2141 9234 8356 1246 -1447
3188 -1447 510 1499 2119 6359 8395 2618 -4763 -3532 4063 7624 6302 3234 -1704 -3518 1172
3203 1172 6906 7084 3170 1618 -146 -1700 1961 8735 9811 1050 -5352 -2064 4453 6487 5556
3218 5556 3323 -1094 -3984 -1121 4115 5375 3894 918 -3452 -4946 650 7986 6628 -950 -4905
$$ packed form
3110c377k147j41J011L942L388j347n634l600R24N003N705L83p245n950K811O819
3126E45J768j409J43k298n024o24P011O290k677o784l294J230L757N119P95n730
3142a182m809J612L386J056J823K882m143p727N15R003N027l621n046j017J82
3157b059J280M190K282k429l495k352L92K494N766J272o790o411K704O429J577
3172D850j044j069j648l978Q53N077M124k63m126m724j081N170P093q78p110k693
3188a447J957R89O20M240K036n777p381J231P595L561j322l068m938j814M690
3203A172N734J78l914j552j764j554L661O774J076q761o402L288O517K034r31
3218E556k233m417k890K863N236J260j481k976m370j494N596P336j358p578l955
$$ plain form
3233 -4905 -2105 1141 2893 4441 3930 -165 -4870 -4105 1015 5097 5147 -322 -6027 -5922 -273 3736
3249 3736 1900 -1755 -2664 -4002 -5002 -1874 3351 4157 -2087 -7412 -5820 -403 3824 2895 -1036 -5112
3265 -5112 -5516 -2813 74 1655 1231 -1552 -6992 -7935 -2433 4121 2417 -4466 -8128 -6213 -2198 81
3281 81 1230 -301 -3773 -7027 -6139 -1462 3389 3013 -2239 -7122 -7016 -1458 3350 1924 -2464 -4943
3297 -4943 -4852 -3750 -1750 1580 2203 -3168 -7813 -7024 -1162 2988 2150 -1961 -5967 -5694 -2056 1624
3313 1624 1902 634 -1468 -3507 -4973 -1409 4454 4826 -1486 -6667 -4810 387 2880 2748 367 -2767
3329 -2767 -4540 -3451 -87 2995 4210 1019 -4842 -6528 123 6882 4736 -1008 -2400 -1276 -771
3344 -771 809 4982 6105 188 -5179 -3308 1439 5447 5769 1697 -3997 -4875 611 4912 3841 1539
$$ packed form
3233d905K800L246J752J548n11m095m705P65N120M082N0n469n705J05N649M009
3249C736j836l655r09j338j000L128N225Q06o244n325J592N417M227r29l931m076
3265e112m04K703K887J581m24k783n440r43N502O554j704o883l662J915M015K279
3281H1J149j531l472l254Q88M677M851l76n252m883J06N558M808j426m388k479
3297d943R1J102K000L330O23n371m645P89N862M150q38m111m006K73L638L680
3313A624K78j268k102k039j466L564N863L72o312n181J857N197K493j32k381l134
3329b767j773J089L364L082J215l191n861j686O651O759k146n744j392J124N05
3344g71J580M173J123n917n367J871M747M008L22m072n694q78N486M301j071k302
$$ plain form
3360 1539 625 -1586 -3725 416 7554 7457 11 -4610 -2067 2668 5752 6191 3471 -1382 -2681 365
3376 365 3561 5237 5729 2416 -3698 -4890 1458 7777 6252 260 -2657 -1736 175 4409 6493 4375
3392 4375 -247 -1919 -1159 2017 6587 8045 3021 -4020 -3462 3265 7073 4476 1541 124 -1625
3407 -1625 -1972 2154 6258 4958 -103 -3704 -3126 894 6467 6912 1059 -3947 -2076 2235 3636 3451
3423 3451 4959 2401 -3238 -4316 2044 7238 5278 -435 -3592 -3163 -247 3176 4206 1391 -2062
3438 -2062 -3791 -3022 -688 3916 5625 686 -5689 -5407 1255 4937 3520 270 -2260 -3485 -2293
3453 -2293 1252 3933 2932 -1163 -5656 -5819 -1348 4276 3808 -2288 -7064 -5763 -1233 1034 1340 469
3469 469 -2327 -6012 -5926 -483 3992 3046 -2060 -6385 -6068 -1000 3509 2612 -1865 -5276 -5060 -4157 -1587
$$ packed form
3360A539r14k211k139M141P138r7p446m621K543M735L084M39k720m853j299L046
3376C65L196J676M92l313o114j192O348O319j525n992k917R21J911M234K084k118
3392D375m622j672P60L176M570J458n024p041N58O727L808k597k935j417j749
3407a625l47M126M104j300n061l601N78M020N573M45n853n006J871M311J401j85
3423C451J508k558n639j078O360N194j960n713l157M29K916L423J030k815l453
3438b062j729P69K334M604J709m939o375K82O662L682j417l250k530j225J192
3453b293L545K681j001m095m493j63M471N624m68o096m776J301M530K267L06q71
3469D69k796l685Q6N443M475r46n106m325L17N068M509q97m477l411K16R03K570
$$ plain form
3486 -1587 1207 1652 -2370 -7628 -7819 -1361 3164 1069 -3412 -5718 -5188 -2293 -350 1152 -151 -2205
3502 -2205 -4948 -4916 -1653 2795 3104 -2167 -7054 -5932 -666 1611 118 -1409 -2591 -4667 -5427 -1897
3518 -1897 2169 2058 -2253 -6034 -5785 -1311 3184 3564 -850 -4102 -3537 -1574 696 2988 3632 294
3534 294 -4375 -5167 653 4841 3582 -631 -4049 -3781 -843 3077 3520 882 -1665 -2469 -2340 41
3550 41 4718 6005 932 -4516 -2659 3401 5802 3870 1272 -34 -1315 -437 2835 5232 3870 1152
3566 1152 -1629 -2408 1260 6236 5861 261 -2586 -477 2431 2477 3728 4884 2848 -1496 -1629 2955
3582 2955 6429 5792 3070 -180 -1162 1682 5297 5341 2348 975 390 -568 295 4423 6589 2147 -3212
3599 -3212 -3005 1522 4519 4780 2907 -443 -1847 161 3098 4714 4671 2883 -1184 -3473 176 6668
$$ packed form
3486a587K794M45m022n258j91O458M525k095m481k306N30K895J943J502j303k054
3502b205k743L2L263M448L09n271m887J122N266K277j493j527j182k076p60L530
3518a897M066j11m311l781K49M474M495L80m414l252N65J963K270K292O44l338
3534B94m669p92N820M188j259m213l418K68K938L920M43k638k547q04J29K381
3550D1M677J287n073n448J857O060K401j932k598j306j281Q78L272K397j362k718
3566A152k781p79L668M976l75n600k847K109K908M6J251J156k036m344j33M584
3582B955L474o37k722l250r82K844L615M4k993j373n85r58Q63M128K166m442n359
3599c212K07M527K997K61j873l350j404K008K937J616m3j788m067k289L649O492
$$ plain form
3615 6668 6752 783 -3930 -2420 208 1948 3643 3160 -591 -4111 -3479 110 3414 4334 1150 -4068
3631 -4068 -4955 -279 4971 3840 89 -1949 -1810 -1996 -439 3299 3866 -674 -5009 -4950 -756 2924
3647 2924 3300 -841 -5172 -4785 -1789 558 598 258 -931 -4077 -5677 -2007 3426 3535 -1759 -5534
3663 -5534 -4219 -1291 1172 1631 450 -2456 -4502 -4017 -1781 1117 2155 -895 -5975 -6694 -2459 2124
3679 2124 1921 -1974 -4699 -4728 -3204 -839 1671 1874 -1496 -4953 -5301 -1826 2354 3458 -353 -5185
3695 -5185 -5730 -1490 1675 1424 -515 -1768 -3990 -5254 -2298 2464 3381 -1590 -5928 -5427 -1148 2329
3711 2329 2381 241 -2890 -3798 -2110 610 2269 2889 660 -3230 -5207 -1192 4315 4016 -937 -4134
3727 -4134 -3117 -940 927 2063 2105 -332 -3468 -4141 -615 3790 4324 583 -3712 -3841 694 3894
$$ packed form
3615F668Q4n969m713J510K628J740J695m83l751l520O32L589L304R20l184n218
3631d068q87M676N250j131l751k038J39j86J557L738N67m540m335N9M194L680
3647B924L76m141m331L87K996K347M0l40j189l146j600L670N433J09n294l775
3663e534J315K928K463M59j181k906k046M85K236K898J038l050n080p19M235M583
3679B124k03l895k725k9J524K365K510K03l370l457l48L475M180J104l811m832
3695e185n45M240L165k51j939j253k222j264K956M762R17m971m338N01M279L477
3711B329N2k140l131r08J688K720J659O20k229l890j977M015N507k99m953l197
3727d134J017K177J867J136M2k437l136o73L526M405N34l741m295j29M535L200
$$ plain form
3743 3894 3085 1442 -34 -1423 -2051 275 4389 5105 979 -3442 -3465 284 3745 4471 1523 -2320
3759 -2320 -2978 -363 2225 2954 3576 2219 -1900 -3659 741 6255 6004 1295 -1912 -1351 784 3653
3775 3653 5223 3284 220 -1741 -1164 663 3959 5698 2550 -2785 -4049 1276 5570 4424 966
3790 966 -460 -864 -420 1999 5145 5392 1544 -1673 -1819 1002 5232 6347 2280 -2812 -2348 1679
3806 1679 3480 3166 2519 1486 -2121 -3098 446 5236 5058 546 -3246 -2794 650 4033 4364 1618
3822 1618 -833 -1423 -542 977 3517 4577 1576 -3797 -4260 813 4512 3251 -273 -2569 -3158 -1924
3838 -1924 901 2650 2025 -914 -3209 -3716 -1348 3177 4322 -208 -4663 -4309 -33 2241 1912 298
3854 298 -1030 -3268 -3872 -949 2218 2321 -1180 -4626 -5516 -2128 2008 2116 -1264 -4217 -4387 -2811
$$ packed form
3743C894q09j643j476j389o28K326M114P16m126m421k3L749L461P26k948l843
3759b320o58K615K588P29O22j357m119j759M400N514k51m709l207N61K135K869
3775C653J570j939l064j961N77J827L296J739l148n335j264N325M294j146l458
3790I66j426m04M44K419L146K47l848l217j46K821M230J115m067n092M64M027
3806A679J801l14o47j033l607r77L544M790j78m512l792M52L444L383L31k746
3822A618k451n90Q81J519K540J060l001n373m63N073L699j261l524k296n89J234
3838a924K825J749o25k939k295n07K368M525J145m530m455L54M276K274l29j614
3854B98j328k238o04K923L167J03l501l446q90L388M136J08l380k953j70J576
$$ plain form
3870 -2811 -1241 573 1492 -1045 -4866 -5569 -1953 2363 2020 -1330 -4610 -4783 -2122 523 966 -739
3886 -739 -2665 -4251 -5107 -3106 1267 2697 -1665 -5998 -5682 -2023 1406 1023 -800 -2667 -3875 -3301
3902 -3301 -917 1515 1838 -673 -3962 -4866 -1976 2363 3139 -878 -4348 -3621 -1340 -94 614 1178
3918 1178 -617 -4062 -4566 -1248 2922 2807 -293 -3599 -3441 -483 2316 2658 656 -1180 -1748 -1489
3934 -1489 -156 2684 3938 1206 -3093 -3517 624 4050 3496 419 -1326 -1593 -332 1422 2983 3017
3950 3017 1354 -1213 -2414 590 4259 5153 1781 -1807 -1021 1460 3286 3479 3053 1369 -555 -1429
3966 -1429 803 4187 4316 2239 -1576 -2222 887 4380 4384 1546 168 -17 211 1075 3839 5216 2608
3983 2608 -1369 -2037 1364 4627 4632 2340 -341 -1256 218 2846 3366 2571 1548 -678 -2277 -504 3663
$$ packed form
3870b811J570J814R19k537l821p03L616M316l43l350l280j73K661K645M43j705
3886g39j926j586q56K001M373J430m362m333L16L659L429l83j823j867j208N74
3902c301K384K432L23k511l289r04K890M339P76m017l470P27K281J246P08N64
3918A178j795l445n04L318M170j15l100l306J58K958K799L42k002j836n68K59
3934a489J333K840J254k732m299m24M141L426n54l077j745k67J261J754J561L4
3950C017j663k567j201L004L669Q94l372l588P86K481J826J93m26j684j924q74
3966a429K232L384J29k077l815o46L109L493Mk838j378j85K28Q64K764J377k608
3983B608l977o68L401L263Nk292k681r15J474K628N20p95j023k226j599J773M167
$$ plain form
4000 3663 5187 1768 -2331 -1982 673 2825 3159 2053 495 -974 -1372 553 2814 3925 1953 -2031
4016 -2031 -3496 -860 3775 3645 480 -1772 -2025 -995 -207 1695 2641 629 -3026 -3709 -839 2358
4032 2358 3327 929 -2564 -3810 -745 1593 1972 859 -147 -2434 -3705 -2073 2265 3558 -339
4047 -339 -4072 -4357 -1929 1060 1978 254 -2355 -3932 -2724 -987 571 1582 572 -3299 -5188 -2402
4063 -2402 2405 3008 -704 -3740 -3409 -1968 -456 1098 1444 -1008 -3460 -4459 -2368 1340 2416 -70
4079 -70 -4396 -5310 -2080 1151 1296 -431 -2057 -3187 -3676 -1739 1801 2361 -58 -3658 -4830 -1906
4095 -1906 1856 2855 -154 -3103 -3530 -2130 -767 514 1201 269 -3332 -5088 -2163 2242 2749 -457
4111 -457 -3357 -3670 -1663 845 2039 1102 -1113 -2635 -2393 -1294 1736 3316 960 -3053 -4441 -1131
$$ packed form
4000C663J524l419m099L49K655K152L34j106j558j469l98J925K261J111j972l984
4016b031j465K636M635j30l165k252k53J030P88J902R46k012l655o83K870L197
4032B358R69k398l493j246L065K338L79j113j006k287j271J632M338J293l897
4047c39l733k85K428K989R18j724k609j577J208J737J558J011j010l871j889K786
4063b402M807O03l712l036L31J441J512J554L46k452k452r99K091L708J076k486
4079g0m326r14L230L231J45j727j626j130m89J937L540N60k419l600j172K924
4095a906L762R99l009k949m27J400J363J281O87r32l601j756K925M405N07l206
4111d57k900l13K007K508J194r37k215j522K42J099L030J580k356m013j388L310
$$ plain form
4127 -1131 2372 2633 -142 -1774 -1922 -1957 -522 1960 2891 646 -2602 -3523 -859 3133 3879 1568 -1745
4144 -1745 -2477 -275 2091 3151 2443 671 -1157 -2219 -383 3234 4724 1696 -2382 -2377 110 3096
4160 3096 3450 1863 107 -1033 -957 619 3021 4482 2679 -1366 -2615 464 4346 4768 2202 -503
4176 -503 -1017 27 1807 3729 3838 1569 -798 -1834 12 3857 5386 2357 -1902 -2490 1172 3388
4192 3388 3114 2290 1240 -471 -1642 619 3769 4700 1916 -1127 -1849 336 3293 3996 1965 -1070
4208 -1070 -1481 10 1399 2413 3253 1942 -1678 -3129 -329 3775 4232 1015 -1855 -1949 -268 1818
4224 1818 2167 1998 635 -1545 -2518 -1234 2167 3580 1087 -3111 -3621 -750 1655 1735 574 -1441
4240 -1441 -2786 -2600 -556 1391 2264 739 -2749 -4509 -2063 2124 2571 -305 -3457 -3427 -1644 -636
$$ packed form
4127a131L503K61k775j632j48l5J435K482R31k245l248r21K664L992P46k311l313
4144a745p32K202K366J060p08j772j828j062J836L617J490l028m078NK487K986
4160C096L54j587j756j140P6J576K402J461j803m045j249L079L882M22k566k705
4176e03n14J044J780J922J09k269k367j036J846L845J529l029m259n88L662K216
4192C388k74q24j050j711j171K261L150R31k784l043p22K185K957P03k031l035
4208a070m11J491J389J014Q40j311l620j451K800M104M57l217k870r4J681K086
4224A818L49j69j363k180r73J284L401J413k493m198n10K871K405Q0j161k015
4240a441j345J86K044J947Q73j525l488j760K446M187M47k876l152L0J783J008
$$ plain form
4256 -636 680 1308 -133 -3549 -4308 -1725 1249 1849 -850 -3684 -4596 -2110 517 1218 -842 -2256
4272 -2256 -2986 -3313 -2106 368 1525 -440 -3893 -4566 -1811 1142 1172 -956 -2573 -3129 -2626 -1178 396
4289 396 845 -418 -3281 -4177 -2457 983 2089 -401 -3065 -3639 -1855 172 831 434 -766 -2255
4305 -2255 -2995 -1832 1317 2872 583 -2568 -4000 -1379 1843 1653 -21 -957 -1801 -2218 -764 1716
4321 1716 2671 801 -2167 -3302 -881 2169 3238 1206 -1279 -2114 -668 1666 2451 1909 701 -778
4337 -778 -1759 -824 3146 4123 1462 -2016 -2339 544 2706 2384 1668 440 -682 -1380 538 3022 3712
4354 3712 1785 -487 -1606 456 3237 3948 1720 -236 -407 649 1260 2030 3165 2134 -709 -1841
4370 -1841 120 3257 3985 1592 -982 -889 345 1848 2824 2415 1358 58 -846 -286 2799 4283 2111
$$ packed form
4256f36J316O28j441l416p59K583K974O00k699k834r12K486K627P01k060j414
4272b256p30l27J207K474J157j965l453o73K755K953L0k128j617n56N03J448J574
4289C96M49j263k863q96J720L440J106k490k664n74J784K027O59l97j200j489
4305b255p40J163L149J555k289l151j432K621L222j90j674r36q44m17J454K480
4321A716R55j870k968j135K421L050J069k032k485q35J446K334P85n42j208j479
4337g78r81R35L970R77k661l478l23K883K162l22p16j228j122o98J918K484O90
4354C712j927k272j119K062K781P11k228j956j71J056O11P70J135j031k843j132
4370a841J961L137P28k393k574R3J234J503R76m09j057j300r04N60L085J484k172
$$ plain form
4387 2111 -1053 -1788 108 2389 3094 1740 187 -853 -391 386 1911 3053 2182 -1075 -3148 -952
4403 -952 2975 3715 1110 -1221 -1383 -461 753 2051 2504 902 -1438 -2184 -672 1888 2890 1374
4419 1374 -1591 -3091 -890 1800 1981 947 -468 -1047 -1625 -1541 1023 2730 758 -2340 -3487 -1168
4435 -1168 1509 2259 397 -1433 -2049 -1570 -346 682 1408 360 -2004 -3758 -1836 1429 2700 584
4451 584 -2430 -3330 -1857 163 1209 531 -510 -2068 -2991 -1871 237 2425 944 -3178 -4178 -1795
4467 -1795 1086 1123 -177 -1562 -2374 -2813 -1406 798 1732 70 -2860 -3990 -2539 786 1875 199
4483 199 -2865 -3678 -1933 -25 579 563 -50 -2255 -3743 -2244 1066 2546 67 -3242 -3366 -1617 367
4500 367 1099 234 -1286 -2589 -2520 -1266 709 1796 853 -2284 -3922 -1677 1454 2148 148 -1948 -2481
$$ packed form
4387B111l164p35J896K281P05j354j553j040M62P77J525J142q71l257k073K196
4403i52L927P40k605k331j62R22J214J298M53j602k340p46J512K560J002j516
4419A374k965j500K201K690J81j034j415n79n78Q4K564J707j972l098j147K319
4435a168K677P50j862j830o16M79J224J028P26j048k364j754J922L265J271k116
4451E84l014r00J473K020J046o78j041j558r23J120K108K188j481m122j000K383
4467a795K881L7j300j385q12m39J407K204R34j662k930j130J451L325J089j676
4483A99l064q13J745J908O04j6o13k205j488J499L310J480k479l309j24J749J984
4500C67P32q65j520j303O9J254J975J087r43l137j638K245L131O94k000k096n33
$$ plain form
4517 -2481 -1557 69 774 1589 603 -1757 -2870 -1546 1516 2949 918 -2072 -2540 -801 1270 1686
4533 1686 1533 202 -894 -1754 -875 1698 2997 1506 -1309 -2507 -338 2536 3272 1438 -593 -567
4549 -567 -548 422 1928 3454 2131 -852 -2309 -17 3300 3809 1798 -656 -1111 30 1816 2789 2707
4566 2707 1482 -304 -1036 48 2669 3917 2517 -908 -1554 390 2763 3412 1865 910 -263 -575
4582 -575 302 2514 3743 1991 -407 -1681 32 3109 3835 1875 -409 -714 182 893 2071 2561 1891
4599 1891 -367 -1893 -544 2680 3852 1660 -969 -1666 -66 1898 2282 1549 287 -894 -1279 -784
4615 -784 1351 2810 1635 -1381 -2971 -518 2069 2214 727 -766 -1548 -1416 -440 977 1777 687
4631 687 -1793 -3088 -1643 1286 2474 189 -2358 -2851 -1311 -132 616 497 -278 -2315 -3064 -1759
$$ packed form
4517b481R24J626P05Q15r86k360j113J324L062J433k031k990m68J739K071M16
4533A686j53j331j096q60Q79K573J299j491k815j198K169K874P36j834k031K6
4549e67J9R70J506J526j323k983j457K292L317N09k011k454m55J141J786R73q2
4566B707j225j786p32J084K621J248j400l425o46J944K373O49j547r55j173l12
4582e75Q77K212J229j752k398j274J713L077P26j960k284l05Q96P11J178M90o70
4599A891k258j526J349L224J172k192k629o97J600J964L84p33j262j181l85M95
4615g84K135J459j175l016j590K453K587J45j487j493p82J32R76J417Q00j090
4631F87k480j295J445K929J188k285k547m93J540J179P48j19p75k037p49J305
$$ plain form
4647 -1759 462 1379 262 -2556 -3376 -1804 662 994 -330 -1786 -2553 -2061 -1383 -217 1271 280 -2800
4664 -2800 -3949 -2042 577 1369 -282 -2342 -2799 -1854 -594 38 148 -689 -2108 -3310 -2662 440 2078
4681 2078 231 -2987 -3492 -1519 272 593 -33 -995 -1993 -2564 -1410 635 1394 534 -1871 -3440 -1927
4698 -1927 1521 1787 -92 -1362 -1408 -1196 -588 411 1649 700 -1569 -2747 -1121 1269 2474 1045 -1498
4715 -1498 -2291 -943 844 1627 1091 600 -487 -1611 -903 1323 2875 1525 -1533 -2252 -515 1621
4731 1621 2245 1281 529 -864 -846 -16 1492 2546 2154 -342 -2206 -451 2006 3407 1594 -547 -978
4748 -978 62 887 1728 2102 1613 -30 -1227 -584 2123 3389 2077 -401 -1537 325 1582 2460 1700
4765 1700 739 -11 -726 -13 1784 2959 2019 -387 -1623 -417 2253 3171 1741 -463 -611 122 564
$$ packed form
4647a759K221R17j117k818q20J572K466L32j324j456p67M92O78J166J488r91l080
4664b800j149J907K619P92j651k060m57R45J260O32J10q37j419j202O48L102J638
4681B078j847l218n05J973J791L21o26r62r98n71J154K045P59q60k405j569J513
4698a927L448K66j879j270m6K12O08R99J238r49k269j178J626K390J205j429k543
4715a498p93J348J787P83n36m91j087j124P08K226J552j350l058p19J737K136
4731A621O24r64p52j393J8Q30J508J054l92k496j864J755K457J401j813k141m31
4748i78J040Q25Q41L74m89j643j197O43K707J266j312k478j136J862J257Q78p60
4765A700r61p50p15P13J797J175r40k406j236J206K670R18j430k204j48P33M42
$$ plain form
4782 564 1587 2232 1988 -391 -1638 -375 2278 3199 1745 -477 -1109 -251 1088 1612 1683 1184 -451
4799 -451 -1201 -328 1453 2407 1832 -463 -1968 -1083 1864 2505 805 -196 -807 -1071 -525 739 2208
4816 2208 1230 -1155 -2740 -1276 1530 2037 1244 -1085 -2063 -1228 114 1234 960 182 -1121 -2367 -1618
4833 -1618 700 2301 1036 -1781 -2466 -1597 365 1177 793 -645 -1094 -1955 -1464 249 1812 634 -1665
4850 -1665 -3129 -1927 541 1312 -88 -1377 -1839 -2057 -1077 303 689 97 -1784 -2900 -2194 222 1723
4867 1723 483 -2506 -3260 -1564 -69 128 188 -381 -1861 -2819 -2406 166 1350 311 -2297 -3089 -2075
4884 -2075 55 1082 39 -1348 -2326 -2141 -1459 62 943 473 -1591 -3126 -2369 714 1728 286
4900 286 -1712 -2080 -1468 -178 516 471 247 -1373 -2604 -1805 908 2115 1039 -1691 -2466 -838 904
$$ packed form
4782E64J023O45k44k379j247J263K653R21j454k222o32Q58J339N24P1m99j635
4799d51p50Q73J781R54n75k295j505Q85K947O41j700j001o11k64N46J264J469
4816B208r78k385j585J464K806N07p93k329r78Q35J342J120k74p78j303j246P49
4833a618K318J601j265k817o85Q69J962Q12l84j438m49q61M91J713J563j178k299
4850a665j464J202K468P71j400j289m62k18R80J380L86n92j881j116P06K416J501
4867A723j240k989p54J696J495J97O0n69j480r58M13K572J184j039k608p92J014
4884b075K130J027j043j387r78J85O82J521Q81m70k064j535P57L083J014j442
4900B86j998l68O12J290O94m5k24j620j231P99K713J207j076k730p75J628J742
$$ plain form
4917 904 1436 914 -189 -1387 -1515 -811 600 1951 1470 -901 -2127 -1116 1707 2713 1450 -941
4933 -941 -765 -260 323 1125 2261 1355 -216 -1587 -478 2137 2873 1846 -131 -1206 -166 1729 2468
4950 2468 2023 998 -30 -236 -68 1453 2958 2365 248 -1489 -350 2417 2970 1451 428 -28
4966 -28 -240 561 1939 2793 1931 -40 -963 -315 1816 3295 2074 191 -1240 28 1349 1833 1816 1367
4984 1367 199 -879 -406 1410 3084 2072 -592 -1577 -227 1478 2039 1143 549 -330 -784 -232 1140
5001 1140 2297 1520 -490 -1597 -718 1344 2346 1031 -212 -1405 -944 239 1050 1175 812 -551
5017 -551 -1958 -1823 830 2318 1147 -1214 -2307 -966 200 572 640 -102 -1018 -2069 -1353 139 1273
5034 1273 718 -1519 -2692 -1982 243 1394 64 -1356 -2033 -1558 -1024 -79 712 461 -1345 -2768 -1986
$$ packed form
4917I04N32n22j103j198j28P04J411J351m81k371j226J011K823J006j263k391
4933i41J76N05N83Q02J136r06j571j371J109K615P36j027j977j075J040J895P39
4950B468m45j025j028k06J68J521J505n93k117j737J139K767N53j519j023m56
4966b8k12Q01J378Q54q62j971r23O48K131J479j221j883j431J268J321M84j7m49
4984A367j168j078M73J816J674j012k664r85J350J705N61q96n94q79m54N52J372
5001A140J157p77k010j107Q79K062J002j315j243j193M61J183Q11J25l63j363
5017e51j407J35K653J488j171k361j093J341J166L72O8p42r16j051P16J492J134
5034A273n55k237j173P10K225J151j330j420o77M75N34R45P91k51j806j423P82
$$ plain form
5051 -1986 302 1532 -81 -1887 -2419 -1459 -390 -275 -11 -638 -1452 -2406 -1755 101 1118 491 -1843
5068 -1843 -2529 -1604 5 513 69 -649 -1693 -1711 -1348 -167 962 599 -1311 -2687 -2103 577 1564 208
5086 208 -1406 -1449 -712 -683 -29 781 393 -1196 -1982 -1602 195 1533 1065 -1269 -2214 -1271 553 890 565
5105 565 -122 -783 -1388 -1322 344 1707 1056 -764 -2032 -1126 708 1413 1023 -297 -957 -872 88 686 1441
5124 1441 1261 -357 -1429 -869 934 2473 1529 -306 -1429 -445 695 1373 1327 798 12 -928 -714 1001
5142 1001 2324 1819 -290 -1388 -485 1140 2165 1503 900 196 -303 6 986 2191 1989 132 -1178
5159 -1178 -397 1407 2690 2042 25 -978 -86 802 1281 1690 1546 423 -1169 -774 1333 2520 1850
5176 1850 -334 -1238 -479 1133 1942 1605 926 -339 -559 -286 1063 2254 1770 197 -1545 -615 1258
$$ packed form
5051a986K288J230j613j806n32R60J069J15K64o27q14r54O51J856J017o27k334
5068a843o86R25J609N08m44p18j044j8L63J181J129l63j910j376N84K680R87j356
5086B08j614m3P37K9O54Q10l88j589p86L80J797J338m68k334r45R43J824L37l25
5105E65o87o61o05O6J666J363o51j820j268R06J834P05l90j320o60Q5R60N98P55
5124A441j80j618j072N60J803J539r44j835j123R84J140O78m6n29p86r40K14J715
5142A001J323n05k109j098R03J625J025o62o03p04m99L09R80J205k02j857j310
5159a178P81J804J283o48k017j003Q92Q88M79M09j44j123j592L95K107J187o70
5176A850k184r04P59J612Q09l37o79j265k20K73J349J191m84j573j742R30J873
$$ plain form
5193 1258 2305 1591 -13 -585 -341 231 995 1898 1575 119 -1647 -690 1054 2305 1545 -285 -1226
5210 -1226 -723 384 1137 1022 764 -399 -1436 -937 363 1611 1384 -966 -2157 -1034 194 1404
5226 1404 1011 -371 -1164 -1306 -876 26 995 844 -617 -2254 -1904 174 1337 402 -1243 -1728 -1133 -414
5244 -414 499 191 154 -944 -2069 -1851 -337 1180 539 -1553 -2699 -1635 -235 278 163 -583 -1604
5261 -1604 -1875 -1567 -207 584 404 -1191 -2129 -2050 -158 1160 106 -1516 -2038 -1759 -755 -291 225 225
5279 225 -1129 -2552 -2171 7 1010 389 -918 -2104 -1508 -546 243 663 -329 -941 -1485 -1227 -122 680
5297 680 1060 -965 -2415 -1809 304 1050 470 -606 -1097 -821 -803 226 1135 843 -647 -1863 -1470 490
5315 490 1825 850 -530 -1271 -725 134 920 1202 1043 29 -939 -724 773 1858 1826 -134 -1402 -856
$$ packed form
5193A258J047p14j604n72K44N72P64R03l23j456j766R57J744J251p60j830r41
5210a226N03J107P53j15k58j163j037M99J300J248k27k350j191J123J228J210
5226A404l93j382p93j42M30R02R69j51j461j637L50K078J163r35j645m85N95P19
5244d14R13l08l7j098j125K18J514J517o41k092j146J064J400N13j15p46j021
5261a604k71L08J360P91j80j595r38P9J892J318j054j622n22K79J004M64N16%
5279B25j354j423L81K178J003o21j307j186N96R62P89M20r92o12n44K58J105Q02
5297F80L80k025j450O06K113P46n80j076m91K76J8J029R09k92j490j216L93J960
5315D90J335r75j380p41N46Q59P86K82j59j014r68K15J497J085l2j960j268N46
$$ plain form
5333 -856 1113 2115 1295 427 31 -105 -125 958 2338 2233 135 -1286 -482 1460 2311 1942 551 -205
5351 -205 -309 352 1385 1517 1504 377 -839 -527 1052 2462 1955 291 -918 -30 1455 1701 1553 1143
5369 1143 291 -43 -457 987 2523 2002 154 -982 -328 860 2105 1429 636 -436 -120 104 1106
5386 1106 1626 1231 491 -1170 -943 868 1966 1237 -419 -1125 -647 684 737 783 808 145 -861 -1170 495
5405 495 1843 1131 -960 -1389 -954 409 835 803 104 -549 -1348 -755 -138 488 819 -44 -1708 -1709 99
5424 99 1252 722 -895 -1602 -1094 -665 200 328 619 -514 -1899 -1895 -141 1260 426 -1090 -1904 -1360 -636
5443 -636 130 39 -202 -990 -1430 -1510 -638 774 587 -640 -2280 -1745 21 1048 -113 -692 -1351 -1212 -655
5462 -655 -468 532 540 -876 -2275 -1749 -86 932 547 -617 -1609 -1585 -525 116 76 -232 -686 -1309 -1358
$$ packed form
5333h56J969J002q20q68l96j36k0J083J380j05k098j421Q04J942Q51l69j391p56
5351b05j04O61J033J32j3j127j216L12J579J410n07j664j209Q88J485K46j48m10
5369A143q52l34m14J444J536n21j848j136O54J188J245o76p93j072L16K24J002
5386A106N20l95p40j661K27J811J098p29j656p06M78J331N3M6K5o63j006l09J665
5405D95J348p12k091m29M35J363M26l2o99o53p99N93O17O26L31q63j664jJ808
5424I9J153n30j617p07N08M29Q65J28K91j133j385MJ754J401q34j516q14N44P24
5443f36P66r1k41p88m40q0Q72J412j87j227j640N35J766J027j161n79o59J39N57
5462f55J87J000Qj416j399N26J663J018l85j164r92K4J060O41m0l08m54o23m9
$$ plain form
5481 -1358 -515 459 1120 -618 -1948 -1636 193 905 230 -410 -506 -1024 -1131 -252 953 926 -793 -1781 -1278
5500 -1278 -58 883 876 -442 -1082 -1183 -416 511 478 442 -27 -846 -1348 -40 1485 1545 -292 -1150 -712 702
5520 702 747 609 770 110 -849 -857 318 1652 1405 93 -974 -494 688 1707 1437 417 -544 -380 214
5539 214 991 1352 1357 838 -806 -993 464 2053 1836 -85 -1470 -260 482 486 1111 1370 617 -632 -629 861
5559 861 1950 1711 351 -518 -477 683 1571 1774 721 63 -153 224 962 1299 1596 569 -1016 -903
5577 -903 913 2171 1305 69 -434 3 340 456 1242 1377 750 -917 -630 721 2017 1592 328 -702
5595 -702 -777 290 1293 945 456 -316 -499 -541 -190 1232 1259 225 -1334 -1376 704 1547 930 -230 -628
5614 -628 -415 -423 119 998 1143 -198 -1322 -1176 -96 999 574 -479 -1506 -1487 -612 476 506 -61 -625
$$ packed form
5481a358Q43R74O61j738j330L12J829P12o75o40r6n18j07Q79J205k7j719r88N03
5500a278J220R41pj318o40j01P67R27l3l6m69q19n02J308J525O0j837q58M38J414
5520G02M5j38J61o60r59qJ175J334k47j312j067M80J182J019k70j020r61J64N94
5539B14P77L61Nn19j644j87J457J589k17j921j385J210P42MO25K59p53j249LJ490
5559H61J089k39j360q69M1J160Q88K03j053o58k16L77P38L37K97j027j585J13
5577i03J816J258q66j236n03M37L37J16P86J35o27j667K87J351J296m25j264j030
5595g02p5J067J003l48m89p72j83m2L51J422K7j034j559m2K080Q43o17j160l98
5614f28K13qN42Q79J45j341j124J46J080J095m25j053j027J9Q75J088L0n67n64
$$ plain form
5633 -625 -954 -1428 -529 734 1146 -444 -1950 -1458 339 558 218 -495 -776 -1396 -1616 -364 415 275
5651 275 -925 -2315 -1826 -768 439 577 -481 -1741 -1570 -464 -16 33 -208 -721 -1584 -2058 -691 925
5669 925 763 -1090 -1812 -1288 -354 174 12 -4 -1167 -1489 -1288 -546 523 498 -470 -1768 -1533 -252 889
5688 889 314 -532 -1364 -1252 -475 214 501 755 -191 -1331 -1493 -66 1623 1169 -616 -1370 -593 217 480
5707 480 604 848 -139 -776 -578 319 970 1204 66 -1009 -933 529 1408 1084 134 -165 -264 217 527 1028
5727 1028 1610 572 -789 -776 448 1666 1489 20 -316 -40 444 895 1098 1009 518 -442 -566 547
5745 547 1580 1817 508 -586 -189 619 1409 1269 680 226 136 -7 336 1573 1669 648 -473 -656 833
5764 833 1923 1277 103 -311 150 145 838 1408 1374 113 -440 -772 395 1624 1558 438 -855 -614 559
$$ packed form
5633f25l29m74Q99J263M12j590j506M92J797K19l40p13k81o20k20J252P79j40
5651B75j200j390M89J058J207J38j058j260J71J106M48M9k41n13q63m74J367J616
5669I25j62j853p22N24R34N28j62j6j163l22K01P42J069k5r68j298K35J281J141
5688H89n75q46q32J12P77O89K87K54r46j140j62J427J689m54j785p54P77Q10K63
5707D80J24K44r87o37J98Q97O51K34j138j075P6J462Q79l24r50k99r9M81L10N01
5727A028N82j038j361J3J224J218j77j469l36K76M84M51K03q9m91r60j24J113
5745E47J033K37j309j094L97Q08P90j40n89m54r0j43L43J237R6j021j121j83J489
5764H33J090o46j174m14M61nO93N70l4j261n53l32J167J229o6j120j293K41J173
$$ plain form
5783 559 892 721 585 165 -323 -449 55 1037 1140 297 -1087 -768 320 1348 972 259 80 -640 -86
5802 -86 262 839 1148 106 -1022 -1009 16 1078 962 -484 -958 -961 -341 294 154 298 -282 -1274 -1132 -260
5822 -260 805 936 -401 -1181 -944 -381 563 541 -67 -493 -968 -863 -375 413 551 -406 -1720 -1460 -500
5841 -500 296 387 -818 -1290 -958 -922 -310 184 332 -282 -1094 -1551 -582 626 563 -699 -1494 -1144 -501 289
5861 289 127 -70 -518 -1011 -1198 -856 181 444 -456 -1490 -1671 -544 515 164 -337 -894 -691 -710 -516
5880 -516 306 713 -198 -1251 -1298 -221 712 730 -402 -1196 -738 -199 10 115 121 -321 -840 -1004 -535 592
5900 592 593 -331 -1151 -800 123 686 629 165 -418 -358 -291 -205 705 804 306 -1032 -754 -182 994 988 -412 -543
5922 -543 -418 -28 416 851 869 199 -493 -716 18 1424 1697 489 -556 -380 533 866 1257 965 409
$$ packed form
5783E59L33j71j36m20m88j26N04R82J03q43j384L19J088J028l76p13j79p20N54
5802h6L48N77L09j042j128J3J025J062j16j446m74lO20O35j40J44n80r92J42Q72
5822b60J065J31j337p80K37N63R44k2o08m26m75J05M88P88J38r57j314K60R60
5841e00P96R1j205m72L32L6O12M94J48o14q12m57R69J208o3j262p95L50O43P90
5861B89j62j97m48m93j87L42J037K63r00j034j81J127J059l51n01n57K03j9J94
5880e16Q22M07r11j053m7J077R33J8j132p94M58N39K09J05Om42n19j64M69J127
5900E92Jr24q20L51R23N63n7m64n83O0O7Q6R10R9m98j338K78N72J176oj400j31
5922e43J25L90M44M35J8o70o92k23P34J406K73j208j045J76R13L33L91k92n56
$$ plain form
5941 409 -248 -117 413 1137 1405 655 -447 -624 560 1450 1395 442 -170 14 401 554 1096 1204 715 -225
5961 -225 -548 799 1800 1626 443 70 -34 430 1077 1525 835 397 -259 -265 443 1077 1276 531 -597
5980 -597 -336 416 1258 1049 543 317 28 175 185 1219 1369 307 -947 -1151 308 1061 1025 123 -818
5999 -818 -641 -134 260 597 768 -4 -840 -987 -406 631 1039 172 -924 -789 -113 322 196 -125 -107 -456
6019 -456 -843 -275 309 797 -410 -1669 -1310 -424 393 121 -523 -1284 -1104 -887 -397 -108 204 -265 -1259
6038 -1259 -1401 -829 509 771 -762 -1559 -1142 -335 -97 -313 -238 -438 -1232 -1402 -751 324 424 -983 -1700
6057 -1700 -1359 -564 361 74 -343 -996 -975 -911 -391 152 193 -280 -1209 -1342 -657 675 462 -501 -1094 -883
6077 -883 -306 -612 132 257 -285 -1227 -1241 -895 584 730 -494 -1210 -784 -180 114 266 42 -446 -587 -378
$$ packed form
5941D09o57J31N30P24K68p50j102j77J184Q90n5r53o12J84L87J53N42J08m89r40
5961b25l23J347J001j74j183l73j04M64O47M48o90m38o56oP08O34J99p45j128
5980e97K61P52Q42k09n06k26k89J47J0J034J50j062j254k04J459P53l6r02r41
5999h18J77N07L94L37J71p72q36j47N81J037M08q67j096J35O76M35j26l21J8l49
6019d56l87N68N84M88j207j259L59Q86Q17k72o44p61J80K17M90K89L12m69r94
6038a259j42N72J338K62j533p97M17Q07K38k16P5k00p94j70O51J075J00j407p17
6057a700L41P95R25k87m17o53K1O4N20N43M1m73r29j33O85J332k13r63n93K11
6077h83N77l06P44J25n42r42j4L46J479J46j224p16M26O04K94J52k24m88j41K09
$$ plain form
6097 -378 -200 566 870 506 -843 -1183 -177 972 741 21 -123 -337 -216 38 493 735 390 -570 -755
6116 -755 -12 1168 1062 484 -437 -416 104 687 762 486 67 46 -82 117 1220 1242 465 -583 -423 196
6136 196 1349 783 52 149 408 -4 247 1009 1409 695 -641 -397 542 1001 1449 451 -178 -207 205 836
6156 836 1000 942 338 -250 -317 7 1220 1192 773 -541 -610 343 581 536 518 368 -9 -513 114 1000 1240
6177 1240 418 -431 -354 150 929 921 295 -296 -489 197 366 503 886 27 -650 -480 -517 604 1187 159
6197 159 -746 -524 121 204 372 548 172 -467 -310 -200 393 446 260 -714 -876 -223 538 598 -126 -344 -678
6218 -678 -402 -133 -188 539 260 -694 -1212 -452 666 833 -256 -859 -584 -532 -141 59 216 -36 -916 -1213
6238 -1213 -457 426 627 -259 -837 -1218 -721 -80 489 -326 -798 -781 -841 -599 -71 555 -366 -1255 -1596 -363
$$ packed form
6097c78J78P66L04l64j349l40J006J149k31p20j44k14J21K54M55K42l45r60j85
6116g55P43J180j06n78r21K1N20N83P5k76m19k1j28J99J103K2p77j048J60O19
6136A96J153n66p31R7K59m12K51P62M00p14j336K44R39M59M48r98o29k9M12O31
6156H36J64n8o04n88o7L24J213k8m19j314o9R53K38m5j8j50l77n04O27Q86K40
6177A240q22q49P7N04P79qo26n91j93O86J69J37L83q59o77J70l7J121N83j028
6197A59r05K22O45Q3J68J76l76o39J57J10N93N3j86r74j62O53P61O0p24k18l34
6218f78K76K69n5P27k79r54n18P60J118J67j089o03K75N2L91K00J57k52q80k97
6238a213P56Q83K01q86n78l81M97O41N69q15m72J7o0K42N28O26r21q89l41J233
$$ plain form
6258 -363 148 195 -727 -889 -941 -463 -135 -244 215 -313 -1054 -1412 -598 181 587 -102 -804 -860 -499 47 227
6279 227 -128 -119 -480 -749 -373 146 796 139 -1039 -1287 -49 319 161 -102 -131 -931 -623 -399 160 595
6299 595 167 -780 -963 -306 553 865 304 -486 -505 244 176 444 380 324 -316 -784 -427 737 1373 592 -556
6320 -556 -528 459 636 894 516 325 -257 -213 287 830 909 490 -126 -482 114 969 1200 676 28 183 326
6341 326 362 561 1057 926 235 -386 138 1249 1359 747 -201 -215 475 870 835 715 538 277 -109 508 864
6362 864 1103 865 35 -311 88 986 1111 490 -72 18 195 182 491 1077 509 -216 -406 -151 979 1110
6382 1110 409 -455 -203 275 287 610 566 204 -328 -429 -460 450 1260 470 -479 -643 -100 647 606 -103 -205
6403 -205 -531 -300 -367 361 609 227 -687 -958 -352 606 686 -39 -875 -702 -231 -313 -9 132 -93 -673 -1053
$$ packed form
6258c63N11M7r22j62n2M78L28j09M59n28p41l58Q14P79M06o89p02n6L61N46J80
6279B27l55Rl61k69L76N19O50o57j178k48J238L68j58k63k9q00L08K24N59M35
6299E95m28r47j83O57Q59L12n61p90j9P49o8K68o4n6o40m68L57J164O36p81j148
6320e56K8R87J77K58l78j91n82M4N00N43P9m19o16l56N96Q55K31n24o48J55J43
6341C26L6J99M96j31o91o21N24J111J10o12r48j4O90L95l5j20j77k61l86O17L56
6362H64K39k38q30l46L99Q98J25o21n62R0J77j3L09N86n68p25j90K55J130J31
6382A110p01q64K52M78J2L23m4l62n32j01l1R10Q10p90r49j64N43P47m1p09j02
6403b05l26K31o7P28K48l82r14k71O06R58Q0p25q36J73M71q2L04J41k25n80l80
$$ plain form
6424 -1053 -589 59 286 -158 -859 -1181 -572 179 -131 -186 -529 -745 -724 -923 -220 517 -19 -957 -1097 -247
6444 -247 234 220 -305 -988 -837 -690 -224 -409 -15 -299 -675 -1049 -612 232 356 -263 -1227 -1069 -275 -98
6464 -98 60 -222 -179 -375 -968 -761 105 548 96 -689 -1281 -92 218 546 -96 -414 -370 -495 -615 -25 688
6485 688 360 -670 -714 -635 436 390 85 -815 -190 -82 162 284 423 322 -49 -736 -44 374 791 91
6505 91 -527 -559 -148 507 332 237 73 -94 -208 -71 122 1364 668 -289 -507 169 858 788 235 -415 -56
6526 -56 -174 481 1008 508 630 -156 -651 -50 659 982 546 -88 -359 386 420 761 534 647 335 -502 141
6547 141 692 1112 471 -82 -460 238 734 654 364 326 21 61 209 608 951 844 28 -172 184 765 1056
6568 1056 445 -117 -91 439 342 172 694 580 128 -420 -242 511 882 387 -335 -509 285 635 584 549 88
$$ packed form
6424a053M64O48K27m44p01l22O09P51l10n5l43k16K1j99P03P37n36r38j40Q50
6444b47M81j4n25o83J51J47M66j85L94k84l76l74M37Q44J24o19r64J58P94J77
6464i8J58k82M3j96n93K07Q66M43m52p85n92J189L10L28o42l18M4j25j20N90P13
6485F88l28j030m4P9J071m6l05r00O25J08K44J22J39j01l71o87O92M18M17p00
6505I1o18l2M11O55j75r5j64j67j14J37J93J242o96r57k18O76O89p0n53o50L59
6526e6j18O55N27n00J22p86m95O01P09L23m36o34k71P45L4L41k27J13l12q37O43
6547A41N51M20o41n53l78O98M96q0k90l8l05M0J48L99L43j07q16k00L56N81K91
6568A056o11n62K6N30r7j70N22j14m52n48J78P53L71m95p22j74P94L50n1l5m61
$$ plain form
6589 88 1 -218 -6 447 701 518 -286 -499 -607 435 661 -45 -245 -339 -17 -70 55 569 346 -47 -1049
6610 -1049 -631 486 755 -60 -507 -677 -224 216 -104 243 -67 -651 -689 -544 -260 322 -170 -956 -958 -565
6630 -565 206 578 -459 -684 -463 -611 -514 -172 157 -44 -742 -1252 -776 335 436 -166 -1002 -685 -486 -310
6650 -310 -65 0 -302 -603 -937 -894 -2 360 98 -797 -993 -450 -115 142 -638 -561 -667 -647 -848 -352 452
6671 452 187 -842 -998 -248 126 64 92 -404 -655 -692 48 94 59 -114 -571 -898 -445 155 465 168 -874
6692 -874 -802 -301 313 -80 -2 188 -411 -458 -265 189 633 364 -484 -650 -162 694 530 197 7 -521 42
6713 42 268 541 543 493 310 -399 -290 559 949 439 -264 -103 371 552 646 798 1033 200 5 113 839 925
6735 925 747 67 -134 108 552 929 899 277 143 410 424 252 831 988 306 -426 -94 704 1514 187
$$ packed form
6589H8q7k19K12M53K54j83q04k13j08J042K26p06k00r4L22n3J25N14k23l93j002
6610a049M18J117K69q15m47j70M53M40l20L47l10n84l8J45K84N82m92p86kL93
6630e65P71L72j037k25K21j48R7L42L29k01o98n10M76J111J01o02q36L17J99J76
6650c10K45O5l02l01l34M3Q92L62k62q95j96N43L35K57p80P7j06K0k01M96Q04
6671D52k65j029j56P50L74o2K8m96k51l7P40M6l5j73m57l27M53O00L10k97j042
6692h74P2N01O14l93P8J90n99m7J93M54M44k69q48j66M88Q56j64l33j90n28N63
6713D2K26K73Kn0j83p09J09Q49L90n10p03J61M74J81R4J52K35q33j95J08P26Q6
6735I25j78o80k01K42M44L77l0o22j34K67J4j72N79J57o82p32L32P98Q10j327
$$ plain form
6755 187 198 77 240 365 588 852 648 60 -385 -86 602 556 601 -65 -271 297 673 480 300 213 215 138
6777 138 -8 221 925 836 -142 -664 -227 820 709 -52 -3 -340 -275 -247 324 571 336 -236 -400 -241 448
6798 448 711 287 -298 -534 -298 34 -86 41 -1 -364 -405 -707 -92 523 144 -517 -947 -435 25 200 -243
6819 -243 -214 -445 -706 -563 23 376 174 -595 -1040 -664 -21 255 -262 -267 -603 -781 -151 -328 -23 -76 -158 -831
6841 -831 -850 -82 348 -306 -831 -1105 -20 82 -318 -24 -196 -553 -578 -415 79 394 315 -633 -690 -696 51 -210
6863 -210 6 -581 -545 -320 -523 -312 -26 149 -153 -986 -645 29 514 68 -572 -443 -70 -42 166 -569 142
6884 142 -414 -766 -481 96 270 61 -464 -567 -298 136 377 9 -341 -175 82 83 112 571 458 -238 -568
6905 -568 -639 425 998 168 -162 -283 41 260 267 656 233 227 -203 144 433 823 792 -94 -154 -8 471 627
$$ packed form
6755A87J1j21J63J25K23K64k04n88m45K99O88m6M5o66k06N68L76j93j80q7Kp7
6777A38j46K29P04q9r78n22M37J047j11p61M9l37O5K8N71K47k35n72j64J59O89
6798D48K63m24n85k36K36L32j20J27m2l63m1l02O15O15l79o61m30N12M60J75m43
6819b43K9k31k61J43N86L53k02p69m45L76O43K76n17nl36j78O30j77L05n3q2o73
6841h31j9P68M30o54n25k74J085J02m00K94j72l57k5J63M94L15p9r48n7oP47k61
6863b10K16n87L6K25k03K11K86J75l02q33L41O74M85m46o40J29L73K8K08p35P11
6884A42n56l52K85N77J74k09n25j03K69M34K41l68l50J66K57JK9M59j13o96l30
6905e68p1J064N73q30l30j21L24K19PL89m23om30L47K89L90l1q86o0J46M79J56
$$ plain form
6927 627 363 120 178 -29 -327 193 839 830 -6 -83 -315 845 697 440 113 22 113 110 534 711 717 228 -133
6950 -133 3 307 973 626 306 -147 -73 631 664 404 202 351 -166 -154 352 966 448 -70 -170 274 654
6971 654 764 472 600 76 364 97 436 905 556 -34 -401 -468 542 667 523 -311 -21 103 209 369
6991 369 247 551 254 -459 -522 130 654 360 -403 -761 -30 277 -69 134 -189 -68 -448 -120 -29 126 194
7012 194 -326 -688 -383 205 222 38 -413 -562 -277 -200 -389 151 361 -240 -802 -576 -31 141 -46 -450 -686
7033 -686 -633 8 49 205 -107 -366 -781 -695 -253 37 67 -419 -1154 -761 164 14 -248 -499 -726 -655 -810 -113
7055 -113 103 -104 -548 -799 -731 103 166 -161 -530 -594 -705 -465 -64 -73 146 -143 -786 -715 -118 407 199 -285
7077 -285 -827 -386 186 192 37 -348 -442 -399 -670 -19 234 311 -310 -763 -656 248 533 -57 -193 -399 -353 172
$$ packed form
6927F27k64k43N8k07k98N20O46rq36p7k32J160j48k57l27r1R1lM24J77Om89l61
6950a33J36L04O66l47l20m53P4P04L3k60k02J49n17J2N06O14n18n18j00M44L80
6971F54J10k92J28n24K88k67L39M69l49n90l67o7J010J25j44q34K90J24J06J60
6991C69j22L04k97p13o3O52N24k94p63l58P31L07l46K03l23J21l80L28R1J55O8
7012A94n20l62L05N88J7j84m51j49K85P7j89N40K10o01n62K26N45J72j87m04k36
7033f86N3O41M1J56l12k59m15Q6M42K90L0m86p35L93R25j50k62k51k27P1j55O97
7055a13K16k07m44k51O8Q34O3l27l69o4j11K40M01rK19k89o43P1N97N25k08m84
7077b85n42M41N72Oj55l85r4M3k71O51K53P7o21m53J07R04K85n90j36k06M6N25
$$ plain form
7099 172 84 394 279 39 -504 -437 259 652 459 -210 -356 -43 436 402 216 561 440 65 -332 561 764
7120 764 1073 -127 -321 143 629 1190 511 163 70 53 371 310 613 860 156 -384 -184 571 824 446 35
7141 35 85 119 360 407 484 652 420 246 -1 822 851 684 74 -81 -114 468 639 626 140 166 229 -33 -34 666
7165 666 640 82 -723 -254 473 666 389 -66 -112 18 -5 246 334 399 360 -283 -419 538 757 459 -26 -453
7187 -453 44 84 229 306 34 113 -101 -475 -46 355 324 -306 -863 -636 179 195 314 -263 -128 -228 -122 96
7209 96 342 118 -124 -805 -749 -128 557 267 -754 -531 -619 -171 -95 -63 -163 -94 -508 -775 -515 312 211 -509
7231 -509 -770 -328 6 210 -165 -393 -224 -502 -707 -197 98 21 -265 -629 -760 -234 135 -191 -497 -800
7251 -800 -265 66 -365 1 23 -453 -1072 -496 69 426 132 -744 -549 -33 -138 123 -24 -69 -476 -485 -501 -458
$$ packed form
7099A72q8L10j15k40n43O7O96L93j93o69j46L13M79l4j86L45j21l75l97Q93K03
7120G64L09j200j94M64M86N61o79l48r3j7L18o1L03K47p04n40K00P55K53l78m11
7141C5N0L4K41M7P7J68k32j74k47Q23K9j67o10j55l3N82J71j3m86K6O3k62jP00
7165F66k6n58q05M69P27J93k77m55m6J30k3K51Q8O5l9o43j36R57K19k98m85m27
7187d53M97M0J45P7k72P9k14l74M29M01l1o30n57K27Q15J6J19n77J35j00J06K18
7209I6K46k24k42o81N6O21O85k90j021K23q8M48P6L2j00O9m14k67K60Q27j01p20
7231e09k61M42L34K04l75k28J69k78k05N10K95p7k86l64j31N26L69l26l06l03
7251h00N35L31m31L66K2m76o19N76N65L57k94q76J95N16j05K61j47m5m07rj6M3
$$ plain form
7273 -458 173 95 -273 -708 -702 -41 178 -151 -293 -401 -259 -370 42 86 308 88 -567 -763 260 419 102
7294 102 -193 -481 -236 -21 -188 -31 188 -150 -199 -335 124 519 662 -42 -619 -211 652 399 88 477
7314 477 113 232 449 -9 568 720 231 -127 -12 56 456 126 -151 -39 -111 270 219 630 368 416 147
7335 147 -16 410 867 810 250 -301 46 481 621 605 470 335 91 199 192 505 679 103 -454 -9 363
7356 363 688 524 126 30 60 298 262 484 669 374 -149 8 86 984 788 95 -490 -125 480 186 269 260
7378 260 395 -156 -368 200 762 170 198 -300 -268 409 173 368 446 -226 -15 -249 48 219 258 -230 -462
7399 -462 -637 214 544 170 -460 -300 -189 -51 -228 -85 270 -91 -666 -746 -66 85 331 -85 -773 -571
7419 -571 -57 181 -33 -430 -298 -617 -366 67 321 116 -721 -905 -904 -358 70 -475 -152 -449 -500 -345 -348 135
$$ packed form
7273d58O31p8l68m35OO61K19l29j42j08J42j11M12M4K22k20o55j96J023J59l17
7294A02k95k88K45K15j67J57K19l38m9j36M59L95J43p04n77M08Q63k53l11L89
7314D77l64J19K17m58N77J52m89l58J15O8M00l30k77J12p2L81n1M11k62M8k69
7335A47j63M26M57n7n60n51L47M35J40j6j35j35k44J08pL13J74n76n57M45L72
7356C63L25j64l98r6L0K38l6K22J85k95n23J57P8Q98j96o93n85L65O05k94Q3r
7378B60J35n51k12N68N62n92K8m98L2O77k36J95P8o72K11k34K97J71L9m88k32
7399d62j75Q51L30l74o30J60J11J38j77J43L55l61n75q0O80J51K46m16o88K02
7419e71N14K38k14l97J32l19K51M33K54k05q37j84JN46M28n45L23k97n1J55lM83
$$ plain form
7441 135 -222 -324 -719 -680 -375 87 -48 -633 -596 -584 -26 -313 111 -405 -205 -513 -986 -491 145 258 -277
7462 -277 -978 -577 154 44 -131 -496 -564 -416 -329 -430 74 145 -274 -782 -637 10 511 336 -286 -523 -170
7483 -170 26 252 28 146 -148 -306 -612 -165 713 415 -311 -693 -31 470 493 29 344 245 -84 -204 387
7504 387 678 372 -172 -280 -230 295 818 574 212 -48 -82 188 378 690 612 437 -85 -423 350 680 707
7525 707 -4 -350 498 450 531 375 376 530 136 -118 321 825 543 233 -351 -87 526 628 450 70 8 143
7547 143 171 488 701 846 365 -80 -262 595 746 708 -276 -246 -185 160 4 336 675 243 1 21 171 368
7569 368 577 -5 -305 -306 580 266 428 -28 -35 -102 -72 176 422 562 -79 -463 -485 107 217 189 -213 -263 -85
7592 -85 -28 30 180 -272 -151 -617 -709 -217 454 324 90 -589 -213 92 203 77 -44 -130 -232 -537 -354 388
$$ packed form
7441A35l57j02l95L9L05M62j35n85L7J2N58k87M24n16K00l08m73M95O36J13n35
7462b77p01M01P31j10j75l65o8J48Q7j01N04P1m19n08J45O47N01j75o22k37L53
7483a70J96K26k24J18k94j58l06M47Q78k98p26l82O62N01K3m64L15r9l29j20N91
7504C87K91l06n44j08N0N25N23k44l62k60l4K70J90L12p8j75n22l38P73L30K7
7525G07p11l46Q48m8Q1j56JJ54l94k54M39N04k82l10n84K64O13J02j78l80o2J35
7547A43K8L17K13J45m81m45j82Q57J51l8r84L0O1L45j56L32L39m32k42K0J50J97
7569C68K09n82l00jQ86l14J62m56po7L0K48K46J40o41l84k2N92J10k8m02n0J78
7592h5N7N8J50m52J21m66r2M92O71j30k34o79L76L05J11j26j21q6j02l05J83P42
$$ plain form
7614 388 425 18 -296 -419 30 300 199 -485 -434 -538 -428 -238 -73 -74 -151 -614 -584 22 19 124 -487 -474 -374
7637 -374 -193 -200 128 28 -138 -479 -576 -495 -102 -111 -588 -1022 -705 -35 435 -233 -341 -588 -554 -242 -99 129
7659 129 512 -174 -891 -454 -223 368 29 -211 -358 -92 89 5 -362 -86 -240 -363 -207 -276 238 214 -397
7680 -397 -712 -336 -142 97 225 -274 -83 -331 -242 -272 124 441 -29 -502 -237 -44 427 306 -275 -451 -170
7701 -170 -16 -77 355 491 -3 -313 -377 173 766 574 -182 -223 114 256 444 310 181 240 231 -237 220 197
7723 197 798 257 -328 -334 654 225 427 386 41 -5 321 117 397 836 97 64 13 416 684 729 272 40
7745 40 172 358 456 578 654 544 310 95 229 772 634 271 -258 -130 627 574 599 515 121 102 -78 198
7767 198 632 863 394 -173 -276 225 549 414 314 -71 168 58 20 161 400 98 -602 -418 -120 402
$$ packed form
7614C88L7m07l14j23M49K70j01o84N1j04J10J90J65jp7m63L0O06lJ05o11J3J00
7637c74J81pL28j00j66l41r7Q1L93rm77m34L17O70M70o68j08k47L4L12J43K28
7659A29L83o86p17M37K31N91l39k40j47K66J81q4l67K76j54j23J56o9N14k4o11
7680c97l15L76J94K39J28m99J91k48Q9l0L96L17m70m73K65J93M71j21n81j76K81
7701a70J54o1M32J36m94l10o4N50N93j92p56m1L37J42J88j34j29N9rm68M57k3
7723A97O01n41n85oR88m29K02m1l45m6L26k04K80M39p39l3n1M03K68M5m57k32
7745D0J32J86R8J22P6j10k34k15J34N43j38l63n29J28P57n3K5q4l94j9j80K76
7767A98M34K31m69n67j03N01L24j35j00l85K39j10l8J41K39l02p00J84K98N22
$$ plain form
7787 402 420 -251 -390 -441 44 284 215 30 265 -65 -72 -285 278 179 -115 -620 -496 -19 346 88 -231 -98
7809 -98 -340 -152 -455 55 84 -13 -241 -634 -155 92 -87 -404 -798 -303 -90 -140 -48 3 -291 -823 -763 -219
7831 -219 -16 -5 -302 -830 -475 -198 -177 -77 -223 -407 -281 -695 -298 -9 255 -432 -717 -656 -318 286 38
7852 38 -114 -272 -534 -472 -234 -117 -186 -310 -754 -460 -357 214 72 -527 -468 -534 263 21 -82 -78 59 -391
7874 -391 -40 -309 541 241 -146 -460 -507 87 519 204 -363 -108 -179 -177 -212 410 277 43 37 -316 -196 342
7896 342 315 -73 -318 -126 108 300 213 190 263 -174 -342 -222 601 572 51 -98 -158 166 262 256 -34 -77 -55 -88
7920 -88 105 662 795 400 -198 -223 221 449 491 124 -347 501 501 306 140 329 385 198 -160 140 545 711
7942 711 227 -225 262 -36 339 426 195 298 -42 -77 276 421 519 91 -202 -258 444 570 539 72 94 206
$$ packed form
7787D02J8o71j39n1M85K40o9j85K35l30pk13N63r9k94n05J24M77L65k58l19J33
7809i8k42J88l03N10K9r7k28l93M79K47j79l17l94M95K13n0R2N1k94n32O0N44
7831b19K03J1k97n28L55K77K1J00j46j84J26m14L97K89K64o87k85O1L38O04k48
7852C8j52j58k62O2K38J17o9j24m44K94J03N71j42n99N9o6P97k42j03MJ37m50
7874c91L51k69Q50l00l87l14m7N94M32l15n67K55p1Kl5O22j33k34ol53J20N38
7896C42k7l88k45J92K34J92q7k3P3m37j68J20Q23k9n21j49o0L24R6ok90m3K2l3
7920h8J93N57J33l95n98k5M44K28M2l67m71Q48%j95j66J89N6j87l58L00M05J66
7942G11m84m52M87k98L75Q7k31J03l40l5L53J45R8m28k93n6P02J26l1m67K2J12
$$ plain form
7964 206 -74 334 420 634 326 -138 -249 -51 367 439 -107 -80 -6 199 345 234 360 111 57 -395 8 260
7986 260 641 -74 -320 -460 431 303 119 38 -57 -260 -248 -285 176 647 -72 -249 -279 365 234 106 106 -470
8008 -470 -26 -57 -154 224 202 215 -482 -473 -494 327 240 -121 -841 -257 -141 54 -457 -285 -226 -269 -494 -506 40 172
8032 172 67 -387 -727 -461 -172 -134 -259 -250 -536 -389 -140 -200 -111 -254 -305 -893 -371 -58 114 -562 -537 -734
8054 -734 37 -70 -248 -146 -56 -373 -934 -116 331 234 -344 -525 -477 -277 -66 308 -164 -130 -248 -499 -204
8075 -204 -44 -17 -12 -541 -546 95 133 283 -296 -96 -211 64 -36 60 15 -46 223 -86 202 249 239 -127 -550 -668
8099 -668 250 283 59 -31 226 272 -292 -42 330 633 290 -471 -142 428 639 477 -21 261 306 93 74 256
8121 256 446 247 21 -302 15 475 714 362 -59 -49 255 604 511 451 356 17 123 -44 606 770 413
$$ packed form
7964B06k80M08Q6K14l08m64j11J98M18P2n46K7P4K05J46j11J26k49n4m52M03K52
7986B60L81p15k46j40Q91j28j84q1r5k03J2l7M61M71p19j77l0O44j31j28%n76
8008d70M44l1r7L78k2J3o97Rk1Q21q7l61p20N84J16J95n11J72N9m3k25j2N46J32
8032A72j05m54l40K66K89L8j25Rk86J47K49o0Q9j43n1n88N22L13J72o76K5j97
8054g34P71j07j78J02R0l17n61Q18M47r7n78j81M8K00K11L74m72L4j18k51K95
8075b04J60K7Nn29nO41L8J50n79K00j15K75j00R6m5o1K69l09K88M7j0l66m23j18
8099f68R18L3k24r0K57M6n64K50L72L03l43p61L29N70K11j62m98K82M5k13j9J82
8121B56J90j99k26l23L17M60K39l52m21J0L04L49r3o0r5l39J06j67O50J64l57
$$ plain form
8142 413 71 -314 286 421 658 350 383 106 162 38 447 717 501 -232 -48 -230 507 432 204 -188 32
8163 32 -341 57 217 383 427 359 -114 114 639 537 -75 -342 -132 378 433 -169 -13 257 -10 -197 -2
8184 -2 67 664 223 -780 -554 -192 261
$$ packed form
8142D13l42l85O00J35K37l08L3k77N6j24M09K70k16p33J84j82P37p5k28l92K20
8163C2l73L98J60J66M4o8m73K28N25j02o12k67K10N10N5o02J56K70k67j87J95
8184bO9N97m41j003K26L62M53
8191B61
$$ Imaginary data points
##PAGE= N=2
##DATA TABLE= (X++(I..I)), XYDATA
$$ plain form
0 0 0 0 0 8 -8 0 -8 16 -16 16 -16 24 -32 32 -40 56 -64 72 -86 100 -119 136 -153 177 -203 229 -260 295 -332
29 -332 372 -418 467 -523 580 -647 719 -798 881 -978 1083 -1197 1324 -1468 1627 -1805 2003
46 2003 -2236 2507 -2816 3183 -3632 4187 -4891 5813 -7080 8928 -11826 16928 -27673 59280
60 59280 -343774 -1168316 16830 924367 -113069 -705530 257142 518493 -516722 -676827
70 -676827 384085 568164 -303710 -463339 155995 182328 -183110 43123 385474 13547
80 13547 -436671 -197826 230887 213647 8007 -57042 -83139 -127786 -101705 -39602 15783
91 15783 30069 -89919 -223602 -95585 121304 32865 -156482 -51725 49880 -163716 -199905
102 -199905 203098 338388 -76167 -253500 49803 77026 -207199 -28828 370754 105224
$$ packed form
0@%%%Qj6QqK4l2L2l2M0n6O4p2R6j20J36j58J86k19K55k89L30l80M32m89N55o27
29c32P04p90Q85r90J103j227J366j517J679j859K061k280K521k792L095l432L808
46B003m239M743n323N999o815P819r078J0704j2893J6008k0754K8754m4601Q6953
60E9280m03054q24542J185146R07537j037436n92461R62672K61351j035215j60105
70f76827J060912J84079q71874j59629O19334K6333l65438K26233L42351l71927
80A3547m50218K38845M28713j7240k05640o5049k6097m4647K6081O2103N5385
91A5783J4286j19988j33683J28017K16889q8439j89347J04757J01605k13596l6189
102a99905M03003J35290m14555j77333L03303K7223k84225J78371L99582k65530
$$ plain form
112 105224 -398733 -171838 272940 19344 -330845 -10395 242168 -181639 -396891 94751
122 94751 336949 -84556 -273625 19588 23667 -219539 26731 419688 125374 -370636
132 -370636 -149737 307232 122511 -236870 -9969 297336 10732 -324305 -50139 313550
142 313550 101349 -282086 -205146 78183 55532 -88844 34773 184454 -31392 -301538
152 -301538 -116027 247458 185293 -116055 -59750 196883 94908 -166106 -25121 269654
162 269654 129658 -190987 -99206 178720 116261 -68996 21662 105231 -108984 -223053 31241
173 31241 211345 37098 -104302 9526 58906 -70163 -72138 107724 162803 22782 -59497
184 -59497 23581 117640 104618 41566 23159 29311 -15272 -49926 64573 213868 114284 -146439
$$ packed form
112A05224n03957K26895M44778k53596l50189L20450K52563m23807k15252M91642
122I4751K42198m21505j89069K93213M079k43206K46270L92957k94314m96010
132c70636K20899M56969j84721l59381K26901L07305k86604l35037K74166L63689
142C13550k12201l83435P6940K83329k2651j44376J23617J49681k15846k70146
152c01538J85511L63485o2165l01348N6305K56633j01975k61014J40985K94775
162B69654j39996l20645R1781K77926o2459j85257R0658Q3569k14215j14069K54294
173C1241J80104j74247j41400J13828M9380j29069j975J79862N5079j40021q2279
184e9497Q3078R4059j3022o3052j8407O152m4583l4654J14499J49295r9584k60723
$$ plain form
196 -146439 -166418 43549 77576 -53330 14905 157192 -2592 -206140 -24844 207649
206 207649 54211 -109570 65091 127515 -120171 -81875 314541 290653 -195043 -264657 144066
217 144066 206318 -82819 -20981 231769 40988 -273342 -94890 190180 44169 -129033
227 -129033 33847 79441 -155312 -116768 214068 187903 -165797 -194065 78531 122477 3641
238 3641 68203 138090 -16378 -130795 -23333 69404 51831 63797 43665 -87223 -109471
249 -109471 40099 67799 -59074 -52719 20763 -86469 -145887 77892 196787 -44640 -184316
260 -184316 2065 53385 -111765 -8937 247735 94992 -217898 -80527 181104 4269
270 4269 -184694 77855 224746 -127885 -287701 85478 245371 -97266 -233881 17017
$$ packed form
196a46439j9979K09967L4027j30906O8235J42287j59784k03548J81296K32493
206B07649j53438j63781J74661O2424k47686L8296L96416k3888m85696o9614M08723
217A44066O2252k89137O1838K52750j90781l14330J78452K85070j46011j73202
227a29033J62880M5594k34753L8544L30836k6165l53700k8268K72596M3946j18836
238C641O4562O9887j54468j14417J07462R2737j7573J1966k0132j30888k2248
249a09471J49570K7700j26873O355P3482j07232n9418K23779J18895k41427j39676
260a84316J86381N1320j65150J02828K56672j52743l12890J37371K61631j76835
270D269j88963K62549J46891l52631j59816L73179J59893l42637j36615K50898
$$ plain form
280 17017 36373 -169675 -43913 208995 42968 -220460 -82824 93265 -54516 -103601
290 -103601 145774 172075 -130958 -187568 77958 140040 -40147 -63269 19219 -57435 -110030
301 -110030 45506 124346 -31272 -134122 -74657 -66292 -88287 28956 119793 -4079 -128261
312 -128261 -71334 -14510 -32927 33150 106086 -11956 -138134 -24576 119745 50823 -40463
323 -40463 -994 -23105 -125723 -49049 138063 97891 -94906 -105856 -9811 -58395 -106079
334 -106079 36777 128693 -22233 -147560 -48392 59336 29343 4166 16054 -36334 -68820
345 -68820 34497 122691 56222 -25728 -12067 -16228 -66685 -21341 95894 95165 -22278 -78478
357 -78478 -44867 -20516 -7495 31134 34862 -25400 -57042 -10258 46067 55605 31424 -8852
$$ packed form
280A7017J9356k06048J25762K52908j66027k63428J37636J76089j47781m9085
290a03601K49375K6301l03033n6610K65526O2082j80187k3122Q2488p6654n2595
301a10030J55536P8840j55618j02850N9465Q365k1995J17243R0837j23872j24182
312a28261N6927N6824j8417O6077P2936j18042j26178J13558J44321o8922r1286
323d0463L9469k2111j02618P6674J87112m0172j92797j0950R6045m8584m7684
334a06079J42856R1916j50926j25327R9168J07728k9993k5177J1888n2388l2486
345f8820J03317Q8194o6469q1950J3661m161n0457M5344J17235p29j17443n6200
357g8478L3611K4351J3021L8629L728o0262l1642M6784N6325R538k4181m0276
$$ plain form
369 -8852 -39281 -16411 47573 88640 77908 39981 -2545 -31422 -25898 12788 64820 88606
381 88606 34985 -62633 -75347 25429 85564 18164 -47928 -18687 9225 -9522 25544 100799
393 100799 66995 -44199 -56688 18242 43683 53935 111917 94800 -41249 -87697 30114
404 30114 97332 36685 9847 27852 -26213 -60301 39881 102770 -1941 -77068 -9888 10492
416 10492 -50919 15285 148621 73494 -108410 -80215 64063 50798 -6718 78585 109566
427 109566 -46483 -111528 45321 126723 13991 -48920 -1827 -17617 -51498 30155 87863
438 87863 -1573 -72910 -41699 -48636 -66095 53175 147634 7911 -145998 -59962 61611
449 61611 16182 -666 83765 26892 -128704 -58816 130776 80987 -75098 -26646 35383
$$ packed form
369h852l0429K2870O3984M1067j0732l7927m2526k8877N524L8686N2032K3786
381H8606n3621r7618j2714J00776O0135o7400o6092K9241K7912j8747L5066P5255
393A00799l3804j11194j2489P4930K5441J0252N7982j7117j36049m6448J17811
404C0114O7218o0647k6838J8005n4065l4088J00182O2889j04711p5127O7180K0380
416A0492o1411O6204J33336p5127j81904K8195J44278j3265n7516Q5303L0981
427A09566j56049o5045J56849Q1402j12732o2911M7093j5790l3881Q1653N7708
438H7863q9436p1337L1211o937j7459J19270R4459j39723j53909Q6036J21573
449F1611m5429j6848Q4431n6873j55596O9888J89592m9789j56085M8452O2029
$$ plain form
460 35383 -104034 -131177 110987 181196 -81952 -202188 -22056 40485 -81845 -23486 134220
471 134220 15074 -197712 -91695 128867 75686 -69561 -24249 22808 -72750 -64690 98773
482 98773 115640 -44749 -101531 -40696 -38513 -33014 61757 74775 -60717 -127507 -52862 -2473
494 -2473 -945 31388 7858 -101582 -98108 44560 74904 -26535 -21435 40856 -52227 -134877
506 -134877 28748 179135 39956 -117423 -38181 27461 -66803 -43181 117252 63667 -148244
517 -148244 -117055 77102 50177 -86290 -16071 74354 -69141 -161008 36820 179044 18449
528 18449 -117575 -15758 47594 -46936 -33155 114701 103252 -62636 -91711 21336 51140
539 51140 -518 4255 19472 -35760 -63237 7046 62386 21788 -36626 -40016 -21975 -16787 2825
$$ packed form
460C5383j39417k7143K42164P0209k63148j20236J80132O2541j22330N8359J57706
471A34220j19146k12786J06017K20562n3181j45247M5312M7057r5558Q060J63463
482I8773J6867j60389n6782O0835K183N499R4771J3018j35492o6790P4645N0389
494b473J528L2333k3530j09440L474J42668L0344j01439N100O2291r3083q2650
506a34877J63625J50387j39179j57379P9242O5642r4264K3622J60433n3585k11911
517a48244L1189J94157k6925j36467P0219R0425j43495r1867J97828J42224j60595
528A8449j36024J01817O3352r4530J3781J47856j1449j65888k9075J13047K9804
539E1140n1658M773J5217n5232k7477P0283N5340m0598n8414l390J8041N188J9612
$$ plain form
552 2825 47501 68566 18400 -58684 -55057 36470 85154 29353 -14824 22060 31259 -25365 -14589
565 -14589 74683 64342 -53013 -71826 24185 44815 -7856 19218 60650 -28386 -116135 -22572
577 -22572 103968 60691 -29904 4131 45664 -24585 -52805 62073 123999 9804 -82361
588 -82361 -2341 86971 41060 -15914 25807 43669 -46183 -86160 29428 123049 37914 -76446
600 -76446 -40772 27813 -13592 -37743 63700 99682 -39363 -105088 37638 118799 -1376
611 -1376 -54590 61701 66089 -83191 -57824 143161 134672 -85061 -114467 53722 59034 -66291
623 -66291 -9596 121072 23325 -137782 -58628 90181 39694 -53065 4210 43225 -43882
634 -43882 -55566 66840 95985 -18228 -66415 -680 26602 2042 25050 58168 16508 -50261
$$ packed form
552B825M4676K1065n0166p7084L627R1527M8684n5801m4177L6884R199n6624J0776
565a4589Q9272j0341j17355j8813R6011K0630n2671K7074M1432q9036q7749R3563
577b2572J26540m3277r0595L4035M1533p0249k8220J14878O1926j14195r2165
588h2361Q0020Q9312m5911n6974M1721J7862q9852l9977J15588R3621q5135j14360
600g6446L5674O8585m1405k4151J01443L5982j39045o5725J42726Q1161j20175
611a376n3214J16291M388j49280K5367K00985q489k19733k9406J68189N312j25325
623f6291N6695J30668r7747j61107P9154J48809n0487r2759N7275L9015q7107
634d3882j1684J22406K9145j14213m8187O5735K7282k4560K3008L3118m1660o6769
$$ plain form
646 -50261 -56491 -10692 39151 46748 -10062 -61984 -28934 16891 -12705 -28720 32989 27760 -81650
659 -81650 -82863 57758 84772 -30938 -41734 38716 -18055 -103018 17119 144353 13739
670 13739 -128467 -18779 76655 -49857 -93314 80133 96287 -126292 -154332 71844 107617
681 107617 -79575 -85807 58016 -1584 -140734 -27724 142162 42933 -118027 -52325 45795
692 45795 -22156 -52400 60952 75003 -70327 -108783 15768 66334 -7797 -40035 -13002
703 -13002 -28373 -54686 -17740 31511 28235 -16753 -68397 -78021 -7804 60054 23068 -39478
715 -39478 -16406 6709 -46303 -41120 67351 76175 -57962 -90824 26856 52360 -33754 -11130
727 -11130 69265 -12791 -129125 -33028 106160 32048 -76373 -3554 48983 -68130 -95614
$$ packed form
646e0261o230M5799M9843P597n6810n1922L3050M5825k9596j6015O1709n229j09410
659h1650j213J40621K7014j15710j0796Q0450n6771q4963J20137J27234j30614
670A3739j42206J09688R5434j26512m3457J73447J6154k22579k8040K26176L5773
681A07617j87192o232J43823n9600j39150J13010J69886r9229j60960O5702R8120
692D5795o7951l0244J13352J4051j45330l8456J24551N0566p4131l2238K7033
703a3002j5371k6313L6946M9251l276m4988n1644r624P0217O7858l6986o2546
715c9478K3072K3115n3012N183J08471Q824j34137l2862J17680K5504q6114K2624
727a1130Q0395q2056j16334R6097J39188p4112j08421P2819N2537j17113k7484
$$ plain form
738 -95614 72407 122629 -43951 -106083 26067 68442 -28966 -19005 81995 36144 -89433
749 -89433 -49414 82386 73713 -16940 -14486 18135 -30788 -52365 39912 97647 14092 -72605
761 -72605 -37257 30981 28421 7073 26910 30154 -25756 -53592 19290 98738 61084 -33650
773 -33650 -42640 17386 29869 9945 42551 70152 270 -73898 -22419 69711 56648 -8118
785 -8118 -6786 11823 -18870 -18903 51534 67677 -15156 -53157 11099 46589 5360 2402 54591
798 54591 40403 -40302 -46267 39463 75188 17126 -23510 6432 23362 -10442 -16293 34270
810 34270 47005 -14297 -45936 3718 35518 -921 -8695 38432 22865 -63878 -55249 62199
822 62199 85929 -19314 -49643 26842 20244 -59133 -11846 103574 51148 -91589 -68732 54394
$$ packed form
738i5614J68021N0222j66580o2132J32150M2375r7408R961J01000m5851j25577
749h9433M0019J31800q673r0653K454L2621m8923k1577R2277N7735q3555q6697
761g2605L5348O8238k560k1348J9837L244n5910k7836P2882P9448l7654r4734
773c3650q990O0026J2483j9924L2606K7601o9882p4168N1479R2130j3063o4766
785h118J332J8609l0693l3P0437J6143q2833l8001O4256L5490m1229k958N2189
798E4591j4188q0705n965Q5730L5725n8062m0636K9942J6930l3804n851N0563
810C4270J2735o1302l1639M9654L1800l6439p774M7127j5567q6743Q629J17448
822F2199K3730j05243l0329P6485o598p9377M7287J15420n2426j42737K2857J23126
$$ plain form
834 54394 43888 -32391 785 40643 -42756 -90400 16193 89756 8491 -59069 -19128 -6822
846 -6822 -44481 1726 82112 29765 -83462 -67771 27350 40923 -584 -3903 -3269 -33984 -37108
859 -37108 2336 26025 22363 1313 -48873 -78018 -12932 66585 31749 -50042 -41164 109
871 109 -27664 -38139 35231 55453 -37476 -76775 -3989 26844 -14992 -921 37692 -21446
883 -21446 -83490 -16982 56268 9902 -32599 7183 -3898 -77298 -39745 72538 48624 -64426
895 -64426 -56145 20442 -7224 -47853 25752 67116 -33717 -93800 -6379 52855 2597 -10355
907 -10355 27482 -16971 -84059 -20445 78180 44178 -38830 -35521 -11620 -29859 -6213 57254
919 57254 34771 -50133 -55098 2940 12361 2885 32741 26279 -47881 -66205 12213 58220 23121
$$ packed form
834E4394j0506p6279L3176L9858q3399m7644J06593P3563q1265o7560L9941J2306
846f822l7659M6207Q0386n2347j13227J5691R5121J3573m1507l319O34l0715l124
859c7108L9444K3689l662k1050n0186k9145O5086P9517l4836q1791Q878M1273
871A09k7773j0475P3370K0222r2929l9299P2786L0833m1836J4071L8613n9138
883b1446o2044O6508P3250m6366m2501L9782j1081p3400L7553J12283k3914j13050
895f4426Q281P6587k7666m0629P3605M1364j00833o0083Q7421N9234n0258j2952
907a0355L7837m4453o7088O3614R8625l4002q3008L309K3901j8239K3646O3467
919E7254k2483q4904m965N8038R421r476K9856o462p4160j8324P8418M6007l5099
$$ plain form
932 23121 -6280 -10882 -33018 -28912 30445 53606 2184 -27327 -6376 -9349 -20081 26942 59301
945 59301 -5650 -61836 -11030 41027 5740 -14434 34324 31113 -47451 -51321 39613 66538
957 66538 82 -27548 4270 5423 -12323 13862 39078 11237 -15253 -2208 1601 -8938
969 -8938 17471 49562 16108 -39669 -26816 25315 32982 10517 10137 11446 -12426 -20749 12086
982 12086 39897 27914 1483 -12199 -13176 1127 27312 37172 15453 -12008 -16798 -2442 16437
995 16437 30395 29532 6654 -22422 -24627 10961 44520 33270 -3538 -17655 -6660 2754 12679
1008 12679 31922 30006 -7179 -30559 -7955 20876 21967 20132 20438 -10822 -44063 -10301 53608
1021 53608 45289 -16653 -29606 3250 6659 -6991 16316 36375 4168 -33637 -22751 7210
$$ packed form
932B3121k9401m602k2136M106N9357K3161n1422k9511K0951k973j0732M7023L2359
945E9301o4951n6186N0806N2057l5287k0174M8758l211p8564l870R0934K6925
957F6538o6456k7630L1818J153j7746K6185K5216k7841k6490J3045L809j0539
969h938K6409L2091l3454n5777J2853N2131P667k2465l80J309k3872q323L2835
982A2086K7811j1983k6431j3682r77J4303K6185R860k1719k7461m790J4356J8879
995A6437J3958q63k2878k9076k205L5588L3559j1250l6808j4117J0995R414R925
1008A2679J9243j916l7185k3380K2604K8831J091j835L06l1260l3241L3762O3909
1021E3608q319o1942j2953L2856L409j3650K3307K0059l2207l7805J0886K9961
$$ plain form
1033 7210 21594 25951 12284 -24115 -37974 -3371 27637 16201 -1 -3038 -18628 -30930
1045 -30930 -984 33170 15137 -17587 -17181 -14710 -20667 5891 38625 8327 -41333 -26384 6119
1058 6119 -10791 -12167 33855 23436 -57115 -63596 21396 40389 -21491 -25941 15401 -16641 -62554
1071 -62554 -4641 57533 1252 -56920 -12642 12312 -41577 -30000 59089 40995 -74269 -75565
1083 -75565 27520 37617 -29506 -16922 27347 -21210 -71534 -10903 51430 8754 -40742 -20152
1095 -20152 -10993 -34525 -7704 44411 18285 -48634 -47299 -3862 7031 8820 22783 1402
1107 1402 -43334 -37406 6670 22496 12934 5440 -20115 -45129 -13954 34542 19683 -17287 -6395
1120 -6395 -1140 -41073 -31315 49817 60345 -29586 -61187 4091 25146 -12034 9406 50846
$$ packed form
1033G210J4384M357j3667l6399j3859L4603L1008j1436j6202l037j5590j2302
1045c0930K9946L4154j8033l2724M06K471n957K6558L2734l0298m9660J4949L2503
1058F119j6910j376M6022j0419q0551o481Q4992J8993o1880m450M1342l2042m5913
1071f2554N7913O2174n6281n8172M4278K4954n3889J1577Q9089j8094j15264j296
1083g5565J03085J0097o7123J2584M4269m8557n0324O0631O2333m2676m9496K0590
1095b0152R159k3532K6821N2115k6126o6919J335M3437J0893J789J3963k1381
1107A402m4736N928M4076J5826r562p494k5555k5014L1175M8496j4859l6970J0892
1120f395N255l9933R758Q1132J0528q9931l1601O5278K1055l7180K1440M1440
$$ plain form
1132 50846 -2496 -63601 -6962 60285 16205 -27819 18801 30798 -42862 -44030 55268 73995
1144 73995 -20912 -54686 7211 23278 -13020 10176 54261 12402 -50671 -21257 39877 31630
1156 31630 2688 14844 15517 -20523 -19238 35389 56163 14234 -21228 -13035 3858 11368 25823
1169 25823 37700 17073 -25801 -37239 4966 49962 38135 -8831 -22678 4231 13341 730
1181 730 15624 43823 18058 -37483 -28696 35934 55670 15411 -7477 -1604 -9126 -11526 24891
1194 24891 49400 11798 -31175 -15776 15139 9284 116 18728 19613 -20366 -34444 11090 43702
1207 43702 15035 -17150 -4092 7287 -11281 -6445 37143 41078 -15807 -40974 4334 31316
1219 31316 -1494 -12955 23322 18323 -38639 -35884 31688 37304 -26010 -31960 17290 4246 -42502
$$ packed form
1132E0846n3342o1105N6639O7247m4080m4024M6620J1997p3660j168R9298J8727
1144G3995r4907l3774O1897J6067l6298K3196M4085m1859o3073K9414O1134q247
1156C1630k8942J2156O73l6040J285N4627K0774m1929l5462Q193J6893P510J4455
1169B5823J1877k0627m2874j1438M2205M4996j1827m6966j3847K6909R110j2611
1181G30J4894K8199k5765n5541Q787O4630J9736m0259k2888N873p522k400L6417
1194B4891K4509l7602m2973J5399L0915n855r168J8612Q85l9979j4078M5534L2612
1207D3702k8667l2185J3058J1379j8568M836M3588L935n6885k5167M5308K6982
1219C1316l2810j1461L6277m999n6962K755O7572N616o3314n950M9250j3044m6748
$$ plain form
1232 -42502 -4662 60589 18997 -63592 -39654 36160 26672 -20830 -215 30132 -11457 -46686
1244 -46686 -3357 37294 9992 -19466 -10532 -12833 -25888 -229 32986 6727 -40418 -38283
1256 -38283 -4267 7662 4230 6296 -689 -20183 -29896 -15105 13172 29344 9071 -31749 -33312
1269 -33312 7873 19730 -9587 -8828 17770 -11151 -60754 -20349 56604 28289 -54226 -43059
1281 -43059 12963 -8350 -37833 17415 46836 -28072 -68773 1517 39691 -15092 -23919 32946
1293 32946 12137 -63897 -32053 63476 44063 -45125 -40300 14151 -5765 -32018 19625 44812
1305 44812 -23195 -62852 -10442 20905 -9274 -8776 23476 -1873 -50728 -24972 37626 33962
1317 33962 -12948 -23310 -7213 -4128 2119 22125 24382 85 -21862 -26351 -9377 24371 34119
$$ packed form
1232d2502L7840O5251m1592q2589K3938P5814r488m7502K0615L0347m1589l5229
1244d6686M3329M0651k7302k9458Q934k301j3055K5659L3215k6259m7145K135
1256c8283L4016J1929l432K066o985j9494r713J4791K8277J6172k0273m0820j563
1269c3312M1185J1857k9317P59K6598k8921m9603M0405P6953k8315q2515J1167
1281d3059N6022k1313k9483N5248K9421p4908m0701P0290L8174n4783q827N6865
1293C2946k0809p6034L1844R5529j9413q9188M825N4451j9916k6253N1643K5187
1305D4812o8007l9657N2410L1347l0179M98L2252k5349m8855K5756O2598l664
1317C3962m6910j0362J6097L085O247K0006K257k4297k1947m489J6974L3748R748
$$ plain form
1330 34119 -3944 -33620 -11624 8387 -7887 -5417 26758 13628 -40033 -33590 28431 38909
1342 38909 -1529 -6701 8084 -14521 -23092 30587 57240 1581 -33128 7254 22715 -17479
1354 -17479 -9796 48685 32782 -43535 -40129 32523 39219 -12242 -13222 17535 -2879 -30145 9387
1367 9387 52743 22565 -23561 -11650 15142 7037 4958 32636 35151 -4943 -24272 5373 30967
1380 30967 18978 2366 3312 2278 -8641 -2786 23002 31309 875 -28095 -16250 14890 21864
1393 21864 11611 12887 12781 -7496 -18401 7804 35704 25787 452 -2680 4007 1813 8805
1406 8805 28072 20653 -17092 -28713 5091 28678 10600 -6005 2378 443 -24324 -22676 19293
1419 19293 41067 6510 -30386 -15991 14671 12122 -835 11466 16659 -12234 -27050 9429
$$ packed form
1330C4119l8063k9676K1996K0011j6274K470L2175j3130n3661O443O2021J0478
1342C8909m0438n172J4785k2605q571N3679K6653n5659l4709M0382J5461m0194
1354a7479P683N8481j5903p6317L406P2652O696n1461r80L0757k0414k7266L9532
1367I387M3356l0178m6126J1911K6792q105k079K7678K515m0094j9329K9645K5594
1380C0967j1989j6612R46j034j0919N855K5788Q307l0434k8970J1845L1140O974
1393B1864j0253J276j06k0277j0905K6205K7900r917k5335l132O687k194O992
1406H805J9267p419l7745j1621L3804K3587j8078j6605Q383j935k4767J648M1969
1419A9293K1774l4557l6896J4395L0662k549j2957J2301N193k8893j4816L6479
$$ plain form
1431 9429 37584 10851 -21140 -12939 -3929 -16469 -5713 28518 18065 -32610 -39562 -313 6755
1444 6755 -15185 195 22984 -12565 -49161 -9799 40424 15167 -28838 -15270 5249 -12022
1456 -12022 -12769 23736 24849 -21483 -37948 -10764 -1218 -7993 7220 14827 -21998 -48937 -18391
1469 -18391 17211 5907 -15772 -14860 -14340 -19693 -4994 15163 9711 -8529 -18279 -22786 -14365 16251
1483 16251 30415 -197 -29568 -18024 -3848 -11055 -2534 19959 794 -40862 -30588 12667
1495 12667 11632 -14556 -6969 -475 -30113 -30416 24339 39831 -12293 -31100 5095 5571 -25179
1508 -25179 1456 50164 18326 -43537 -26741 24222 14650 -12410 4306 11511 -25133 -29859
1520 -29859 16053 27976 -7139 -15437 1075 -13111 -24929 14753 46618 11226 -26780 -11785
$$ packed form
1431I429K8155k6733l1991Q201R010j2540J0756L4231j0453n0675o952L9249P068
1444F755k1940J5380K2789l5549l6596L9362N0223k5257m4005J3568K0519j7271
1456a2022p47L6505J113m6332j6465K7184R546o775J5213P607l6825k6939L0546
1469a8391L5602j1304k1679R12N20n353J4699K0157n452j8240r750m507Q421L0616
1483A6251J4164l0612k9371J1544J4176p207Q521K2493j9165m1656J0274M3255
1495A2667j035k6188P587O494k9638l03N4755J5492n2124j8807L6195M76l0750
1508b5179K6635M8708l1838o1863J6796N0963r572k7060J6716P205l6644m726
1520b9859M5912J1923l5115q298J6512j4186j1818L9682L1865l5392l8006J4995
$$ plain form
1532 -11785 9615 5521 12748 29165 11744 -19652 -11651 15586 18572 11719 10675 -7162 -29927
1545 -29927 -10061 30978 29198 -3413 -12314 -6715 -15340 -6957 30030 38485 498 -23012 -5505
1558 -5505 12112 17546 27423 21213 -12548 -23314 12022 35046 17059 2218 6562 -7754 -27662
1571 -27662 -2834 39249 30057 -13367 -23543 -4947 1954 5165 20710 17425 -10418 -16847 8241
1584 8241 22966 14607 10107 8884 -6032 -13507 8122 31022 23433 -55 -11533 -10151 -5230
1597 -5230 5113 14296 9937 -3550 -12044 -11486 -3502 9130 14737 1684 -14749 -11919 6377 17060
1611 17060 14794 7913 -308 -9440 -9753 2797 19167 22212 6054 -15229 -20445 -6231 9588
1624 9588 11514 99 -14184 -18615 -8000 5249 5599 -1663 -5948 -11683 -19446 -9201 20849 30166
$$ packed form
1532a1785K1400m094P227J6417j7421l1396Q001K7237K986o853j044j7837k2765
1545b9927J9866M1039j780l2611q901N599q625Q383L6987Q455l7987k3510J7507
1558e505J7617N434R877o210l3761j0766L5336K3024j7987j4841M344j4316j9908
1571b7662K4828M2083r192m3424j0176J8596O901L211J5545l285k7843o429K5088
1584H241J4725q359m500j223j4916p475K1629K2900p589k3488j1478J382M921
1597e230J0343R183m359j3487q494N58P984J2632N607j3053j6433K830J8296J0683
1611A7060k266o881q221r132l13J2550J6370L045j6158k1283n216J4214J5819
1624I588J926j1415j4283m431J0615J3249L50p262m285n735p763J0245L0050R317
$$ plain form
1638 30166 -1409 -28690 -14195 8973 6825 1674 10480 6122 -17997 -21544 2281 11695 -2797
1651 -2797 -13605 -15050 -17658 -10310 7256 7627 -12468 -20493 -11169 -9600 -10520 6792 18914 -39
1665 -39 -20717 -11915 2376 318 1171 8393 -2462 -18906 -8336 7540 -2816 -12324 -1650 -5853
1679 -5853 -29726 -23067 13854 16883 -15392 -23817 -8870 -12949 -17376 9248 24798 -4308 -26577
1692 -26577 -6211 8800 -3044 1880 18438 -1917 -33484 -13088 26799 16840 -14644 -14470 -8034
1705 -8034 -22669 -17014 18090 22569 -13463 -28363 -11230 -4823 -4273 14497 19282 -12032 -27460
1718 -27460 3045 25628 9704 -1718 5699 -2303 -18010 -887 27636 20130 -5936 -14476 -13970
1731 -13970 -11257 6392 21219 3087 -18128 -8348 4901 -5397 -3377 20444 15338 -18999 -18272
$$ packed form
1638C0166l1575k7281J4495K3168k148n151Q806m358k4119l547K3825R414j4492
1651b797j0808j445k608P348J7566L71k0095q025R324J569r20J7312J2122j8953
1665c9k0678Q802J4291k058Q53P222j0855j6444J0570J5876j0356r508J0674m203
1679e853k3873O659L6921L029l2275q425J4947m079m427K6624J5550k9106k2269
1692b6577K0366J5011j1844M924J6558k0355l1567K0396L9887r959l1484J74O436
1705h034j4635N655L5104M479l6032j4900J7133O407N50J8770M785l1314j5428
1718b7460L0505K2583j5924j1422P417q002j5707J7123K8523p506k6066q540N06
1731a3970K713J7649J4827j8132k1215R780J3249j0298K020K3821n106l4337P27
$$ plain form
1744 -18272 20373 29303 5985 3407 12363 -4704 -14888 15623 35515 10096 -9829 4087
1756 4087 3467 -15823 -1666 30971 15870 -24863 -18556 16605 16274 -3460 4945 15915 -4214
1769 -4214 -17600 8940 34000 22266 3016 843 -614 -1996 12872 28539 17673 -4350 -7028
1782 -7028 2412 5579 6955 10247 4722 -8258 -13206 -1793 14690 20050 6247 -13152 -14253 3243
1796 3243 15888 14625 13014 12848 510 -12718 -164 23318 22645 1096 -7170 -1571 -352 2872
1810 2872 13211 10347 -12149 -22801 -7341 7433 5361 3564 4945 -7214 -23135 -13066 15539
1823 15539 22860 2178 -11228 -3421 4347 1223 3924 12774 5584 -14157 -17422 2205 14787
1836 14787 5044 -7915 -12933 -17752 -19053 -2573 13973 3604 -18759 -18541 -5016 -6893 -9089
$$ packed form
1744a8272L8645Q930k3318k578Q956j7067j0184L0511J9892k5419j9925J3916
1756D087o20j9290J4157L2637j5101m0733O307L5161l31j9734Q405J0970k0129
1769d214j3386K6540K5060j1734j9250k173j457j382J4868J5667j0866k2023k678
1782g028R440L167J376L292n525j2980m948J1413J6483N360j3803j9399j101J7496
1796C243J2645j263j611j66j2338j3228J2554K3482o73k1549q266N599J219L224
1810B872J0339k864k2496j0652J5460J4774k072j797J381j2159j5921J0069K8605
1823A5539P321k0682j3406P807P768l124K701Q850p190j9741l265J9627J2582
1836A4787r743j2959n018m819j301J6480J6546j0369k2363K18J3525j877k196
$$ plain form
1849 -9089 8576 14673 -11967 -28228 -1719 22999 8277 -11530 -6021 -2711 -15161 -11353 13012
1862 13012 16258 -9984 -25277 -17608 -10863 -7160 4488 6029 -14174 -27335 -12839 3986 3228
1875 3228 -2545 -4452 -9629 -13174 -3283 11338 14439 4667 -11950 -22586 -11214 14484 19284 -2356
1889 -2356 -14823 -8333 -9426 -16361 -1312 17389 -389 -29502 -20570 7714 8224 -2501 3181
1902 3181 -426 -21825 -16042 20533 27610 -221 -7497 5542 -3649 -17144 8044 33888 8795
1915 8795 -25543 -12722 12498 4141 -7251 5636 5819 -17446 -18171 8983 17345 2193 -1701
1928 -1701 717 -10658 -11622 14266 29708 11253 -6889 -1759 4363 2704 8596 17874 9814 -6033
1942 -6033 -8527 234 9212 15488 8620 -12150 -20531 -2475 14480 10455 6669 8214 -4911 -20918
$$ packed form
1849i089J7665O097k6640j6261K6509K4718j4722j9807N509L310j2450L808K4365
1862A3012L246k6242j5293P669O745L703J1648J541k0203j3161J4496J6825p58
1875C228n773j907n177l545R891J4621L101r772j6617j0636J1372K5698M800k1640
1889b356j2467O490j093o935J5049J8701j7778k9113Q932K8284N10j0725N682
1902C181l607k1399N783L6575P077k7831p276J3039r191j3495K5188K5844k5093
1915H795l4338J2821K5220q357j1392J2887J83k3265p25K7154Q362j5152l894
1928a701K418j1375r64K5888J5442j8455j8142N130O122j659N892R278q060j5847
1942f033k494Q761Q978O276o868k0770q381J8056J6955m025l786J545j3125j6007
$$ plain form
1956 -20918 -3602 27734 24971 400 -3319 3702 -814 3437 26188 23804 -10603 -21335 6864
1969 6864 20036 5219 3888 13294 -5699 -30953 -9904 30045 23862 -9053 -13784 14 -542
1982 -542 -1413 15274 20596 -567 -13255 288 14405 15010 12765 7841 -6621 -15102 1029 19906
1996 19906 16706 -718 -8328 -7459 -7342 -3283 7079 11178 1291 -12005 -13028 283 12963 10316
2010 10316 -1477 -6546 -2531 1247 5432 13001 14151 401 -13326 -9081 3665 9585 8302 3989
2024 3989 -6740 -16500 -11207 5562 8564 -4554 -11653 -6932 -4888 -6218 2046 11956 2662 -16666
2038 -16666 -17521 2207 15715 10052 -672 -4743 -7422 -9176 -2201 9125 7387 -6567 -13580 -9353
2052 -9353 -5880 -2675 3028 316 -16365 -23644 -5765 10976 2836 -10495 -6016 -1346 -12974 -13724
$$ packed form
1956b0918J7316L1336k763k4571l719P021m516M251K2751k384l4407j0732K8199
1969F864J3172j4817j331R406j8993k5254K1049L9949o183l2915m731J3798n56
1982e42q71J6687N322k1163j2688J3543J4117O05k245m924j4462q481J6131J8877
1996A9906l200j7424p610Q69J17M059J0362M099r887j3296j023J3311J2680k647
2010A0316j1793n069M015L778M185P569J150j3750j3727M245J2746N920j283m313
2024C989j0729r760N293J6769L002j3118p099M721K044j330Q264R910r294j9328
2038a6666q55J9728J3508n663j0724m071k679j754O975J1326j738j3954p013M227
2052i353L473L205N703k712j6681p279J7879J6741q140j3331M479M670j1628p50
$$ plain form
2066 -13724 8327 19007 -1061 -17902 -8262 3788 -423 -3036 2234 -2460 -13534 -11152 -1086
2079 -1086 275 -3364 -3889 -10139 -19720 -12672 5875 8871 -4849 -11160 -6977 -6709 -6142 3915 10340
2094 10340 1383 -7994 -6626 -2860 1486 8886 6533 -9985 -17122 -3701 7144 2279 -946 -52
2108 -52 -9995 -19903 -7428 12092 9460 -3951 -4878 -4348 -9955 -1233 18507 14609 -9705 -11362 7517
2123 7517 10060 554 7739 14981 -5204 -20896 -1897 20210 12861 -2423 -3177 -4971 -10940 -951
2137 -951 15865 10609 -5551 -4107 3410 -769 2292 18705 17026 -7702 -13013 9342 21544 11790
2151 11790 5990 6675 -974 -7618 2974 15466 13240 5019 -1105 -8081 -6722 9469 18418 4478
2165 4478 -8960 -2023 6576 3615 6864 17178 10373 -8964 -8360 10600 17598 12163 10393 5402
$$ packed form
2066a3724K2051J0680k0068j6841R640J2050m211k613N270m694j1074K382J0066
2079a086J361l639n25o250r581P048J8547K996j3720o311M183K68N67J0057O425
2094A0340q957r377J368L766M346P400k353j6518p137J3421J0845m865l225Q94
2108e2r943r908J2475J9520k632j3411r27N30n607Q722J9740l898k4314j657J8879
2123G517K543r506P185P242k0185j5692J8999K2107p349j5284p54j794n969R989
2137i51J6816n256j6160J444P517m179L061J6413j679k4728n311K2355J2202r754
2151A1790n800O85p649o644J0592J2492k226q221o124o976J359J6191Q949j3940
2165D478j3438O937Q599k961L249J0314o805j9337O04J8960O998n435j770m991
$$ plain form
2179 5402 -7834 -7685 11147 18059 4488 -3464 1166 -1809 -6956 4458 16701 4698 -13714
2192 -13714 -10419 4291 8773 7848 8863 1642 -10666 -7085 8528 13149 7016 5169 1863 -8434
2206 -8434 -9187 7492 16168 2670 -11611 -9955 -1678 1302 3038 3523 -3471 -12861 -12016 -3251 4762
2221 4762 8099 4635 -7199 -15672 -7792 7583 11175 1950 -4764 -4868 -5526 -4651 2738 7967 576
2236 576 -12413 -16723 -7358 3908 6486 -1932 -12109 -15880 -10909 -2587 3130 2983 -1464 -8630 -13450
2251 -13450 -8735 3751 10973 2471 -11045 -13099 -3082 5176 4854 1123 -4734 -12184 -14163 -5111
2265 -5111 5436 5863 -3137 -12512 -16944 -11902 1308 9391 1430 -11309 -11573 -4616 -172 3037 6679
2280 6679 1714 -9701 -12287 -772 9480 9306 2089 -7216 -13951 -9027 4770 9130 -522 -6679
$$ packed form
2179E402j3236J49J8832O912j3571p952M630k975n147J1414J2243j2003j8412
2192a3714L295J4710M482r25J015p221j2308L581J5613M621o133j847l306j0297
2206h434p53J6679Q676j3498j4281J656Q277K980J736M85o994r390Q45Q765Q013
2221D762L337l464j1834q473P880J5375L592r225o714j04o58Q75P389N229p391
2236E76j2989m310R365J1266K578q418j0177l771M971Q322N717j47m447p166m820
2251a3450M715J2486P222q502j3516k054J0017Q258l22l731n857p450j979R052
2265e111J0547M27r000r375m432N042J3210Q083p961j2739k64O957M444L209L642
2280F679m965j1415k586J1515J0252j74p217r305o735M924J3797M360r652o157
$$ plain form
2294 -6679 -5349 -8283 -10314 1886 12577 1872 -14753 -10834 3236 6517 4327 5890 805 -9518
2308 -9518 -6987 7352 11738 5289 3729 1080 -10293 -10802 8196 18305 1735 -12685 -5550 1624
2322 1624 -1894 1296 11097 3810 -11392 -10048 4193 9911 8948 9080 1047 -11221 -5978 13115
2336 13115 17310 5529 -556 1462 -2551 -3481 8858 16577 3948 -10005 -7324 872 5910 11021
2350 11021 8740 -5448 -13332 -874 11351 8562 5421 8842 1676 -11235 -3236 18056 19451
2363 19451 1998 -5262 76 2151 4363 12576 11542 -2860 -9626 -783 3975 3551 9161 10818
2377 10818 -5540 -17231 -2607 15771 11100 -3 940 2334 -4412 -1254 12818 15162 2131
2390 2131 -5895 -2050 2056 6153 11977 8791 -5972 -12594 -2721 7265 6831 3909 1726 -6390 -11712
$$ packed form
2294f679J330k934k031J2200J0691j0705j6625L919J4070L281k190J563n085j0323
2308i518K531J4339M386o449j560k649j1373n09J8998J0109j6570j4420P135P174
2322A624l518L190R801p287j5202J344J4241N718r63J32q033j2268N243J9093
2336A3115M195j1781o085K018m013r30J2339P719j2629j3953K681Q196N038N111
2350A1021k281j4188p884J2458J2225k789l141L421p166j2911P999K1292J395
2363A9451j7453p260N338K075K212Q213j034j4402o766Q843M758m24N610J657
2377A0818j6358j1691J4624J8378m671j1103R43J394o746L158J4072K344j3031
2390B131q026L845M106M097N824l186j4763o622R873R986m34k922k183q116n322
$$ plain form
2405 -11712 -3440 9057 10684 2055 -5987 -8961 -3804 7948 13864 4439 -7206 -7362 -1388 1347
2419 1347 5357 10945 4033 -12030 -15845 -2233 8791 6318 -1392 -7475 -11769 -8741 1613 6747
2433 6747 -18 -7072 -6865 -5796 -4696 2913 10371 2763 -13497 -14236 1021 8711 2055 -3457 -2874
2448 -2874 -4852 -10566 -7096 3727 4738 -5826 -12451 -9858 -4224 -762 1146 -2030 -8996 -11304
2462 -11304 -5898 380 702 232 534 -5307 -12593 -7887 5273 8634 -1716 -8831 -7021 -4668 -3967
2477 -3967 -348 2442 -2337 -10547 -11089 -4435 1256 2812 304 -7541 -12576 -7577 3184 6382 1927
2492 1927 -3199 -6003 -6223 -1576 5394 6036 1101 -3886 -6977 -5799 3156 10239 3729 -9571 -9955
2507 -9955 -594 3022 1226 3954 4329 -5484 -12097 -2046 10200 8559 1735 -309 -3038 -5148 4005
$$ packed form
2405a1712Q272J2497J627q629q042k974N157J1752N916r425j1645j56N974K735
2419A347M010N588o912j6063l815J3612J1024k473p710o083m294L028J0354N134
2433F747o765p054K07J069J100P609P458p608j6260p39J5257P690o656n512N83
2448b874j978n714L470J0823J011j0564o625K593N634L462J908l176o966k308
2462a1304N406O278L22m70L02n841p286M706J3160L361j0350p115J810K353P01
2477c967L619K790m779q210n42O654N691J556k508p845n035M999J0761L198m455
2492A927n126k804k20M647O970O42m935m987l091J178Q955P083o510j3300l84
2507i955R361L616j796K728L75r813o613J0051J2246j641o824k044k729k110R153
$$ plain form
2522 4005 14619 8038 -4528 -2175 5014 943 -331 11178 13789 -4390 -14505 516 13898
2535 13898 8037 28 2331 1351 -4633 -1008 10543 11267 3523 -709 -688 -233 6698 15365 10148 -3734
2551 -3734 -5140 4558 8573 6209 8326 7550 -2089 -7653 367 10721 11106 5052 -1267 -6244 -3657
2566 -3657 7681 13071 5482 -1818 -1101 -404 -782 7412 15197 7055 -6740 -6402 2849 7089 7813 8423
2582 8423 1616 -9831 -6943 6878 9673 1225 -975 210 -5325 -8321 3930 14849 4158 -11003
2596 -11003 -8855 1898 4453 3889 5907 940 -8108 -7971 1736 6455 4604 2176 -3178 -10471 -7845
2611 -7845 4881 10201 341 -10119 -8419 -2962 -1760 779 4411 731 -8469 -11792 -4988 4323
2625 4323 7501 1806 -7652 -10642 -4782 2029 3285 861 -1639 -5702 -9753 -5709 2786 6072 -667
$$ packed form
2522D005J0614o581j2566K353P189m071j274J1509K611j8179j0115J5021J3382
2535A3898n861q009K303r80n984L625J1551P24p744m232K1M55O931Q667n217j3882
2551c734j406R698M015k364K117p76r639n564Q020J0354L85o054o319m977K587
2566c657J1338N390p589p300P17O97l78Q194P785q142j3795L38R251M240P24O10
2582H423o807j1447K888J3821K795q448k200J185n535k996J2251J0919j0691j5161
2596a1003K148J0753K555n64K018m967r048J37R707M719j851k428n354p293K626
2611g845J2726N320r860j0460J700N457J202K539L632l680r200l323O804R311
2625D323L178n695r458k990N860O811J256k424k500m063m051M044Q495L286o739
$$ plain form
2640 -667 -9290 -11060 -6269 758 4675 1449 -6278 -10439 -6689 -1749 765 3206 2482 -5282 -12789
2655 -12789 -7739 5074 8599 -49 -8306 -8489 -5199 -1776 3154 5326 -1180 -11000 -11330 -3568 3145
2670 3145 4861 2433 -5641 -13313 -9211 4330 9422 749 -6482 -5682 -4180 -4017 2641 9314 3615
2685 3615 -9824 -12330 -1129 7229 5720 416 -4360 -8891 -6441 1840 6487 2505 -2314 -4559
2699 -4559 -6903 -4601 5227 10436 1776 -8449 -7477 845 4947 4989 3961 385 -5419 -4891 762 5606
2715 5606 6709 4428 -2309 -8882 -3839 7511 9499 1128 -2442 -866 -1755 -1840 5520 10335 3719
2730 3719 -4515 -4593 655 4950 9127 8676 -605 -7389 -1318 8151 7582 3816 4759 2243 -6194 -4018
2746 -4018 9629 14498 3578 -5373 -3375 920 4611 10009 9745 -41 -6278 -1013 5884 6909 8110
$$ packed form
2640f67q623j770M791P027L917l226p727m161L750M940K514K441p24p764p507
2655a2789N050J2813L525q648q257j83L290L423M930K172o506r820l30P762O713
2670C145J716k428q074p672M102J3541N092q673p231Q00J502J63O658O673n699
2685C615j3439k506J1201Q358j509n304m776m531K450Q281M647l982m819k245
2699d559k344K302R828N209q660j0225R72Q322M102M2j028l576n804N28N653M844
2715E606J103k281o737o573N043J1350J988q371l570J576q89q5P360M815o616
2730C719q234p8N248M295M177m51r281o784O071R469n69l766R43k516q437K176
2746d018J3647M869j0920q951J998M295L691N398k64r786o237N265O897J025J201
$$ plain form
2761 8110 8296 -264 -8965 -1984 12529 13312 2482 -2655 -1007 -401 2305 8520 9606 1527 -4141
2776 -4141 -2760 668 5786 10509 6922 -4216 -7950 882 8153 6308 2883 2422 -872 -4724 -1102
2791 -1102 7787 8660 1722 -3325 -4868 -2406 3613 8937 4749 -5035 -6905 -1223 1586 1544 4980 4659
2807 4659 -4490 -10910 -4068 6554 7569 780 -5033 -7117 -5464 645 6045 3233 -3105 -6613 -6641
2822 -6641 -4403 1464 7056 2944 -9125 -12841 -4100 4069 4153 -724 -5062 -7940 -7840 -2858 3177
2837 3177 3460 -1954 -8339 -10167 -5636 2342 5984 -749 -9669 -10356 -4084 564 619 174 -2224 -7417
2853 -7417 -10130 -4865 2944 4329 -1947 -8486 -9651 -4552 1367 3061 -832 -5528 -6274 -5272 -3257
2868 -3257 -161 3658 1229 -7120 -10662 -3914 3649 3277 -1207 -4365 -5576 -4851 -1653 2514 3474 -152
$$ packed form
2761H110J86q560q701O981J4513P83j0830n137J648O06K706O215J086q079n668
2776d141J381L428N118M723l587j1138l734Q832P271j845l425m61l294l852L622
2791a102Q889Q73o938n047j543K462O019N324m188r784j870N682K809m2L436l21
2807D659r149o420O842J0622J015o789n813k084J653O109N400k812o338l508k8
2822f641K238N867N592m112j2069l716Q741Q169Q4m877m338k878J00M982O035
2837C177K83n414o385j828M531P978L642o733q920o87O272M648N5m45k398n193
2853g417k713N265P809J385o276o539j165N099N919J694l893m696p46J002K015
2868c257L096L819k429q349l542O748P563l72m484l158j211P25L198M167R60l626
$$ plain form
2884 -152 -4838 -6528 -3986 1993 6879 3295 -5620 -8235 -1808 3387 2819 1962 1421 -2525 -6845 -2824
2900 -2824 5598 7671 2452 -3557 -5087 -2764 3908 8540 4836 -2535 -3544 -225 1425 2811 7166
2915 7166 6990 -2217 -7862 -979 8423 8685 2996 -573 -2209 -1767 2611 7729 6915 1925 -799 -1834
2931 -1834 -761 5051 10732 7557 -2799 -5605 1845 7381 6431 4930 3576 -954 -3429 1588 7560
2946 7560 8320 4631 211 -4522 -2936 6027 11646 5568 -2844 -2272 1566 2075 4099 8092 6259 -2491
2962 -2491 -5807 104 7207 8613 5165 -837 -5522 -2947 5268 8427 3677 118 -862 -3505 -3953
2977 -3953 4025 10801 4437 -6389 -6946 -189 4481 5308 4711 131 -5763 -4861 2180 5679 4070 2122
2993 2122 -1688 -7394 -5690 4635 9769 1987 -6892 -6194 -1831 -73 2073 4113 794 -6279 -7605
$$ packed form
2884a52m686j690K542N979M886l584q915k615O427N195n68q57n41l946m320M021
2900b824Q422K073n219o009j530K323O672M632l704p371j009L319J650J386M355
2915G166j76r207n645O883R402K62n689l569j636M42M378N118q14m990k724j035
2931a834J073N812N681l175j0356k806P450N536r50j501j354m530k475N017N972
2946G560P60l689m420m733J586Q963N619o078q412N72L838N09K024L993j833q750
2962b491l316N911P103J406l448o002m685K575Q215L159m750l559r80k643m48
2977c953P978O776o364j0826n57O757M670Q27n97m580n894R02P041L499j609j948
2993B122l810n706J704J0325N134p782q879O98M363J758K146K040l319p073j326
$$ plain form
3008 -7605 -2157 3337 5000 1963 -4626 -9165 -4968 3753 5407 475 -3383 -4395 -5206 -3817 1885
3023 1885 5810 868 -6933 -8850 -4328 1880 4620 1345 -5950 -8609 -5096 -67 1635 1468 8
3038 8 -4607 -9060 -6038 3218 6695 278 -6880 -7876 -4414 190 2825 1716 -3091 -6898 -6605 -3522
3054 -3522 1075 3897 1495 -6232 -11225 -5604 3601 4774 -618 -5218 -5288 -4817 -2912 2188 4758 612
3070 612 -6394 -8123 -3326 3269 5364 1370 -5538 -8175 -4145 1852 3839 1177 -1898 -4769 -6473
3085 -6473 -4402 2522 6912 2092 -6268 -8017 -2020 3928 4852 2191 -1811 -4235 -3177 228 3675
3100 3675 5210 2818 -3021 -6782 -2974 5607 8109 1575 -4141 -4193 -1298 1225 3977 4972 2096 -3392
3116 -3392 -3910 -389 5018 7652 5195 -2224 -5610 -85 7343 7271 3174 1018 133 -2159 -939 5976
$$ packed form
3008g605N448N494J663l037o589m539M197Q721J654m932l858j012q11J389N702
3023A885L925m942p801j917M522O208K740l275p295k659L513N029J702j67j460
3038Hm615m453L022R256L477o417p158r96L462M604K635j109m807l807K93L083
3054c522M597K822k402p727m993N621R205J173n392m600p0M71J905N100K570m146
3070F12p006j729M797O595K095l994o908k637M030N997J987k662l075k871j704
3085f473K071O924M390m820q360j749N997N948R24k661m002k424J058L405L447
3100C675J535k392n839l761L808Q581K502o534n716n2K895K523K752R95k876n488
3116c392n18L521N407K634k457p419l386N525P428p2m097k156q85k292J220O915
$$ plain form
3132 5976 9765 3804 -3433 -3637 737 5344 7589 5589 -656 -4148 140 5062 5554 5152 5032 910
3148 910 -4254 -787 8030 10692 3891 -1984 -1336 1545 3690 5779 5721 2050 -1803 -1631 1256 4022
3164 4022 7116 5264 -1932 -5946 -370 7111 6935 2534 555 -242 -1802 264 5106 7162 3632
3179 3632 -1462 -3912 -1948 3611 7944 4428 -3361 -5223 -513 1857 1565 3156 3355 -2414 -7733
3194 -7733 -3836 4737 6249 1526 -2990 -5211 -3852 1218 5517 2829 -2327 -4098 -3224 -2552 583
3209 583 5025 2948 -6121 -9891 -3711 3295 3402 -1083 -3981 -6361 -6559 -2037 2542 2020 -2083 -5054
3225 -5054 -6843 -5217 547 5595 900 -6809 -8412 -3337 1133 1284 -166 -1833 -5699 -7757 -4676
3240 -4676 595 2732 -437 -5950 -9250 -6260 851 2899 -1395 -5328 -5116 -3984 -3312 -498 3201
$$ packed form
3132E976L789n961p237k04M374M607K245k000o245l492M288M922M92m02j20m122
3148I10n164L467Q817K662o801n875O48K881K145K089n8l671l853J72K887K766
3164D022L094j852p196m014N576P481j76m401j979p97j560K066M842K056l530
3179C632n094k450J964N559M333l516p789j862M710K370k92J591J99n769n319
3194g733L897Q573J512m723m516k221J359N070M299k688n156j771Q74O72L135
3209E83M442k077r069l770O180P006J07m485k898k380j98M522M579n22m103k971
3225e054j789J626N764N048m695p709j603N075M470J51j450j667l866k058L081
3240d676N271K137l169n513l300K990P111K048m294l933K12J132O72K814L699
$$ plain form
3255 3201 915 -5216 -8000 -3994 2167 4038 323 -4778 -6516 -4753 -763 1546 853 -1547 -3944
3270 -3944 -6275 -4777 1263 5186 1296 -5974 -7218 -2435 2648 3474 1872 -781 -3149 -4436 -1557
3285 -1557 3766 5333 2337 -3083 -5566 -2899 3203 6162 2369 -3107 -4198 -1694 844 2473 3770
3300 3770 2778 -2246 -5018 -1258 4976 7264 3501 -1425 -3132 -705 3814 6268 4243 1337 -616
3315 -616 -1195 -199 3235 6961 5273 -2191 -4905 -594 5229 5991 3466 -28 -1750 -1238 1637 4772
3331 4772 6045 4610 1102 -3174 -1811 5307 9644 5259 -1880 -2258 1633 3288 3519 5288 4502 -1373
3347 -1373 -4510 -603 5198 6945 3892 -904 -4464 -2592 3716 7360 3965 60 -735 -580 -560 3162
3363 3162 7920 5365 -2655 -5349 -332 4979 6024 3516 -891 -3984 -3109 1179 4308 3816 1414
$$ packed form
3255C201k286o131k784M006O161J871l715n101j738J763L990K309o93k400k397
3270c944k331J498O040L923l890p270j244M783N083Q26j602k653k368j287K879
3285a557N323J567k996n420k483K667O102K959l793n476j091K504K538J629J297
3300C770r92n024k772L760O234K288l763m926j707K427M519K454k025k906j953
3315f16n79R96L434L726j688p464k714M311N823P62k525l494j722N12K875L135
3331D772J273j435l508m276J363P118M337m385p139l78L891J655K31J769p86n875
3347a373l137L907N801J747l053m796l560J872O308L644l395l905p95J55K0L722
3363C162M758k555q020k694N017N311J045k508m407l093Q75M288L129m92k402
$$ plain form
3378 1414 -1800 -5095 -3821 3365 7662 2705 -3850 -4838 -1296 2425 4341 4029 401 -3784 -3917 -363
3394 -363 2839 4323 2894 -2839 -7527 -4387 3351 5343 98 -3757 -4068 -3438 -2303 1676 3632 462
3410 462 -4706 -5830 -2743 1786 4674 2349 -3884 -7108 -2876 2288 2500 -186 -453 -2583 -6251 -5316
3426 -5316 1232 4829 14 -6348 -7145 -3744 147 1923 908 -2877 -5696 -4813 -2262 450 2597
3441 2597 2443 -3382 -8118 -4910 2410 4215 337 -3813 -5151 -4198 -1694 911 2033 -993 -4858
3456 -4858 -7261 -4499 372 4205 1551 -5351 -8109 -4094 1690 2803 875 -1367 -3448 -4973 -2422
3471 -2422 2569 5130 1203 -4532 -6517 -3096 2082 4713 1174 -3846 -5632 -3366 -203 1463 2312
3486 2312 1468 -3176 -6060 -3425 3591 5828 1808 -2888 -3360 -603 2326 3948 3017 613 -1419 -2180
$$ packed form
3378A414l214l295J274P186M297m957o555r88L542L721J916l12l628m185j33L554
3394c63L202J484j429n733m688L140P738J992n245l855l11O30J135L979J956l170
3410D62n168j124L087M529K888k325o233l224M232N164K12k686k67k130l668R35
3426e316O548L597m815o362p97L401L891J776j015l785k819Q83K551K712K147
3441B597j54n825m736L208P320J805l878m150j338R53K504K605J122l026l865
3456d858k403K762M871L833k654o902k758M015N784J113j928k242k081j525K551
3471b422M991K561l927n735j985L421N178K631l539n020j786K266L163J666Q49
3486B312q44m644k884K635P016K237m020m696m72K757K929J622r31k404k032p61
$$ plain form
3502 -2180 -653 3086 5381 3679 -2272 -5496 -1716 3903 5281 1539 -488 -903 -1185 -121 3204
3517 3204 5939 4204 -859 -2864 -9 5088 7272 4781 10 -2052 339 3634 4907 4793 3583
3532 3583 5 -3069 -1428 4533 7502 4167 -1403 -2654 -347 3726 6001 4847 890 -717 379
3547 379 1799 4343 6591 5777 -308 -4051 151 6345 7152 2058 -384 -890 -393 1149 3806 4748
3563 4748 1958 -1533 -2557 -1243 2707 6251 3736 -2193 -4083 160 3810 3138 1933 2496 118
3578 118 -3079 -1895 3131 5357 2167 -1904 -3367 -2523 753 3338 1881 -2124 -3306 -2187 -1581 -331
3594 -331 2343 2477 -2627 -6522 -3385 2062 3693 1388 -1962 -4116 -3769 -623 2132 1736 -342 -2786
3610 -2786 -4758 -4946 -709 3944 1776 -5270 -8257 -4272 -244 513 -121 -1524 -4874 -5775 -3889 477
$$ packed form
3502b180J527L739K295j702n951l224L780N619J378l742k027m15k82J064L325
3517C204K735j735n063k005K855N097K184k491m771k062K391L295J273j14j210
3532C583l578l074J641N961K969l335n570j251K307M073K275j154l957j607J096
3547C79J420K544K248q14o085l743M202O194Q07n094k442n06M97J542K657R42
3563D748k790l491j024J314L950L544k515n929j890M243L650o72j205N63k378
3578A18l197J184N026K226l190m071j463Q44L276K585j457m005j182J119O06J250
3594c31K674J34n104l895L137N447J631k305l350k154L47L146K755l96k078k444
3610b786j972j88M237M653k168p046k987L985M028P57o34j403l350r01J886M366
$$ plain form
3626 477 2452 445 -2893 -6312 -5041 822 3973 597 -4481 -5564 -3250 -1572 -722 896 265 -4446
3642 -4446 -7203 -4888 568 2412 559 -3859 -6746 -4410 385 1910 64 -1427 -2444 -3683 -3387
3657 -3387 480 4535 2412 -3650 -6017 -2570 1641 2889 1118 -1280 -3774 -4284 -1810 1169 2459
3672 2459 1640 -2293 -5363 -3697 1713 5064 2530 -2240 -3653 -1553 708 2722 3365 2112 -1744
3687 -1744 -3550 -1667 2533 5361 3708 -1324 -4628 -2636 2439 4553 2343 -391 -1736 -1664 -992 2082
3703 2082 5097 4123 -1187 -4120 -965 3961 6148 3756 401 -1952 -1092 1747 4403 4449 2822 399
3719 399 -2430 -2097 2845 6497 4236 -1590 -3966 -784 3354 4101 3019 2207 -88 -1833 -517 3502
3735 3502 6288 4806 221 -3012 -1365 4104 6226 3164 -192 -791 -766 209 2490 5080 3748 -1364
$$ packed form
3626D77J975k007l338l419J271N863L151l376n078j083K314J678Q50J618o31m711
3642d446k757K315N456J844j853m418k887K336M795J525j846j491j017j239K96
3657c387L867M055k123o062k367L447M211J248j771k398k494n10K474K979J290
3672B459q19l933l070J666N410L351k534m770j413K100K261K014O43j253l856
3687a744j806J883M200K828j653n032l304J992N075K114k210k734j345P2O72L074
3703B082L015r74n310k933L155M926K187k392l355k353Q60K839K656M6j627k423
3719C99k829L33M942L652k261n826k376L182M138P47j082q12k295j745J316M019
3735C502K786j482m585l233J647N469K122l062l356n99K5R75K281K590j332n112
$$ plain form
3751 -1364 -3988 -1450 3081 5384 3899 -436 -3348 -1552 1992 4251 3575 2057 470 -2087 -2063 2933
3767 2933 6540 4006 -1422 -3847 -1291 2376 3821 2934 257 -2670 -2890 -835 2011 3290 2991 -988
3783 -988 -4849 -3368 2552 5789 2194 -2291 -2865 -1069 131 1875 3472 1631 -2275 -4268 -2498
3798 -2498 1245 3698 2542 -2531 -6041 -3826 1240 2737 592 -1645 -2686 -3630 -3542 668 3729 1634
3814 1634 -3643 -5524 -3084 1208 3239 1178 -2585 -4716 -3406 -1218 141 971 803 -2806 -6788
3829 -6788 -4828 532 3018 243 -4332 -5349 -3427 -1476 763 1315 -1000 -4206 -4674 -2944 -228
3844 -228 2725 2062 -3069 -6332 -3849 756 2077 -216 -2635 -3516 -3878 -3185 54 1826 300 -3862
3860 -3862 -5729 -4108 185 2854 1461 -3057 -4648 -2721 -86 987 1685 925 -1595 -4255 -3016
$$ packed form
3751a364k624K538M531K303j485m335k912J796L544K259o76j518j587k557K4M996
3767B933L607k534n428k425K556L667J445q87k677k927k20K055K846J279k99l979
3783i88l861J481N920L237l595m485n74J796J200J744J597j841l906j993J770
3798b498L743K453j156n073l510K215N066J497k145k237j041r44Q8M210L061k095
3814A634n277j881K440M292K031k061l763k131J310K188J359Q30j68l609l982
3829f788J960N360K486k775m575j017J922J951K239N52k315l206m68J730K716
3844b28K953o63n131l263K483M605J321k293k419q81l62O93L239J772j526m162
3860c862j867J621M293K669j393m518j591J927K635J073O98p60k520k660J239
$$ plain form
3875 -3016 1499 4042 1830 -2584 -4283 -2515 889 2798 1579 -1077 -2715 -2558 -1511 914 3980
3890 3980 3415 -898 -4507 -2020 2827 4729 2367 -216 -1584 -1326 635 3219 4049 2625 -60 -2301
3906 -2301 -1480 2499 5501 3566 -1043 -3338 -539 3098 3721 2829 2177 663 -1490 -574 3543 6363
3922 6363 4175 -20 -1705 -215 3501 5537 3776 797 -775 -18 1094 2950 4228 3657 356
3937 356 -2926 -1048 3756 5486 3169 -295 -1715 -153 1784 3652 3664 2317 210 -1382 -646 2680
3953 2680 5417 4136 -701 -2786 -900 2536 3740 2208 887 -460 -1800 -670 1991 3587 2633
3968 2633 -917 -3431 -2400 1734 4196 2717 -1179 -2327 -1022 206 1264 2199 2236 -843 -3862 -3046
3984 -3046 1345 3465 1345 -1813 -3722 -2754 -143 1686 1027 -726 -2340 -3533 -2859 -504 2630 2246
$$ packed form
3875c016M515K543k212m414j699J768L404J909j219k656j638J57J047K425L066
3890C980n65m313l609K487M847J902k362k583j368K58J961K584Q30j424k685k241
3906b301Q21L979L002j935m609k295K799L637O23q92o52j514k153R16M117K820
3922F363k188m195j685J490L716K036j761k979j572P57J112J856J278n71l301
3937C56l282J878M804J730k317l464j420J562J937J868J2j347k107j592P36L326
3953B680K737j281m837k085J886L436J204j532j321j347j340J130K661J596r54
3968B633l550k514J031M134K462j479l896j148J305J228J058R35L7l079l019Q16
3984c046M391K120k120l158j909R68K611J829o59j753j614j193O74K355L134l84
$$ plain form
4000 2246 -2441 -5022 -2965 621 2051 850 -1409 -2625 -3393 -2236 -121 1324 455 -2365 -4756
$$ packed form
4000B246m687k581K057L586J430j201k259j216p68J157K115J445q69k820k391
$$ [...]
8191e2
##END NTUPLES=NMR FID
##END=
