##TITLE=1H_LacPbMe-C2-f4
 CDCl3, 8 sc, 
 17.9.2019
##JCAMPDX= 6.0         $$ Bruker NMR JCAMP-DX V2.0
##DATA TYPE= NMR FID
##DATA CLASS= NTUPLES
##ORIGIN= UXNMR, Bruker Analytische Messtechnik GmbH
##OWNER= root
$$ XWIN-NMR		Version 3.5
$$ Tue Sep 17 15:55:12 2019 Russian Standard Time (UT+4h)  she@DPX200
##.OBSERVE FREQUENCY= 200.1315
##.OBSERVE NUCLEUS= ^1H
##.DELAY= (6, 6)
##.ACQUISITION MODE= SIMULTANEOUS
##.ACQUISITION SCHEME= undefined
##.AVERAGES= 8
##.DIGITISER RES= 18
##SPECTROMETER/DATA SYSTEM= spect
##.PULSE SEQUENCE= zg30
##.SOLVENT NAME= CDCl3
##.SHIFT REFERENCE= (INTERNAL, CDCl3, 0, 15.7039)
##AUDIT TRAIL= $$ (NUMBER, WHEN, WHO, WHERE, WHAT)
$$ ##TITLE= Audit trail, XWIN-NMR		Version 3.5
$$ ##JCAMPDX= 5.01
$$ ##ORIGIN= Bruker BioSpin GmbH
$$ ##OWNER= she
$$ F:/spectra/data/she/nmr/H-F/1/audita.txt
$$ ##AUDIT TRAIL=  $$ (NUMBER, WHEN, WHO, WHERE, WHAT)
(   1,<2019-09-17 15:54:12.42 +0400>,<she>,<DPX200>,
      <created by zg, POWCHK disabled, PULCHK disabled
       configuration hash MD5:
       00 E9 B6 7A A2 85 ED C7 34 08 36 98 17 FE 4E 26
       data hash MD5: 16K
       C9 A4 BF 72 77 15 9A B8 A9 61 20 9F 72 D7 B7 F9>)
$$ ##END=
$$ 
$$ hash MD5
$$ A2 96 58 07 4E 1C DA 92 39 57 E5 D4 58 AD 0E 04
##$RELAX= 
##$RELAX= 
##$RELAX= 
##$RELAX= 
##$RELAX= 
##$RELAX= 
$$ Bruker specific parameters
$$ --------------------------
##$DU= <F:/spectra>
##$EXPNO= 1
##$NAME= <H-F>
##$PROCNO= 1
##$TYPE= <nmr>
##$USER= <she>
##$AMP= (0..31)
100 100 100 100 100 100 100 100 100 100 100 100 100 100 100 100 100 100 
100 100 100 100 100 100 100 100 100 100 100 100 100 100 
##$AQSEQ= 0
##$AQ_mod= 1
##$AUNM= <au_zg>
##$AUTOPOS= <>
##$BF1= 200.13
##$BF2= 200.13
##$BF3= 200.13
##$BF4= 200.13
##$BF5= 200.13
##$BF6= 200.13
##$BF7= 200.13
##$BF8= 200.13
##$BYTORDA= 1
##$CFDGTYP= 0
##$CFRGTYP= 5
##$CHEMSTR= <none>
##$CNST= (0..31)
1 1 145 1 1 1 1 1 1 1 1 1 1 1 1 1 1 1 1 1 1 1 1 1 1 1 1 1 1 1 1 1 
##$CPDPRG= <>
##$CPDPRG1= <>
##$CPDPRG2= <>
##$CPDPRG3= <>
##$CPDPRG4= <mlev>
##$CPDPRG5= <mlev>
##$CPDPRG6= <mlev>
##$CPDPRG7= <mlev>
##$CPDPRG8= <mlev>
##$CPDPRGB= <>
##$CPDPRGT= <>
##$D= (0..31)
0 1.2 0 0 0 0 0 0 0 0 0 0.03 0 0 0 0 0 0 0 0 0 0 0 0 0 0 0 0 0 0 0 0 
##$DATE= 1568721252
##$DBL= (0..7)
120 120 120 120 120 120 120 120 
##$DBP= (0..7)
150 150 150 150 150 150 150 150 
##$DBP07= 0
##$DBPNAM0= <>
##$DBPNAM1= <>
##$DBPNAM2= <>
##$DBPNAM3= <>
##$DBPNAM4= <>
##$DBPNAM5= <>
##$DBPNAM6= <>
##$DBPNAM7= <>
##$DBPOAL= (0..7)
0.5 0.5 0.5 0.5 0.5 0.5 0.5 0.5 
##$DBPOFFS= (0..7)
0 0 0 0 0 0 0 0 
##$DE= 6
##$DECBNUC= <off>
##$DECIM= 24
##$DECNUC= <off>
##$DECSTAT= 4
##$DIGMOD= 1
##$DIGTYP= 9
##$DL= (0..7)
0 120 120 120 120 120 120 120 
##$DP= (0..7)
150 150 150 150 150 150 150 150 
##$DP07= 0
##$DPNAME0= <>
##$DPNAME1= <>
##$DPNAME2= <>
##$DPNAME3= <>
##$DPNAME4= <>
##$DPNAME5= <>
##$DPNAME6= <>
##$DPNAME7= <>
##$DPOAL= (0..7)
0.5 0.5 0.5 0.5 0.5 0.5 0.5 0.5 
##$DPOFFS= (0..7)
0 0 0 0 0 0 0 0 
##$DQDMODE= 0
##$DR= 18
##$DS= 0
##$DSLIST= <SSSSSSSSSSSSSSS>
##$DSPFIRM= 0
$$ [...]
##$SUBNAM2= <"">
##$SUBNAM3= <"">
##$SUBNAM4= <"">
##$SUBNAM5= <"">
##$SUBNAM6= <"">
##$SUBNAM7= <"">
##$SUBNAM8= <"">
##$SUBNAM9= <"">
##$SW= 24.0689530833862
##$SWIBOX= (0..15)
0 0 2 0 0 0 0 0 0 0 0 0 0 0 0 0 
##$SW_h= 4816.95568400771
##$TD= 16384
##$TD0= 1
##$TE= 0
##$TE2= 300
##$TE3= 300
##$TEG= 300
##$TL= (0..7)
0 120 120 120 120 120 120 120 
##$TP= (0..7)
150 150 150 150 150 150 150 150 
##$TP07= 0
##$TPNAME0= <>
##$TPNAME1= <>
##$TPNAME2= <>
##$TPNAME3= <>
##$TPNAME4= <>
##$TPNAME5= <>
##$TPNAME6= <>
##$TPNAME7= <>
##$TPOAL= (0..7)
0.5 0.5 0.5 0.5 0.5 0.5 0.5 0.5 
##$TPOFFS= (0..7)
0 0 0 0 0 0 0 0 
##$TUNHIN= 0
##$TUNHOUT= 0
##$TUNXOUT= 0
##$USERA1= <user>
##$USERA2= <user>
##$USERA3= <user>
##$USERA4= <user>
##$USERA5= <user>
##$V9= 5
##$VALIST= <valist>
##$VCLIST= <CCCCCCCCCCCCCCC>
##$VD= 0
##$VDLIST= <DDDDDDDDDDDDDDD>
##$VPLIST= <PPPPPPPPPPPPPPP>
##$VTLIST= <TTTTTTTTTTTTTTT>
##$WBST= 1024
##$WBSW= 4
##$XGAIN= (0..3)
0 0 0 0 
##$XL= 0
##$YL= 0
##$YMAX_a= 366752
##$YMIN_a= -584200
##$ZGOPTNS= <>
##$ZL1= 120
##$ZL2= 120
##$ZL3= 120
##$ZL4= 120
##$ABSF1= 10
##$ABSF2= 0
##$ABSG= 5
##$ABSL= 3
##$ALPHA= 0
##$AQORDER= 0
##$ASSFAC= 0
##$ASSFACI= 0
##$ASSFACX= 0
##$ASSWID= 0
##$AUNMP= <proc_1d>
##$AZFE= 0.1
##$AZFW= 0.1
##$BCFW= 1
##$BC_mod= 2
##$BYTORDP= 1
##$COROFFS= 0
##$CY= 11.3945322036743
##$DATMOD= 1
##$DC= 2
##$DFILT= <>
##$DTYPP= 0
##$F1P= 20.1720416913024
##$F2P= 0.152960286110954
##$FCOR= 0.5
##$FTSIZE= 0
##$FT_mod= 4
##$GAMMA= 1
##$GB= 0.15
##$INTBC= 1
##$INTSCL= 1
##$ISEN= 128
##$LB= 0.24
##$LEV0= 0
##$LPBIN= 0
##$MAXI= 10000
##$MC2= 0
##$MEAN= 0
##$ME_mod= 0
##$MI= 1.114404
##$NCOEF= 0
##$NC_proc= 0
##$NLEV= 6
##$NOISF1= 3.799351
##$NOISF2= 2.8
##$NSP= 1
##$NTH_PI= 0
##$NZP= 0
##$OFFSET= 15.70392
##$PC= 1
##$PHC0= -9581.083
##$PHC1= 23.40096
##$PH_mod= 1
##$PKNL= yes
##$PPARMOD= 0
##$PSCAL= 0
##$PSIGN= 0
##$REVERSE= no
##$SF= 200.130013532006
##$SI= 16384
##$SIGF1= 3
##$SIGF2= 2
##$SINO= 400
##$SIOLD= 16384
##$SREGLST= <1H.CDCl3>
##$SSB= 0
##$STSI= 0
##$STSR= 0
##$SW_p= 3612.71676300578
##$SYMM= 0
##$S_DEV= 0
##$TDeff= 0
##$TDoff= 0
##$TI= <>
##$TILT= no
##$TM1= 0
##$TM2= 0
##$TOPLEV= 0
##$USERP1= <user>
##$USERP2= <user>
##$USERP3= <user>
##$USERP4= <user>
##$USERP5= <user>
##$WDW= 1
##$XDIM= 8192
##$YMAX_p= 0
##$YMIN_p= 0
$$ End of Bruker specific parameters
$$ ---------------------------------
##NTUPLES= NMR FID
##VAR_NAME=  TIME,          FID/REAL,        FID/IMAG
##SYMBOL=    X,             R,               I
##VAR_TYPE=  INDEPENDENT,   DEPENDENT,       DEPENDENT
##VAR_FORM=  AFFN,          ASDF,            ASDF
##VAR_DIM=   8192,          8192,            8192
##UNITS=     SECONDS,       ARBITRARY UNITS, ARBITRARY UNITS
##FACTOR=    0.0002076,     1,               1
##FIRST=     0,             0,               0
##LAST=      1.7004516,     0,               0
##MIN=       0,             -584200,         0
##MAX=       1.7004516,     366752,          0
$$ Real data points
##PAGE= N=1
##DATA TABLE= (X++(R..R)), XYDATA
$$ [...]
$$ plain form
2754 644 429 -1014 794 1219 -2591 -3789 302 2735 -667 -2828 -388 -109 -2048 -1270 2009 693
2770 693 -3254 -2174 1449 1239 -2543 -1322 997 -376 -1998 369 2081 -925 -3414 32 2351
2785 2351 105 -2291 -662 521 -1173 -360 2398 1430 -2769 -2689 1188 2111 13 228 1204 -1070 -2564
2802 -2564 777 4466 1530 -2348 -1670 1037 454 792 2457 1831 -2805 -2672 2082 3602 410 -462
2818 -462 907 356 -1489 795 4035 1767 -2408 -1348 1998 1838 -379 1391 1645 -972 -1248 1521
2834 1521 2971 -421 -1290 1158 1579 -616 -291 2317 1290 -1773 -316 2458 1027 -2064 -490 2308
2850 2308 942 -1246 201 1671 -621 -1686 1089 2599 -777 -2407 133 728 -306 -216 1661 -251
2866 -251 -3498 -1378 2290 1535 -1814 -1407 140 -1096 -1999 966 2590 -913 -3977 -997 1826 427
$$ packed form
2754F44k15j443J808M25l810j198M091K433l402k161K440K79j939P78L279j316
2770F93l947J080L623k10l782J221K319j373j622K367J712l006k489L446K319
2785B351k246k396J629J183j694Q13K758r68m199Q0L877R23k098K15R76k274j494
2802b564L341L689k936l878O78K707n83L38J665o26m636J33M754J520l192q72
2818d62J369n51j845K284L240k268m175J060L346j60k217J770K54k617k76K769
2834A521J450l392q69K448M21k195L25K608j027l063J457K774j431l091J574K798
2850B308j366k188J447J470k292j065K775J510l376j630K540N95j034R0J877j912
2866b51l247K120L668p55l349M07J547j236r03K965J624l503l064K980K823j399
$$ plain form
2882 427 -983 125 -499 -2756 -1849 1686 1526 -1723 -2287 131 -131 -1946 91 1736 -708 -3449
2898 -3449 -1110 1559 -112 -2023 -401 1183 -1076 -2121 336 1500 -1167 -1549 932 1471 -1708
2913 -1708 -1815 1170 891 -1082 -97 1570 -64 -2636 -212 2934 1161 -1945 -1397 368 -446 -503 2102
2930 2102 2305 -1053 -3231 -107 2631 1641 976 762 -1180 -2641 379 4133 3061 -1113 -1587 22
2946 22 449 314 2902 2929 -1202 -3768 -844 3260 2766 969 156 -1273 -2353 -386 3909 3901 -446 -2323
2964 -2323 -849 -70 1018 3013 3277 -603 -3605 -1356 2243 2964 1138 214 -978 -2635 -1630 2485
2980 2485 3690 941 -1857 -1879 -1444 -137 2252 2908 460 -3586 -3193 443 2165 1490 982 -354 -3486
2997 -3486 -4118 529 3920 2179 -1747 -2916 -2495 -1638 856 3549 1677 -3267 -4746 -1567 1266 2078
$$ packed form
2882D27j410J108o24k257R07L535j60l249n64K418k62j815K037J645k444k741
2898c449K339K669j671j911J622J584k259j045K457J164k667l82K481N39l179
2913a708j07K985k79j973R85J667j634k572K424L146j773l106N48J765q14n7K605
2930B102K03l358k178L124K738r90o65k14j942j461L020L754j072m174m74J609
2946B2M27j35K588K7m131k566K924M104m94j797q13j429j080J967M295qm347j877
2964b323J474P79J088J995K64l880l002K249L599P21j826r24j192j657J005M115
2980B485J205k749k798k2M35J307K389O56k448m046L93L636J722o75n08j336l132
2997c486o32M647L391j741l926j169M21Q57K494K693j872m944j479L179K833Q12
$$ plain form
3013 2078 1964 -418 -4031 -4831 -697 3808 3194 -687 -3032 -3460 -2393 183 3925 3241 -1874 -4996
3029 -4996 -3536 404 2644 2751 1031 -2869 -5329 -2395 2847 4257 1033 -2167 -3202 -2882 -226
3044 -226 3795 4565 12 -4350 -3568 153 2991 3415 2242 -1274 -4212 -2728 1998 4751 3261 -517
3060 -517 -2908 -3175 -1012 2907 4899 2061 -2749 -3937 -1094 2026 3640 3477 234 -2590 -3670 523
3076 523 4248 4074 1184 -1506 -2653 -1650 1931 4530 3262 -825 -3371 -2161 897 2981 3666 1983
3092 1983 -2032 -4188 -1492 2777 3881 2005 -634 -2714 -2932 -299 3310 3854 976 -2644 -3073 -1157
3108 -1157 1820 3404 2395 -1054 -3627 -2682 338 2684 2156 244 -2127 -3762 -1938 1402 3507
3123 3507 1345 -1679 -3030 -2720 -560 1922 2796 470 -2850 -3402 -1508 1151 2892 1402 -1031 -3389
$$ packed form
3013B078j14k382l613q00M134M505o14l881k345m28J067K576L742o84n115l122
3029d996J460L940K240J07j720l900k460K934N242J410l224l200j035L20K656
3044b26M021P70m553m362P82L721K838M24j173l516k938J484M726K753j490l778
3060e17k391k67K163L919J992k838m810j188K843L120J614j63l243k824j080M193
3076E23L725j74k890k690j147J003L581K599j268m087k546J210L058K084O85j683
3092A983m015k156K696M269J104j876k639k080k18K633L609N44k878l620m29J916
3108a157K977J584j009l449k573R45L020K346n28j912k371j635J824L340K105
3123C507k162l024j351L10K160K482Q74k326l320n52J894K659J741j490k433k358
$$ plain form
3139 -3389 -3165 -354 2220 1901 -392 -2766 -3118 -1908 73 2239 1765 -1129 -3677 -2966 -147 2010
3155 2010 2423 843 -2267 -3719 -2049 1408 2804 1806 -550 -2331 -2628 -1187 1973 3144 848 -2478
3171 -2478 -2862 -1458 1118 2359 2034 -137 -2716 -2635 99 2759 3115 1183 -1387 -2649 -1475 1759
3187 1759 3724 2845 -58 -2187 -1730 -124 1980 3703 2077 -1018 -3209 -1591 2126 3564 2307
3202 2307 278 -1745 -2465 -71 2818 3802 1887 -1362 -2251 -1289 1621 3523 3527 251 -2818 -2766 402
3219 402 3029 3063 1385 -1252 -2932 -2115 1299 3757 2941 -578 -3019 -2840 -303 2712 3575 1017 -2375
3236 -2375 -3579 -1206 1433 3061 2453 -323 -3209 -3279 -66 3394 3297 363 -2912 -3616 -1953 1570
3252 1570 3506 1840 -1677 -3922 -2986 -389 2409 2875 109 -3049 -4645 -1663 2105 2852 693 -1848
$$ packed form
3139c389K24K811K574l19k293k374l52J210J981K166m74k894k548P11K819K157
3155B010M13j580l110j452J670L457J396r98k356j781k97J441L160J171k296l326
3171b478l84J404K576J241l25k171k579Q1K734K660L56j932k570j262J174L234
3187A759J965q79k903k129M57J606K104J723j626l095k191J618L717J438j257
3202B307k029k023p20K394K889R84j915l249q89R62K910J902Ml276l069N2L168
3219D02K627L4j678k637j680Q17L414K458q16l519k441J79K537L015Q63k558l392
3236b375j204K373K639J628o08k776k886p0L213L460r7k934l275p04J663L523
3252A570J936j666l517k245R36K597K798M66k766l158j596K982L768P47k159k541
$$ plain form
3268 -1848 -2983 -2751 -76 2771 2839 -426 -3585 -3530 -602 1620 2408 946 -1882 -3935 -2295 1255
3284 1255 2580 1388 -424 -2341 -3103 -1277 2134 3357 389 -2619 -3023 -792 533 1552 2286 219
3300 219 -2783 -2715 434 2512 2111 531 -914 -2243 -1802 1262 3553 1868 -1353 -2120 -1120 -187 1523
3317 1523 2986 1784 -1433 -2859 -544 2650 2091 1384 577 -839 -1803 324 3234 3160 399 -1423
3333 -1423 -1181 -368 1106 2950 2151 -1011 -2785 -895 2000 2313 1183 406 -891 -2473 -785 2891
3349 2891 3011 307 -1822 -885 -455 304 1800 2148 -112 -2676 -1421 1514 1678 439 -199 -544 -1585
3366 -1585 -1338 1347 2245 -636 -2474 -944 303 -231 -179 864 59 -2342 -1430 956 650 -1017 -826
3383 -826 -154 -844 -1225 207 1038 -746 -1937 24 724 -1131 -2160 -98 717 -947 -1247 161 300
$$ packed form
3268a848j135K32K675K847O8l265l159N5K928K222P88j462k828k053J640L550
3284A255J325j192j812j917p62J826L411J223k968l008m04K231J325J019P34k067
3300B19l002O8L149K078m01j580j445j329M41L064K291j685l221p67J000R33J710
3317A523J463j202l217j426K315L194n59p07q07j416r64K127K910p4k761j822
3333a423K42Q13J474J844p99l162j774J890K895L13j130p77j297j582J688L676
3349B891J20k704k129R37M30P59J496L48k260k564J255K935J64j239o38l45j041
3366a585K47K685Q98k881j838J530J247n34N2J043q05k401R12K386l06j667J91
3383h26O72o90l81J432Q31j784j191J961P00j855j029K062Q15j664l00J408J39
$$ plain form
3400 300 -1669 -1463 793 421 -1325 -1099 673 -218 -869 615 1259 -875 -2106 61 1265 9 -1060
3417 -1060 297 312 -1352 -1020 1420 1399 -1554 -1561 681 944 -381 140 1353 -222 -1621 458 2415
3434 2415 573 -1349 150 1608 234 -626 1010 1825 -956 -1417 1335 1895 -289 -894 1096 1108 -483
3451 -483 322 1721 308 -1818 95 2421 1162 -904 -96 1535 377 -389 1773 2340 -1029 -2399
3467 -2399 1121 2724 718 -569 624 194 -1356 44 2904 1473 -1790 -1929 766 1092 101 1003
3483 1003 1174 -1370 -2697 855 3409 674 -2058 -630 299 -1067 -382 2240 1190 -1958 -2472 631
3499 631 1807 -296 -689 261 -718 -2034 -28 2016 -65 -2134 -1099 584 -207 -1077 832 538 -1919
3516 -1919 -2355 1154 1541 -1253 -1942 490 717 -1455 -1208 770 -204 -2222 -861 1399 -126 -2333
$$ packed form
3400C00j969K06K256l72j746K26J772q91o51J484O44k134j231K167J204j256j069
3417a060J357J5j664L32K440k1k953pK242K63j325N21J213j575j399K079J957
3434B415j842j922J499J458j374q60J636Q15k781m61K752N60k184o05J990J2j591
3451d83Q05J399j413k126J913K326j259k066Q08J631j158p66K162N67l369j370
3467b399L520J603k006j287J193m30j550J400K860j431l263j39K695L26r91R02
3483A003J71k544j327L552K554k735k732J428R29j366O85K622j050l148n14L103
3499F31J176k103l93R50r79j316K006K044k081k069J035J683p91q70J909k94k457
3516a919m36L509L87k794o89K432K27k172K47J978r74k018J361K260j525k207
$$ plain form
3532 -2333 -1247 900 -305 -1050 567 518 -1916 -2120 1229 2360 -183 -2170 -343 237 -542 317 2133
3549 2133 581 -2444 -1668 1395 1622 -46 15 349 -1724 -1513 1788 2936 58 -2030 -741 681
3565 681 211 424 2643 1030 -2069 -1769 1399 2554 236 80 699 -185 -1133 875 3026 1078 -1569
3582 -1569 -690 591 294 347 1682 1784 -988 -1944 420 1961 303 120 1041 349 -1899 -901 1945
3599 1945 2281 -52 -723 -20 -627 -975 1597 2692 488 -2118 -1458 568 605 795 1754 295 -2625
3616 -2625 -2817 751 2715 1221 -659 -1299 -1997 -1967 847 3270 1538 -2447 -3283 -1231 514 1461 2092
3633 2092 609 -2894 -3944 -539 2811 2246 -401 -1862 -2498 -2447 245 2832 1921 -2068 -3890 -2363
3649 -2363 75 1709 2076 365 -2768 -4212 -1358 2565 2630 341 -1295 -2427 -2810 -365 3005 2895
$$ packed form
3532b333J086K147j205p45J617m9k434k04L349J131k543j987J827N80p79Q59J816
3549B133j552l025P76L063K27j668O1L34k073K11L301J148k878k088J289J422
3565F81m70K13K219j613l099L00L168J155k318j56O19q84r48K008K151j948k647
3582a569Q79J281k97N3J335J02k772r56K364J541j658j83R21o92k248R98K846
3599A945L36k333o71P03o07l48K572J095k204k606O60K026L7J90R59j459k920
3616b625j92L568J964j494j880o40o98L0K814K423j732l985q36K052J745R47O31
3633B092j483l503j050L405L350n65k647j461o36N1K692K587r11l989j822J527
3649b363K438J634L67j711l133j444K854L923O5k289j636j132l83K445L370j10
$$ plain form
3665 2895 -614 -3662 -2531 -296 1249 2046 1713 -883 -3368 -2109 1277 2927 1724 -423 -1863
3680 -1863 -2692 -649 2368 3704 1170 -1700 -2182 -1024 768 2187 3143 771 -2689 -2801 112 2847
3696 2847 2809 1172 -801 -2342 -1584 1348 3527 2600 -322 -1771 -1785 48 2384 3592 1773 -1591
3712 -1591 -2628 -654 2042 3038 1991 25 -2060 -2241 294 3137 3122 758 -1983 -2188 -706 1889
3728 1889 2948 2127 -671 -2561 -1753 647 2384 2135 481 -1593 -3029 -1281 1857 2942 1205 -1249
3744 -1249 -2251 -1414 168 1915 1927 147 -2274 -2691 -1021 1275 1961 675 -1014 -2581 -2272 99
3760 99 1921 1472 -472 -2027 -2091 -1346 622 1908 1079 -1084 -2366 -1731 -149 1818 1019 -429 -1779
3777 -1779 -2364 -1206 564 1454 754 -1074 -2291 -1963 23 1427 1416 -100 -2192 -2120 -627 794 1733
$$ packed form
3665B895l509l048J131K235J545P97l33k596k485J259L386J650j203k147j440
3680a863q29K043L017J336k534k870m82J158J792J419R56k372l460j12K913K735
3696B847l8j637j973j541P58K932K179r27k922j449j4J833K336J208j819l364
3712a591j037J974K696R96j047j966k085j81K535K843j5k364k741k05J482K595
3728A889J059q21k798j890Q08K400J737k49j654k074j436J748L138J085j737k454
3744a249j002Q37J582J747J2j780k421m17J670K296O86j286j689j567L09K371
3760I9J822m49j944j555o4P45J968J286q29k163j282O35J582J967p99j448j350
3777a779n85J158J770Q90p00j828j217L28J986J404j1j516k092P2J493J421R39
$$ plain form
3794 1733 894 -631 -1893 -1586 39 2110 1872 388 -1724 -1733 -446 1073 1753 876 -522 -1467 -1378 21
3812 21 1697 1936 673 -1329 -1662 -647 1379 2223 1592 -218 -1573 -973 676 1795 2099 1147 -558
3829 -558 -1450 -764 1527 2374 1553 -442 -1252 -1210 366 1728 2023 844 -822 -1382 -447 1297 2214 1767
3847 1767 -461 -1744 -1149 579 2001 2244 407 -1006 -1729 -1118 844 2432 1683 -400 -2172 -1690
3863 -1690 291 1853 1869 382 -1159 -2157 -857 1106 1727 958 -864 -1962 -1808 -117 1789 1784 8
3880 8 -2000 -2390 -785 1050 1758 718 -1040 -2537 -2238 247 2193 1459 -707 -1992 -2155 -781 782
3897 782 1597 764 -1589 -2713 -1833 159 1605 1093 -163 -2002 -2327 -565 1570 2010 84 -1363 -1896
3914 -1896 -1238 200 1909 1804 -598 -2254 -2199 -24 1585 1958 442 -1004 -2225 -1209 911 1966
$$ packed form
3794A733q39j525j262L07J625K071k38j484k112rJ287J519O80q77j398r45Q9J399
3812B1J676K39j263k002l33J015K026Q44o31j810j355O00J649J119L04r52j705
3829e58q92O86K291Q47q21j995q10M2J576J362K95j179j666n60R35J744R17m47
3847A767k228j283N95J728J422K43j837j413p23O11J962J588p49k083j772M82
3863a690J981J562J6j487j541r98J300J963O21p69j822j098J54J691J906nj776
3880Hk008l90J605J835P08j040j758j497K99K485J946p34k166j285j63J374J563
3897G82Q15q33k353j124Q80J992J446n12j256j839l25J762K135M40j926j447n33
3914a896O58J438J709j05k402j656N5K175J609L73j516j446j221J016K120J055
$$ plain form
3930 1966 1043 -238 -1518 -1398 -48 1951 2297 736 -1586 -1818 145 1393 2113 1287 -260 -1685
3946 -1685 -1178 503 2240 1794 118 -1060 -1220 -382 1580 2519 1215 -1065 -1389 167 1314 1273 1370
3963 1370 218 -1056 -1605 512 2283 1927 276 -812 -608 -384 587 1963 1429 -838 -1365 -203 655
3980 655 750 898 1008 -628 -1708 -106 1469 1228 -201 -374 -215 -546 -799 735 1318 -209 -1332 -480
3998 -480 408 108 -73 565 -38 -1383 -1353 609 605 -270 -900 196 -560 -1266 -235 1012 91 -1563 -882
4017 -882 134 -230 -555 444 362 -760 -1373 -454 649 -235 -904 -103 -480 -1167 -686 857 391 -1118 -1080
4036 -1080 -13 164 -475 140 811 -419 -1550 -266 1129 31 -799 -407 260 -349 -506 1110 631
4053 631 -923 -1164 748 953 -68 -519 458 -44 -925 376 1856 737 -1405 -495 1041 926 -37
$$ packed form
3930A966r23j281j280J20J350J999L46j561k322k32J963J248P20q26j547j425
3946a685N07J681J737m46j676j178j60Q38J962R39j304k280l24J556J147m1R7
3963A370j152j274n49K117J771l56j651j088K04K24R71J376n34k267n27J162Q58
3980F55R5J48J10j636j080J602J575k41j429j73J59l31k53J534N83j527j123Q52
3998d80Q88l00j81O38o03j345L0J962mq75o30J096p56p06J031J247r21j654O81
4017h82J016l64l25R99q2j122o13R19J103q84o69Q01l77o87M81J543m66j509L8
4036a080J067J77o39O15O71j230j131J284J395j098q30L92O67o09j57J616m79
4053F31j554k41J912K05j021m51R77n02q81J301J480j119k142R10J536j15r63
$$ plain form
4070 -37 509 710 -785 -868 1116 2231 191 -841 136 442 -27 506 1714 337 -1690 -775 1643 1729
4088 1729 -283 -205 398 -181 -552 982 2230 398 -1149 -420 1409 701 269 1210 550 -1205 -488 1654
4106 1654 1619 -210 -676 503 69 -916 536 2004 173 -1489 -559 1317 306 -730 286 1014 -729
4123 -729 -1009 451 829 -742 -1207 276 680 -1084 -1002 498 349 -785 -624 857 -339 -1941 -537
4140 -537 1572 115 -1450 -927 -39 -720 -506 955 562 -1575 -2081 163 974 30 -173 99 -971 -2223
4158 -2223 -253 1988 1182 -1769 -1607 -98 -50 -306 574 1093 -1006 -2163 -310 1689 641 -699 -274
4175 -274 -69 -1226 -364 1604 1462 -1079 -1645 155 673 10 788 1467 -120 -1585 -427 1746 1099
4192 1099 -632 119 659 -294 -783 851 1480 -66 -581 845 567 -796 190 1921 1421 -384 -593
$$ packed form
4070c7N46K01j495q3J984J115k040j032R77L06m69N33J208j377k027R15K418Q6
4088A729k012P8O03n79l71J534J248j832j547P29J829p08m32R41o60j755P17K142
4106A654l5j829m66J179m34r85J452J468j831j662R30J876j011j036J016P28j743
4123g29k80J460L78j571m65J483M04j764Q2J500j49j134J61J481j196j602J404
4140e37K109j457j565N23Q88o81K14J461l93k137n06K244Q11r44k03K72j070j252
4158b223J970K241q06k951J62J509M8k56Q80N19k099j157J853J999j048j340M25
4175b74K05j157Q62J968j42k541n66J800N18o63P78O79j587j465J158K173o47
4192A099j731P51N40r53m89J634O29j546n15J426k78j363R86J731n00j805k09
$$ plain form
4209 -593 843 760 -253 982 2071 410 -1764 -479 1465 1515 338 567 -33 -1113 -626 1583 2497
4226 2497 288 -1102 -531 -191 -86 1551 2407 -138 -2295 -1548 1214 2031 783 -103 -451 -1580 -1332
4243 -1332 1465 2781 612 -1957 -1729 -688 445 1230 1763 -99 -2501 -2080 744 1759 763 -225
4259 -225 -577 -2027 -1811 850 2600 833 -1858 -1987 -668 -233 638 1490 346 -2275 -2611 -339 1308
4276 1308 790 64 -443 -1711 -2101 -153 2049 942 -655 -1494 -1141 -1113 148 1377 1404 -940 -2482
4293 -2482 -1292 732 1008 720 458 -1325 -2264 -1221 1007 2142 544 -1022 -1364 -1474 -524 1690 2432
4310 2432 97 -2349 -2074 377 1392 1586 1389 -98 -2103 -1945 1246 2887 1925 -214 -1423 -1907
4326 -1907 -131 1465 2947 1212 -1704 -1995 -406 1246 1966 1934 207 -1932 -2118 405 2940 2320
$$ packed form
4209e93J436q3j013J235J089j661k174J285J944N0j177K29o00j080M87K209R14
4226B497k209j390N71L40J05J637Q56k545k157P47K762Q17j248q86l48j129K48
4243a332K797J316k169k569K28J041J133P85N33j862k402M21K824J015r96r88
4259b25l52j450K16K661J750j767k691j29J319M35Q71Q52j144k621l36K272J647
4276A308n18p26n07j268l90J948K202j107j597q39L53K8J261J229K7k344j542
4293b482J190K024K76k88k62j783r39J043K228J135j598j566l42j10R50K214P42
4310B432k335k446K75K451J015J94j97j487k005J58L191J641r62k139j209m84
4326a907J776J596J482j735k916k91J589J652P20l2j727k139j86K523K535o20
$$ plain form
4342 2320 30 -951 -1771 -606 1414 2786 1492 -898 -1934 -745 922 1620 1908 743 -1559 -2201
4358 -2201 -325 1896 2039 624 -806 -1162 -1370 26 1717 1878 -185 -1653 -1299 11 1010 1569 872
4375 872 -777 -2155 -1433 689 1544 911 -243 -1334 -1870 -1142 1001 1550 399 -1325 -1912 -925 42
4392 42 1244 1310 -113 -2021 -2330 -497 764 1107 573 -810 -2179 -1747 392 1314 992 -1119 -1523 -1586
4410 -1586 -950 663 1387 810 -1108 -2418 -1168 566 1267 973 -157 -1320 -1644 -8 969 1381 231
4427 231 -945 -1449 -1024 217 1441 1273 -497 -1335 -1290 156 866 1131 566 -439 -1187 -664 984 1552
4445 1552 1013 -206 -955 -994 -49 1289 1470 872 -362 -748 -452 150 1490 1510 628 -1017 -1096 -8 1388
4464 1388 1507 779 -132 -1029 -804 486 1579 1669 256 -601 -1183 -362 1000 1426 1034 -545 -1162 -488
$$ packed form
4342B320k290r81q20J165K020J372j294k390j036J189J667O98K88j165k302o42
4358b201J876K221J43j415j430l56k08J396J691J61k063j468L54J310R99N59o97
4375H72j649j378P22K122Q55o33j154j091n36P28K143N49j151j724n87R87R67
4392D2J202O6j423j908l09J833J261L43n34j383j369M32K139R22l22k111m04o3
4410a586O36J613P24n77j918j310J250J734P01k94j130j163l24J636R77M12j150
4427B31j176n04M25J241J224j68j770q38M5J446P10K65n65j005p48N23J648N68
4445A552n39j219p49l9R45J338J81n98j234l86K96O02J340K0q82j645p9J088J396
4464A388J19p28r11q97K25J290J093R0j413q57n82Q21J362M26l92j579o17O74
$$ plain form
4482 -488 590 1209 1188 447 -761 -1268 -480 845 1872 864 -568 -1128 -1059 219 1124 1150 -68 -1364
4500 -1364 -1199 -658 754 1427 517 -589 -1648 -1176 157 1203 1030 -480 -1157 -1525 -873 409 1216
4517 1216 962 -1070 -1643 -1061 -182 1269 780 -463 -1744 -1709 -504 757 790 193 -883 -1371 -1448 -192
4535 -192 1314 697 -663 -1611 -1579 -394 539 1065 27 -1103 -1863 -1015 480 1273 970 -494 -1339 -1436
4553 -1436 -260 1130 1162 281 -837 -1369 -400 635 1151 1112 -36 -1088 -984 595 1529 935 235 -785
4571 -785 -1076 -448 787 1677 602 -371 -779 -315 742 1046 1359 456 -1168 -848 -99 1296 1441 278
4589 278 -248 -541 -556 557 1516 1035 132 -750 -328 259 908 1460 716 -99 -880 -192 798 949 204 -33
4609 -33 -455 -831 -137 1077 1114 430 -707 -489 95 574 340 750 -122 -1370 -596 319 868 211 -56 -691
$$ packed form
4482d88J078O19k1p41j208n07P88J325J027j008j432n60O9J278R05K6j218j296
4500a364J65N41J412O73r10j106j059M72J333J046j73j510o77l68O52J282Q07
4517A216k54k032n73N82Q79J451m89j243j281L5J205J261L3n97j076m88p7J256
4535a92J506o17j360r48L2J185R33N26j038j130p60Q48J495P93l03j464q45r7
4553a436J176J390L2q81j118n32R69J035N16l9j148j052J04J579R34n94p00j020
4571g85k91O28J235Q90j075r73m08M64J057L04L13r03j624L20P49J395J45j163
4589B78n26k93j5J113R59m81r03q82M22N87O49N52p44q15p81O88R90J51p45k37
4609c3m22l76O94J214L7o84j137K18N84M79k34M10q72j248P74R15N49o57k67o35
$$ plain form
4629 -691 -756 -612 179 830 -99 -769 -803 -147 34 -25 409 -277 -1049 -1123 138 564 -301 -647 -628 -843 -484
4650 -484 90 453 -99 -1020 -696 48 125 -390 30 -81 -934 -1070 302 720 73 -887 -376 -268 -559 -345
4670 -345 207 -78 -596 -653 -30 338 -161 -275 -134 -446 -593 747 976 -435 -845 -87 225 -107 -73 529
4690 529 45 -419 -399 468 963 157 -246 -203 70 -523 602 968 249 -647 47 628 187 348 506 293
4710 293 -341 -233 557 837 313 -117 321 332 -57 312 963 430 -459 -83 622 178 239 638 1065 -97
4730 -97 -803 685 809 352 -185 170 408 -458 -466 766 983 -216 -584 141 -12 14 552 1012 -126 -1235
4750 -1235 -316 724 177 -220 187 -29 -1026 -860 660 959 -527 -1090 -699 -32 -163 3 823 -124 -1472
4769 -1472 -1213 387 563 159 -267 -371 -1200 -737 549 1326 -47 -1488 -928 -381 -403 99 601 -188 -1528
$$ packed form
4629f91o5J44P91O51r29o70l4O56J81n9M34o86p72p4J261M26q65l46J9k15L59
4650d84N74L63n52r21L24P44P7n15M20j11q53j36J372M18o47r60N11J08k91K14
4670c45N52k85n18n7O23L68m99j14J41l12j47J340K29j411m10P58L12l32L4O02
4690E29m84m64K0Q67M95q06m03M3K73n93J125L66p19q96O94N81m41J61J58k13
4710B93o34J08P90K80n24m30M38J1l89L69O51n33q89L76P05m44O1L99M27j162
4730i7p06J488J24m57n37L55K38q66qJ232K17j199l68P25j53K6N38M60j138j109
4750a235R19J040n47l97M07k16r97J66J520K99j486n63L91O67j31J66Q20r47j348
4769a472K59J600J76m04m26j04q29M63J286P77j373j441N60N47k2N02N02p89j340
$$ plain form
4788 -1528 -1357 449 765 43 -529 -439 -501 -549 -139 811 -127 -1010 -544 47 -48 -106 581 333 -708 -736 338
4809 338 495 -509 -289 588 333 -764 -171 1054 646 -216 313 666 -219 -539 281 1074 337 -292 -121
4828 -121 183 -384 85 1420 943 -984 -1106 371 1203 865 478 740 -439 -1255 472 1732 1151 -317
4846 -317 -846 -270 -306 612 1409 1078 -605 -1383 57 1409 805 303 345 -477 -1215 15 2067 1270 -364
4865 -364 -1223 -417 52 51 1273 1072 -544 -1737 95 915 778 -38 93 -342 -1132 -746 855 1058 -173
4884 -173 -1089 -319 -543 -1015 366 1073 312 -1584 -1216 -39 13 -36 580 116 -1261 -1536 -140 1302 336
4903 336 -114 -162 -846 -1544 -364 1507 1028 -897 -1867 -889 -62 210 860 831 -868 -2196 -843 1129
4921 1129 1168 454 -508 -1480 -1744 -412 1879 1688 -433 -1423 -1249 -33 396 1330 1383 -448 -2426 -1474
$$ packed form
4788a528J71J806L16p22n72R0o2m8M10R50r38q83M66N91r5n8O87k48j041k8J074
4809C38J57j004K20Q77k55j097N93J225m08q62N29L53q85l20Q20P93p37o29J71
4828a21L04n67M69J335m77j927j22J477Q32l38l87K62j179q16J727J260n81j468
4846c17n29N76l6R18P97l31j683p78J440J352o04n02M2q22p38J230K052p97j634
4865c64q59Q06M69jJ222k01j616j193J832Q20j37q16J31m35p90L86J601K03j231
4884a73r16P70k24m72J381P07p61j896L68J177N2m9O16m64j377k75J396J442r66
4903C36m50m8o84o98J180J871m79j925r70R78Q27K72O50k9j699j328J353J972
4921A129L9p14r62r72k64J332K291j91k121r90J74J216M29R34N3j831j978R52
$$ plain form
4939 -1474 1298 2133 728 -240 -1042 -1785 -641 1637 2212 283 -1671 -1313 17 676 1416 1493 -13
4956 -13 -2232 -1173 1246 2093 904 225 -173 -1160 -869 1088 2171 1021 -1034 -1125 -210 380 1172 1478
4974 1478 612 -1205 -1214 114 1318 1214 628 346 -495 -1015 397 1946 1707 -309 -767 -763 -560 445 1471
4993 1471 1360 -749 -1765 -745 410 948 960 469 -507 -1522 -863 1309 1197 508 -1279 -1117 -1214 -662
5011 -662 863 1688 -109 -1874 -1692 -222 789 742 454 -588 -1670 -1409 328 1565 574 -634 -1062
5028 -1062 -1147 -655 803 1363 423 -1379 -1646 -468 420 566 765 77 -1287 -1473 -453 1371 759 -242
5046 -242 -1154 -1049 -754 278 1236 1033 -750 -1371 -636 -50 415 764 442 -315 -1381 -698 579 930 223
5065 223 -55 -359 -926 -230 800 1607 345 -734 -626 35 490 660 922 194 -919 -994 307 1104 737
$$ packed form
4939a474K772Q35j405r68q02p43J144K278N75j929j954L58J330O59P40P7j506
4956a3k219J059K419Q47j189o79l98r87K91J957J083j150k055r1R15N90P92L06
4974A478q66j817rJ328J204j04n86k82q41n20J412J549k39k016m58MK03J005J026
4993A471j11k109j016J020J155N38J2m91r76j015O59K172j12o89j787J62r7N52
5011f62J525Q25j797j765J82J470J011m7k88j042j082K61J737J237r91j208m28
5028a062q5M92J458N60r40j802k67J178Q88J46J99o88j364j86J020J824o12j001
5046b42r12J05K95J032R58k03j783o21P35N86M65L49l22p57j066O83J277L51p07
5065B23k78l04n67O96J030Q07j262j079J08O61M55J70K62p28j113p5J301P97l67
$$ plain form
5084 737 468 -158 -116 -547 263 1149 908 61 -818 -318 138 839 1004 753 -231 -617 -407 540 780 972
5104 972 465 -128 -817 -12 914 1016 406 -638 -359 -159 109 913 795 -135 -1250 -604 346 640 508
5123 508 395 -256 -694 -464 408 827 565 -602 -955 -605 -377 274 662 71 -689 -1172 -433 230 534 283
5143 283 60 -801 -878 -360 525 714 60 -772 -934 -1008 55 688 473 -342 -1174 -830 -553 121 315 174
5163 174 -863 -1032 -620 186 810 167 -214 -434 -635 -102 615 823 194 -772 -1218 -375 224 762 533 -180
5183 -180 -1096 -469 168 800 782 35 -660 -784 -383 134 827 640 -408 -858 -522 292 771 675 192 -382
5203 -382 -598 -142 769 1055 295 -258 -115 -400 381 1283 825 67 -447 -225 409 862 928 478 -238 -657
5223 -657 -289 337 1079 803 -78 -336 -166 17 679 973 212 -374 -523 -4 574 603 576 -370 -259 -107 276
$$ packed form
5084G37k69o26M2m31Q10Q86k41q47q79N00M56P01J65k51r84l86K10R47K40J92
5104I72n07n93o89Q05R26J02o10j044K79K00K68Q04j18r30j115O46R50K94j32
5123E08j13o51m38K30Q72M19k62j167l53L50K28O51L88n91p60m83P39O63L04k51
5143B83k23q61p7N18Q85J89o54q32j62p4J063O33k15q15q32L44K77O74J94j41
5163A74j037j69M12Q06O24o43l81k20k01N33P17K08o29r66m46Q43N99N38k29p13
5183a80r16O27O37O32j8p47o95j24M01N17O93j87j048m50L36Q14M79r6m83n74
5203c82k16M56R11K86p60n53J43k85P81R02m58p58n14K22O34M53O6m50p16m19
5223f57L68O26P42k76q81k58J70J83O62K94p61n86j49N19N78K9k7r46J11J52L83
$$ plain form
5244 276 939 587 88 -482 -393 -44 222 446 130 -311 -648 -250 143 404 -103 -46 -726 -859 62 313 445
5265 445 -334 -528 -566 -358 139 441 -33 -580 -1004 -673 17 108 569 -228 -849 -733 -147 106 -5 -199 -321
5286 -321 -580 -724 11 30 -155 -628 -750 -288 23 75 189 -190 -543 -404 -371 -9 2 -233 -362 -152 -458
5307 -458 -62 343 -25 -263 -231 86 326 313 113 218 -1 11 -22 410 396 -44 120 -152 -17 495 480 -123
5329 -123 -492 -35 260 560 121 -29 203 -37 -510 478 590 477 329 -304 154 -15 423 486 455 -236 -364
5350 -364 -172 254 639 451 287 -491 -696 477 1068 657 -93 -280 -187 -70 330 607 347 -231 -698 -293
5370 -293 403 508 363 273 -308 -672 50 548 713 -590 -532 -331 -101 37 760 473 -656 -1349 -365 425
5390 425 564 193 79 -740 -785 -186 632 475 -155 -567 -465 -331 -265 434 533 -441 -981 -497 31 -100 -345
$$ packed form
5244B76O63l52m99n70Q9L49K66K24l16m41l37L98L93K61n07N7o80j33R21K51J32
5265D45p79j94l8K08M97L02m74n47m24L31O90R1M61p97o21J16N86K53j11j94j22
5286c21k59j44P35J9j85m73j22M62L11N2J14l79l53J39L3L62J1k35j29K10l06
5307d58L96M05l68k38L2L17K40j3k00J05k19J2l3M32j4m40J64k72J35N12j5o03
5329a23l69M57K95L00m39j50K32k40m73R88J12j13j48o33M58j69M38O3l1o91j28
5350c64J92M26L85j88j64p78k05J173N91m11p50j87R3J17M00K77k60n78m67M05
5370b93O96J05j45r0n81l64P22M98J65j303N8K01K30J38P23k87j129o93R84P90
5390D25J39l71j14q19m5N99Q18j57o30m12J02J34O6O99R9r74n40M84N28j31k45
$$ plain form
5411 -345 -26 -26 -703 -566 383 518 -69 -177 -83 -612 -511 -40 371 187 -642 -492 5 -318 -243 456 701
5432 701 -679 -878 91 498 557 62 147 -14 -951 -203 826 940 -11 -301 -340 -5 48 942 938 -221 -1278
5453 -1278 -526 509 806 390 175 79 -273 -404 815 1339 332 -664 -337 129 -15 404 1154 266 -1069
5472 -1069 -478 686 1152 332 -12 284 -613 -549 827 1471 297 -533 -334 127 -250 184 1086 411 -376
5491 -376 -700 242 587 150 38 483 -43 -924 1 609 331 -134 242 -21 -412 -348 646 841 82 -927
5511 -927 -297 -188 -7 315 823 12 -1130 -904 20 554 376 363 -101 -1353 -1317 67 1017 318 -1069
5530 -1069 -728 -568 -549 482 1092 504 -1511 -1657 -307 757 569 -112 -381 -1350 -1472 125 1541 1085
5548 1085 -738 -1423 -603 -547 279 1333 681 -1201 -1774 -438 1006 786 309 159 -423 -1199 -53 1517
$$ packed form
5411c45L19%o77J37R49J35n87j08R4n29J01M71M11j84q29J50M97l23P5O99K45
5432G01j380j99R69M07N9m95Q5j61r37P48J029J14r51k90l9L35N3Q94mj159j057
5453a278P52J035K97m16k15r6l52j31J219N24j007r96L27M66j44M19P50q88j335
5472a069N91J164M66q20l44K96q97O4J376O44j174q30J99M61l77M34R02o75p87
5491c76l24R42L45m37j12M45n26q81R25O08k78m65L76k63l91O4R94J95p59j009
5511i27O30J09J81L22N08q11j142K26R24N34j78j3m64j252L6J384R50o99j387
5530a069L41J60J9J031O10n88k015j46J350J064j88o81k69r69j22J597J416m56
5548A085j823o85Q20N6Q26J054o52j882n73J336J444k20m77j50n82p76J146J570
$$ plain form
5566 1517 871 -251 -1099 -357 -304 67 901 1225 -171 -1702 -282 811 764 170 448 -95 -812 -932 807
5585 807 1378 475 -355 -71 -251 -434 561 1737 708 -594 -1041 114 395 612 1113 653 -315 -1079 438
5604 438 1210 1435 -94 -138 -321 -687 61 1547 1474 -510 -1424 -404 411 611 744 708 -738 -1808 -424
5623 -424 1476 1416 78 -414 -1145 -1222 -248 1664 1324 -340 -1455 -1081 280 592 728 631 -577 -1771
5641 -1771 -910 998 1136 305 -845 -1036 -1092 -18 1033 1142 -13 -1381 -1001 -82 310 480 399 -71
5659 -71 -1315 -1011 212 1112 323 -403 -554 -557 -633 66 764 182 -865 -937 -509 -115 -108 615 289 -1001 -1150
5680 -1150 -133 706 506 6 194 -170 -945 -301 665 724 -268 -509 -425 -425 4 812 758 -311 -950 -309 157
5701 157 343 476 488 -94 -705 -501 523 1116 519 -206 -571 -169 114 657 1290 404 -585 -772 136 709
$$ packed form
5566A517o46j122q48P42N3L71Q34L24j396j531J420J093m7n94K78n43p17j20J739
5585H07N71r03q30K84j80j83R95J176j029j302m47J155K81K17N01m60r68p64J517
5604D38P72K25j529m4j83l66P48J486p3j984r14J020Q15K00J33l6j446j070J384
5623d24J900o0j338m92p31p7R74J912l40j664j115L74J361L12J36r7j208j194
5641a771Q61J908J38q31j150j91n6J074J051J09j155j368L80R19L92J70q1m70
5659g1j244L04J223R00p89p26j51lp6O99O98n82j047p2M28L94PP23l26j290j49
5680a150J017Q39k00n00J88l64p75O44R66N9r92k41Q4%M29Q08n4j069o39O41M66
5701A57J86J33J2n82o11K04J024N93n97p25l65M02K83N43O33q86r89j87R08N73
$$ plain form
5721 709 725 736 -63 -328 -702 542 1249 503 -9 -218 103 168 562 1250 527 -432 -717 -226 625 215 487
5742 487 409 -241 -627 -229 811 269 203 -281 -298 -469 -149 315 781 142 -621 -43 -222 126 264 207 -256
5763 -256 -552 -799 -127 620 -9 -108 -217 -600 -420 -53 547 353 -666 -546 -340 -342 60 702 111 -377 -1017
5784 -1017 -581 80 378 -222 -311 -614 -636 -513 283 296 -289 -550 -780 -354 -222 462 337 -555 -719 -532 35
5805 35 384 259 -20 -214 -752 -666 32 467 -53 -355 -457 -318 -47 407 586 88 -335 -330 60 463 647
5826 647 414 -120 -603 -393 128 576 823 146 -17 -493 -262 628 541 345 166 -347 -412 376 742 680 181
5847 181 -99 -385 -181 398 530 389 -127 -192 -179 272 571 532 4 -618 -231 364 471 483 34 -66 12 127
5869 127 250 296 334 -84 -73 -125 240 700 421 -58 -248 -211 161 307 352 -25 -256 -339 -272 -150 317 272 -130
$$ packed form
5721G09J6J1p99k65l74J244P07p46n12k09L21O5L94O88p23r59k85M91Q51m10K72
5742D87p8o50l86L98J040n42o6m84j7j71L20M64M66o39p63N78j79L48J38n7m63
5763b56k96k47O72P47o29r9j09l83J80L67O00j94j019J20K06kM02O42n91m88o40
5784a017M36O61K98o00q9l03k2J23P96J3n85k61k30M26J32O84j25q92j64J87N67
5805C5L49j25k79j94n38Q6O98M35n20l02j02J39K71M54J79m98m23NL90M03J84
5826F47k33n34m83K10N21M48K47o77j63m76K31Q90q7j96j79n13o5P88L66o2m99
5847A81k80k86K04N79J32j41n16o5J3M51K99l9n28o22L87N95J07J2m49j00P8J15
5869A27J23M6L8m18J1n2L65M60k79m79j90L7L72J46M5l77k31q3O7J22M67m5m02
$$ plain form
5892 -130 -214 -331 -81 -96 -21 -208 -309 -346 -190 87 310 -157 -62 -432 -407 -155 152 149 -355 -351 -282 -10 42 -118
5916 -118 -198 -592 -146 -340 -60 -102 -354 -157 -719 -407 -170 320 48 -413 -387 -172 -112 -44 19 49 -359 -321 -259
5939 -259 -119 -60 -304 -94 -99 258 437 299 232 -245 -418 -16 254 -79 502 295 -296 -78 151 604 543 46
5961 46 136 -29 -146 409 677 -7 -69 -158 -179 567 588 495 142 -394 -141 -57 455 298 105 291 -454 -267 350
5984 350 410 463 -2 -276 -250 17 490 689 106 -307 -390 316 189 590 56 -112 45 -362 177 554 322
6005 322 -200 -280 -237 220 220 137 56 -449 -692 -270 180 44 42 -24 -21 -664 -171 315 617 -543 -567 -404 -258 -264
6029 -264 -14 280 -352 -843 -603 127 298 229 -185 -479 -474 -492 139 694 186 -304 -418 -395 -333 245 486 13
6051 13 -933 -1069 -290 162 369 21 -63 -501 -705 -40 564 224 -320 -595 -424 -332 364 552 202 -814 -563
$$ packed form
5892a30q4j17K50j5P5j87j01l7J56K77K23m67R5l70K5K52L07ln04MO9K72N2j60
5916a18q0l94M46j94K80m2k52J97n62L12K37M90k72m61K6K15O0O8O3L0m08L8O2
5939b59J40N9k44K10nL57J79j38o7m77j73M02K70l33N81k07n91K18K29M53o1m97
5961D6R0j65j17N55K68o84o2q9k1P46K1r3l53n36K53Q4N12j57j93J86p45J87O17
5984C50O0N3m65k74K6K67M73J99n83m13q3P06j27M01n34j68J57m07N39L77k32
6005C22n22q0M3M57%q3q1n05k43M22M50j36ko6Lo43M93M86L02j160k4J63J46o
6029b64K50K94o32m91K40P30J71o9m14k94Nj8O31N55n08m90j14K3O2N78K41m73
6051A3r46j36P79M52K07l48q4m38k04O65O04l40n44k75J71R2O96J88l50j016K51
$$ plain form
6072 -563 21 122 198 250 -22 -390 -424 -183 978 623 4 -315 -77 134 -63 668 735 -76 -223 -200 692
6093 692 613 397 508 -30 -165 -229 754 715 115 -144 251 -164 -214 147 937 402 -486 -290 300 400 216
6114 216 691 366 -411 -493 367 106 280 347 233 108 -693 137 809 725 -188 -493 -410 -214 27 509 651
6135 651 -326 -1293 -559 406 496 165 -161 -219 -1002 -496 588 603 -252 -510 -667 -209 -112 259 800 -514 -1330
6156 -1330 -854 348 626 126 -324 -367 -685 -812 552 828 -9 -448 -424 58 -497 43 639 182 -596 -787
6176 -787 78 635 9 216 80 -473 -776 -153 684 410 -512 -200 -102 -344 -217 473 835 -157 -615 -51
6196 -51 117 -120 540 584 274 -945 -493 869 520 154 -90 49 -584 -494 578 1260 352 -463 -628 -314
6216 -314 -71 807 1213 401 -786 -1003 725 1067 478 138 -47 -947 -527 507 1563 755 -594 -700
$$ packed form
6072e63N84J01P6N2k72l68l4K41J161l55o19l19K38K11j97P31O7q11j47K3Q92
6093F92p9k16J11n38j35o4R83l9o00k59L95m15n0L61P90n35q88J96N90J00j84
6114B16M75l25p77q2Q60k61J74O7j14j25q01Q30O72q4r13l05Q3J96K41M82J42
6135F51r77r67P34R65R0l31l26n8p83N06J084J5q55k58j57M58R7L71N41j314q16
6156a330M76J202K78n00m50m3l18j27J364K76q37m39K4M82n55N40N96m57p78j91
6176g87Q65N57o26K07j36n53l03O23Q37k74r22L12R8k42J27O90L62r92m58N64
6196e1J68k37O60M4l10j219M52J362l49l66k44J39o33R0J072O82r08q15j65L14
6216c14K43Q78M06q12j187k17J728L42n89l40j85r00M20J034J056q08j349j06
$$ plain form
6234 -700 -183 60 361 1192 549 -501 -1039 155 921 947 119 -101 -542 -663 66 1390 856 -679 -900
6253 -900 -246 234 350 890 499 -718 -1195 -159 766 520 221 -265 -643 -543 -201 626 875 -479 -862
6272 -862 -467 -282 -184 162 464 -302 -1005 -595 25 72 20 108 -157 -545 -760 63 473 275 -617 -476 -358
6293 -358 -505 147 367 361 -863 -925 16 134 418 329 96 -630 -1276 -331 902 668 -77 -853 -289 -612 -20
6314 -20 912 495 -377 -817 -497 -190 353 504 475 -518 -1304 -23 1051 889 31 -311 -330 -303 410 897 970
6335 970 51 -683 -456 206 815 482 167 -171 -791 -330 682 696 571 -129 410 -199 23 726 861 313
6355 313 -309 -157 260 236 43 420 372 -186 -364 249 625 265 51 376 25 -361 192 595 699 -304
6375 -304 -299 -115 -18 -49 460 645 -122 -592 55 166 -25 35 257 -212 -247 -223 295 459 -172 -177 -302 -294 -461 108
$$ packed form
6234g00N17K43L01Q31o43j050n38J194P66K6q28k20m41j21P29J324n34j535k21
6253i00O54M80J16N40l91j217m77J036R25k46k99m86l78J00L42Q27K49j354l83
6272h62L95J85R8L46L02p66p03M10O20M7n2Q8k65l88k15Q23M10j98q92J41J18
6293c58j47O52K20oj224o2R41J18K84q9k33p26o46R45J233k34p45p76N64l23N92
6314b0R32m17q72m40L20L07N43J51k9r93p86J281J074j62q58l42j9K7P13M87P3
6335I70r19p34K27O62O09l33l15l38o20M61J012J4j25p00N39o09K22P03J35n48
6355C13o22J52M17k4j93L77m8n58j78O13L76l60k14L25l51l86N53M03J04j003
6375c04NJ84R7l1N09J85p67m70O47J11j91O0K22m69l5K4N18J64o31nj25Qj67N69
$$ plain form
6399 108 480 -286 -734 -431 -15 295 84 355 -187 -184 -579 -420 84 68 -268 -250 -202 -411 100 378 -127 -370
6421 -370 -468 135 -118 -243 -102 26 -428 -676 -46 198 168 -251 26 -224 -357 -95 90 304 -173 -306 -130
6442 -130 -21 12 50 345 -113 -298 -127 353 378 22 275 153 -1 -261 172 379 85 -47 20 -156 -146 169
6464 169 339 276 -176 -268 181 317 215 325 211 -60 -81 -140 378 427 115 76 -28 -19 111 673 194 -78 -171
6487 -171 9 386 361 543 68 97 0 234 536 419 -137 10 203 -232 118 413 326 83 -94 -217 255
6508 255 493 109 191 3 -372 9 98 251 215 -205 -111 -252 -229 152 -103 -87 -406 -358 -103 83 -230 119
6530 119 -131 -424 -72 99 252 -265 -219 -530 -294 -59 -114 133 -142 -281 -126 83 -128 -171 -48 -2 -238
6551 -238 -169 -400 -283 -155 -279 -668 -86 87 142 59 -98 -242 -164 259 51 36 -147 -159 -303 10 308 169
$$ packed form
6399A08L72p66m48L03M16L10k11K71n42Ll95J59N04j6l36J8M8k09N11K78n05k43
6421c70r8O03k53j25J41J28m54k48O30K44l0m19K77k50j33K62J85K14m77j33J76
6442a30J09L3L8K95m58j85J71M80K5l56K53j22j54k60M33K07k94j32O7j76J0L15
6464A69J70o3m52r2M49J36j02J10j14k71k1n9N18M9l12l9j04RJ30N62m79k72r3
6487a71J80L77k5J82m75K9r7K34L02j17n56J47J93m35L50K95q7k43j77j23M72
6508B55K38l84Q2j88l75L81Q9J53l6m20R4j41K3L81k55J6l19M8K55J86l13L49
6530A19k50k93L52J71J53n17M6l11K36K35n5K47k75j39J55K09k11m3J23M6k36
6551b38O9k31J17J28j24l89N82J73N5q3j57j44P8M23k08j5j83j2j44L13K98j39
$$ plain form
6573 169 -15 -482 -146 287 197 72 220 110 -268 -248 160 357 81 -82 -128 -151 5 250 89 146 62 -166
6595 -166 405 99 -102 90 154 -101 -145 393 587 289 -331 -43 -270 171 316 485 -65 57 24 3 230
6616 230 431 468 44 -330 -178 92 409 287 194 -229 -302 152 426 381 111 -249 -616 79 47 368 -70 236
6638 236 -20 -243 -162 641 219 -231 -182 -221 -112 -69 572 293 -321 -340 -26 101 -45 164 -181 -591 -648 -440
6660 -440 -3 285 245 -193 -311 -243 58 -167 240 146 -472 -234 -247 -104 191 -148 -179 -731 -662 -220 395 292
6682 292 -229 -190 -257 155 303 458 -184 -213 -472 -60 347 27 384 43 -414 -272 99 345 310 -278 -184 -150
6704 -150 40 -26 505 419 -231 -272 133 109 129 402 353 -175 -245 -199 319 590 183 166 -276 -227 -64 512 606 129
6728 129 -429 -128 141 95 431 637 369 -243 -481 156 570 331 74 258 -229 -370 769 571 207 -297
$$ packed form
6573A69j84m67L36M33r0j25J48j10l78K0M08J97k76j63m6k3J56K45j61N7q4k28
6595a66N71l06k01J92O4k55m4N38J94k98o20K88k27M41J45J69n50J22l3k1K27
6616B30K01L7m24l74J52K70L17j22r3m23p3M54K74m5k70l60l67O95l2L21m38L06
6638B36k56k23Q1Q03m22m50M9l9J09M3O41k79o14j9L14J27j46K09l45m10n7K08
6660d40M37K88m0m38j18O8L01k25M07r4o18K38j3J43K95l39l1n52O9M42O15j03
6682B92n21L9o7M12J48J55o42k9k59M12M07l20L57l41m57J42L71K46l5n88R4L4
6704a50J90o6N31q6o50m1M05k4K0K73m9n28p0M6N18K71m07j7m42M9J63N76R4m77
6728A29n58L01K69m6L36K06k68o12k38O37M14k39k57J84m87j41J139j98l64n04
$$ plain form
6748 -297 -157 -241 -131 135 581 88 -136 -585 -183 608 103 270 -210 -421 -434 23 461 627 -60 -219 30
6769 30 -52 152 259 699 -488 -477 -91 78 161 127 196 -82 -700 -158 399 329 -104 -156 -359 -605 -296 146
6791 146 114 -174 -514 -380 -190 -151 -52 117 50 -471 -591 36 389 265 -46 -282 -542 -366 37 619 418
6812 418 -136 -617 -312 20 55 246 500 -519 -888 -94 209 312 119 66 -527 -554 -44 775 720 -101 -271
6833 -271 -418 -149 236 753 603 -4 -419 -458 391 619 734 114 -368 -875 -409 553 854 309 -377 -463 -285
6854 -285 272 490 646 201 -955 -310 571 432 329 153 279 -344 -301 476 828 -37 -265 -51 -296 35
6874 35 379 894 518 -308 -597 -33 509 79 562 78 -204 -680 143 564 347 -16 -106 -512 -473 -161 544
6895 544 611 -307 -483 -247 -176 138 102 621 58 -659 -660 183 108 338 -155 -614 -432 -631 406 569 -349 -821
$$ packed form
6748b97J40q4J10K66M46m93k24m49M02P91n05J67m80k11j3M57M38J66o87j59K49
6769C0q2K04J07M40j187J1L86J69Q3l4O9k78o18N42N57p0m33n2k03k46L09M42
6791A46l2k88l40J34J90L9R9J69o7n21j20O27L53j24l11k36k60J76M03N82k01
6812D18n54m81L05L32L5J91K54j019l69P94L03J03j93n3n93k7N10Q19n5q21j70
6833b71j47K69L85N17j50o07m15l9Q49K28J15o20m82n07M66R62L01n45o86q6J78
6854b85N57K18J56m45j156O45Q81j39j03j76J26o23M3P77L52q65k28K14k45L31
6874C5L44N15l76q26k89N64N42m30M83m84k82m76Q23M21k17l63r0m06L9L12P05
6895E44O7r18j76K36P1L14l6N19n63p17jQ43p5K30m93m59J82j99J037J63r18m72
$$ plain form
6917 -821 -693 -256 -81 213 365 -248 -825 -639 262 369 132 -161 -127 -712 -325 76 381 184 -400 -776
6937 -776 178 188 394 523 -143 -614 -625 215 732 174 -336 15 -465 -306 249 639 203 -550 -438 179 380
6958 380 -90 -60 41 59 -273 65 468 137 119 357 -90 -110 37 680 607 106 -236 168 243 98 223 872
6980 872 317 -293 -94 405 333 6 296 153 -454 -527 68 648 286 -299 116 -171 -243 -30 606 427 -516
7001 -516 -282 -39 122 183 246 166 -262 -398 -23 742 332 -221 39 -355 -167 235 313 536 -517 -672 93
7022 93 37 -79 -58 20 -32 -475 21 234 215 -26 -304 -200 -160 193 417 61 -237 -344 -181 16 7 -141 -30
7045 -30 -252 -494 -528 -239 76 -686 -406 -207 -78 -351 -458 248 -2 -98 -60 -281 -82 -279 182 67 -364
7066 -364 -113 -114 101 -199 -95 310 -6 -200 -319 332 140 84 -39 -97 31 -231 196 235 -236 -253 190 183 116
$$ packed form
6917h21J28M37J75K94J52o13n77J86R01J07k37k93L4n85L87M01L05j97n84l76
6937g76R54J0K06J29o66m71j1Q40N17n58n10L51m80J59N55L90m36p53J12O17K01
6958C80m70L0J01J8l32L38M03l31j8K38m47k0J47O43p3n01l42M04P5j45J25O49
6980H72n55o10J99M99p2l27K90j43o07p3N95N80l62n85M15k87p2K13O36j79r43
7001e16K34K43J61O1O3q0m28j36L75P65m10n53K60l94J88M02P8K23j053j55P65
7022I3n6j16K1P8n2m43M96K13j9k41k78J04M0L53K24l56k98j07J63J97rj48J11
7045c0k22k42l4K89L15p62K80J99J29k73j07P06k50r6L8k21J99j97M61j15m31
7066c64K51jK15l00J04M05l16j94j19O51j92n6j23n8J28k62M27L9m71j7M43po7
$$ plain form
7089 116 187 300 111 -15 -130 296 42 -50 54 72 -152 -73 195 727 396 -225 -261 188 130 242 302 151
7111 151 68 -105 178 379 327 90 106 -61 278 350 352 160 -306 -436 259 237 160 367 108 67 -205 -326 358
7134 358 200 31 -30 -5 -168 64 209 48 -103 -77 45 50 -138 -265 149 -114 -117 -351 -124 -50 -50 -101 -1 -337
7158 -337 -272 -20 271 -176 -565 -15 -129 6 -226 126 -184 -201 -493 -199 30 -251 -317 -126 -202 -216 -388 -197
7180 -197 -124 -212 -176 221 -237 -411 11 -362 37 -214 -317 -20 362 -172 -20 -163 -221 242 162 -90 -96 14
7202 14 -57 317 55 -336 -6 -104 91 -84 143 247 45 -253 14 66 106 -94 6 -207 71 305 463 240
7224 240 215 4 -20 132 425 233 -31 -80 -261 132 137 576 -178 -195 -76 86 208 417 220 267 -197 -49
7246 -49 95 296 593 471 287 127 -211 263 250 102 -118 -293 -90 -24 -61 326 64 -102 -421 -147 176
$$ packed form
7089A16P1J13j89j26j15M26k54r2J04J8k24P9K68N32l31o21l6M49n8J12O0j51
7111A51q3j73K83K01n2k37J6j67L39P2Kj92m66j30O95k2p7K07k59m1k72j21O84
7134C58j58j69o1K5j63K32J45j61j51K6J22Nj88j27M14k63lk34K27P4%n1J00l36
7158c37O5K52K91m47l89N50j14J35k32L52l10j7k92K94K29k81o6J91p6j4j72J91
7180a97P3q8L6L97m58j74M22l73L99k51j03K97L82n34J52j43n8M63q0k52oJ10
7202A4p1L74k62l91L30r8J95j75K27J04k02k98K67N2M0k00J00k13K78K34J58k23
7224B40k5k11k4J52K93j92k64m9j81L93NM39p54j7J19J62J22K09j97M7m64J48
7246d9J44K01K97j22j84j60l38M74j3j48k20j75K03O6l7L87k62j66l19K74L23
$$ plain form
7267 176 135 191 159 -414 -453 184 302 165 246 -132 -219 -215 141 105 -321 -216 -746 -329 -100 174 242 -335 -564
7290 -564 -454 -273 88 155 92 -328 -562 -580 -56 188 111 -268 -370 -508 -327 -152 74 179 -351 -473 -285
7311 -285 67 107 128 -97 -448 -691 -429 303 202 -72 -170 -231 -268 25 358 349 -34 -298 -145 173 524 253
7333 253 115 46 -316 47 151 325 228 41 -265 -384 -94 280 652 147 1 -85 -222 -4 373 489 -95
7354 -95 -385 -265 -149 532 497 142 -164 -461 165 149 715 248 173 -158 -69 105 298 643 152 -231 -311 226
7376 226 435 431 65 -158 -205 -127 200 97 388 -51 -392 -367 -242 319 459 178 -193 -171 122 230 74 363
7398 363 47 -331 -569 -179 -24 209 174 -176 -111 -306 -132 -16 273 -14 -59 -159 -179 162 119 261 -313 -498
7420 -498 -637 66 -29 -44 -296 -279 -682 -382 113 226 91 -301 -289 -126 -112 120 270 111 -63 -145 -17 55
$$ packed form
7267A76m1N6l2n73l9O37J18j37Q1l78q7ML56l6m26J05n30M17K29K74O8n77k29
7290e64J10J81L61O7o3m20k34j8N24K44p7l79j02j38J81J75K26J05n30j22J88
7311b85L52M0K1k25l51k43K62P32j01k74r8o1l7K93L33rl83k64J53L18L51k71
7333B53j38o9l62L63J04J74r7j87l06j19K90L74L72n05j46q6j37K18L77J16n84
7354i5k90J20J16O81l5l55l06k97O26j6N66m67p5l31Q9J74J93L45m91l83q0N37
7376B26K09ml66k23m7P8L27j03K91m39l41K5J25N61J40k81l71K2K93J08j56K89
7398C63l16l78k38L90J55K33l5l50O5j95J74J16K89k87m5j00k0L41m3J42n74j85
7420d98j39P03r5j5k52J7m03L00M95J13j35l92J2J63J4K32J50j59j74q2J28P2
$$ plain form
7442 55 439 89 -52 -234 -122 132 391 215 -46 -504 -365 -51 238 573 646 98 -378 42 137 176 374
7463 374 126 -199 -335 -296 386 462 -142 -522 -208 -59 263 278 213 -4 182 -218 209 437 180 204 134 218
7485 218 -291 470 357 160 278 261 -369 -263 84 518 303 -36 -71 140 184 15 592 145 -86 -283 -80
7506 -80 583 330 119 31 -117 -564 182 516 190 -33 -415 -181 87 110 585 550 -283 -536 -232 321 589
7527 589 67 -291 -214 -512 54 268 415 -110 -369 -382 -280 271 300 475 -350 -781 -313 364 249 -176 -302
7548 -302 -433 -345 -416 548 415 -390 -423 -360 34 79 235 -73 -128 -481 -329 80 197 145 -49 -38 -252 -455 140
7571 140 540 -19 2 -59 124 -443 382 603 248 -417 -507 126 337 172 141 6 -322 -108 -125 418 63 255
7593 255 77 -107 -33 -241 460 475 -2 -471 -61 64 114 191 601 -133 -134 -311 583 248 187 178 -206 -286 -314 564
$$ packed form
7442E5L84l50j41j82J12K54K59j76k61m58J39L14K89L35P3n48m76M20R5L9J98
7463C74k48l25j36L9O82P6o04l80L14J49L22J5o5k17J86m00M27K28k57K4p0Q4
7485B18n09P61j13j97J18j7o30J06L47M34k15l39l5K11M4j69N77m47k31j97K03
7506h0O63k53k11q8j48m47P46L34l26k23l82K34K68K3M75l5q33k53L04N53K68
7527E89n22l58P7k98N66K14J47n25k59j3J02N51K9J75q25m31M68O77j15m25j26
7548c02j31Q8p1R64j33q05l3O3L94M5J56l08n5l53J52M09J17n2j94J1k14k03N95
7571A40M00n59K1o1J83n67Q25K21l55o65r0O33K11j65l1j35l28K14j7N43l55J92
7593B55j78j84P4k08P01J5m77m69M10J25N0P7M10p34jj77Q94l35o1rl84q0k8Q78
$$ plain form
7617 564 593 418 -396 -186 399 100 535 463 299 -321 -62 238 562 329 -107 -100 -67 29 222 502 199 -393
7639 -393 -270 369 110 68 190 259 -404 -456 70 622 -65 -326 -164 -33 -230 -204 243 -1 -386 -219 -14
7660 -14 -115 -371 -239 263 -39 -526 174 42 -343 -18 -80 139 -409 -369 112 -122 -277 -130 -53 94 -230
7681 -230 -65 -124 -2 -303 -454 -255 -103 53 135 -3 -237 -453 243 191 124 -2 -132 -257 -125 -35 -34 244
7703 244 8 -570 -17 110 10 265 301 -230 -155 96 195 -241 216 -162 158 33 -34 330 223 -297 -151
7724 -151 188 206 31 -84 8 -70 72 140 336 266 155 -307 57 -36 310 64 41 108 82 342 264 129 -20
7747 -20 -10 79 -16 72 381 153 -82 164 340 193 -238 247 104 131 101 71 206 -17 -126 254 70 -351 -43
7770 -43 -16 -109 -126 -107 27 -189 -248 -113 -213 -41 240 -77 -98 -219 111 64 72 -206 -195 22 -90 -21 128 -388
$$ packed form
7617E64K9j75q14K10N85k99M35p2j64o20K59L00L24k33m36PL3R6J93K80l03n92
7639c93J23O39k59m2J22O9o63n2N26N52o87k61J62J31j97K6M47k44l85J67K05
7660a4j01k56J32N02l02m87P00j32l85L25o2K19n48M0M81k34j55J47P7J47l24
7681b30J65n9J22l01j51J99J52J56Q2j38k34k16O96n2o7j26j30j25J32R0JK78
7703B44k36n78N53J27j00K55L6n31P5K51R9m36M57l78L20j25o7L64j07n20J46
7724a51L39J8j75j15R2p8J42O8J96p0j11m62L64r3L46k46k3O7k6K60p8j35j49
7747b0J0Q9r5Q8L09k28k35K46J76j47m31M85j43K7l0l0J35k23j09L80j84m21L08
7770d3K7r3j7J9J34k16n9J35j00J72K81l17k1j21L30m7Qk78J1K17j12O9J49n16
$$ plain form
7794 -388 -79 -49 -426 -136 -103 128 -289 -329 -23 -230 17 -167 -207 -385 -217 24 0 -453 -70 -44 -177 -263
7816 -263 -150 -4 -294 -188 -94 -41 -178 -22 -81 68 12 190 -74 -93 -343 -266 -97 -325 171 106 217 122 -31
7839 -31 135 43 334 164 197 40 -121 -221 -37 96 84 -176 176 -59 240 84 -10 94 -189 -81 253 372
7861 372 215 -275 16 217 -69 66 257 228 -151 -71 402 -17 172 69 304 -107 -34 -100 273 185 -112 224
7883 224 -374 -52 -103 184 129 143 55 -227 -19 75 310 -180 -9 -324 -267 118 89 -100 -81 -175 -169 -146 -146 151 9
7908 9 -135 -41 -71 200 365 -53 -97 -146 118 141 196 -39 -261 -172 -21 11 79 -140 103 -170 -336 151 -63 39
7932 39 38 -314 -310 -287 -191 311 337 -115 -295 -225 13 88 221 -32 -245 -138 -224 2 321 95 -74 -13 -521 82
7956 82 53 348 416 -166 -135 -149 178 110 302 -212 7 -400 -92 22 323 285 -43 18 -257 271 642 269 79
$$ packed form
7794c88L09L0l77K90L3K31m17m0L06k07K47j84m0j78J68K41k4m53L83K6j33q6
7816b63J13J46k90J06R4N3j37J56n9J49n6J78k64j9k50P7J69k28M96o5J11r5j53
7839c1J66r2K91j70L3j57j61j00J84J33j2k60L52k35K99j56r4J04k83J08L34J19
7861C72j57m90K91K01k86J35J91k9l79Q0M73m19J89j03K35m11P3o6L73q8k97L36
7883B24n98L22n1K87n5J4q8k82K08R4K35m90J71l15N7L85k9j89J9r4OK3%K97j42
7908Ij44R4l0K71J65m18m4m9K64K3N5k35k22Q9J51L2O8k19K43k73j66M87k14J02
7932C9jl52MK3R6N02K6m52j80P0K38P5J33k53k13J07q6K26L19k26j69O1n08O03
7956H2k9K95O8n82L1j4L27o8J92n14K19m07L08J14L01l8l28O1k75N28L71l73j90
$$ plain form
7979 79 74 -202 103 511 318 322 81 -329 -248 371 221 460 -110 80 -35 -71 201 288 181 52 -388 -194 377
8002 377 385 319 107 -81 -131 -86 214 81 -130 64 -17 -206 68 278 169 106 -157 -292 274 -17 208 54
8024 54 -68 64 -141 85 75 131 14 -51 -105 59 102 81 -80 -295 -413 -379 -39 401 -50 73 -399 -319 -123
8047 -123 4 -21 31 -438 -398 -434 -129 3 -92 -156 -189 -371 -230 -39 -101 75 -567 -288 -68 81 248 47 -275
8070 -275 -345 -64 -187 -164 113 112 -254 -524 -4 113 248 341 -248 -195 -297 -156 407 399 52 -43 -323 -211 235
8093 235 343 143 140 -401 -64 373 168 110 194 -96 -116 142 315 242 327 76 -166 -189 -43 291 326 -83 -107
8116 -107 -147 102 -81 462 415 85 -24 18 227 257 285 176 -18 30 -302 111 580 84 -502 -70 -191 -192 164
8139 164 353 149 -723 -358 184 140 186 -95 -280 -298 -382 -221 81 136 -303 -460 -478 130 9 293 135 -312
$$ packed form
7979G9nk76L05M08j93Mk41m10Q1O19j50K39n70J90j15l6K72Q7j07j29m40J94N71
8002C77Qo6k12j88n0M5L00j33k11J94q1j89K74K10j09o3k63j35N66k91K25j54
8024E4j22J32k05K26j0N6j17o5n4J64M3k1j61k15j18L4L40M40m51J23m72Q0J96
8047a23J27k5N2m69M0l6L05J32r5o4l3j82J41J91o2J76o42K79K20J49J67k01l22
8070b75p0K81j23K3K77jl66k70N20J17J35R3n89N3j02J41N63ql47r5k80J12M46
8093B35J08k00ln41L37M37k05n8Q4k90k0K58J73p3Q5k51k42k3J46L34L5m09k4
8116a07m0K49j83N43m7l30j09M2K09L0K8j09j94M8l32M13M69m96n86M32j21jL56
8139A64J89k04q72L65N42m4M6k81j85j8q4J61L02N5m39j57j8O08j21K84j58m47
$$ plain form
8161 -312 -246 -54 -77 14 47 56 -166 -597 -257 120 144 -14 -208 -273 -51 86 216 134 -128 -576 -431 -138 117
8184 117 27 103 22 -228 -384 146 315
$$ packed form
8161c12O6J92k3R1L3Rk22m31L40L77K4j58j94o5K22J37J30q2k62m48J45K93K55
8184A17r0P6q1k50j56N30J69
8191C15
$$ Imaginary data points
##PAGE= N=2
##DATA TABLE= (X++(I..I)), XYDATA
$$ plain form
0 0 0 0 0 0 0 0 -8 8 -8 8 -9 16 -19 24 -24 32 -40 48 -56 64 -76 88 -100 118 -136 152 -172 196 -223 251
30 251 -283 315 -355 395 -437 492 -545 604 -668 741 -822 907 -1004 1114 -1236 1372 -1526
47 -1526 1703 -1910 2151 -2440 2792 -3233 3800 -4560 5638 -7284 10075 -15710 31460 -159945
61 -159945 -584200 -69729 366752 119332 -187981 -14078 85140 -146908 -188566 132089
71 132089 211713 -67782 -174803 18303 65983 -52251 6771 157285 42682 -169752 -105702
82 -105702 108443 113892 -5827 -8449 15525 -82976 -123176 30965 148276 32263 -117100
93 -117100 -87048 2971 -8314 -27143 36296 57965 -35360 -93559 -28012 38273 29666 29765 47879
106 47879 -11116 -87421 -28046 97808 85175 -28692 -48669 5640 -7829 -31227 41997 84938
$$ packed form
0@%%%%%%qJ6j6J6j7K5l5M3m8N6p2Q8j04J20j40J64j88K18k54K88l24L68m19M74
30B51n34N98o70P50q32R29j037J149j272J409j563J729j911K118k350K608k898
47a526L229l613M061m591N232o025P033q360J0198j2922J7359k5785M7170j91405
61a59945m24255N14471M36481k47420l07313J73903R9218k32048m1658L20655
71A32089P9624k79495j07021J93106M7680j18234N9022J50514j14603k12434O4050
82a05702K14145N449j19719k622K3974r8501m0200J54141J17311j16013j49363
93a17100L0052R0019j1285j8829O3439K1669r3325n8199O5547O6285q607R9J8114
106D7879n8995p6305N9375J25854j2633j13867j9977N4309j3469k3398P3224M2941
$$ plain form
118 84938 -22061 -114748 -45636 38588 13319 277 54648 20629 -105291 -104335 43560 110215
130 110215 39472 -9775 -9317 -41999 -45796 51499 113016 29281 -59337 -27452 20293 7344
142 7344 22843 67853 15371 -95357 -81396 44166 90537 23418 -32530 -42338 -48540 -25051
154 -25051 43595 71189 16074 -34440 -25379 -7038 -158 32640 62234 26708 -34148 -31304 17392
167 17392 32876 13126 3768 2137 -9785 -15563 -4017 3907 1515 3196 -2633 -29216 -39611
180 -39611 1449 45762 25765 -31683 -44646 -7988 16557 15484 25761 33165 -4425 -50361
192 -50361 -29932 30504 43790 8942 -5977 -2795 -22880 -38909 -6277 30460 12607 -22077
204 -22077 -25338 -21054 -22898 4405 35075 -2219 -59126 -29789 40880 30377 -23122 -6214 31858
$$ packed form
118H4938j06999r2687O9112Q4224k5269j3042N4371l4019j25920R56J47895O6655
130A10215p0743m9247M58l2682l797R7295O1517q3735q8618L1885M7745j2949
142G344J5499M5010n2482j10728J3961J25562M6371o7119n5948r808o202K3489
154b5051O8646K7594n5115n0514R061J8341O880L2798K9594l5526o0856K844M8696
167A7392J5484j9750r358j631j1922n778J1546P924k392J681n829k6583j0395
180c9611M1060M4313j9997n7448j2963L6658K4545j073J0277P404l7590m5936
192e0361K0429O0436J3286l4848j4919L182k0085j6029L2632L6737j7853l4684
204b2077l261M284j844K7303L0670l7294n6907K9337P0669j0503n3499J6908L8072
$$ plain form
217 31858 -9948 -56834 -2223 66241 32944 -26293 -18584 -7290 -37741 -19958 55309 51377
229 51377 -42738 -72510 -6760 21104 -12225 -4019 31580 -3129 -57050 -20525 45418 28454
241 28454 -19178 -3836 19154 -11371 -20935 36809 60089 -3183 -48869 -15234 18847 10963
253 10963 18318 36486 -4363 -67435 -45381 34779 49139 -3462 -20600 2511 -7626 -34166
265 -34166 -5211 47106 36519 -14696 -22562 6064 14321 12986 29906 26311 -17539 -34626 13122
278 13122 52099 23680 -15760 -15621 -9792 -18528 -666 37397 27074 -26417 -40163 -6866 3916
291 3916 -5910 16409 40326 2121 -47609 -22741 33376 33644 2488 6091 12986 -14344 -20091
304 -20091 25228 43307 -5217 -37949 -7634 18274 -436 -8382 10600 53 -38459 -35852
$$ packed form
217C1858m1806m6886N4611O8464l3297n9237P709J1294l0451J7783P5267l932
229E1377r4115k9772O5750K7864l3329Q206L5599l4709n3921L6525O5943j6964
241B8454m7632J5342K2990l0525r564N7744K3280o3272m5686L3635L4081p884
253A0963P355J8168m0849o3072K2054Q0160J4360n2601j7138K3111j0137k6540
265c4166K8955N2317j0587n1215p866K8626Q257j335J6920l595m3850j7087M7748
278A3122L8977k8419l9440J39N829q736J7862L8063j0323n3491j3746L3297J0782
291C916r826K2319K3917l8205m9730K4868N6117K68l1156L603O895k7330n747
304b0091M5319J8079m8524l2732L0315K5908j8710p946J8982j0547l8512K607
$$ plain form
316 -35852 6124 21844 7194 384 -8824 -37188 -36136 18144 52790 16476 -27067 -19010 2257
329 2257 454 6312 26506 13113 -28444 -27734 16110 26954 -8558 -25811 -10540 -7503 -18170
342 -18170 -3010 19545 3428 -32654 -33237 -4209 9681 7517 9026 2513 -17659 -18631 9549
355 9549 24413 5974 -8431 3497 11467 135 -5632 2294 3199 -5200 -2502 5230 -1075 -11004
369 -11004 -6370 -613 -8486 -12519 1333 10708 1771 -5658 -1692 -3732 -8943 5723 27310 18559
383 18559 -8059 -10144 11505 16488 2766 706 9333 7260 11 4161 9056 -1585 -12547 -6765
397 -6765 2284 3587 6891 9992 -2149 -19550 -14744 7709 18018 13641 9186 1378 -12153 -8435
411 -8435 16906 27615 7412 -7770 2968 8539 -3352 -727 19559 13152 -21630 -26443 7879
$$ packed form
316c5852M1976J5720j4650o810r208k8364J052N4280L4646l6314m3543Q057K1267
329B257j803N858K0194j3393m1557P10M3844J0844l5512j7253J5271L037j0667
342a8170J5160K2555j6117l6082n83K9028J3890k164J509o513k0172r72K8180
355I549J4864j8439j4405J1928P970j1332n767P926R05q399K698P732o305r929
369a1004M634N757p873m033J3852R375q937p429L966k040n211J4666K1587q751
383A8559k6618k085K1649M983j3722k060Q627k073p249M150M895j0641j0962N782
397f765R049J303L304L101j2141j7401M806K2453J0309m377m455p808j3531L718
411h435K5341J0709k0203j5182J0738N571j1891K625K0286o407l4782m813L4322
$$ plain form
424 7879 24419 3715 -10667 -6184 -15125 -26653 640 41469 29931 -23336 -44299 -13876 18465
437 18465 28288 24055 3752 -26018 -28453 5576 28778 15070 -3532 -8832 -18440 -22342 6361
450 6361 33441 7971 -38466 -34965 3182 11407 -2043 6359 11418 -22782 -46233 -7314 39471
463 39471 25640 -12031 -12949 -864 -13198 -15470 16407 32406 4206 -21699 -16398 -8877 -7589
476 -7589 11287 27653 -2520 -45357 -30896 17440 24990 -2920 -10488 -5579 -21452 -24020 18333
489 18333 46981 10583 -33274 -24405 3949 7880 15487 35450 16584 -36900 -41574 13671 39364
502 39364 8784 -8243 5944 -6383 -37237 -14479 39794 35485 -19357 -34423 -4327 7560
514 7560 2876 20827 28683 -12310 -43268 -6097 42960 33791 1571 -2588 -3934 -22445 -11082
$$ packed form
424G879J6540k0704j4382M483q941j1528K7293M0829j1538n3267k0963L0423L2341
437A8465R823m233k0303k9770k435L4029K3202j3708j8602n300r608l902K8703
450F361K7080k5470m6437L501L8147Q225j3450Q402N059l4200k3451L8919M6785
463C9471j3831l7671r18J2085j2334k272L1877J5999k8200k5905N301P521J288
476g589J8876J6366l0173m2837J4461M8336P550k7910p568M909j5873k568M2353
489A8333K8648l6398m3857Q869K8354L931P607J9963j8866n3484m674N5245K5693
502C9364l0580j7027J4187j2327l0854K2758N4273m309n4842j5066L0096J1887
514G560m684J7951P856m0993l0958L7171M9057r169l2220m159j346j8511J1363
$$ plain form
527 -11082 36617 46801 -77 -32787 -18346 -745 3086 18862 26797 -6172 -38890 -15711
539 -15711 22982 15743 -8009 1666 11675 -11341 -19829 14954 33638 4654 -16346 1661 8266
552 8266 -10133 -2238 31915 24838 -21539 -32948 -1037 12610 2987 10286 16095 -17246 -47234
565 -47234 -16948 29743 24798 -7043 -12710 -9108 -20702 -13053 24289 32973 -4774 -27485 -9702
578 -9702 3431 895 16042 28450 -7472 -49251 -21489 35333 30776 -15984 -22691 -1359 -12003
591 -12003 -28229 1477 34936 11906 -28959 -28916 -9459 -3833 9918 31615 13085 -34746 -35895
604 -35895 12850 29864 2521 -4668 10615 -3614 -28796 -7746 31509 21768 -15339 -19705 -6434
617 -6434 -9509 -3329 24326 21676 -22452 -38075 -1938 17462 1485 4814 24308 1582 -41368
$$ packed form
527a1082M7699J0184m6878l2710J4441J7601L831J5776P935l2969l2718K3179
539a5711L8693p239k3752R675J0009k3016q488L4783J8684k8984k1000J8007O605
552H266j8399P895L4153p077m6377j1409L1911J3647r623P299N809l3341k9988
565d7234L0286M6691m945l1841n667L602j1594P649L7342Q684l7747k2711J7783
578i702J3133k536J5147J2408l5922m1779K7762N6822m557m6760o707K1332j0644
591a2003j6226K9706L3459k3030m0865M3J9457N626J3751K1697j8530m7831j149
604c5895M8745J7014k7343p189J5283j4229k5182K1050L9255r741l7107m366J3271
617f434l075O180K7655k650m4128j5623L6137J9400j5977L329J9494k2726m2950
$$ plain form
630 -41368 -24634 32519 40997 3848 -9083 -688 -13643 -19773 19172 48317 14448 -31267 -25650
643 -25650 902 7903 15669 29010 5380 -42345 -38176 18664 44666 15667 -8850 -10593 -21050
656 -21050 -23262 17821 57268 28925 -29568 -38281 -5503 14681 22778 35176 17277 -33073 -47769
669 -47769 2583 44030 24976 -6387 -11168 -16668 -27276 -1956 41759 33565 -20859 -41264 -12944
682 -12944 9609 13551 25484 21890 -20216 -47712 -10427 36901 28988 -151 -3770 -9934 -32471
695 -32471 -19081 33591 45152 -6768 -39673 -19113 -1459 -4579 12659 31709 -513 -47627
707 -47627 -32209 18649 26160 2065 -199 -1504 -28546 -30556 19527 48168 8686 -32105 -21736
720 -21736 -4450 -6037 9368 35414 14832 -36985 -41649 -494 19752 10611 11025 5533 -28940
$$ packed form
630d1368J6734N7153Q478l7149j2931Q395j2955o130L8945K9145l3869m5715N617
643b5650K6552P001P766J3341k3630m7725M169N6840K6002k8999k4517j743j0457
656b1050k212M1083L9447k8343n8493q713L2778K0184Q097J2398j7899n0350j4696
669d7769N0352M1447j9054l1363m781n500j0608K5320M3715q194n4424k0405K8320
682a2944K2553L942J1933l594m2106k7496L7285M7328p913k9139l619o164k2537
695c2471J3390N2672J1561n1920l2905K0560J7654l120J7238J9050l2222m7114
707d7627J5418N0858P511k4095k264j305k7042k010N0083K8641l9482m0791J0369
720b1736J7286j587J5405K6046k0582n1817m664M1155K0246r141M14n492l4473
$$ plain form
733 -28940 -43125 1322 41569 20798 -16407 -16441 -9016 -16562 -991 39083 34497 -21536 -46527
746 -46527 -9880 23890 20233 13671 9883 -17191 -41765 -12465 38435 37484 -4360 -23942 -16647
759 -16647 -13789 -1474 32025 37592 -9587 -44587 -18150 21949 24060 11618 9655 -5211 -27983
772 -27983 -12720 30215 34079 -2747 -16782 -2323 -3235 -9931 15151 36820 5151 -37301 -22986
785 -22986 17222 19637 1858 5517 6849 -16266 -22824 8431 28223 8214 -7628 224 -874
798 -874 -11775 1875 25993 13946 -16342 -13914 8125 6810 -3668 6211 12863 -8193 -21855
811 -21855 -1984 14695 3044 -5718 3990 733 -17721 -13483 12814 16979 -3216 -9088 -1089
824 -1089 -7031 -12705 7453 25894 5265 -24761 -18134 6411 9660 1699 5492 2974 -18149 -24251
$$ packed form
733b8940j4185M4447M0247k0771l7205l4P425p546J5571M0074m586n6033k4991
746d6527L6647L3770l657o562l788k7074k4574K9300N0900r51m1844j9582P295
759a6647K858J2315L3499N567m7179l5000K6437M0099K111j2442j963j4866k2772
772b7983J5263M2935L864l6826j4035J4459r12o696K5082K1669l1669m2452J4315
785b2986M0208K415j7779L659J332k3115o558L1255J9792k0009j5842P852j098
798h74j0901J3650K4118j2047l0288K428K2039j315j0478R879O652k1056j3662
811b1855J9871J6679j1651q762R708l257j8454M238K6297M165k0195n872P999
824a089n942n674K0158J8441k0629l0026O627K4545L249p961L793k518k1123o102
$$ plain form
838 -24251 3240 23311 7112 -14307 -13744 -7923 -7175 4301 17675 4927 -21355 -19898 4244
851 4244 12030 2346 669 2498 -9513 -16152 1507 15603 4582 -7682 -1419 -45 -11315 -6609
865 -6609 13738 10936 -12318 -12963 7023 5148 -12034 -4599 15845 7340 -16697 -11628 9548 9426
879 9426 -1055 2875 5702 -7974 -11484 7472 17198 4122 -4720 885 -2401 -9125 3938 20041
893 20041 7771 -13014 -7387 6956 935 -4683 12241 18778 -7863 -25634 -2553 23827 14855
906 14855 -3926 -3767 -1454 -8598 -1979 19992 19725 -6074 -17109 -2908 7423 5446 9852 12792
920 12792 -4700 -21869 -8349 18529 18837 -189 -8699 -7094 -7769 -818 15965 16017 -7389 -18997
934 -18997 -3485 10049 4457 -300 4525 -24 -11881 -6119 9274 8534 -3945 -3302 2623 -5979
$$ packed form
838b4251K7491K0071j6199k1419N63N821P48J1476J3374j2748k6282J457K4142
851D244P786r684j677J829j2011o639J7659J4096j1021j2264O263J374j1270M706
865f609K0347k802k3254o45J9986j875j7182P435K0444q505k4037N069K1176j22
879I426j0481L930K827j3676l510J8956R726j3076q842N605l286o724J3063J6103
893B0041j2270k0785N627J4343o021n618J6924O537k6641j7771K3081K6380q972
906A4855j8781J59K313p144O619K1971k67k5799j1035J4201J0331j977M406K940
920A2792j7492j7169J3520K6878L08j9026q510J605o75O951J6783N2k3406j1608
934a8997J5512J3534n592m757M825m549j1857N762J5393p40j2479O43N925q602
$$ plain form
948 -5979 -11494 3656 16259 747 -16609 -7777 5697 792 -5340 3205 5667 -8158 -13189 358
962 358 7408 -803 -3829 988 -3586 -12391 -2748 12465 5346 -12023 -10031 2044 922 -4195 3117
977 3117 6291 -6709 -13860 -11 10370 304 -8302 -1067 2438 -5495 -5080 5917 5060 -6680
991 -6680 -6876 3407 1649 -4716 989 7621 -2615 -11876 -300 11709 3320 -7965 -1496 5955
1005 5955 -915 -4416 5663 8663 -4321 -9382 3645 10169 1993 -2930 473 -773 -3102 4462
1019 4462 11138 1543 -8742 -2531 6535 2767 12 7035 6672 -7828 -10882 7254 17937 4179
1033 4179 -8206 -2546 3347 575 3215 11193 5610 -9415 -9155 5359 10037 3524 1535 1590 -6348
1048 -6348 -9317 4158 14972 5981 -7279 -5515 -527 -2711 873 12731 10887 -8383 -15671 -1807
$$ packed form
948e979n515J5150J2603j5512j7356Q832J3474m905o132Q545K462j3825n031J3547
962C58P050q211l026M817m574q805R643J5213p119j7369J992J2075j122n117P312
977C117L174j3000p151J3849J0381j0066q606P235L505p933M15J0997q57j1740
991f680j96J0283j758o365N705O632j0236r261J1576J2009q389j1285O469P451
1005E955o870l501J0079L000j2984n061J3027O524q176m923L403j246k329P564
1019D462O676r595j0285O211R066l768k755P023l63j4500l054J8136J0683j3758
1033D179j2385N660N893k772K640P978n583j5025K60J4514M678o513j989N5p938
1048f348k969J3475J0814q991j3260J764M988k184L584J1858j844j9270p288J3864
$$ plain form
1062 -1807 9870 7107 2819 1823 -6710 -13581 -1999 15058 11156 -6206 -11367 -5238 -3449 -1247
1076 -1247 9703 11589 -6315 -20282 -10456 6471 9543 5063 745 -8493 -16805 -8210 12197 16686
1090 16686 818 -12509 -11744 -5960 1575 11382 10742 -4931 -18181 -10499 3634 6098 4430 3992
1104 3992 -5051 -18731 -13885 8827 19100 4099 -11845 -11773 -6585 -2591 7335 15903 5831 -13744
1118 -13744 -16824 -1046 10252 9771 6450 -580 -11805 -13652 1772 15697 9872 -2685 -7812
1131 -7812 -9388 -8288 4357 19026 12033 -11254 -19894 -4401 10523 11992 9069 3434 -9172
1144 -9172 -14870 -482 17280 15196 876 -4259 -4886 -7260 -1661 15033 18606 -593 -16312 -9914
1158 -9914 3858 8738 9899 7674 -4906 -16520 -7020 12755 15360 3081 -3040 -3453 -7912 -5014
$$ packed form
1062a807J1677k763m288r96q533o871J1582J7057l902j7362n161O129J789K202
1076a247J0950J886j7904j3967R826J6927L072m480m318r238q312Q595K0407M489
1090A6686j5868j3327P65N784P535R807o40j5673j3250P682J4133K464j668m38
1104C992r043j3680M846K2712J0273j5001j5944P2N188L994R926Q568j0072j9575
1118a3744l080J5778J1298m81l321p030j1225j847J5424J3925n825j2557n127
1131g812j576J100J2645J4669o993k3287q640J5493J4924J469k923n635j2606
1144i172n698J4388J7762k084j4320n135o27k374N599J6694L573j9199j5719O398
1158i914J3772M880J161k225j2580j1614R500J9775K605j2279o121m13m459K898
$$ plain form
1172 -5014 11713 21207 4994 -13861 -10783 1973 5741 7413 11785 4308 -14297 -16815 2709
1185 2709 15692 7100 -3266 -5079 -7247 -7978 1985 11974 5582 -7651 -7734 -1457 -1961 -297 10220
1200 10220 10680 -7580 -17895 -3960 10905 7542 544 796 -4615 -14758 -9217 9949 14219 -1051
1214 -1051 -11852 -8938 -6324 -4371 6307 12132 -774 -16544 -11901 2749 5960 2921 3912 -654
1228 -654 -12284 -11881 6095 14899 3374 -7546 -5768 -4567 -6516 2023 13740 6610 -12055 -15313
1242 -15313 -2665 4049 2410 5134 5927 -5958 -16097 -7359 9118 12511 6052 -605 -8142 -12170
1256 -12170 -657 16956 15239 -3001 -11010 -3781 389 1720 11055 14287 -3383 -20128 -10329
1269 -10329 11609 14166 3904 -281 -2856 -12715 -10849 10195 22767 8307 -10827 -11623 -3075
$$ packed form
1172e014J6727R494j6213j8855L078J2756L768J672M372p477j8605k518J9524
1185B709J2983q592j0366j813k168p31R963R989o392j3233q3O277n04J664J0517
1200A0220M60j8260j0315J3935J4865l363o998K52n411j0143N541J9166M270j5270
1214a051j0801K914K614J953J0678N825j2906j5770M643J4650L211l039R91m566
1228f54j1630M03J7976Q804j1525j0920J778J201j949Q539J1717p130j8665l258
1242a5313J2648O714j639K724P93j1885j0139Q738J6477L393o459o657p537m028
1256a2170J1513J7613j717j8240q009P229M170J331R335L232j7670j6745R799
1269a0329K1938K557j0262m185k575r859J866K1044J2572j4460j9134p96Q548
$$ plain form
1282 -3075 3336 11987 17366 5238 -13014 -13032 3548 12179 10083 6557 -271 -13044 -13538 5857
1296 5857 19291 9329 -6385 -10142 -8945 -6449 7743 21806 9844 -17050 -20964 409 14074
1309 14074 9555 5632 4264 -7130 -16604 -4403 16016 15927 403 -7568 -8699 -9364 -2028 13219
1323 13219 13891 -5453 -18243 -9781 1537 3573 6836 8870 -4651 -21854 -13967 10704 18685
1336 18685 5487 -5249 -8733 -13460 -9570 11531 24176 6906 -17787 -19781 -5483 4306 11288
1349 11288 14684 -550 -24487 -22666 5059 19362 7084 -5660 -8428 -13914 -13761 6341 24896
1362 24896 10464 -17729 -20780 -2135 8404 9986 12606 5019 -16017 -21542 745 19851 13291
1375 13291 -1172 -6514 -11405 -13547 862 19302 13380 -9628 -16984 -6181 2320 5293 10615
$$ packed form
1282c075O411Q651N379j2128j8252j8J6580Q631k096l526o828j2773m94J9395
1296E857J3434r962j5714l757J197K496J4192J4063j1962k6894l914K1373J3665
1309A4074m519l923j368j1394r474J2201K0419q9j5524p971j131o65P336J5247
1323A3219O72j9344j2790Q462J1318K036L263K034j3521j7203P887K4671P981
1336A8685j3198j0736l484m727L890K1101J2645j7270k4693j994J4298R789O982
1349A1288L396j5234k3937J821K7725J4303j2278j2744k768n486J53K0102J8555
1362B4896j4432k8193l051J8645J0539J582K620p587k1036n525K2287J9106o560
1375A3291j4463n342m891k142J4409J8440n922k3008p356J0803Q501K973N322
$$ plain form
1388 10615 7766 -9411 -15765 374 15039 8885 506 2275 -767 -10551 -3772 16291 18389 -1921
1402 -1921 -12193 -4129 1666 189 6144 12716 1955 -13418 -9380 4731 6251 1825 5407 5264
1416 5264 -7849 -12310 3572 16719 7832 -4248 -2962 -1131 -3750 3913 16636 10527 -10711
1429 -10711 -14760 908 9569 5435 5099 3301 -10029 -17555 -1086 16266 9072 -6035 -6997 -3386
1443 -3386 -7501 -2725 13617 14067 -6653 -16481 -2640 9067 5231 2109 2819 -4850 -12250 -1147
1457 -1147 13021 5503 -9258 -6328 1221 -4623 -7251 5643 10917 -5869 -16919 -4592 6402
1470 6402 672 -3342 3055 2037 -8409 -6988 6157 6060 -5037 -4095 5590 2358 -7561 -3335 6296
1485 6296 1457 -7290 -1870 4664 -2333 -8211 511 6133 -2948 -9076 -918 4021 -2216 -2841 5421
$$ packed form
1388A0615k849j7177o354J6139J4665o154q379J769l042r784O779K0063K098k0310
1402a921j0272Q064N795j477N955O572j0761j5373M038J4111J520m426L582j43
1416E264j3113m461J5882J3147q887j2080J286J831k619P663J2723o109k1238
1429a0711m049J5668Q661m134l36j798j3330p526J6469J7352p194j5107r62L611
1443c386m115M776J6342M50k0720r828J3841J1707l836l122P10p669p400J1103
1457a147J4168p518j4761K930P549n844k628J2894N274j6786j1050J2327J0994
1470F402n730m014O397j018j0446J421J3145r7j1097R42R685l232r919M226R631
1485F296m839q747N420O534o997n878Q722N622r081o128Q158M939o237o25Q262
$$ plain form
1500 5421 3195 -8538 -6927 6854 8710 -395 -1252 3577 -1756 -7927 2128 13187 5680 -7723
1514 -7723 -5217 2522 201 -1429 5730 5643 -6603 -9478 2820 9059 759 -3135 1874 156 -5302
1529 -5302 1993 13056 6432 -6899 -4837 4794 4226 658 6388 8687 -3268 -9875 862 9208
1543 9208 2445 -2735 2180 1862 -6134 -4736 6363 6088 -4125 -4157 3777 2725 -3599 247 7105
1558 7105 1669 -5679 -611 6315 2821 -1247 3077 3272 -5410 -6592 4675 7937 -1172 -6005 -1511
1573 -1511 -1204 -5883 -2481 5722 3089 -7014 -6856 788 943 -2854 1117 4426 -2046 -6916 263
1588 263 6681 1104 -4571 -490 1851 -3170 -2723 4858 4004 -6563 -8962 -228 2478 -2995 -2535 2592
1604 2592 -1665 -10045 -5499 4880 3829 -3613 -3288 915 -1807 -3543 2684 6179 -1461 -5890 1137
$$ packed form
1500E421k226j1733J611J3781J856r105q57M829n333o171J0055J1059p507j3403
1514g723K506P739k321j630P159q7j2246k875J2298O239q300l894N009j718n458
1529e302P295J1063o624j3331K062R631n68l568N730K299j1955o607J0737Q346
1543I208o763n180M915l18p996J398J1099k75j0213l2P934j052o324L846O858
1558G105n436p348N068O926l494m068M324J95q682j182J1267L262r109m833M494
1573a511L07m679L402Q203k633j0103J58P644J55l797L971L309o472m870P179
1588B63O418n577n675M081K341n021M47P581q54j0567k399Q734K706n473M60N127
1604B592m257q380M546J0379j051p442L25M203k722j736O227L495p640m429P027
$$ plain form
1619 1137 5846 576 -2359 928 -83 -4542 -1497 6322 2814 -6694 -5848 1458 1158 -3468 455
1634 455 3828 -1393 -6258 11 6396 1261 -3633 1052 5092 1306 -241 4122 3747 -2568 -2671 4458
1650 4458 6575 1237 -1134 537 -1757 -3952 1165 6823 2733 -4280 -3230 1128 379 -229 3435
1665 3435 4107 -2112 -3907 2793 7175 3420 -561 566 270 -1132 2940 8903 4804 -4992 -6721
1680 -6721 90 4221 3655 2910 420 -5037 -7436 -1192 5253 3801 -918 -2354 -3098 -3747 80 6049
1696 6049 5212 -2102 -5101 -1045 2619 2774 3489 2670 -3384 -7646 -2317 5747 5565 -377 -4272 -5871
1712 -5871 -6856 -3303 4933 6782 -1365 -9010 -8634 -3269 2125 5826 5006 -2804 -9487 -5845 3696 7571
1728 7571 3702 -1173 -4630 -6305 -2456 5717 8352 181 -8658 -8604 -2961 2139 5657 4759 -2623 -11145
$$ packed form
1619A137M709n270k935L287j011m459L045P819l508r508Q46P306l00m626L923
1634D55L373n221m865O269O385n135m894M685M040l786j547M363l75o315j03P129
1650D458K117n338k371J671k294k195N117N658m090p013J050M358p49o08L664
1665C435O72o219j795O700M382l755l981J127k96j402M072N963m099r796j729
1680f721O811M131n66p45k490n457k399O244O445j452m719j436p44o49L827N969
1696F049q37p314k999M056L664J55P15q19o054m262N329Q064j82n942l895j599
1712e871r85L553Q236J849q147p645L76N365N394L701q20p810o683L642R541L875
1728G571l869m875l457j675L849Q173K635q171q839N4N643N100L518q98p382q522
$$ plain form
1744 -11145 -9996 394 8187 6623 587 -5093 -8453 -5011 4765 10959 6298 -3362 -6790 -3269
1758 -3269 1074 5968 8370 2844 -7092 -9691 -925 8020 7717 1202 -4562 -7296 -6156 1751 9874
1773 9874 8415 -1695 -8371 -6557 66 7314 10438 6319 -3445 -7947 -2627 5581 8166 6184 2421
1788 2421 -3534 -6936 -1985 7180 9621 1910 -5957 -6348 -2871 2321 6918 6463 -1287 -8243 -6782
1803 -6782 1535 7979 8122 3784 -3355 -8148 -4655 5638 11390 6439 -2174 -6053 -5587 -1184 5308
1818 5308 8343 2668 -6552 -8699 -3161 2622 4576 3073 -2197 -7874 -7173 528 6817 4737 -865
1833 -865 -4199 -5768 -4012 2935 8983 6002 -3786 -8071 -4553 603 3847 5436 3094 -5069 -10482
1848 -10482 -5800 2515 4079 1526 -1774 -5696 -8089 -3802 4019 5886 -197 -5821 -5019 -2113 949
$$ packed form
1744a1145J149J0390P793j564o036n680l360L442R776O194m661r660l428L521
1758c269M343M894K402n526r936k599Q766Q945l03o515n764k734J140P907Q123
1773I874j459j0110o676J814O623P248L124m119r764m502N320Q208K585j982l763
1788B421n955l402M951R165K441p711p867l91L477N192M597m55p750o956J461
1803f782Q317O444J43m338p139m793L493J0293N752m951q613l879M66M403O492
1818E308L035n675r220k147N538N783J954j503n270n677P01P701O289k080n602
1833h65l334j569J756O947O048k981r788m285L518N156L244J589k342q163n413
1848a0482M682Q315J564k553l300l922k393M287P821J867o083n624Q02K906L062
$$ plain form
1863 949 5104 6103 -508 -7887 -5648 2346 6081 4565 1895 -2400 -7924 -7284 1932 7942 4107 -3339
1879 -3339 -6692 -5858 -3583 2488 7805 4230 -4787 -8100 -1860 3360 4851 5024 3000 -3132 -6726
1894 -6726 125 8598 7665 1136 -2291 -3203 -3659 440 8152 8722 -1982 -9430 -5519 1802 3868 5032
1910 5032 5277 -900 -8651 -6364 3971 9020 5133 1425 -731 -4705 -4151 5491 12656 5440 -5420
1925 -5420 -5706 265 3030 3815 6375 2950 -6592 -9643 -1174 7029 6595 2021 -2995 -8394 -8956 1164
1941 1164 11773 8400 -2862 -7844 -5015 -1432 3592 9713 8193 -4389 -12100 -4868 6163 7886
1955 7886 4140 -198 -6726 -10527 -3238 8477 9130 -1895 -9467 -7912 -4304 541 7481 8031 -3858
1970 -3858 -14102 -8376 4153 8162 4655 1174 -3627 -9393 -6979 5547 11507 3354 -5914 -6843
$$ packed form
1863I49M155R99o611p379K239P994L735j516k670m295n524O40R216O010l835p446
1879c339l353Q34K275O071N317l575r017l313O240N220J491J73k024o132l594
1894f726O851Q473r33o529l427r12m56M099P712N70j0704p448L911P321K066J164
1910E032K45o177p751K287J0335N049l887l708k156l974N54R642P165p216j0860
1925e420k86N971K765P85K560l425r542l051Q469Q203m34m574n016n399n62J0120
1941A164J0609l373j1262m982K829L583N024O121j520j2582p711P232J1031J723
1955G886l746m338o528l801P289J1715O53j1025p572J555L608M845O940N50j1889
1970c858j0244N726J2529M009l507l481m801n766K414J2526N960q153r268r29
$$ plain form
1984 -6843 -4770 -2426 4215 8664 1342 -11252 -10540 979 5594 2690 747 -956 -7324 -8912 1429
1999 1429 11143 6743 -3597 -5786 -3912 -2862 2890 10822 7485 -6046 -10413 -1277 4782 3419
2013 3419 3183 4006 -3448 -10528 -4003 8051 7706 -883 -3508 -2800 -4751 -1728 8401 10541 -772
2028 -772 -9541 -3920 4252 4888 5755 7017 -198 -9935 -5981 8154 11404 3099 -2038 -3307 -5702
2043 -5702 -4377 6420 12340 1856 -9902 -6687 2384 3389 3298 5450 1570 -8012 -7687 5538 12053
2058 12053 3741 -4019 -3089 -1429 -1757 3372 9760 4039 -7158 -7316 53 2933 1604 3485 2171
2073 2171 -6348 -9306 257 7894 1914 -4774 -1783 831 -3101 -2537 4947 4910 -3837 -6363 869 3568
2089 3568 -324 -293 2474 -1347 -6320 -1570 4546 1013 -4336 -1393 1581 -3626 -6442 420 4446
$$ packed form
1984f843K073K344O641M449p322j2594P12J1519M615k904j943j703o368j588J0341
1999A429R714m400j0340k189J874J050N752P932l337j3531m367R136O059j363
2013C419k36Q23p454p080O525J2054l45q589k625P08j951L023J0129K140j1313
2028g72q769N621Q172O36Q67J262p215r737L954J4135L250q305n137j269k395
2043e702J325J0797N920j0484j1758L215R071J005r1K152l880r582L25J3225O515
2058A2053q312p760R30J660l28N129O388n721j1197j58P369K880j329J881j314
2073B171q519k958R563P637n980o688K991K614l932N64P484l7q747k526P232K699
2089C568l892L1K767l821m973M750O116l533n349K943K974n207k816O862M026
$$ plain form
2104 4446 -1251 -5203 -734 555 -4034 -2971 4446 4322 -3526 -4730 1014 1136 -1671 1303 4350
2119 4350 -1626 -6951 -862 5636 1861 -3744 -1781 62 -3291 -2702 4468 4827 -3647 -7144 -850
2134 -850 2891 572 832 3443 -289 -5247 -1673 5900 4308 -1451 -309 3012 -292 -2367 3116
2149 3116 5798 -975 -5186 607 4924 92 -2430 1279 2333 -2641 -2479 3947 3665 -1834 -1733 3095
2165 3095 1844 -2335 523 5196 2472 -1854 1277 4692 -563 -3479 2358 6249 725 -3071 670
2180 670 2058 -2501 -1816 5007 4223 -4263 -4872 1676 3310 -602 -429 2169 -1272 -4273 1031 6471
2196 6471 2156 -3608 -1962 1178 -445 501 4834 3075 -5224 -6372 1104 4641 415 -1632 -107
2211 -107 -2197 -5059 -1127 4340 1704 -4810 -4161 506 547 -1258 1209 1703 -2881 -4689 566 4153
$$ packed form
2104D446n697l952M469J289m589J063P417j24p848j204N744J22k807K974L047
2119D350n976n325O089O498l775n605J963J843l353N89P170L59q474l497O294
2134h50L741k319K60K611l732m958L574P573j592n759J142L321l304k075N483
2149C116K682o773m211N793M317m832k522L709J054m974J62O426k82n499J01M828
2165C095j251m179K858M673k724m326L131L415n255k916N837L891n524l796L741
2180F70J388m559O85O823p84q486o09O548J634l912J73K598l441l001N304N440
2196F471m315n764J646L140j623R46M333j759q299j148P476L537m226k047J525
2211a07k090k862L932N467k636o514O49M667M1j805K467M94m584j808N255L587
$$ plain form
2227 4153 402 -2750 -1267 -225 -2531 -1305 2453 1666 -3511 -3770 576 484 -2406 -1540 890 -1024
2243 -1024 -3551 -814 1800 -1018 -3121 -192 2396 -185 -2211 452 1780 -1360 -1983 2008 2658
2258 2658 -1375 -2147 1058 1422 -1019 -344 1407 -174 -2167 342 2670 50 -2460 23 1581 -58
2274 -58 -605 2392 2790 -1296 -2169 1575 2866 611 734 2360 1020 -1595 -95 2884 1818 -459
2290 -459 820 1686 -589 -1409 1521 3385 460 -1488 181 1029 -283 768 3337 1662 -2213 -1801
2306 -1801 1737 3454 1502 909 634 -1479 -2418 1302 4770 2698 -1328 -2243 -1101 -1419 603 3766
2322 3766 2688 -3466 -5346 -1274 2411 2262 955 -215 -2806 -4410 -459 4382 4239 -1109 -4008
2337 -4008 -3542 -953 1710 4307 2762 -3332 -6526 -2942 1510 3242 2169 2 -4426 -6823 -2962
$$ packed form
2227D153l751l152J483J042k306J226L758p87n177k59M346r2k890Q66K430j914
2243a024k527K737K614k818k103K929K588k581k026K663J328l140o23L991O50
2258B658m033p72L205L64k441O75J751j581j993K509K328k620k510K483J558j639
2274e8n47K997L98m086q73L744J291k255J23J626j340k615J500K979j066k277
2290d59J279Q66k275q20K930J864k925j948J669Q48j312J051K569j675l875M12
2306a801L538J717j952n93k75k113r39L720L468k072m026r15J142l18K022L163
2322C766j078o154j880M072L685j49j307j170k591j604L951M841j43n348k899
2337d008M66K589K663K597j545o094l194L584M452J732j073k167m428k397L861
$$ plain form
2352 -2962 3767 5006 -409 -4269 -4500 -2810 -99 3463 3759 -794 -5663 -4765 134 3379 3846 1465
2368 1465 -3238 -6567 -3526 3216 5492 1881 -2808 -4654 -4691 -1423 3824 5846 1174 -5754 -6265 -1754
2384 -1754 3256 4876 3520 -1093 -5045 -4254 1301 5751 4852 700 -3394 -4717 -1498 3931 6933
2399 6933 3386 -3340 -5720 -2547 1969 4886 5067 916 -4782 -6111 -199 5600 6060 2719 -1510
2414 -1510 -4397 -3602 1877 7730 6246 -445 -4912 -3484 1102 4440 5854 3335 -1967 -6062 -2512
2429 -2512 3646 6266 3286 -954 -4042 -4853 -355 5143 6183 1132 -3948 -4551 -2030 1588 5418
2444 5418 5338 -499 -5878 -4749 1531 4849 4004 875 -2294 -4982 -3733 1890 5762 2939 -2590 -5281
2460 -5281 -3906 -427 3201 4549 599 -5357 -6048 -1309 2915 3404 1937 -1125 -5261 -5654 -371 5202
$$ packed form
2352b962O729J239n415l860k31J690K711L562K96m553m869Q98M899L245M67k381
2368A465m703l329L041O742K276l611m689j846l7L268N247K022m672o928n11M511
2384a754N010J620j356m613l952P91N555M450q99m152m094j323L219N429L002
2399F933l547o726k380L173M516K917J81m151n698j329N912N799M60l341m229
2414a510k887P95N479N853j484o691m467J428M586L338J414k519n302m095L550
2429b512O158K620k980m240l088q11M498N498J040n051n080o03K521L618L830
2444E418q0n837n379J129O280L318q45l129l169k688J249N623L872k823n529k691
2460e281J375L479L628J348l950n956o91M739M224M89j467l062m136l93N283N573
$$ plain form
2476 5202 3918 -1106 -4306 -4163 -2315 524 3936 2936 -2225 -5705 -3739 124 2253 2333 241 -3123
2492 -3123 -5460 -2598 2327 3936 1310 -1985 -3451 -3331 -1127 3352 4923 794 -3777 -4101 -1062
2507 -1062 1489 3176 2982 106 -4483 -4710 100 4151 3172 120 -1653 -2961 -2839 1005 4899 3550
2523 3550 -1090 -3818 -2231 781 3184 4614 2774 -2204 -4090 -1136 3385 4478 2898 658 -2514
2538 -2514 -3829 -1002 4589 5630 1175 -3192 -3459 -1250 1287 4238 4498 324 -4711 -3741 1245 4387
2554 4387 4016 1830 -1009 -3916 -2905 2471 6168 3524 -1574 -3262 -2756 -810 3302 5766 2376
2569 2376 -4472 -5790 -1190 2692 3628 2902 399 -4373 -5943 -837 5417 4974 -481 -3719 -3395 -2816
2585 -2816 878 5034 4461 -2121 -6347 -3817 743 3356 3484 1107 -3538 -7137 -3350 3764 4641 717
$$ packed form
2476E202j284n024l200J43J848K839L412j000n161l480J966L863K129Q0k092l364
2492c123k337K862M925J609k626l295j466J20K204M479J571m129m571l24L039
2507a062K551J687j94k876m589k27M810M051r79l052j773j308J22L844L894j349
2523C550m640k728J587L012K403J430j840m978j886K954M521J093j580k240l172
2538b514j315K827N591J041m455m367k67K209K537K951K60m174n035R70M986L142
2554D387l71k186k839k907J011N376L697k644n098j688N06J946M112K464l390
2569B376o848j318M600L882R36p26k503m772j570N106O254m43n455l238L24N79
2585b816L694M156n73o582m226K530M560K613J28k377m645l599L787P114Q77l924
$$ plain form
2601 717 -2967 -3980 -4220 -2112 3779 5873 223 -5903 -5593 -948 2105 2752 2920 -972 -6268 -5717
2617 -5717 1189 5157 3044 -856 -2984 -4022 -3810 1844 6856 3398 -4163 -6305 -2514 1221 3159
2632 3159 4300 1640 -4597 -6689 -1275 5269 5088 1517 -1766 -3790 -4511 505 7029 6094 -1664 -5783
2648 -5783 -3074 955 3109 4601 3967 -2266 -6977 -3072 4694 6432 2554 -1028 -3307 -4078 -460
2663 -460 6078 6993 -65 -4831 -3320 454 2282 4382 4609 -337 -5802 -3371 3489 5516 2018 -860
2679 -860 -1521 -2681 -1730 3198 6090 1244 -3726 -2886 -268 543 1910 3877 1249 -4144 -3809 1586
2695 1586 3709 1228 102 788 -1510 -3477 -91 4111 2629 -1851 -2566 -813 -1083 -583 2578 3031
2711 3031 -1895 -4596 -1392 1568 824 279 1388 -1023 -4753 -3424 2407 3460 -556 -2511 -1469
$$ packed form
2601G17l684j013k40K108N891K094n650o126L10M645L053O47J68l892n296N51
2617e717O906L968k113l900k128j038K12N654N012l458p561k142L791L735J938
2632C159J141k660o237k092N414O544j81l571l283k024p21N016O524r35p758m119
2648e783K709M029K154J492o34o233m711L905P766J738l878l582k279p71L618
2663d60O538R15p058m766J511L774J828K100K27m946n465K431O860K027l498k878
2679h60o61j160R51M928K892m846m970Q40K618Q11J367J967k628n393L35N395
2695A586K123k481j126O86k298j967L386M202j482m480p15J753k70N00L161M53
2711C031m926k701L204K960p44n45J109k411l730J329N831J053m016j955J042
$$ plain form
2726 -1469 -2202 -2231 1731 3957 -411 -5041 -3083 914 875 34 1459 -344 -4643 -3823 1872 3661 -299
2743 -299 -2473 -1044 -1312 -2302 425 3709 207 -4643 -2893 1755 1924 -525 186 588 -2103 -2839 1334
2760 1334 3292 -152 -2539 -169 1293 -692 -820 2170 1267 -2429 -1245 2682 2002 -1508 -1366 1689
2776 1689 671 -1315 735 2355 -496 -2270 1157 3494 653 -1994 -18 1923 318 333 2704
2791 2704 1417 -2105 -1902 2612 3452 -74 -361 1011 -471 -983 1665 4296 896 -2937 -1373 2084
2807 2084 1737 375 1706 667 -2464 -1677 2682 3646 -567 -2143 457 538 -1062 1006 3272 513
2823 513 -3284 -1846 2460 1872 -883 -322 780 -1603 -2073 1090 1971 -1280 -2379 441 933 -1517
2839 -1517 -1238 1263 308 -2590 -1325 1870 511 -2848 -1237 1605 112 -2434 -937 875 -538
$$ packed form
2726a469p33k9L962K226m368m630J958L997l9q41J425j803m299Q20N695J789l960
2743b99k174J429k68r90K727L284l502m850J750M648J69k449P11M02k691p36M173
2760A334J958l444k387K370J462j985j28K990r03l696J184L927o80l510J42L055
2776A689j018j986K050J620k851j774L427K337k841k647J976J941j605J5K371
2791B704j287l522K03M514Q40l526k87J372j482n12K648K631l400l833J564L457
2807B084l47j362J331j039l131P87M359R64m213j576K600Q1j600K068K266k759
2823E13l797J438M306n88k755N61J102k383m70L163Q81l251j099K820M92k450
2839a517K79K501r55k898J265L195j359l359J611K842j493k546J497J812j413
$$ plain form
2854 -538 -2082 484 1457 -1689 -2832 -530 1011 -689 -1237 430 -993 -3133 -1053 2681 1016 -2567
2870 -2567 -2493 546 165 -1165 739 1900 -1157 -3497 -267 2361 415 -1381 -336 -121 -1762 -831
2886 -831 2053 1847 -1714 -2337 832 1100 -590 234 1927 -394 -2571 -245 2848 972 -1711 324
2902 324 1816 46 -1014 907 1792 -486 -1130 1722 1908 -885 -1358 1881 1555 -514 -10 1436 401
2919 401 -1731 509 3167 1297 -2043 -972 1673 1032 613 1641 1578 -1592 -2230 1498 3535 1595
2935 1595 -306 -100 -607 -1368 1285 4022 1589 -2428 -2501 222 1358 863 1464 913 -2740 -3671 247
2952 247 3717 2125 -1107 -1796 -1607 -1457 559 3523 2127 -2383 -3439 -627 973 1117 1567 794 -2596
2969 -2596 -4192 -1261 2711 2258 -876 -1897 -1983 -2314 -694 2361 2527 -1057 -4067 -2248 -82 1190
$$ packed form
2854e38j544K566R73l146j143K302J541j700n48J667j423k140K080L734j665l583
2870b567P4L039l81j330J904J161l057k340L230K628j946j796J045K15j641R31
2886h31K884k06l561o23L169K68j690Q24J693k321k177K326L093j876k683K035
2902C24J492j770j060J921Q85k278o44K852J86k793m73L239l26k069N04J446j035
2919D01k132K240K658j870l340J071K645o41m19J028o3l170o38L728K037j940
2935A595j901K06n07p61K653K737k433m017p3K723J136m95O01n51l653r31L918
2952B47L470j592l232o89J89J50K016K964j396m510j056K812J600J44M50p73l390
2969b596j596K931L972m53l134j021q6l31J620L055J66l584l010J819K166J272
$$ plain form
2985 1190 1508 1581 -1963 -4337 -2161 1980 2620 322 -979 -1940 -3229 -2143 1837 3998 574 -3499
3001 -3499 -3370 -1261 633 2009 2598 -93 -4174 -3721 758 3370 2242 379 -1312 -3304 -2357 1905
3017 1905 5215 2793 -1966 -3618 -1625 282 2506 3952 1592 -2945 -4752 -688 3605 3846 2062
3032 2062 -900 -3176 -3255 909 5066 4001 -438 -3069 -2055 46 2320 4709 3519 -1603 -4535
3047 -4535 -1665 2903 4745 2788 -117 -2625 -3379 -218 4073 4716 1181 -2669 -3521 -1210 1415 4050
3063 4050 3857 -460 -4116 -3316 1361 4012 2979 823 -1471 -3602 -2142 2316 4536 2341 -1635
3078 -1635 -3622 -2388 48 2787 3581 527 -3391 -4596 -1461 1882 3339 1594 -923 -4057 -3673
3093 -3673 7 3146 3090 -366 -3187 -3277 -1367 1274 2999 2151 -1847 -4426 -3069 107 2467 2222
$$ packed form
2985A190L18P3l544k374K176M141O40k298j301r61j289J086L980K161l424m073
3001c499J29K109J894J376N89k691m081M53M479K612j128j863j691j992R47M262
3017A905L310k422m759j652J993J907K224J446k360m537j807M064M293K41j784
3032B062k962k276p9M164M157j065m439k631J014K101K274K389j190n122k932
3047d535K870M568J842j957k905k508p54L161M291O43l535l850q52K311K625K635
3063D050j93m317l656Q00M677K651j033k156k294k131J460M458K220k195l976
3078a635j987J234K436K739P94l054l918j205L135L343J457j745k517l134L84
3093c673L680L139n6l456k821r0J910K641J725q48l998k579J357L176K360k45
$$ plain form
3109 2222 110 -3110 -4380 -1911 1918 2907 706 -2016 -3527 -2853 -240 2676 2784 -261 -3278 -3195
3125 -3195 -1007 1655 2735 1507 -1076 -3451 -2815 362 2756 2132 -216 -2048 -3054 -1443 1516
3140 1516 3025 1335 -1736 -3124 -1950 542 2295 2796 920 -1989 -2726 -272 2283 3168 2170 -233
3156 -233 -2470 -2032 646 3157 3383 1028 -1680 -2117 -1292 1186 3456 2691 -331 -2715 -1908 1198 2802
3173 2802 2582 1353 -1257 -2727 -1337 2159 3583 2420 -146 -2185 -2218 454 3089 3765 882 -1959
3189 -1959 -2878 -668 1418 2908 2233 118 -2897 -2859 213 3025 2915 529 -1981 -2738 -1236 1009
3205 1009 3230 2368 -581 -3153 -2438 96 2295 2807 1005 -2132 -3892 -1716 1843 3132 1153 -1268
3221 -1268 -3447 -3261 -868 1940 3024 212 -3193 -4145 -1789 1201 3078 1628 -1430 -4010 -3281 -31
$$ packed form
3109B222k112l220j270K469L829R89k201k722j511O74K613K916J08l045l017Q3
3125c195K188K662J080j228k583k375O36L177K394o24k348j832j006J611K959
3140A516J509j690l071j388J174K492J753N01j876k909p37K454K555Q85r98k403
3156b33k237M38K678K511K26k355k708m37Q25K478K270p65l022k384Q07L106J604
3173B802k20j229k610j470J390L496J424j163k566k039l3K672K635O76k883k841
3189a959r19K210K086J490o75k115l015L8L072K812j10k386k510p57J502K245
3205A009K221q62k949k572P15K534K199N12j802l137j760K176L559J289j979k421
3221a268k179J86K393K808J084k812l405r52K356K990J877j450l058k580P29L250
$$ plain form
3237 -31 2595 2469 203 -2409 -3869 -2157 1531 3186 1726 -2390 -3989 -2749 54 2706 2377 -196
3253 -196 -3428 -4029 -1276 1827 2955 1783 -1224 -4017 -3055 984 3848 2613 -993 -2810 -2442 -404
3269 -404 1970 3619 1753 -1831 -3644 -1396 2082 3036 2067 -347 -2720 -2893 63 3279 3315 337
3285 337 -1612 -1760 -1153 1318 3565 3349 -421 -3035 -1343 1378 2359 2204 1394 -830 -2807 -1133 1744
3302 1744 3393 1774 -695 -1364 -1285 -112 2516 3386 570 -2083 -2329 87 1425 2120 2198 494 -2492
3319 -2492 -2433 860 3367 2037 -222 -907 -1557 -1607 794 3262 1898 -1840 -2850 -910 595 1167 1914
3336 1914 482 -2360 -3171 -44 2352 1601 -590 -1397 -1806 -1979 232 2734 2178 -1595 -3152 -1336
3352 -1336 349 715 613 630 -1480 -3328 -1100 1665 1377 -1298 -1638 -1171 -1575 -719 1615 1312 -1570
$$ packed form
3237c1K626j26k266k612j460J712L688J655j460m116j599J240K803K652l29k573
3253a96l232o01K753L103J128j172l007k793R62M039K864j235l606j817L68K038
3269d04K374J649j866l584j813K248L478R54r69k414k373j73K956L216L6k978
3285C37j949j48O07K471K247k16l770k614J692K721R81j55q10k224j977J674K877
3302A744J649j619k469o69P9J173K628Q70k816k653k46K416J338O95P8j704k986
3319b492N9L293K507j330k259o85o50n0K401K468j364l738j010J940J505N72P47
3336A914j432k842q11L127K396p51k191q07m09j73K211K502n56l773j557J816
3352a336J685L66j02J7k110j848K228K765k88k675l40M67m04Q56K334l03k882
$$ plain form
3369 -1570 -2709 -626 947 -2 -263 258 -143 -1888 -786 1566 1063 -1103 -1394 -84 73 -833 500
3386 500 1207 -859 -1725 472 1231 -246 -1332 342 1258 -510 -1010 752 881 -725 -425 1362 1286
3403 1286 -914 -237 1149 922 -340 721 1308 -510 -1324 948 2518 245 -1156 487 1086 -324
3419 -324 -115 2057 1769 -1341 -1563 1271 1648 282 297 1249 221 -812 967 2480 472 -1252 353
3436 353 1795 649 -736 1008 1247 -954 -1292 1465 1911 -754 -1588 661 1049 -548 -698 1287 266
3453 266 -1465 302 2343 875 -1770 -840 1267 142 -599 688 1191 -1657 -2428 707 2412 -38
3469 -38 -1947 -625 -142 -1253 -137 1772 423 -2758 -2178 913 1139 -318 -694 -150 -1633 -2418 1301
3486 1301 2762 -433 -3011 -1249 270 -227 -286 1167 372 -2943 -2653 1116 2005 -1011 -1567 -20 -701
$$ packed form
3369a570j139K083J573r49k61N21m01j745J102K352n03k166k91J310J57r06J333
3386E00P07k066q66K197P59j477j086J674R16j768n00J762J29j606L00J787p6
3403A286k200O77J386k27j262J061N87j818q14K272J570k273j401J643N99j410
3419c24K09K172k88l110k22K834L77j366J5R52j028j033J779J513k008j724J605
3436C53J442j146j385J744K39k201l38K757M46k665q34K249L88j597j50J985j021
3453B66j731J767K041j468k645R30K107j125p41J287N03k848p71L135J705k450
3469c8j909J322M83j111J116J909j349l181N80L091K26j457l76N44j483p85L719
3486A301J461l195k578J762J519m97n9J453p95l315K90L769Q89l016n56J547o81
$$ plain form
3503 -701 -1469 546 1742 -222 -2730 -620 1549 383 -681 270 755 -1338 -1548 1581 1812 -924
3519 -924 -1811 818 1141 -811 -890 1003 623 -1085 -417 1562 313 -1845 -478 1531 886 -469 577
3536 577 1038 -933 -1011 2109 3008 7 -1683 239 1139 624 453 1852 613 -1997 -913 2112 2267
3553 2267 -267 -779 -67 -611 -333 2153 2929 -208 -2688 -484 1755 1184 191 1475 508 -2399 -1604
3570 -1604 2165 2683 66 -1033 2 -90 -882 1000 2297 -35 -2171 -751 1199 688 63 747 630
3587 630 -1892 -2450 431 1751 98 -971 -28 88 -1981 -873 2241 1484 -1434 -2092 -492 -235 -521
3604 -521 850 1679 -1032 -3537 -1411 863 936 58 115 -967 -2796 -2103 1453 2864 -63 -2156 -2141
3621 -2141 -1390 -502 1465 2963 36 -4169 -3067 504 2115 1730 635 -948 -3308 -2685 1298 3719
$$ packed form
3503g01p68K015J196j964k508K110K169j166j064R51M85k093k10L129K31k736
3519i24q87K629L23j952p9J893l80j708O68J979j249k158J367K009o45j355J046
3536E77M61j971p8L120Q99l001j690J922R00n15j71J399j239k610J084L025J55
3553B267k534n12P12n44K78K486P76l137k480K204K239n71r93J284r67k907P95
3570a604L769N18k617j099J035r2p92J882J297k332k136J420J950n11o25O84j17
3587F30k522n58K881J320j653j069R43J16k069J108L114p57k918o58J600K57k86
3604e21J371Q29k711k505K126K274P3q78N7j082j829O93L556J411k927k093J5
3621b141P51Q88J967J498k927m205J102L571J611l85j095j583k360O23L983K421
$$ plain form
3637 3719 1426 -2160 -2527 -1709 -554 1756 3170 1093 -3114 -3671 -585 2613 2689 1377 -626 -2827
3653 -2827 -2594 1186 4063 2512 -919 -2352 -1445 -511 1409 3118 1923 -1517 -3583 -878 1952 2576
3669 2576 1783 355 -1482 -2612 -301 3381 3473 702 -1442 -1682 -1125 1106 3319 3096 -140 -2625
3685 -2625 -1826 499 2210 2534 1646 -800 -2983 -1930 1862 3649 1612 -875 -1984 -1758 -153 2363
3701 2363 3095 1224 -2031 -2538 -727 1147 2722 1969 -602 -3022 -2655 303 2748 2007 -162 -2141
3717 -2141 -2669 -1634 993 2906 1564 -1938 -3582 -2075 224 2116 2080 128 -2775 -3035 -1142 1733
3733 1733 2241 857 -1313 -2338 -2272 -91 2337 1813 -593 -2823 -2589 -512 1074 1841 961 -1684 -2991
3750 -2991 -2150 251 1855 1407 -398 -2144 -2616 -580 1226 2143 762 -1284 -2317 -1453 123 1752
$$ packed form
3637C719k293l586l67Q18J155K310J414k077m207n57L086L198P6j312k003k201
3653b827K33L780K877j551l431j433R07R34J920J709j195l440k066K705K830O24
3669B576p93j428j837j130K311L682R2k771k144k40N57K231K213k23l236k485
3685b625P99K325J711L24q88k446k183J053L792J787k037k487j109K26J605K516
3701B363P32j871l255n07J811J874J575p53k571k420L67K958K445p41k169j979
3717b141n28J035K627J913j342l502j644J507K299J892l6j952k903k60J893K875
3733A733N08j384k170j025O6K181K428n24k406k230K34K077J586P67q80k645j307
3750b991Q41K401J604m48j805j746m72K036J806R17j381k046j033Q64J576J629
$$ plain form
3766 1752 1788 77 -1968 -2341 -286 1666 2169 770 -1053 -1956 -1356 834 1842 1635 175 -1215 -2017
3783 -2017 -308 1264 2317 1408 -792 -1612 -980 929 2278 1784 354 -1013 -1594 -231 1764 2497
3799 2497 1425 -528 -1705 -991 996 2389 1549 505 -1149 -1125 -362 1573 2209 1292 -557 -1642 -1264
3816 -1264 474 2201 2137 207 -1598 -1744 -125 1290 1943 1385 -253 -1753 -1689 171 1655 1789 163
3833 163 -1612 -1917 -512 694 1520 884 -844 -2054 -1535 1 1489 1526 190 -1630 -2208 -1201 1195
3850 1195 1931 799 -963 -2067 -1709 -104 1300 1602 8 -2019 -2712 -1365 860 1467 346 -1371
3866 -1371 -2219 -1907 -177 1772 1321 -195 -2018 -2320 -867 1036 1804 844 -1446 -2769 -1782 708 1896
3883 1896 1144 -261 -1950 -2087 -695 995 2005 724 -1217 -2033 -1320 399 2062 1766 84 -1742
$$ packed form
3766A752L6j711k045l73K055J952N03j399j823r03O00K190J008k07j460j390q02
3783b017J709J572J053r09k200q20O32J909J349m94j430j367n81J363J995P33
3799B497j072j953j177P14J987J393q40j044j654K4P63J935O36r17j849j085L78
3816a264J738J727o4j930j805j46J619J415O53n58j638j500O4J860J484J34j626
3833A63j775l05J405J206Q26o36j728j210N19J536J488L7j336j820n78J007K396
3850A195P36j132j762j104L58J605J404L02j594k027o93J347K225O07j121j717
3866a371q48L12J730J949m51j516j823l02J453J903P68r60k290j323R87K490J188
3883A896p52j405j689j37J392J690J010j281j941q16P13J719J663k96j682j826
$$ plain form
3899 -1742 -1903 -219 1710 1956 973 -930 -2084 -1138 1211 2571 1521 -414 -1754 -1215 329 1401
3915 1401 2288 1198 -1192 -2162 -369 1498 2545 1574 -326 -1507 -1130 514 2204 2088 446 -1399
3931 -1399 -1087 53 1016 2165 1821 -417 -2261 -1127 1301 2117 1153 197 -1075 -1802 -462 1576 2432
3948 2432 759 -1193 -1545 -862 749 1939 1939 -95 -1851 -1676 730 1819 1164 285 -748 -1614 -1215
3965 -1215 682 1813 903 -1314 -1789 -764 57 541 1053 186 -1314 -1648 -301 831 546 61 -281
3982 -281 -1162 -1673 -6 1259 802 -1076 -1343 -257 -482 -339 542 556 -767 -1584 -640 347 316 -251 -136
4001 -136 -615 -1117 -592 488 671 -558 -851 -127 -316 -760 276 1094 275 -1313 -927 494 416 -436 254
4020 254 383 -656 -1241 481 1229 227 -819 167 118 -749 427 1379 589 -1172 -420 893 1218 -156
$$ packed form
3899a742j61J684J929K46r83j903j154R46K349J360j050j935j340N39J544J072
3915A401Q87j090k390r70J793J867J047r71j900j181L77J644J690j16j642j845
3931a399L12J140R63J149l44k238j844J134K428Q16r64r56j272p27J340K038Q56
3948B432j673j952l52O83J611J190%k034j756J75K406J089o55q79j033q66L99
3965a215J897J131r10k217m75J025Q21M84N12q67j500l34J347J132k85m85l42
3982b81q81n11J667J265m57j878k67J086k25J43Q81J4j323q17R44R87l1n67J15
4001a36m79n02N25J080J83j229k93P24j89m44J036Q18q19j588L86J421p8q52O90
4020B54J29j039n85J722P48j002j046R86m9q67J176R52p90j761P52J313L25j374
$$ plain form
4038 -156 34 833 173 -691 467 1886 828 -1154 -88 564 173 78 1045 954 -796 -435 1278 1396
4056 1396 -38 -330 866 649 -376 633 1726 494 -1553 -296 1268 993 -273 -238 385 -614 -673
4073 -673 1248 1652 -177 -1414 15 763 288 378 1013 -276 -1770 -442 1875 1255 -795 -846 -86 -412
4091 -412 -661 917 1337 -554 -2185 -524 926 357 -517 -162 -209 -1453 -827 1052 1101 -1233 -1257 1
4109 1 -256 -912 -101 1105 -613 -1958 -615 1028 -148 -1489 -441 572 -724 -1201 84 681 -963
4126 -963 -991 193 -28 -1438 -1028 641 570 -1111 -642 422 -342 -1439 -206 1635 139 -1580 -896
4143 -896 537 -88 -550 695 785 -1242 -1582 717 1913 282 -665 192 -280 -718 433 2067 1055
4160 1055 -1739 -1220 783 1056 36 802 1124 -779 -1467 1182 2626 1036 -865 -210 387 -112 494
$$ packed form
4038a56J90P99o60q64J158J419j058j982J066O52l91r5R67r1j750L61J713J18
4056A396j434k92J196k17j025J009J093j232k047J257J564k75j266L5O23r99n9
4073f73J921M04j829j237J429P48m75R0O35j289j494J328K317o20k050n1P60l26
4091d12k49J578M20j891j631J661J450n69q74L55m7j244O26J879M9k334k4J258
4109Ak57o56Q11J206j718j345J343J643j176j341J048J013j296m77J285N97j644
4126i63k8J184k21j410M10J669p1j681M69J064p64j097J233J841j496j719O84
4143h96J433o25m62J245R0k027l40K299J196j631r47Q57m72m38J151J634j012
4160A055k794N19K003K73j020P66L22j903o88K649J444j590j901O55N97m99O06
$$ plain form
4177 494 1992 1234 -1109 -1456 1300 1621 30 141 1063 -87 -1402 339 2249 1138 -1083 -439 775
4194 775 4 -637 858 1497 -250 -967 492 743 -618 -195 1250 980 -1057 -980 566 534 -522 544
4212 544 1080 -301 -2217 -353 1414 952 -327 -429 -411 -1142 -503 1439 1504 -766 -2383 -1073 313
4229 313 377 735 755 -998 -2733 -1148 1730 1704 -409 -1222 -1296 -1361 -307 1743 1959 -965 -2574 -1771 307
4248 307 821 849 643 -1100 -2963 -1511 1902 1922 3 -1362 -1133 -1368 -451 1694 2292 -136 -2753 -1770
4266 -1770 595 1156 886 923 -369 -2522 -1512 826 2321 1004 -675 -1172 -1186 -782 1224 2252 1107
4283 1107 -1607 -1635 287 524 589 1587 807 -1327 -1906 48 2168 1703 701 -187 -1007 -1292 372 2309
4301 2309 1927 -69 -1207 -815 10 812 2003 1863 -432 -2313 -964 1530 2193 1287 415 -942 -1902
$$ packed form
4177D94J498p58k343l47K756L21j591J11R22j150j315J741J910j111k221O44J214
4194G75p71o41J495O39j747p17J459K51j361M23J445k70k037P7J546l2j056J066
4212E44N36j381j916J864J767m62j279j02J8p31O39J942O5k270j617J310J386
4229C13O4L58K0j753j735J585K878k6k113q13p4o5J054K050K16k924j609Q03K078
4248C07N14K8k06j743j863J452L413K0j919j365K29k35R17K145N98k428k617R83
4266a770K365N61k70L7j292k153J010K338J495j317j679m97j4M04K006J028j145
4283A107k714k8J922K37O5R98p80k134n79J954K120m65j002q88q20k85J664J937
4301B309l82j996j138L92Q25Q02J191j40k295j881J349K494O63r06q72j357r60
$$ plain form
4318 -1902 -545 2020 2937 842 -1658 -1875 -744 1198 2334 1959 -241 -2334 -1423 963 2070 1507
4334 1507 451 -1218 -2178 -1342 1453 2618 1051 -1468 -2006 -1115 263 1640 1500 59 -2202 -2192 -352
4351 -352 1290 1404 473 -939 -2166 -1743 697 1859 1104 -1049 -1830 -1270 -757 729 1526 644 -1503
4368 -1503 -2445 -1165 677 1397 711 -473 -1671 -1983 -455 1280 1474 2 -1128 -1400 -1268 -233 1409
4385 1409 1503 -540 -1614 -1276 -319 1004 1226 684 -1022 -1763 -998 922 1519 622 141 -1104 -1622 -267
$$ packed form
4318a902J357K565R17k095k500k17J131J942J136l75k200k093R11K386J107n63
4334A507j056j669r60Q36K795J165j567k519n38Q91J378J377j40j441k261J0J840
4351c52J642J14r31j412j227M23K440J162p55k153p81N60N13J486P97q82k147
4368a503r42J280J842P20o86j184j198l12J528J735J94j472j130k72J32J035J642
4385A409R4k043j074L38R57J323K22n42j706p41P65J920N97q97m81j245n18J355
$$ [...]
8191E7
##END NTUPLES=NMR FID
##END=
