##TITLE=1H_LacDMe-C19-B-14
 CDCl3, 8 sc, 
 11.11.2019
##JCAMPDX= 6.0         $$ Bruker NMR JCAMP-DX V2.0
##DATA TYPE= NMR FID
##DATA CLASS= NTUPLES
##ORIGIN= UXNMR, Bruker Analytische Messtechnik GmbH
##OWNER= root
$$ XWIN-NMR		Version 3.5
$$ Mon Nov 11 14:24:41 2019 Russian Standard Time (UT+4h)  she@DPX200
##.OBSERVE FREQUENCY= 200.1315
##.OBSERVE NUCLEUS= ^1H
##.DELAY= (6, 6)
##.ACQUISITION MODE= SIMULTANEOUS
##.ACQUISITION SCHEME= undefined
##.AVERAGES= 8
##.DIGITISER RES= 18
##SPECTROMETER/DATA SYSTEM= spect
##.PULSE SEQUENCE= zg30
##.SOLVENT NAME= CDCl3
##.SHIFT REFERENCE= (INTERNAL, CDCl3, 0, 15.7039)
##AUDIT TRAIL= $$ (NUMBER, WHEN, WHO, WHERE, WHAT)
$$ ##TITLE= Audit trail, XWIN-NMR		Version 3.5
$$ ##JCAMPDX= 5.01
$$ ##ORIGIN= Bruker BioSpin GmbH
$$ ##OWNER= she
$$ F:/spectra/data/she/nmr/H-F/1/audita.txt
$$ ##AUDIT TRAIL=  $$ (NUMBER, WHEN, WHO, WHERE, WHAT)
(   1,<2019-11-11 14:23:34.85 +0400>,<she>,<DPX200>,
      <created by zg, POWCHK disabled, PULCHK disabled
       configuration hash MD5:
       00 E9 B6 7A A2 85 ED C7 34 08 36 98 17 FE 4E 26
       data hash MD5: 16K
       33 69 C0 70 10 6F 69 1E 3E F6 1D 84 69 A1 31 F9>)
$$ ##END=
$$ 
$$ hash MD5
$$ BD 10 C3 A6 2E D6 D4 B1 73 3B C0 E5 3A A9 6A 36
##$RELAX= 
##$RELAX= 
##$RELAX= 
##$RELAX= 
##$RELAX= 
##$RELAX= 
$$ Bruker specific parameters
$$ --------------------------
##$DU= <F:/spectra>
##$EXPNO= 1
##$NAME= <H-F>
##$PROCNO= 1
##$TYPE= <nmr>
##$USER= <she>
##$AMP= (0..31)
100 100 100 100 100 100 100 100 100 100 100 100 100 100 100 100 100 100 
100 100 100 100 100 100 100 100 100 100 100 100 100 100 
##$AQSEQ= 0
##$AQ_mod= 1
##$AUNM= <au_zg>
##$AUTOPOS= <>
##$BF1= 200.13
##$BF2= 200.13
##$BF3= 200.13
##$BF4= 200.13
##$BF5= 200.13
##$BF6= 200.13
##$BF7= 200.13
##$BF8= 200.13
##$BYTORDA= 1
##$CFDGTYP= 0
##$CFRGTYP= 5
##$CHEMSTR= <none>
##$CNST= (0..31)
1 1 145 1 1 1 1 1 1 1 1 1 1 1 1 1 1 1 1 1 1 1 1 1 1 1 1 1 1 1 1 1 
##$CPDPRG= <>
##$CPDPRG1= <>
##$CPDPRG2= <>
##$CPDPRG3= <>
##$CPDPRG4= <mlev>
##$CPDPRG5= <mlev>
##$CPDPRG6= <mlev>
##$CPDPRG7= <mlev>
##$CPDPRG8= <mlev>
##$CPDPRGB= <>
##$CPDPRGT= <>
##$D= (0..31)
0 1.2 0 0 0 0 0 0 0 0.06 0 0.03 0 0 0 0 0.0002 0 0 0 0 0 0 0 0 0 0 0 0 
0 0 0 
##$DATE= 1573467814
##$DBL= (0..7)
120 120 120 120 120 120 120 120 
##$DBP= (0..7)
150 150 150 150 150 150 150 150 
##$DBP07= 0
##$DBPNAM0= <>
##$DBPNAM1= <>
##$DBPNAM2= <>
##$DBPNAM3= <>
##$DBPNAM4= <>
##$DBPNAM5= <>
##$DBPNAM6= <>
##$DBPNAM7= <>
##$DBPOAL= (0..7)
0.5 0.5 0.5 0.5 0.5 0.5 0.5 0.5 
##$DBPOFFS= (0..7)
0 0 0 0 0 0 0 0 
##$DE= 6
##$DECBNUC= <off>
##$DECIM= 24
##$DECNUC= <off>
##$DECSTAT= 4
##$DIGMOD= 1
##$DIGTYP= 9
##$DL= (0..7)
0 120 120 120 120 120 120 120 
##$DP= (0..7)
150 150 150 150 150 150 150 150 
##$DP07= 0
##$DPNAME0= <>
##$DPNAME1= <>
##$DPNAME2= <>
##$DPNAME3= <>
##$DPNAME4= <>
##$DPNAME5= <>
##$DPNAME6= <>
##$DPNAME7= <>
##$DPOAL= (0..7)
0.5 0.5 0.5 0.5 0.5 0.5 0.5 0.5 
##$DPOFFS= (0..7)
0 0 0 0 0 0 0 0 
##$DQDMODE= 0
##$DR= 18
##$DS= 0
##$DSLIST= <SSSSSSSSSSSSSSS>
$$ [...]
##$SUBNAM2= <"">
##$SUBNAM3= <"">
##$SUBNAM4= <"">
##$SUBNAM5= <"">
##$SUBNAM6= <"">
##$SUBNAM7= <"">
##$SUBNAM8= <"">
##$SUBNAM9= <"">
##$SW= 24.0689530833862
##$SWIBOX= (0..15)
0 0 2 0 0 0 0 0 0 0 0 0 0 0 0 0 
##$SW_h= 4816.95568400771
##$TD= 16384
##$TD0= 1
##$TE= 0
##$TE2= 300
##$TE3= 300
##$TEG= 300
##$TL= (0..7)
0 120 120 120 120 120 120 120 
##$TP= (0..7)
150 150 150 150 150 150 150 150 
##$TP07= 0
##$TPNAME0= <>
##$TPNAME1= <>
##$TPNAME2= <>
##$TPNAME3= <>
##$TPNAME4= <>
##$TPNAME5= <>
##$TPNAME6= <>
##$TPNAME7= <>
##$TPOAL= (0..7)
0.5 0.5 0.5 0.5 0.5 0.5 0.5 0.5 
##$TPOFFS= (0..7)
0 0 0 0 0 0 0 0 
##$TUNHIN= 0
##$TUNHOUT= 0
##$TUNXOUT= 0
##$USERA1= <user>
##$USERA2= <user>
##$USERA3= <user>
##$USERA4= <user>
##$USERA5= <user>
##$V9= 5
##$VALIST= <valist>
##$VCLIST= <CCCCCCCCCCCCCCC>
##$VD= 0
##$VDLIST= <DDDDDDDDDDDDDDD>
##$VPLIST= <PPPPPPPPPPPPPPP>
##$VTLIST= <TTTTTTTTTTTTTTT>
##$WBST= 1024
##$WBSW= 4
##$XGAIN= (0..3)
0 0 0 0 
##$XL= 0
##$YL= 0
##$YMAX_a= 394052
##$YMIN_a= -315866
##$ZGOPTNS= <>
##$ZL1= 120
##$ZL2= 120
##$ZL3= 120
##$ZL4= 120
##$ABSF1= 10
##$ABSF2= 0
##$ABSG= 5
##$ABSL= 3
##$ALPHA= 0
##$AQORDER= 0
##$ASSFAC= 0
##$ASSFACI= 0
##$ASSFACX= 0
##$ASSWID= 0
##$AUNMP= <proc_1d>
##$AZFE= 0.1
##$AZFW= 0.1
##$BCFW= 1
##$BC_mod= 2
##$BYTORDP= 1
##$COROFFS= 0
##$CY= 11.3945322036743
##$DATMOD= 1
##$DC= 2
##$DFILT= <>
##$DTYPP= 0
##$F1P= 19.5091578491511
##$F2P= -0.509923556040331
##$FCOR= 0.5
##$FTSIZE= 0
##$FT_mod= 4
##$GAMMA= 1
##$GB= 0.15
##$INTBC= 1
##$INTSCL= 1
##$ISEN= 128
##$LB= 0.24
##$LEV0= 0
##$LPBIN= 0
##$MAXI= 10000
##$MC2= 0
##$MEAN= 0
##$ME_mod= 0
##$MI= 1.114404
##$NCOEF= 0
##$NC_proc= 0
##$NLEV= 6
##$NOISF1= 3.799351
##$NOISF2= 2.8
##$NSP= 1
##$NTH_PI= 0
##$NZP= 0
##$OFFSET= 15.70392
##$PC= 1
##$PHC0= -9458.757
##$PHC1= 20.20088
##$PH_mod= 1
##$PKNL= yes
##$PPARMOD= 0
##$PSCAL= 0
##$PSIGN= 0
##$REVERSE= no
##$SF= 200.130013532006
##$SI= 16384
##$SIGF1= 3
##$SIGF2= 2
##$SINO= 400
##$SIOLD= 16384
##$SREGLST= <1H.CDCl3>
##$SSB= 0
##$STSI= 0
##$STSR= 0
##$SW_p= 3612.71676300578
##$SYMM= 0
##$S_DEV= 0
##$TDeff= 0
##$TDoff= 0
##$TI= <>
##$TILT= no
##$TM1= 0
##$TM2= 0
##$TOPLEV= 0
##$USERP1= <user>
##$USERP2= <user>
##$USERP3= <user>
##$USERP4= <user>
##$USERP5= <user>
##$WDW= 1
##$XDIM= 8192
##$YMAX_p= 0
##$YMIN_p= 0
$$ End of Bruker specific parameters
$$ ---------------------------------
##NTUPLES= NMR FID
##VAR_NAME=  TIME,          FID/REAL,        FID/IMAG
##SYMBOL=    X,             R,               I
##VAR_TYPE=  INDEPENDENT,   DEPENDENT,       DEPENDENT
##VAR_FORM=  AFFN,          ASDF,            ASDF
##VAR_DIM=   8192,          8192,            8192
##UNITS=     SECONDS,       ARBITRARY UNITS, ARBITRARY UNITS
##FACTOR=    0.0002076,     1,               1
##FIRST=     0,             0,               0
##LAST=      1.7004516,     0,               0
##MIN=       0,             -315866,         0
##MAX=       1.7004516,     394052,          0
$$ Real data points
##PAGE= N=1
##DATA TABLE= (X++(R..R)), XYDATA
0 0 0 0 0 0 0 0 0 0 0 0 0 0 0 8 -8 8 -8 12 -15 16 -20 24 -28 31 -36 44 -51 55 -65 74 -83 95 -105 120 -134
35 -134 149 -168 187 -206 231 -255 283 -312 346 -382 424 -468 518 -574 637 -708 787 -879 986
54 986 -1105 1238 -1367 1437 -1178 -1004 32322 394052 268642 -191306 -178795 68032 28896
67 28896 -100067 87338 239518 -4263 -252043 -69745 192259 127135 -45978 -30937 -11493
78 -11493 -104717 -68524 135868 158817 -59944 -162189 -31720 46632 -11581 -1612 76916 21321
90 21321 -103877 -58807 94217 94648 -33469 -58925 23395 43669 1787 16695 62184 35559
102 35559 -28731 -35806 993 22670 29535 28668 1453 -31924 -24791 3034 1222 -16968 -12140
115 -12140 3553 3282 -1775 -5595 -19051 -20575 13441 38219 4209 -37557 -13133 40800 45933
128 45933 15084 -2350 -14579 -30202 -7283 47165 56913 4622 -36500 -31609 -19746 -11411 16917
141 16917 34502 -4060 -58479 -52846 861 33507 18271 -22421 -54226 -40233 16031 47769
153 47769 15943 -20557 -11734 -1176 -19577 -9691 42852 49562 -13185 -40638 3593 24433 -11472
166 -11472 -15427 25670 15407 -46334 -43618 24073 37618 -21023 -45829 -17250 -6104 -13142 7413
179 7413 23707 -9193 -35500 -5964 18191 -6705 -13474 28413 37249 -10830 -24201 19835 29375
192 29375 -11530 -12456 30751 27910 -17859 -19148 15492 10036 -15459 2563 20489 -19767 -51515
205 -51515 -3854 52556 29019 -26890 -39168 -24052 -7362 29157 59034 20649 -45856 -39606
217 -39606 22108 40189 16527 17567 22329 -16955 -40786 14410 72355 38781 -32057 -44408
229 -44408 -12250 7961 24422 40323 11933 -47150 -57847 -6454 31318 24715 8581 -8104
241 -8104 -35112 -33629 15643 47315 14972 -23394 -13273 5826 -273 7940 40340 33632 -22685
254 -22685 -48355 -9702 31555 32775 15031 -7251 -33474 -34759 481 22465 1997 -17089
266 -17089 -6570 -6507 -28513 -20236 19615 21402 -20431 -34851 -5572 11263 4791 11633 19565 -7512
280 -7512 -34642 -12250 24300 21392 3003 5193 1693 -21892 -22623 8191 17885 -3940 -10601 -1725
294 -1725 -16472 -31192 -1422 31008 2852 -43816 -32750 8698 15465 3193 10653 7567 -25219
307 -25219 -33387 8653 38730 20476 228 2788 -6273 -21331 2006 38942 26603 -18014 -26581
320 -26581 -1126 8758 7778 16721 8188 -30478 -40868 3389 34708 12955 -10021 -2779 -4571
333 -4571 -23977 -10580 31401 35555 -1470 -16519 667 8320 6817 21590 26412 -4713 -25556
346 -25556 2031 33164 21145 -2224 -3185 -4434 -16473 -6521 21115 17966 -10307 -14399 1875
359 1875 -3728 -16162 653 21272 5870 -16313 -4056 14137 4866 -5192 9287 15112 -3408
372 -3408 -8981 8776 14615 3654 6145 12547 -7079 -28312 -7414 26125 19838 -9790 -17495
385 -17495 -12291 -15641 -7951 16276 15275 -18155 -31574 -6160 12701 3630 -2223 1919 -8300
398 -8300 -19415 -1458 22304 14312 -6281 -5226 -268 -11229 -10551 15660 24024 -4615 -24090
411 -24090 -8276 3980 -6628 -7989 6138 3397 -18019 -20810 -2632 5525 510 -379 -4931 -19515
425 -19515 -16425 11016 24403 5452 -12266 -7922 -3713 -5005 9252 26083 11896 -16924 -15881
438 -15881 6501 9917 596 3879 6949 -8257 -17812 -2490 12133 5795 -2525 -3894 -12787 -17504
452 -17504 3577 26438 13082 -14270 -12502 2730 -74 -536 20794 27027 -3681 -23471 -692
465 -692 22280 12625 1785 8586 2673 -15975 -7250 22555 21808 -7836 -16466 -2796 -1532 -6456
479 -6456 9334 21259 -376 -22995 -11009 7326 2660 2108 18141 12967 -18677 -23342 11215
492 11215 29047 9186 -6205 -2309 -5144 -11104 9562 31671 12701 -24786 -26502 -651 10511
505 10511 8998 11117 1060 -25093 -28344 1699 20683 5925 -9334 -8284 -10552 -14438 4377
518 4377 23480 7420 -21155 -16959 5476 7848 210 7832 10452 -9967 -20717 -3662 11456
531 11456 3680 -684 4176 -5489 -22528 -13250 12383 11193 -10252 -13339 -2926 -7261 -11186 6913
545 6913 17012 -5796 -25571 -9175 12581 8645 293 7204 3923 -15194 -15029 10480 20778
558 20778 3879 -6906 -1510 -3150 -8531 3561 16468 3885 -15797 -10393 4321 2711 -838
571 -838 8284 7558 -13273 -19677 2488 20119 10379 -1448 -115 -2261 -8376 356 18222 17846 11
586 11 -7901 -1791 4218 7921 12841 8178 -6436 -9683 2811 9356 3461 2467 6184 -1244 -14156
601 -14156 -7626 11327 14820 2214 -5525 -3411 -2135 -506 6985 10735 4111 -2651 -1491 752
615 752 2840 9161 11813 -247 -12610 -4590 10495 10594 -674 -2633 -984 -6477 -8804 1318 10361
630 10361 3464 -7888 -9662 -4888 -1382 1973 4652 -485 -7312 -5569 -329 232 1194 5353 3745
645 3745 -7400 -11971 -1503 9192 7273 536 -4077 -9535 -11519 -2709 8512 7496 -2977 -10782
659 -10782 -11969 -9456 -371 9381 6297 -9140 -15811 -7737 1718 4898 6580 3223 -9999 -16381
673 -16381 -2927 13576 11158 -723 -4670 -5158 -7786 -3087 11268 13896 -2977 -14288 -6929 2634
687 2634 2996 3559 4774 -3886 -13293 -6367 7737 8668 69 -2120 -2446 -8314 -5296 11366 17452 1345
703 1345 -11090 -4258 4585 3399 5405 12413 6393 -9013 -9869 4579 11916 7113 3301 -293 -8782
718 -8782 -9088 6767 16223 5236 -7330 -4842 -1879 -4734 1809 15296 12000 -8088 -13609 -283
732 -283 7988 4487 5903 9338 -481 -12442 -4103 11970 11346 1167 -1731 -2672 -7448 -3558 10429
747 10429 13301 -2760 -13083 -6533 336 103 4533 9713 -1978 -17715 -11398 8229 11885 -103
761 -103 -5562 -3540 -5898 -5481 6812 13118 1162 -12407 -10587 -357 4975 6802 5724 -4619
775 -4619 -14356 -8624 3546 5387 473 -293 -2981 -12292 -11646 3593 12320 1054 -11452 -8698 -1422
790 -1422 -503 1401 5784 1981 -7528 -7999 -506 2845 2730 4564 2084 -7456 -8835 2473 7494 -319
806 -319 -4426 2217 2439 -6567 -6470 4430 7365 -2268 -5611 -422 280 -2234 2057 7158 1692 -5525
822 -5525 -3445 2605 3475 4724 7622 2667 -8012 -5773 8068 12003 2735 -3246 -525 121 -991
837 -991 5093 10061 2715 -7299 -4831 3279 5381 4699 5090 119 -7073 -4148 6462 8199 1999
852 1999 1013 2695 -1921 -5125 3767 11849 4523 -4235 -1147 3402 -1087 -1471 7840 8613 -3814 -9799
868 -9799 -253 5482 1687 1268 3528 -1893 -9932 -4090 6969 5905 -1908 -2455 -637 -5463 -4894 5368
884 5368 9151 -2356 -9096 -1869 2690 -2096 -1331 6442 2455 -10094 -9989 3032 6940 -505 -3368
899 -3368 -1689 -6179 -8364 147 7887 971 -7912 -6713 -3253 -3683 874 7186 1480 -10897 -10279
914 -10279 1980 5533 1 -616 1191 -5605 -10728 -990 10611 5611 -5541 -6553 -2462 -2856 -1203
929 -1203 5883 5797 -4458 -8627 -2985 1119 1287 4662 5031 -4958 -12143 -2744 10166 7744 -1780 -2057
945 -2057 -501 -4582 -3326 8431 12326 -50 -9660 -3945 4214 4860 4809 5192 -542 -7237 -2906 6483
961 6483 6524 1586 1040 -190 -4992 -3622 7422 11256 743 -6928 -1460 3727 753 1424 7610 5626
977 5626 -4488 -6343 2325 7104 4699 2877 1066 -4195 -5037 2888 9100 3918 -2729 -2304 -1244
992 -1244 -2870 947 7984 5357 -5810 -8416 -345 4445 1917 976 2104 -2255 -6697 -2458 4966
1007 4966 4884 -175 -2524 -3557 -3923 -548 5453 3995 -3640 -5954 -1823 -444 -1564 1435 3947 -2225
1023 -2225 -8672 -5296 2404 3361 -959 -2056 -2424 -4571 -4303 1427 3728 -372 -3796 -3531 -2377 -1391
1039 -1391 1248 3582 -593 -5065 -3291 287 -238 -233 2452 1296 -4744 -5992 115 4265 1787 -1914
1055 -1914 -1589 -1875 -2482 -217 3408 2636 -1303 -3074 -1485 -130 1638 3914 2870 -1510 -3119 -37
1071 -37 2353 2546 3155 2970 -1074 -4040 -289 5336 4419 470 -455 450 -756 -424 3664 5833 1926
1088 1926 -1850 -1718 98 2096 4676 5404 114 -3937 -1311 3288 4071 2386 2995 1468 -3239 -3127
1104 -3127 4149 7410 2686 -2203 -1204 -51 -697 1772 5772 3280 -3095 -4769 -650 2307 3656
1119 3656 3795 166 -5506 -4718 2219 5168 1244 -1553 -123 -2133 -5011 -1131 6549 4768 -3891
1134 -3891 -6392 -2065 887 865 2028 1768 -3166 -6760 -3346 1740 2227 452 -1248 -4449 -7119 -2436
1150 -2436 4831 3276 -3396 -5169 -2433 -3142 -3213 2827 5726 -1954 -10280 -6276 2682 4085 549 -1857
1166 -1857 -3010 -5746 -3770 2356 4362 208 -3240 -3392 -3778 -2580 3033 6068 -569 -7074 -4744
1181 -4744 1672 2147 619 2484 1717 -4716 -6102 1270 6510 3109 -1620 -1718 -1641 -1979 1695 5832 4012
1198 4012 -1898 -3401 -801 875 2412 5845 3693 -3790 -5747 1573 6693 3788 283 466 39
1213 39 -2319 1 6189 5511 -355 -2517 -378 1165 1873 4529 4852 -1093 -4149 -450 4060 3997 2186
1230 2186 1662 -723 -3588 -853 4919 5119 -9 -2220 -405 -346 -811 2232 4819 1125 -4145 -2832
1246 -2832 1185 2406 1761 1061 -866 -2584 -2103 811 1817 470 -123 -304 -2728 -3607 324 2668
1262 2668 438 -2134 -1433 -779 -2742 -1968 2037 2569 -2035 -4950 -2428 705 795 210 -506 -2598 -3401
1279 -3401 -1042 449 115 -626 21 -2563 -5093 -1763 3667 2636 -3614 -4983 -447 617 -1241 -349
1295 -349 2060 -295 -4440 -2768 1817 2160 255 -200 -1126 -3220 -2380 2390 3868 640 -1455 -826
1311 -826 -2178 -2044 2582 5992 883 -5012 -2602 2603 2500 -250 1772 2709 -1458 -3927 331 4851
1327 4851 3479 469 82 -622 -1709 792 4709 3351 -812 -632 862 63 -269 3840 5312 -489
1343 -489 -4065 215 4684 2119 266 2203 2076 -3043 -3018 3534 6259 1653 -2411 -1314 8 482
1359 482 3428 4472 -239 -4330 -1814 2548 1695 458 2703 1042 -5244 -5324 2705 7490 1643 -4227
1375 -4227 -3038 -1390 -1707 1182 5142 2439 -4821 -6202 -1490 2574 2118 1895 88 -5273 -6261 -79
1391 -79 4941 1815 -2533 -2710 -2606 -4402 -1419 4518 3341 -4413 -7171 -1763 1799 -15 -949 -27
1407 -27 -1579 -4587 -2626 1988 1620 -1520 -2406 -1505 -2367 -1731 1135 2079 -1421 -3792 -1702 463 -625
1424 -625 143 1404 -225 -3743 -3159 1467 2542 -221 -1304 -84 -916 -2849 -1 4135 2641 -1923
1440 -1923 -3467 -1002 921 2309 2847 1984 -1482 -2775 -591 2650 3357 2360 1199 -1386 -2922 41
1456 41 4855 4914 523 -2039 -716 378 780 2846 4174 1404 -2811 -2624 2073 4509 2590 147
1472 147 -380 28 -17 1465 3107 2381 220 -711 102 1066 1989 2581 917 -1697 -1263 1764 2847 818
1490 818 -1054 387 1049 -534 -896 1389 2387 -771 -2364 -247 1903 -86 -834 495 835 -1246
1506 -1246 -2063 -580 1018 282 -38 -119 -1637 -2310 -637 1215 -190 -1194 -323 -521 -2908 -2785 1703
1523 1703 3320 -1208 -4936 -2375 358 -243 -746 710 56 -3623 -4560 -221 2422 807 -1318 -1898
1539 -1898 -2478 -2032 523 2639 345 -2721 -2164 -677 -998 -571 2217 1515 -3442 -4627 150 3617
1555 3617 668 -1687 -286 22 -2101 -1275 2708 2901 -521 -2897 -749 887 630 2157 2137 -717
1571 -717 -2725 123 3088 1808 442 1406 840 -2079 -1552 3498 4664 53 -1945 165 1025 -647
1587 -647 1269 4553 2467 -2552 -2341 1552 2857 1999 1684 826 -1672 -2155 1978 4247 2281 -391
1603 -391 -53 -724 -1588 1337 4933 2611 -2687 -3322 341 2256 1043 788 1686 -1440 -3804 -780 3357
1620 3357 2772 -672 -1777 -1448 -1509 -113 2554 2240 -1904 -3057 -924 -315 -37 1279 1814 -1561 -5017
1637 -5017 -1972 2405 2068 -1545 -1665 -941 -2524 -2278 816 2533 -775 -3976 -3304 -850 182 378
1653 378 573 -1415 -3551 -2367 170 538 -634 -142 -840 -2999 -2836 749 2639 -151 -3035 -1626
1669 -1626 -96 -964 -811 1225 886 -1800 -2833 -1217 1090 1153 176 -1057 -2008 -1403 774 1528 321
1686 321 -386 215 -450 -1373 83 2583 2074 -1286 -1725 680 1867 818 696 1417 988 -478 -633 900
1704 900 2064 1734 720 -17 -364 615 1836 1559 375 718 1110 116 -326 1873 3016 1376 -890
1721 -890 -543 1668 2053 1208 978 1160 453 -258 477 1383 1853 1272 94 -1165 -682 1399 1716 322
1739 322 -124 465 295 -596 -98 1679 1812 -637 -1822 -375 835 890 773 458 -812 -1570 -1085 427
1757 427 819 791 -345 -1693 -2287 -395 1537 582 -1690 -1993 -820 -1272 -1405 47 1361 -726 -2975
1774 -2975 -2400 -222 978 48 -718 -1407 -1961 -1622 -128 1034 -207 -798 -1594 -2158 -1500 825 1597 -436
1792 -436 -2706 -1824 -439 -87 -224 496 294 -2426 -2973 84 2423 1088 -855 -1432 -657 -721 283 1868
1810 1868 909 -771 -1308 -839 184 1338 2429 1153 -1496 -2282 604 2154 1565 382 516 -278 -1843
1827 -1843 -264 2743 3064 -46 -1785 -874 1129 1554 1708 1816 406 -1468 -596 1673 2377 1815 939
1844 939 -561 -1664 -137 3098 3144 246 -1044 -21 475 -280 1229 2385 1065 -1671 -1972 537
1860 537 2208 1102 -128 -564 -952 -540 232 1550 1152 -172 -868 -1009 -581 1120 1776 427 -1440
1877 -1440 -1593 162 657 211 -402 -96 -1212 -2263 -959 923 1541 -1066 -2248 -1558 -721 -540 97
1894 97 -169 -612 -1990 -2252 -1189 275 836 -320 -1634 -2137 -1167 -47 330 -345 -905 -1357 -1579 -1190
1912 -1190 -204 737 336 -1125 -2150 -1221 323 254 -426 -991 -618 -958 -1669 -553 1253 981 -782 -1846
1930 -1846 -594 832 575 -112 64 189 -425 143 740 889 352 344 57 -556 165 1932 1347 -630 -104
1949 -104 887 921 -89 480 1734 1200 -466 -484 1531 1870 554 495 1351 667 -323 789 1943 1933 491
1968 491 740 387 -359 582 2598 2394 -358 -1195 894 883 -293 1465 2392 91 -2213 -1040 2493
1985 2493 2303 -149 -40 430 -716 -1487 827 2891 645 -1428 -1190 157 73 753 1879 466 -2215
2002 -2215 -1579 1060 946 -547 -270 431 -1443 -2768 332 2531 330 -3010 -2045 731 -87 -1436
2018 -1436 -87 447 -1808 -2638 -497 1295 -445 -1404 -351 -1150 -2216 -587 1570 203 -2433 -1692
2034 -1692 184 -1120 -2061 591 1587 -1457 -3797 -1209 1352 -106 -1070 432 516 -2364 -2902 518
2050 518 2319 193 -1077 -535 -1079 -1448 655 2468 717 -2134 -1398 557 161 118 1615 2028 -1681
2067 -1681 -3042 626 2935 1047 -1112 282 602 -838 -274 2221 2553 -902 -1532 323 1636 1483
2083 1483 1461 1019 -859 -1246 1290 3012 1197 -269 327 330 -850 434 3160 2524 -1183 -2656 401
2100 401 2409 1486 503 981 19 -1209 -646 1907 1767 520 -463 -385 -767 142 1822 1249 -406 -1030
2118 -1030 150 566 -685 320 1668 823 -1705 -1421 463 981 -773 -980 519 269 -1147 -1233 -173
2135 -173 502 -262 -337 -914 -1255 -656 167 -62 -980 -698 -280 -910 -1187 -1 769 -636 -1989 -960 199
2154 199 549 -690 -1137 -392 -765 -989 -110 538 -78 -1492 -1607 -892 412 1011 -71 -1187 -1509 -632
2172 -632 342 182 191 167 -463 -865 -759 775 1278 271 -1226 -904 62 206 381 384 425 312 89 -137 264
2193 264 891 1044 267 -390 171 578 147 571 904 1397 691 -383 58 1209 1396 962 207 337 459
2212 459 626 512 1369 1070 753 -176 -64 837 1840 1392 -81 -712 229 1017 1031 1047 1084 194 -726 -386
2232 -386 950 1714 787 -442 -752 78 955 1244 696 -72 -596 -1083 -206 752 1338 767 -1251 -1700 -686
2251 -686 831 890 -160 -1199 -1208 -789 -528 263 836 157 -1355 -1853 -731 370 681 -353 -911 -1730 -816
2270 -816 -408 -16 -10 -184 -894 -2166 -1496 36 569 -527 -1539 -1308 -647 -259 -257 -104 -133 -871 -1622 -1118
2290 -1118 97 642 -122 -974 -1379 -572 239 470 179 -149 -688 -1146 -947 6 1061 517 -1076 -1067 -343
2309 -343 741 728 420 213 -495 -453 -384 528 1000 934 -216 -769 -267 919 1442 897 323 -273 -169 150
2329 150 555 1268 1370 231 -882 -115 1188 1492 762 63 288 198 456 727 1008 953 392 -255 -120 626
2349 626 1433 815 -141 -412 558 643 524 527 481 302 -383 -452 646 931 408 -29 -212 93 120 296 274 431
2371 431 -124 -349 -547 -462 484 390 -229 -859 -673 286 -85 -664 67 88 -634 -986 -598 72 75 -748 -1057 -531
2393 -531 -563 -417 -382 -238 -447 -597 -747 -963 -735 113 -3 -840 -1079 -564 -221 -560 -610 -85 -34 -995 -1208
2414 -1208 -201 832 -46 -697 -691 -624 -399 -214 -85 104 -183 -311 -717 -212 396 623 179 -913 -543 505
2434 505 863 219 125 316 302 -595 -285 871 1164 -90 -718 48 438 760 595 861 491 -477 172 511
2454 511 847 1301 982 -26 -699 338 1523 1327 70 -103 196 684 178 861 1449 1254 -848 -763 989
2473 989 1648 1042 544 296 148 -99 774 1153 821 389 -44 -432 -437 1003 1140 480 -1244 -770 294 430
2493 430 30 583 569 -435 -1513 -577 895 907 -305 -1057 -690 -176 -41 110 66 -323 -1184 -1066 -697 -312
2513 -312 142 21 -1374 -1637 -290 782 200 -1094 -754 -376 -1010 -1227 -207 564 -171 -1424 -1265 -457
2531 -457 28 -55 -616 -575 -1137 -899 -474 -109 -460 -378 -777 -1168 -587 435 627 -516 -1060 -806 24 37 -142
2552 -142 40 361 -428 -805 -99 677 597 -76 -560 -237 292 109 422 773 510 -306 -350 156 479 1148 723
2573 723 -277 -378 226 895 529 669 896 471 117 -39 546 1170 554 156 68 694 1070 252 517 824
2593 824 575 198 278 261 651 435 273 45 206 483 202 264 455 334 299 -19 95 540 790 80 -305
2614 -305 -8 678 528 -61 -223 309 376 -413 -604 409 431 -122 -955 -692 -53 -161 226 -238 -203 -500 -697
2635 -697 -325 -96 233 -109 -616 -1061 -567 209 -188 -298 -616 -282 -487 -1133 -684 278 439 -664 -1322 -654
2655 -654 -213 -614 -228 -118 29 -474 -862 -480 -171 -57 16 -638 -1097 -224 435 27 -365 -349 80 -468 -465
2676 -465 132 626 202 -737 -1012 553 1291 531 -149 -253 -476 -103 221 835 1001 -27 -520 -600 662
2695 662 1404 1161 133 -705 -290 974 1029 1197 605 59 -388 -435 660 1913 1324 262 -829 -639 792
2714 792 1241 864 206 58 -4 38 505 1451 1108 298 -627 -383 881 837 263 215 507 118 -92 171 655
2735 655 309 143 -83 -437 172 231 316 -237 -305 260 304 153 -509 -5 193 -519 -801 -244 955 163 -858
2756 -858 -634 -201 -656 -481 474 202 -247 -1166 -1010 -440 -88 51 -138 -1318 -1570 -765 5 -93 -124 -280
2776 -280 -848 -1495 -1165 330 844 -414 -1497 -1128 -131 -668 -480 588 -99 -1259 -1620 -88 693 -1
2794 -1 -594 -719 -631 -478 300 613 -773 -1045 -357 553 -76 -332 838 177 -811 -811 873 904 -415 -819 66
2815 66 969 -10 -165 1029 445 -560 -312 714 1018 205 38 526 75 -275 887 562 -97 40 1326
2834 1326 867 -560 -340 905 991 -256 264 1223 894 -730 -289 1659 1545 2 -157 569 293 84
2852 84 786 1370 268 -382 11 478 340 644 1250 161 -1258 -622 1416 995 -714 -410 627 397
2870 397 -980 -132 972 411 -734 -1016 660 499 -718 -242 66 -549 -400 328 154 -710 -698 157 -353
2889 -353 -928 -72 682 -499 -1490 -566 463 428 -1300 -555 844 -582 -1243 -679 479 -188 -609 -579 -372
2908 -372 -872 -839 -151 315 -567 -508 -353 -632 -846 305 966 -115 -1435 -661 493 141 -428 133 93 -506
2928 -506 -1184 -26 1039 619 -580 -478 169 110 141 1173 498 -480 -323 165 383 194 709 356 -89
2947 -89 -703 462 1492 999 -400 44 680 214 268 945 739 -201 -721 351 1441 792 230 262 317 14
2967 14 513 939 691 454 -136 369 94 407 1049 746 -199 -348 521 797 435 157 331 583 -289 -445
2987 -445 506 674 92 -389 149 30 -33 112 73 63 -455 -253 -442 -253 206 60 -593 -1018 -157 120 -141
3008 -141 -642 -316 -399 -311 -614 -560 126 71 -785 -965 -424 -170 -162 -487 -620 -355 -422 -654 -435 -367 -233 -362 -799
3031 -799 -855 -171 -259 -156 -749 -545 -191 -304 -591 -421 148 21 -887 -741 -66 339 -75 -468 -408 93 253
3052 253 -160 -66 16 338 45 -9 -57 388 213 202 -32 -23 222 74 -401 153 452 502 486 -301 57 856 651
3075 651 -14 299 515 672 145 433 745 591 318 -94 677 497 612 520 238 444 519 375 269 516 689
3096 689 518 52 -122 540 1063 -107 -48 230 440 412 11 88 661 123 -284 71 681 436 -25 41 51
3117 51 -172 365 333 89 1 -383 -206 -417 -212 281 522 -510 -794 -113 629 -4 -133 -28 -239 -479 -477
3138 -477 115 265 -321 -592 -468 -338 -268 -344 -286 -65 -595 -402 -537 -133 -349 -652 -637 -899 -362 109 296
3159 296 -335 -460 -267 -227 -443 -217 168 35 -819 -854 -385 389 151 -367 -110 -483 -478 -300 422 -52 176
3180 176 -322 -512 -358 445 648 85 -509 -147 303 326 290 91 542 165 -52 -290 504 717 316 -350 92
3201 92 320 636 413 292 447 176 226 79 383 936 526 -11 -270 390 859 637 -11 29 467 110 -331
3222 -331 271 958 550 -109 -522 437 675 678 40 -17 356 272 8 -207 280 408 119 -433 -150 141 511
3243 511 -223 -198 -95 87 -103 -120 114 86 -257 -145 -602 -211 88 -306 -196 -320 -40 141 -168 -619 -252
3264 -252 191 -14 -606 -391 -89 -380 -896 -531 -118 -22 -650 -303 -195 -240 -597 -717 -298 -323 -309 125 -346
3285 -346 -397 -364 -132 -494 -591 -197 103 -575 -1002 -192 539 -155 -585 -354 -17 -325 -701 258 198 -176 -428
3306 -428 -192 277 229 369 333 212 -273 67 395 314 -56 407 461 -281 83 839 1040 118 -175 166 929
3327 929 353 68 661 624 -63 -48 1020 925 311 71 475 921 43 85 699 159 292 225 431 408 512 714
3349 714 620 -208 -262 830 724 -13 -182 298 658 -376 -226 765 679 2 -198 -147 789 331 157 151 -177
3370 -177 -583 -281 149 74 1 272 69 -654 -676 294 569 -179 -738 18 -133 -766 -387 391 468 -813 -1071
3391 -1071 -193 227 57 -510 -194 -307 -795 -331 228 126 -927 -462 -397 -349 -385 241 -233 -984 -850 277
3411 277 651 -309 -682 -449 -175 -663 -392 747 665 -690 -1069 -118 354 98 249 22 -709 -635 213 393
3431 393 220 -165 -95 -339 -600 -218 757 635 -271 -559 204 765 -236 -381 455 680 -60 -72 354 646
3451 646 186 64 742 531 18 130 313 495 89 345 653 -448 -75 576 727 -4 -262 600 440 -282
3471 -282 -249 649 585 -221 -93 587 636 -90 -197 166 416 97 469 765 238 -237 24 406 89 129 296
3492 296 33 -393 -351 714 545 -386 -619 54 109 -882 -150 560 254 -673 -659 -74 396 -608 -530 -12 -310
3513 -310 -447 -379 -40 -79 -530 -180 -82 -477 -212 -17 -367 -758 -248 269 -38 -751 -389 419 210 -369 -441
3534 -441 -104 -320 -555 -171 183 -41 -607 -522 -75 376 -253 -176 -110 -456 -334 549 1 -202 -234 -57 -392
3555 -392 -270 272 873 -98 -804 -105 431 638 95 -191 589 2 9 447 799 307 -314 -202 204 830 706
3576 706 564 -24 -372 259 960 414 117 393 555 -252 -233 570 781 352 -353 -15 610 334 6 291
3596 291 493 368 7 42 257 332 207 261 -296 0 409 449 33 122 358 394 -104 -324 404 649 -46 -426
3618 -426 -189 464 109 -458 215 -143 -409 -443 -30 381 210 -143 -516 -508 56 433 -300 -504 -460 -225 -100
3639 -100 -286 -432 198 -379 -837 -674 -68 376 -246 -608 -560 -592 -380 -385 -186 -109 -175 -736 -573 -69 -84 -21 -664
3662 -664 -473 -804 55 162 -263 -303 -194 11 -473 -291 416 93 -583 -625 342 264 99 52 -59 -175 -254 -149
3684 -149 517 225 62 301 173 -52 260 468 -46 30 32 269 153 42 235 392 244 21 -281 277 163
3705 163 102 458 613 733 70 275 270 314 81 -80 156 243 375 256 467 316 244 288 133 -194 598 628 127
3728 127 -242 334 455 138 7 344 -75 81 169 -245 310 553 -118 -278 -211 78 216 -155 129 140 87
3749 87 -145 -381 18 137 198 -411 -451 310 -314 -123 -475 -267 -105 -171 -254 -408 3 42 -376 -520 -154 -124
3771 -124 220 -505 -462 -291 -309 -552 -660 103 170 -415 -941 -86 14 47 -169 -465 123 -221 -114 -297 43
3792 43 105 -132 -378 -284 -178 322 -106 -424 -57 136 70 -113 -163 249 402 -362 -229 389 301 286 55 -137
3814 -137 78 263 385 37 201 216 305 130 21 550 763 117 -125 275 230 555 382 279 175 257 252 137
3836 137 754 314 368 15 230 462 276 181 -65 131 381 564 381 255 626 416 102 98 515 476 364 -53
3858 -53 -211 371 228 145 44 209 -142 -507 50 218 196 -44 -356 42 20 -34 41 -202 -111 -118 -233 -420 -221
3881 -221 -175 361 -305 -245 77 -20 -139 -263 -246 58 -107 -375 -117 -95 -168 -414 -424 -344 -75 -444 -219 -284 -68
3904 -68 -564 -324 -494 221 -351 -260 -541 -398 -223 -343 -639 -55 68 -208 -126 -91 -42 -87 -147 -101 -476 83 283
3927 283 -199 -324 -28 200 -382 -251 46 444 -81 -244 -136 350 15 -206 -396 160 5 90 -117 435
3947 435 145 143 164 -108 229 394 611 -36 100 107 458 169 40 274 527 232 -105 206 357 441 8 139
3969 139 736 267 299 115 315 489 314 278 50 115 61 775 298 255 195 285 -28 -97 352 816 205 -239 -133
3992 -133 59 380 -97 -3 -223 158 -257 117 87 -99 -116 -366 -419 -407 -11 22 -218 -414 72 168 -311 -415
4014 -415 -325 -194 -503 -877 -147 -9 -635 -778 -517 -211 36 -150 -174 -206 -521 -318 -61 -35 -245 -235 -74 -632
4036 -632 -288 64 181 -20 -394 64 -133 -263 -97 62 -171 -261 -245 -94 117 61 15 148 -226 -182 79 19
4058 19 198 34 276 197 260 24 229 240 104 195 190 -55 67 95 164 136 13 197 154 298 85 -209 21 30
4082 30 88 111 487 273 69 20 150 530 598 522 -371 113 76 286 409 244 543 84 -132 -186 616 502 10
4105 10 -9 71 217 296 363 -53 216 77 -135 -129 167 20 -335 8 -226 -147 163 171 -252 -573 96 360 -362
4128 -362 -390 -191 242 -467 -713 -13 155 -185 -685 -415 -134 180 197 -220 -210 -440 -341 -177 -162 -420 -172 -541
4150 -541 -671 -170 31 46 -829 -536 165 288 -499 -602 -235 245 -203 -232 -217 -153 -423 -540 -4 -35 -266 -356
4172 -356 -472 -605 144 439 375 -180 -159 -132 139 -335 -90 654 149 -591 -218 521 278 1 -28 9 339 -24
4194 -24 287 186 269 77 -218 439 192 323 593 -113 -389 314 571 338 25 -78 327 303 67 342 195
4215 195 304 -43 135 619 195 -84 291 685 150 177 340 658 371 126 236 208 172 298 392 280 230 138
4237 138 -91 89 -285 228 448 387 -288 -470 46 153 -128 228 321 -230 -398 -324 289 169 -76 -512 -443
4258 -443 -132 -174 -53 -2 -484 -433 -112 -6 -326 -595 -48 -400 -722 -172 110 -127 -413 -472 6 -187 -204 -160
4280 -160 3 -457 -524 28 166 -83 -234 -357 -398 -167 -43 118 -78 -150 -105 -114 -278 57 -25 142 -7 -544
4302 -544 -100 -97 186 -479 -248 123 86 -194 74 413 -52 54 210 65 62 -102 170 -55 -102 509 317 124
4324 124 111 69 236 -18 -4 62 408 309 -176 59 477 357 164 490 334 398 66 66 168 204 -108 513 148
4347 148 145 119 159 362 66 222 168 -35 231 343 326 242 -427 108 322 219 -32 -254 179 136 -299 -401 216
4370 216 362 239 -131 -167 -135 -9 -101 -224 -438 28 -23 -428 -266 -174 -6 -143 -252 -64 16 -500 -494 -299 105
4393 105 -494 -307 -258 -126 -451 -274 -97 -177 -257 -234 -505 -286 -216 -118 -408 -336 -48 22 -199 -374 -59 -170 83
4416 83 -370 -280 -232 117 -196 -57 64 59 85 -88 248 -220 -307 226 236 324 185 -161 -139 316 310 216 101 -150
4440 -150 60 -86 346 263 3 395 490 -7 240 219 56 85 183 296 400 216 -169 155 133 -270 -47 -110
4462 -110 373 77 112 190 186 594 264 9 12 448 163 80 143 651 364 225 -34 -152 375 147 189 -64 248
4485 248 -135 26 81 403 -9 99 -195 -146 221 142 243 -322 -234 -64 209 16 19 137 17 -123 -378 34
4507 34 430 15 -304 -128 -430 -103 -228 -246 -411 -37 -195 -333 -297 -127 18 -450 -429 -158 5 -327 -296 -101
4529 -101 -12 -285 -152 -23 -67 -38 -274 -439 -207 -130 -18 -273 40 233 -141 -159 -136 -65 -113 186 -201 59 102
4552 102 136 -68 -22 42 201 283 159 -159 276 202 -158 -198 207 -39 81 -85 -224 159 264 330 -180 36
4574 36 298 62 253 76 531 412 135 199 302 707 -44 308 -244 352 291 -70 348 169 435 184 -443
4595 -443 115 45 287 22 260 156 163 177 219 239 217 118 -140 -272 88 244 270 -302 30 74 68 86 184 255 -118
4620 -118 144 189 -29 210 -148 -25 -20 54 -158 -23 24 196 216 51 -545 -233 -113 -112 -110 -8 -6 -420 -499 -612
4644 -612 93 -254 -294 -452 -512 -458 -302 -427 -378 -231 -208 -104 -188 251 295 5 -144 -23 -358 -18 50 -162 -95
4667 -95 -383 215 -291 -57 114 101 -222 -466 5 202 -64 -307 263 110 -127 2 -74 55 130 -49 200
4688 200 427 482 667 133 78 28 498 204 115 226 541 397 -23 -154 628 938 72 -30 72 -76 393
4709 393 4 377 374 122 179 283 175 101 216 295 193 -7 497 305 -191 47 -70 144 13 0 405 290
4731 290 -222 -262 189 326 13 -266 -20 -124 -141 -146 -164 105 -125 -235 150 18 154 125 188 -433 -366 185 242
4754 242 -54 -407 110 185 -212 -218 96 53 -163 -381 243 84 -397 -405 -288 53 80 -68 -242 -91 -517 -94
4776 -94 -14 -158 -447 -183 155 -238 -324 -186 199 -409 -90 -246 -176 -459 -140 220 -226 -246 -162 42 -38 -82 -231
4799 -231 117 -2 -101 -10 -183 56 -270 158 95 125 -137 118 251 -35 -21 365 215 -77 347 188 370 -300
4821 -300 -15 70 327 5 295 299 347 -259 -126 397 89 246 494 280 -10 44 468 265 -268 -214 580 116
4843 116 -47 -226 26 12 -373 45 437 332 -263 31 158 240 -81 18 132 -14 40 100 200 98 -208 -173
4865 -173 -154 -198 -167 -3 -115 -365 -291 90 264 -27 -44 121 -212 -679 -125 172 -365 -543 -479 -2 -234 -162
4887 -162 -208 -293 -122 -205 -187 -225 -25 -366 68 -184 -97 -114 97 -123 -366 157 209 -196 -493 -251 -280 -126 -27
4910 -27 -285 36 -163 -11 -227 -161 -50 -256 37 -67 -27 -248 62 -203 -106 56 272 -52 31 -28 400 -84
4932 -84 -243 226 0 39 -282 77 270 169 198 87 302 392 318 273 274 146 -56 360 78 324 409 172 152
4955 152 -37 609 75 -154 -127 -51 -20 142 -130 501 170 -295 -149 -105 465 260 73 36 -28 -259 243 340
4977 340 108 -200 424 152 11 191 140 494 8 -106 -74 496 -52 -134 52 186 -223 -11 456 -102 -522
4998 -522 -163 -193 138 -26 -2 -202 -240 11 -70 -126 -206 -487 201 -116 -296 0 -144 -47 -268 -177 -34 -9 -262
5021 -262 -75 -163 -168 -155 -118 112 -60 -279 -338 -261 -1 -143 89 -180 13 -224 -65 -214 -137 274 155 4 -237
5044 -237 -341 -24 85 -144 272 326 -24 -152 -123 201 95 -100 138 -93 -72 -100 -66 87 140 57 -26 51 -181
5067 -181 -91 157 -240 -301 250 408 335 73 119 203 59 -146 99 228 209 -189 102 176 122 249 264 198 253 64
5091 64 129 -44 232 248 -60 -168 -99 -92 185 2 65 214 22 -197 -64 53 237 -58 17 -106 62 -65 61
5114 61 15 92 -159 -93 -7 205 89 145 107 -23 70 54 -25 13 -82 -197 -133 192 126 -406 -382 -276 -374 -255 56
5139 56 -216 -277 -80 -140 -109 -491 -257 -380 -76 64 -67 -228 -137 -91 21 -150 -361 111 -43 -19 -370 -91
5161 -91 43 -135 -623 -40 67 -13 -56 -115 -180 -113 -129 -194 -179 -212 26 -128 -68 169 79 -45 66 336 -87 -17
5185 -17 54 114 161 30 242 16 490 76 -216 88 169 232 89 183 68 281 -154 29 320 423 175 -38
5207 -38 132 217 117 169 134 192 411 18 -32 102 234 444 251 14 123 -192 346 70 152 -122 23 38 152
5230 152 54 111 -93 -338 269 54 161 125 -43 -81 -72 221 -394 -225 27 -153 129 -202 -373 -185 -138 -168 -229
5253 -229 -164 -170 -285 -359 -168 -159 -104 -69 37 41 35 -420 -64 -322 189 175 -642 -39 25 56 -309 -256 148 -124 -487
5278 -487 -230 -375 76 -338 -483 -196 -181 245 -208 -218 -48 -261 -197 24 141 -5 50 144 -22 151 151 175 -193
5301 -193 51 95 395 58 -118 52 217 44 -24 11 113 138 -53 36 57 283 300 94 177 -251 -111 -68 -149
5324 -149 -210 -5 424 233 23 470 214 55 -157 -133 78 89 -73 131 -102 289 70 200 275 295 222 2
5346 2 41 336 -116 125 -119 -93 29 48 -223 111 105 -28 196 132 67 154 -75 24 85 117 98 189 293 -210 90
5371 90 -227 -153 -137 -51 -485 160 -112 -237 -333 129 166 -42 78 -8 54 -181 -19 -122 -322 -69 -114 -69 -165 -344
5395 -344 -148 20 -319 -440 -175 227 -139 -191 -90 5 -103 22 -89 -43 -5 -213 -311 -237 -166 -196 153 -27 75
5418 75 120 23 -17 -33 -58 -59 126 -169 71 486 -304 -74 -89 222 171 -285 -60 146 -101 -80 136 337 295 129
5442 129 -182 102 207 47 -6 -15 445 235 272 -321 -52 96 19 12 58 277 193 -127 -92 391 281 201 126 154
5466 154 -83 285 167 -50 315 245 264 156 -85 188 476 54 57 220 -59 93 115 -197 -107 124 -100 -193
5488 -193 3 -39 116 -236 -78 77 192 -93 -294 -148 96 131 -18 -240 -31 -205 -182 -3 -24 28 -268 -201
5510 -201 -177 -396 -203 -241 -170 -80 -254 -142 -71 -212 -225 126 -334 -478 -94 -103 -231 -274 -7 328 -340 -29 -387
5533 -387 69 -52 -357 -37 -19 94 42 105 -90 -8 45 -106 33 114 -155 -186 -3 122 3 -53 -198 -250 6
5556 6 -336 53 -101 -65 77 100 -219 -275 458 286 230 -121 -2 298 193 -93 140 -306 -130 -16 -164 269
5578 269 -241 290 -152 -18 268 401 130 69 273 275 -63 -104 270 509 129 -242 -115 143 -70 47 275
5599 275 131 13 164 -42 -110 -44 -175 167 134 115 187 74 -164 -144 107 182 -88 -328 -60 427 -232 59
5621 59 92 280 -208 -380 153 -50 77 -149 -118 86 -90 -13 -32 -181 24 -43 32 23 -231 42 282 36 -305
5644 -305 -47 -55 -55 -404 -48 250 -366 25 -87 72 -19 -401 -161 145 184 -55 55 -356 322 -10 90 -233
5666 -233 2 -167 -58 -144 -188 -130 287 -58 -12 -49 180 -307 68 363 336 174 25 59 -2 119 115 298 247 97
5690 97 25 -147 -58 32 -1 -107 144 193 254 224 167 -40 394 115 -151 111 178 39 -28 143 -291 262 98 -108
5714 -108 248 128 104 58 242 143 28 169 241 307 130 62 -139 215 -48 366 272 -39 45 167 -143 36 226
5737 226 191 -204 -80 47 -13 45 -161 -90 -194 -245 -295 -174 -118 -162 -76 285 -95 -77 -312 47 -24 -122 -202 -103 8
5762 8 -205 -80 -24 -299 -220 -59 -94 -107 -260 -98 81 -95 -417 -175 89 40 40 -168 152 -26 -24 0 -341 14
5786 14 96 -76 -121 -84 -157 92 -82 90 -208 92 -62 81 21 -21 118 -8 3 285 74 -43 26 -37 46 -46
5810 -46 110 -52 -40 126 -34 -56 -32 156 -36 228 -146 -57 16 136 -99 -86 122 98 235 -130 -87 439 254
5833 254 -84 45 123 303 2 97 87 -207 -115 -59 14 -101 269 -17 128 212 -8 -139 17 -185 0 100
5855 100 -148 58 151 226 63 -124 149 71 58 -157 -128 105 34 -155 -249 -52 -51 9 -3 42 -164 -241 -141 88
5879 88 -53 -186 -13 -234 25 -231 108 -185 -219 55 -60 91 -101 206 -48 -38 34 25 96 -189 -177 -224 -177
5902 -177 -200 -242 -8 53 195 -108 154 -215 -266 -214 229 -62 161 -228 -152 -20 31 6 -20 74 -310 135 388
5925 388 170 -46 87 93 -119 -59 -62 28 -104 275 -75 -264 90 133 87 140 73 -242 268 56 45 199 -83 0
5949 0 7 56 13 -120 134 -154 159 5 -113 93 155 -21 59 170 110 333 -43 -176 191 196 293 36 -123 -186
5973 -186 5 42 -329 66 -59 57 -223 238 -40 288 -220 -404 284 186 83 -75 -23 -165 104 273 -350
5994 -350 -169 232 -175 -202 179 -17 -141 -185 -117 -124 9 -69 32 -76 -121 162 -225 -216 -12 221 -32 -472 -363
6017 -363 -250 -26 -219 -331 -46 -27 -274 -63 195 -77 -11 -326 -50 182 -64 -92 168 76 116 -31 -44 -269
6039 -269 113 68 101 -51 -40 -113 -204 -76 93 -85 -36 -295 -34 25 151 -1 63 4 -21 33 154 106 186 216 4
6064 4 95 -95 -121 32 200 70 31 305 92 133 -19 19 96 85 203 134 297 -1 46 -177 -174 124 347 78
6088 78 226 -56 87 -117 41 -2 34 33 77 126 150 72 -59 -73 233 69 -40 -135 25 52 -191 -238 -161 264 -30
6113 -30 -31 160 138 -114 -142 -125 120 -396 50 -26 -43 -380 -46 -57 82 -56 44 77 -179 -109 79 51 34 -80
6137 -80 84 6 -324 -132 127 -23 -219 84 28 -42 -41 101 -105 -4 -131 -89 114 30 -7 -18 -129 -197 -38 -281
6161 -281 -1 44 -101 -144 206 -154 -409 126 4 -196 171 4 -44 -70 -216 -76 7 148 16 71 109 266
6183 266 221 -64 304 73 217 -165 91 -42 197 17 -208 184 231 123 -69 -88 341 28 65 3 370 159
6205 159 -235 -9 297 32 57 141 226 24 -6 90 191 185 -42 98 181 116 -87 119 -54 -53 198 200 365 -144
6229 -144 401 53 158 -54 -136 173 -248 -4 -182 150 -130 37 -54 232 -74 45 186 -182 -194 -133 140
6250 140 48 -5 -268 263 -324 -264 89 328 107 -321 -221 -32 90 -134 219 -17 -174 -74 -120 115 122 126 56
6273 56 0 69 41 86 -79 -336 73 150 -57 -68 7 -317 -44 -136 -286 -83 -41 -227 -92 -18 -132 -96 36 -53
6297 -53 110 -1 -12 1 61 -143 -65 133 217 249 -138 -87 64 19 186 107 -190 97 -156 -168 267 116 110 -113
6321 -113 -219 437 230 190 -255 -59 58 -234 362 45 86 -434 165 130 161 127 265 152 -83 128 -37 235
6343 235 158 278 -230 153 266 -340 -70 231 181 -101 249 -157 -126 113 213 24 37 -31 -37 107 -156 -78 -27
6366 -27 -348 -135 106 -217 89 -138 -227 -188 -270 117 93 58 85 -52 -182 -319 -65 -40 -168 375 -42 -73 375
6389 375 -96 -117 246 132 -220 63 174 -184 -253 -254 -144 -136 -24 222 -226 128 5 -89 -68 -317 -64 -197 -116
6412 -116 42 69 -194 -172 224 -132 22 -286 -85 39 -232 -168 44 69 98 -60 -157 -239 3 -51 48 94 -85
6435 -85 -120 114 181 -356 4 -57 -105 -96 -2 100 9 -192 23 223 -39 -178 60 122 125 55 386 20 366 49
6459 49 51 -78 132 -44 -84 220 101 -188 96 -5 205 332 64 -126 -124 245 87 198 26 -223 122 -116
6481 -116 44 131 -126 -26 -95 141 172 73 40 -132 -151 49 -170 9 -59 -215 73 80 71 -104 -288 360 -77 166
6505 166 -6 -173 108 -170 20 235 -47 -264 -275 55 40 -147 -140 -139 -45 90 -277 -466 -217 -324 192 -123
6527 -123 -30 83 3 -213 -187 -84 -69 -157 -30 136 -57 191 -27 -108 -72 378 -136 -159 111 -6 113 -42 -88
6550 -88 241 12 -65 -70 69 348 223 -184 307 263 303 41 190 160 161 193 47 -68 256 71 304 -212 328
6573 328 84 -155 39 -196 -68 204 11 48 167 101 125 -219 -143 -43 158 50 -59 96 182 64 -220 -8
6595 -8 135 348 171 -19 -8 69 41 -191 136 321 -168 -258 136 195 259 -26 -191 -130 -313 101 311 121 12
6618 12 59 -24 -441 -55 25 -193 77 -191 -86 -243 -162 194 279 -191 -141 -3 0 8 62 -27 25 86 -195 -32 -82
6643 -82 -164 -332 -32 62 -165 -146 -70 -181 -69 280 4 -36 6 -117 -188 115 -125 -35 -77 -251 80 -197 -177 -100
6667 -100 -239 -192 -79 -43 -28 6 -49 -226 -120 378 -93 74 130 -2 -73 -21 27 163 -156 264 202 190 -87 34
6691 34 -35 221 58 -7 -69 160 -68 -19 -119 -143 82 122 74 73 -72 225 193 9 152 103 161 91 -102 215 119
6716 119 146 -109 67 0 35 167 42 13 -217 89 -37 -143 73 -148 -31 -65 -211 138 -1 -56 153 68
6738 68 166 -7 1 4 154 384 -103 -249 -23 -119 303 -97 166 17 -223 -112 -179 -23 39 146 -42 -334 95
6761 95 48 -330 -147 -170 -145 4 -9 32 -183 -30 70 -283 154 -246 -172 112 -134 -178 -97 144 -99 -59 48
6784 48 -176 530 -314 6 -31 -441 -69 31 8 25 -459 -30 -29 222 18 231 -12 -35 -206 53 135 -45 -50
6807 -50 88 79 -4 -103 -185 -167 -123 131 -197 299 37 388 192 -42 124 16 87 -14 61 -84 86 -178 11
6830 11 282 155 187 378 84 56 -68 -219 42 -70 -195 -49 -49 178 -196 6 144 134 82 65 66 204 122 51
6854 51 128 -522 169 8 141 -79 -301 21 -251 47 101 163 146 12 249 189 -291 63 120 66 -348 -29 -86
6877 -86 155 24 50 156 -182 -70 76 -142 -242 61 -57 -139 13 -156 -43 -52 -150 -169 -142 10 -392 -151 -9
6900 -9 -193 -61 384 -65 132 -73 232 -23 101 -273 -18 39 282 -134 -15 25 3 -7 72 117 32 -34 -5 -99
6924 -99 -46 -85 60 97 185 174 -31 106 -68 375 -86 -27 -205 -11 60 -7 189 174 -227 -61 64 -4 16 -73
6948 -73 74 140 68 -233 192 194 229 -71 9 -239 39 146 293 34 -84 -13 36 67 30 -103 269 90 -31 -109
6972 -109 -148 -22 -129 154 116 -170 -34 114 6 214 13 -277 11 -25 153 254 -232 54 -95 287 103
6993 103 -174 383 -429 4 30 5 47 98 -15 -154 266 86 37 -368 -97 85 -134 125 -43 -92 67 159
7015 159 162 -66 -157 -299 -43 -107 -33 144 -169 -173 -193 122 58 -132 98 77 -7 37 80 -26 104 -258 -112 -81 262
7040 262 -155 -131 25 -148 22 120 -112 25 -78 263 -378 -265 -96 -19 -84 -1 -67 -150 -26 -3 132 -241 84
7063 84 -18 44 224 -56 -40 228 150 14 117 20 67 146 -24 95 249 -20 267 209 -67 -43 104 87 -199
7086 -199 152 -29 150 175 192 -188 296 -57 -1 410 312 -153 81 367 -73 74 -414 -161 282 170 56
7107 56 63 20 46 -176 -166 -217 372 143 117 -104 -59 -99 -108 200 -326 -179 -187 94 117 -62 67 58 -45 57 76 19
7133 19 -157 33 10 -45 104 118 -179 10 176 -34 -134 -86 -13 -44 -342 -9 -146 -97 40 -379 -18 -116 -151
7156 -151 -111 -361 148 -26 -142 52 281 87 -281 72 -139 41 -195 -258 18 -204 -156 -124 299 -131 -66 -43
7178 -43 -186 223 36 -110 77 372 -116 126 159 13 -12 -144 38 205 163 208 42 142 86 19 39 321 307
7201 307 150 34 77 148 54 125 239 161 195 -137 -32 136 -131 -92 -368 133 9 -99 156 -143 28 256
7223 256 149 133 54 77 -85 -309 32 -1 281 -129 -57 -83 -192 22 -291 -47 -237 78 187 -130 -42 -154
7245 -154 -35 -80 -385 -45 -307 -20 -254 49 -17 -153 -50 -170 -264 99 -115 -216 142 -108 -290 149 208
7266 208 -236 -22 5 -45 29 -127 -99 -261 198 86 -81 -38 -298 123 -46 -345 20 2 -277 104 79 1 106
7289 106 -91 -241 -144 -112 -341 -42 166 16 -2 138 -363 46 47 -16 6 119 -71 -114 239 63 125 -52 -59 -285
7313 -285 -166 135 214 -80 41 245 -80 111 45 5 -65 64 261 -74 20 146 44 -8 -59 -36 456 8 -75
7336 -75 122 15 -139 347 7 31 102 141 -27 -134 93 126 213 125 -3 143 -36 -33 10 -49 4 65 173 -61
7360 -61 12 156 -7 -6 148 97 -300 200 0 -218 -106 -32 -306 -122 28 9 40 141 76 -508 -79 209 141
7383 141 -120 -283 125 109 -190 -18 74 69 -43 -172 -173 7 120 -19 -96 -98 6 0 255 -99 -125 -22 -85 58
7407 58 117 -17 143 -43 -97 143 200 -22 153 162 125 -32 93 -121 314 128 -31 195 -12 80 -72 219 186
7430 186 -167 -30 -69 17 78 171 72 -22 -231 -201 64 188 -105 135 204 5 -1 143 431 -3 -216 -59 12 35
7454 35 -28 93 -211 119 -94 157 208 -237 -104 27 -209 -92 -122 -89 12 52 137 46 -13 -75 -138 -118 134 140 170
7479 170 66 -126 94 84 168 -47 -65 202 -102 205 67 -229 427 -49 -65 -16 -5 60 180 22 -10 -252 -88
7502 -88 -48 119 43 -92 -241 -1 -322 10 171 -144 -122 237 163 -113 30 -207 196 45 -177 -231 140 -5
7524 -5 -73 14 -205 -491 -35 77 -60 -24 -105 -16 -4 -176 -136 -100 -272 -83 -100 218 160 -54 -135 -60 -131 123 100
7549 100 61 291 107 39 122 14 -16 64 113 -258 -187 110 326 -175 -40 94 228 -70 205 64 -7 -25 220
7572 220 68 -189 -72 -16 256 -88 202 -20 384 1 248 107 227 -62 -24 336 -91 -162 152 -189 -131
7593 -131 249 187 245 86 216 77 165 57 -281 322 -27 26 -95 -140 99 286 162 49 71 -59 147 47
7615 47 109 138 14 462 -161 45 -102 -65 202 -125 -197 139 232 -42 -70 86 -94 -233 -204 90 -256 -57 -55
7638 -55 -113 -302 3 -39 105 -89 -261 79 179 -75 -121 89 -21 -115 130 -183 -238 -93 60 -6 56 -38 -98
7661 -98 -12 198 -124 8 70 -100 55 -356 144 156 158 92 -134 -187 -150 246 122 202 48 479 58 309 313 237
7685 237 55 -109 54 -61 -169 45 77 -134 38 79 203 -3 -136 155 64 25 28 87 5 -142 -10 259 -14
7708 -14 24 103 -169 -242 -59 -82 122 21 -163 -305 82 129 64 -302 -30 189 -19 46 43 296 76 -223 98
7731 98 -160 -130 87 58 -61 -106 -223 8 113 11 49 -38 27 228 67 -99 30 94 66 -83 12 -61 -114 27
7755 27 -191 2 13 -213 -11 120 -103 -138 69 -123 374 -209 -22 -235 -131 -106 -189 -229 48 33 -81 269
7777 269 214 -86 -394 94 -63 -30 189 -45 -98 -279 37 -62 67 -188 146 31 158 28 -33 -185 -112 -13
7799 -13 -95 -100 -290 -30 -128 55 422 68 -34 38 -130 329 -33 -24 36 58 244 -176 -16 59 170 -183 -91 12
7823 12 -87 59 -123 385 30 8 -86 14 -19 150 -58 8 177 13 -148 -198 99 333 -29 -61 -57 -306 -44
7846 -44 287 -150 247 208 -55 137 -127 -103 125 -35 267 112 -158 9 249 449 39 136 -63 -127 -89 -278
7868 -278 13 64 206 46 72 98 25 -162 -8 336 -13 -27 213 -212 -59 -102 165 136 -284 -27 -110 95 16
7891 16 119 -149 -199 84 -110 -58 35 196 36 226 -232 52 -59 -160 63 39 -45 -175 -202 64 225 -83
7913 -83 -75 -24 -118 -41 71 -10 164 243 -201 69 -166 144 -16 -258 405 -18 131 -71 164 57 -152 -2 -42
7936 -42 87 -83 -168 95 -80 147 -75 235 -191 -101 259 -221 297 -119 86 29 140 50 241 107 283 150
7958 150 8 -35 -43 -90 83 33 -228 79 -292 128 133 -198 169 -88 2 -142 -144 -130 87 -159 82 -164 214 -18
7982 -18 14 -36 82 99 163 -59 -60 148 -226 -152 -68 -176 0 -96 -170 -158 -195 24 -82 -147 -247 268 -38 -160 -15
8007 -15 -67 2 -289 272 -129 -41 9 -26 97 31 13 -31 4 -76 216 10 -285 -115 136 -47 -478 322 -85 199
8031 199 -160 122 -4 49 -256 60 156 -108 22 -83 23 -395 164 -102 -24 -194 193 -65 -262 10 270
8052 270 -229 -39 -73 -87 470 228 -351 -220 86 113 227 127 113 299 70 177 62 94 -46 231 30 207
8074 207 44 21 -52 -96 195 92 -369 3 -54 -158 222 207 89 46 166 41 101 131 325 53 24 60 -83
8097 -83 47 -16 36 129 21 -75 -160 85 -327 -186 6 311 -17 3 -26 415 -36 -10 184 -262 -14 -108 -141 6
8121 6 -3 62 -267 -17 44 -77 -276 -187 507 72 -272 121 -103 54 384 -159 -15 -129 -232 -131 -75 232 -21
8144 -21 -274 52 -146 -243 16 -75 -187 -300 -207 -10 -53 -63 -178 253 -7 231 41 -64 -77 -247 -30 46 69
8167 69 -136 42 3 -214 147 65 -79 -232 69 316 90 99 10 165 -94 21 -148 23 -95 -90 -95 93 -127
8190 -127 -176
8191a76
$$ Imaginary data points
##PAGE= N=2
##DATA TABLE= (X++(I..I)), XYDATA
0 0 0 0 0 -8 8 -8 8 -16 16 -16 24 -32 40 -48 56 -72 88 -96 120 -136 160 -192 216 -251 290 -335 377 -432
28 -432 488 -552 622 -698 783 -875 977 -1089 1210 -1345 1490 -1652 1829 -2028 2244 -2484
44 -2484 2752 -3054 3391 -3780 4226 -4741 5352 -6085 6986 -8121 9610 -11647 14626 -19410
58 -19410 28358 -50829 224587 265364 -315866 -215817 103485 126807 -65997 63945 170722
69 170722 -49736 -265036 -30210 227902 111809 -127016 -96398 -8205 -43457 -22113 137212
80 137212 116596 -107150 -179563 5875 109123 28830 -7232 55209 13337 -87409 -31634
91 -31634 113841 89363 -56141 -75019 31508 57508 -2334 -8011 29289 134 -59143 -48644
103 -48644 7178 25539 11072 -4540 -27721 -46991 -27167 7844 7614 -13402 -8400 10224 7559
116 7559 -3819 -5524 -7613 -3728 21911 34937 -1428 -35795 -4766 44659 32991 -15528 -32849
129 -32849 -25645 -20957 2248 38813 27813 -34162 -65582 -36035 -3291 5183 16016 17557 -20876
142 -20876 -57299 -30830 30439 47292 10531 -29520 -37332 -4884 45536 56272 8412 -32345
154 -32345 -15096 10033 679 3531 38482 32174 -31004 -51563 2292 29006 -9438 -22624 13881
167 13881 8775 -42035 -33186 34392 39948 -25139 -44861 1252 23991 10362 16364 26772 -2725
180 -2725 -25028 8034 36265 10886 -3893 27939 32716 -14997 -27658 17859 29521 -12965
192 -12965 -18992 21860 18517 -27300 -27525 13628 12502 -17078 -5988 14028 -14475 -35685 12858
205 12858 58186 19420 -40807 -35730 5363 26476 40000 43644 -750 -53669 -30043 39126
217 39126 49039 4463 -9925 -1308 -23202 -34582 16542 56685 6630 -63779 -54441 2312 24939
230 24939 19486 13086 -16278 -56810 -43961 19550 49977 20796 -11475 -21225 -26062 -12180 30930
243 30930 46735 2599 -36858 -17102 14195 8811 4373 20095 6830 -41511 -50284 2075 39719
256 39719 20010 -14725 -32118 -37772 -23635 12241 27410 -823 -24033 -9882 241 -12591
268 -12591 -4962 27286 23303 -18982 -27305 10562 29445 12354 5180 8433 -11571 -28513 -816
281 -816 33588 21114 -10061 -11605 -7338 -19310 -15477 14238 20081 -7087 -17327 -3040 -5553
294 -5553 -14139 10244 34181 3915 -36577 -14658 33674 34322 6936 4107 5110 -15589 -14722 26783
308 26783 47620 14425 -15620 -9293 -4587 -10515 7919 33898 13383 -31497 -30627 7035 19079
321 19079 6590 3490 -2821 -27642 -24826 21422 44835 10892 -20024 -7882 3094 -6818 5379
334 5379 37153 30513 -12639 -24816 2174 15364 7413 9541 9451 -16069 -29041 2117 29356
347 29356 7776 -22874 -19747 -8395 -11696 -2935 18136 10557 -19214 -21004 1820 3287 -8502
360 -8502 3890 20728 3692 -18835 -5254 16001 5435 -8926 2308 9176 -7689 -13975 4397
373 4397 10116 -5769 -9225 -2612 -14752 -27045 -3743 25033 9449 -25141 -27466 -8771 -3052
386 -3052 1819 16287 10141 -20183 -26271 5848 24280 7534 -5850 -1340 -3507 -9322 6132
399 6132 24461 9914 -15245 -12980 -305 -4645 -4841 14014 16026 -13718 -29022 -6326 11715
412 11715 322 -5991 5778 4479 -13805 -12446 9767 16667 5335 -589 -1431 -6572 -554 22448
426 22448 27552 1745 -16219 -5559 7015 6593 12710 19555 2180 -22586 -14718 11936 14791
439 14791 -975 -2856 1757 -8119 -13361 4374 17327 5975 -6701 -5249 -4606 -3388 13859 27859
453 27859 8563 -18727 -11994 10676 11152 4950 15919 16245 -12762 -26362 1658 25027 8203
466 8203 -10464 -4669 -3384 -15295 -6280 18487 12860 -18886 -24280 -1445 5964 -1092 6758 13567
480 13567 -6929 -25506 -6930 16095 9932 584 8523 3932 -20933 -19331 15938 28194 -1065
493 -1065 -20679 -10225 -3194 -6085 6959 19759 -3657 -36350 -26205 8696 18204 4192 -2743
506 -2743 -9954 -24623 -18615 13167 26259 2602 -16291 -9378 -2535 -1996 10244 21265 1671
519 1671 -23811 -13642 13744 14360 -522 251 2431 -12337 -18370 1911 16957 4259 -6872
532 -6872 -2655 -5699 -16101 -4609 18987 13552 -11076 -12959 3935 4921 -815 10715 17061 -4578
546 -4578 -20136 1368 24173 14761 -1553 1815 2639 -10516 -7250 16632 22079 -1057 -13636
559 -13636 -3849 1157 -2267 5830 14426 211 -16897 -6955 11612 9684 583 4894 4804 -10018
573 -10018 -11567 12325 25329 8364 -8218 -4571 689 -1744 5248 17573 11462 -8668 -13763
586 -13763 -1839 6454 6094 4696 -1532 -12258 -11459 3250 9373 384 -4571 -1366 -4825 -12128 -3174
601 -3174 14016 12338 -4524 -11782 -4403 1102 1773 5906 6430 -2205 -8712 -4490 353 1554 3505
616 3505 2310 -8371 -15673 -5038 9533 5602 -8712 -10798 -4994 -6072 -6809 2287 8055 -1053
630 -1053 -12499 -9855 -198 3137 3753 3012 -2584 -7111 -3907 3355 3435 920 1855 -648 -8427 -9342
646 -9342 2923 10887 4118 -6287 -9009 -8322 -5417 2962 10378 4894 -7865 -12102 -6360 601 7422
661 7422 11493 4121 -9722 -11688 1625 11510 10106 5331 433 -7889 -8793 6292 18858 10650
675 10650 -5577 -8323 -2704 -682 3455 12658 10128 -7394 -15251 -2149 9919 7207 2576 1801
689 1801 -3817 -8791 586 13510 11076 -1753 -3903 -100 -963 2501 13984 14576 -3051 -14079
703 -14079 -2317 9868 6679 3153 5516 65 -12169 -8589 7785 12576 1907 -5224 -5779 -7948
717 -7948 -4521 9083 13749 -1227 -13361 -6939 1779 979 3359 11624 5104 -13319 -14428 3611
731 3611 11902 3510 -1049 1315 -5806 -12971 -2705 11744 7520 -6979 -10015 -5239 -5164 -1974 8090
746 8090 6814 -9799 -17311 -4963 5470 3296 1846 3216 -6028 -16268 -5913 12988 12088 -4438
760 -4438 -10329 -3833 -1767 -564 7173 9004 -4246 -15600 -7689 5744 8284 3864 -1300 -8510
774 -8510 -12343 -3492 8981 7993 -1292 -4008 -3549 -7248 -3892 9544 13693 -465 -11941 -4850 6064
789 6064 6163 4013 5158 1073 -6372 -4181 5184 8453 4270 2273 195 -5922 -4737 6161 9974
804 9974 426 -4762 1750 4048 -3380 -3125 7191 8989 -1851 -5124 2023 4810 1430 3608 6786
819 6786 1271 -5236 -998 6450 6397 3333 3552 -448 -7697 -3197 9719 10575 -2007 -8050 -2390 1676
835 1676 603 3797 6077 -2065 -9923 -4637 5899 6080 1341 -526 -3281 -7051 -2575 7680 7026
850 7026 -1934 -4147 -919 -2934 -4643 2955 8119 -142 -9569 -5336 1792 -1343 -3129 3376 2851
865 2851 -8840 -11856 -318 6383 225 -3551 -1759 -4544 -9219 -2749 8014 4173 -6055 -6406
879 -6406 -1417 -3248 -2750 5076 6372 -5606 -11070 -1320 4873 -828 -2899 3092 -232 -10652 -7684
894 -7684 5955 8311 -2295 -6659 -2827 -2921 -3584 3811 8582 34 -8936 -4970 1976 2732 3653 6098
910 6098 557 -9266 -5827 7498 9695 818 -2480 377 -2276 -5176 3783 12494 4691 -7808 -6230
925 -6230 1902 2972 2966 6432 4306 -4882 -6919 1742 7147 4850 3741 2997 -4410 -7953 3351 14031
941 14031 8170 -4481 -4280 1041 227 1165 9105 9473 -3605 -10994 -1361 8313 6498 1859 690
956 690 -2973 -6613 -709 8348 5968 -1634 -3107 -1690 -3034 -1087 7778 8656 -3292 -9696 -1629
971 -1629 5303 2031 -409 3476 1201 -7496 -7271 3189 6859 1312 -3204 -3578 -5161 -4292 3013 6584
987 6584 -550 -7799 -5366 -1094 -1356 874 4728 909 -8954 -8964 1703 6067 1112 -2390 -1507 -3390
1003 -3390 -6045 -1107 5400 3322 -3503 -5563 -3432 -1799 1257 4268 1249 -5998 -6684 -457 1992
1018 1992 131 563 2186 -2699 -7242 -2467 5754 4897 -1543 -3275 -1142 -1467 -566 3802 4866 -328
1034 -328 -4296 -1561 1120 2161 3345 3080 -827 -3985 -888 3535 2669 976 2232 1388 -3202 -3039
1050 -3039 3560 6687 2322 -2154 -841 764 764 2627 5189 3004 -1096 -1978 987 2920 3435 3848
1066 3848 1905 -2246 -2192 2055 4528 2969 1559 1001 -1546 -2997 1460 6148 3719 -1754 -2376 376
1082 376 231 609 3322 3825 -634 -3976 -1738 1487 2834 2947 1700 -2721 -5080 -876 3913 3049
1098 3049 -529 -1285 -1997 -4315 -3008 3033 4825 -1657 -6175 -3431 -409 -478 766 2083 -802 -6668
1114 -6668 -5900 -68 2997 1763 -590 -3437 -6742 -3837 3050 4380 -1492 -4553 -2601 -2060 -3865
1129 -3865 -127 4985 1651 -7098 -8054 -643 3051 829 -105 -1040 -4432 -6081 -595 3999 2687 -1288
1145 -1288 -2845 -4090 -3650 1160 6513 2827 -4966 -5330 14 1081 204 3708 4733 -2982 -8340 -2029
1161 -2029 7481 6390 -540 -2995 -2223 -1636 551 5014 5121 -36 -3612 -1690 288 1807 5342 5761
1177 5761 -1170 -6137 -1197 5614 5166 1454 1429 1162 -2695 -2698 4533 8401 2380 -3150 -1879 507 1108
1194 1108 3073 5852 2499 -3598 -2778 1808 3376 3260 3646 1322 -4539 -4369 3695 7358 2018 -2974
1210 -2974 -1764 -126 -1485 1065 5012 3371 -3123 -4625 -361 1757 1844 2150 1099 -3774 -5298 -429
1226 -429 4650 2611 -1338 -1900 -2771 -3673 -592 4501 2700 -3464 -5237 -1462 -66 -851 980 2103
1242 2103 -1996 -6170 -3425 1617 2361 -517 -2096 -2687 -3352 -2105 970 1131 -1137 -2231 -1805 -2491
1258 -2491 -2673 310 2792 -572 -3401 -2218 -301 -1307 -1241 2360 1926 -2841 -4602 -841 2931 1616
1274 1616 -427 -1496 -2220 -1523 847 2131 773 -634 -82 -1111 -2338 716 5184 2954 -3633 -3676
1290 -3676 1609 3625 526 431 2253 45 -2666 -70 4269 3677 594 -656 -206 -991 748 4251
1306 4251 4163 48 -1883 -165 480 509 3946 5275 -225 -4919 -1067 4776 3907 -55 575 1913 -1417
1323 -1417 -2816 1722 5637 2708 -1576 -1800 -358 -683 1820 4172 1628 -2412 -2367 767 441 -210
1339 -210 2629 2777 -2316 -5072 224 4104 1292 -2029 -202 25 -3347 -3010 3317 4374 -1684 -5279
1355 -5279 -2393 545 573 1175 1366 -3120 -5862 -1813 2802 1381 -2021 -814 -1416 -5517 -4273 3555
1371 3555 5990 -1693 -7465 -3852 11 189 1378 2901 -549 -6714 -5759 1178 4019 1465 -1323
1386 -1323 -2832 -5018 -3980 2332 5656 539 -4860 -3625 -1137 -986 850 4574 2002 -5200 -5980
1401 -5980 862 4611 1485 -923 -47 -450 -2371 -12 3832 2667 -1362 -1852 373 375 452 2888 2856
1418 2856 -926 -2500 522 3113 1893 759 1891 569 -2152 -392 4036 4398 87 -1347 1252
1433 1252 997 -169 1903 4979 2609 -2317 -2648 1831 3567 3150 2093 414 -1572 -1932 1250 4121
1449 4121 3122 847 -865 -1952 -1844 1782 5117 3412 -1704 -3754 -644 1487 1632 1865 1854 -639
1465 -639 -3860 -2184 2832 3927 281 -2432 -1639 -418 19 855 1265 21 -1818 -2339 -610 670
1481 670 520 196 -1017 -3037 -2137 943 1479 -1372 -2882 -844 -62 -1298 -1726 356 878 -1975 -3449
1498 -3449 -910 1131 -439 -2008 -499 38 -2243 -2603 -48 863 -323 -1068 -1239 -1749 -2262 -24 1326
1515 1326 -488 -1804 -919 -487 -1684 -1047 2406 2659 -1966 -4613 -1218 2433 1827 -312 131 215 -2495
1532 -2495 -2226 1952 3952 1284 -2042 -1544 -578 425 2441 3597 479 -2512 -1129 1892 1672 1058
1548 1058 2086 1439 -2619 -2893 2663 5057 1439 -2062 -119 1397 -132 669 3481 3164 -1155 -2411
1564 -2411 867 2683 1991 1386 1250 -1372 -2018 1304 3733 1671 -452 -70 195 -1721 -524 3910
1580 3910 3768 -1188 -3313 -2 1653 324 789 2507 740 -3502 -2502 1879 3011 876 -730
1595 -730 -1077 -2314 -1732 1746 3387 -39 -2985 -1854 -994 -1020 990 3081 -290 -4764 -4406 864 2391
1612 2391 -342 -1053 -857 -2510 -3828 -494 3149 1077 -2789 -3464 -1330 -533 305 1700 240 -3141
1628 -3141 -3629 -725 858 552 409 140 -2620 -4256 -541 3200 1462 -2358 -2736 -530 -843 -813 1237
1645 1237 2206 -1276 -3733 -1798 1371 1760 1099 261 -1327 -2208 -402 2403 1894 91 -142 -63 -1158
1662 -1158 -268 2525 3748 -366 -2782 -442 1948 1527 788 2096 1491 -1011 -1638 1332 3181 2236
1678 2236 367 -80 -165 628 2266 2750 870 34 528 822 508 1266 2904 2110 -1261 -1581 1527 2665
1696 2665 1026 -86 887 736 -690 -265 1585 1948 1061 -184 -707 22 1245 1445 640 -434 -194
1713 -194 427 -301 -193 1163 1935 -445 -2258 -1401 897 1214 -141 -808 -365 -1056 -1173 -474 330 319 -819
1732 -819 -1494 -2024 -549 480 509 -1274 -1986 -761 -538 -1119 -772 443 -56 -2127 -2625 -683 752 117
1750 117 -787 -1151 -1541 -1738 -631 348 -102 -895 -1342 -1876 -1929 -23 1679 239 -2069 -1970 -469 210 -568
1769 -568 78 690 -903 -2704 -1133 1500 1781 -79 -1188 -660 -750 -195 1120 1861 209 -903 -1164
1786 -1164 -356 556 1838 1793 -617 -2311 -731 1837 1805 857 663 438 -1360 -1025 1792 3414 1229
1803 1229 -1347 -711 660 1184 1777 2231 1154 -963 -1177 764 1693 1945 1705 69 -1568 -1382 1640
1820 1640 3311 1341 -768 -293 71 -961 893 2972 2459 -1083 -2503 -210 1643 1567 1089 537 -819
1837 -819 -1941 -276 1761 1628 512 -933 -1600 -1569 -34 2328 1254 -1819 -2768 -580 -25 -292 434
1854 434 1067 -489 -3233 -2459 899 2023 118 -1717 -1801 -1115 -470 399 1228 -145 -1832 -1997 -1377 -464
1872 -464 870 997 -986 -2405 -1929 119 830 -464 -701 -992 -1676 -1997 -535 1469 721 -1534 -2444
1889 -2444 -1313 159 557 100 -330 -860 -1008 -653 66 1289 1271 -337 -1558 -762 313 1338 1094 -119
1907 -119 -472 -348 -450 284 1159 1688 501 -492 -878 311 1901 1432 157 -172 438 468 343 1166 2303
1926 2303 1654 -748 -662 1076 2214 1391 547 663 886 524 868 1193 1096 373 633 389 146 837 1708
1945 1708 1073 -702 -497 947 1402 -399 21 1629 734 -815 -700 1554 1014 -353 -325 845 214
1962 214 -847 333 1413 605 -992 -548 -265 -719 -57 1156 753 -1911 -2114 -341 757 -526 -270
1979 -270 1020 -1049 -3200 -1246 2014 1308 -1686 -1763 -397 -1030 -1370 477 1801 -1061 -3221 -1820
1995 -1820 82 -111 -235 208 -1252 -3316 -2162 1162 576 -1645 -1716 -154 -1354 -2370 591 2121
2011 2121 -677 -3387 -1570 1616 684 -1423 -290 628 -1569 -2040 614 1930 66 -1722 -552 -421
2027 -421 -1034 523 2023 113 -2224 -1341 1356 464 -701 962 2045 -987 -2820 286 3272 1356
2043 1356 -624 435 1069 -945 -879 2111 3341 617 -1142 -336 408 301 1769 2971 691 -1886
2059 -1886 -280 1892 1061 570 1480 1501 -1756 -1943 1988 3669 672 -1463 -222 1131 -77 401 2287
2076 2287 2071 -1129 -1639 817 2048 1034 377 97 -1233 -1065 1303 2761 42 -2141 -975 33
2092 33 -551 -36 1940 883 -2422 -3021 643 2149 398 -916 -596 -786 -1657 -604 1268 689 -1260
2109 -1260 -1845 -1013 -547 204 1074 444 -1698 -2003 -132 212 -1076 -814 326 -255 -2218 -1582 207 493
2127 493 -1321 -1240 94 -331 -1330 -1103 188 531 -501 -1054 -938 -649 21 234 -241 -774 -825 -213 12
2146 12 -604 236 849 138 -1251 -335 1407 857 -376 -679 -10 214 81 868 1059 99 -784 -295 666
2165 666 1443 1723 289 -674 -529 1024 1822 1424 327 274 2 -152 671 1667 1907 475 -453 5 1285
2184 1285 1252 839 619 450 349 422 644 793 1282 889 325 -280 82 749 663 404 611 878 -1 -717 -226
2205 -226 1285 1084 285 -345 -44 143 52 -11 102 338 -683 -853 -384 427 929 134 -1344 -1707 -466
2224 -466 455 160 -487 -258 -731 -1099 -703 472 979 -852 -1915 -1549 -211 592 23 -805 -1359 -1908 -1332
2243 -1332 -268 418 164 -790 -2377 -1831 -410 1186 434 -1302 -1889 -1246 -608 -271 317 313 -528 -1952
2261 -1952 -1709 -137 1144 737 -748 -1457 -1032 -68 123 202 39 50 -859 -1010 -386 989 1115 -504 -1278
2280 -1278 -608 461 677 389 444 130 -125 -694 178 1284 1455 255 -697 -365 583 1563 755 270 33
2299 33 145 168 317 1188 1826 716 -729 -485 748 1779 1254 101 94 175 244 252 1377 1304 565 -402 -567
2320 -567 723 1480 1587 471 -517 30 234 507 669 1065 592 -624 -781 -134 1281 1084 -210 -877
2338 -877 -293 229 240 77 148 86 -418 -828 -116 475 639 -357 -1160 -905 40 320 -89 -444 -212 -336 -783
2359 -783 -786 -2 314 -180 -1205 -863 -305 -25 -342 -480 -403 -485 -826 -1072 -465 -334 -155 -1062 -1170 -240 149
2380 149 -499 -793 -526 -39 -627 -1050 -512 -43 -66 -895 -629 -392 -402 -73 320 115 -193 -367 -313 -193 252
2401 252 688 552 -269 -544 257 637 308 258 763 151 -353 -480 577 1256 772 20 -242 523 498 352
2421 352 554 822 411 57 259 481 944 1045 303 -329 43 1403 1038 576 493 390 256 88 541 1545
2441 1545 1226 -245 -638 416 1026 1069 731 378 249 -293 79 785 872 938 63 -353 -1110 423 1553
2460 1553 624 -900 -834 -26 67 -606 -47 995 -116 -1594 -934 802 1007 -129 -837 -621 -481 -381
2478 -381 266 307 -393 -860 -1208 -1120 -239 369 769 -848 -1854 -1198 291 18 -676 -289 -194 -1077 -1682 -451
2498 -451 874 389 -1436 -1626 -744 118 -17 -165 -190 -696 -1091 -745 -118 140 -127 -67 -1487 -1177 -73
2517 -73 1297 312 -718 -649 219 -218 -617 115 812 -146 -1471 -578 757 1003 173 -150 -175 -181 -65 808
2537 808 908 476 166 -400 -348 540 1449 1279 205 -766 121 848 1047 349 730 475 82 -83 909 1361
2557 1361 1143 33 -461 301 847 1031 997 844 134 115 -5 493 714 1074 311 -204 202 595 1071 328
2577 328 -94 250 434 -79 -11 455 662 217 -593 -159 131 427 -263 -198 85 268 -273 -503 -53 423 88
2598 88 -495 -591 -401 -173 -219 -424 -104 -106 -255 -457 -827 -298 -199 -557 -1204 -575 46 173 -764 -858 -132 -271
2620 -271 -481 -419 -302 394 -581 -1001 -790 -209 213 -707 -350 -423 -648 -681 -373 -200 112 -349 -902 -714 -113
2641 -113 520 383 -343 -503 -63 27 -538 -314 576 458 -574 -744 135 409 391 -67 252 209 34 -338 464
2662 464 863 676 -55 -213 -187 206 1226 511 -28 -34 482 97 207 558 1101 549 -608 -313 1122 1181
2682 1181 561 -296 27 324 685 574 1204 818 -122 -298 -124 756 1636 651 -736 -881 -35 1224 1142
2701 1142 596 115 -12 -581 -271 719 1358 604 -887 -1246 -410 747 890 159 -403 -815 -460 -96 160
2720 160 342 161 -557 -847 -701 258 302 -465 -773 -558 -525 -120 -704 -393 -71 -941 -1018 -387 -293 -463 -701
2741 -701 -815 -661 -223 -124 -624 -831 -335 -213 -818 -974 -134 435 -392 -1078 -856 -90 -179 -336 227 346 -300
2762 -300 -951 -371 481 422 86 -479 -715 -996 -153 1009 433 -439 -184 -262 -735 -265 1189 1264 -573 -1511
2782 -1511 -242 955 775 367 797 81 -550 -286 971 1252 450 -62 -146 435 192 758 1445 259 -370
2801 -370 680 1347 484 572 715 685 -142 206 1593 1277 -329 -623 1331 1427 379 -83 954 763 -370
2820 -370 -72 1081 917 98 -9 519 426 -292 615 653 -284 -329 697 656 -828 -647 626 1133 -699 -471
2840 -471 868 -61 -1440 -619 888 778 -864 -1026 200 80 -268 -51 338 -653 -1273 -363 401 -131
2858 -131 -246 -76 -620 -1801 -640 811 457 -1432 -1116 97 -3 -974 -693 683 -243 -1648 -918 696
2876 696 278 -804 -643 -261 -451 -612 -34 66 -682 -922 -123 87 -823 -214 161 -208 -1431 -418 1029
2895 1029 303 -953 -142 805 129 -1068 -270 912 648 -545 -294 352 7 92 634 534 -190 -176 236
2914 236 315 1 809 1071 60 -1053 151 1357 909 60 173 1061 86 -386 620 1826 496 -689
2932 -689 -268 619 597 762 736 323 -454 -41 1022 732 330 345 419 -521 -262 901 1594 225 -1044 79
2952 79 768 251 133 440 566 -546 -788 -73 781 284 -464 -279 -434 -255 280 281 -217 -598 -413 -422 -6
2973 -6 -163 441 -58 -1161 -1160 -194 239 -148 -519 -239 -385 -743 -584 280 202 -438 -801 -655 -88 59 -555
2994 -555 -286 -607 -574 -660 -259 -137 -194 -7 -483 -991 -685 -92 -46 -456 -601 -285 -162 -469 -401 109 322 -671
3016 -671 -483 -206 385 -121 -400 -322 -224 -98 -98 -117 270 209 25 -403 -31 546 922 108 -243 -4 841 633
3038 633 -24 44 897 653 -117 323 481 711 328 -196 272 671 643 240 273 398 650 554 374 520 674
3059 674 577 503 409 93 668 375 136 395 954 504 144 347 589 894 261 -6 178 564 -120 -189 305
3080 305 571 135 -598 -125 159 339 466 -272 -173 -183 -49 305 141 120 2 82 -660 -412 205 269 -159 -711
3102 -711 -629 62 -318 -546 -97 -120 -791 -858 -437 110 -5 -799 -679 -619 -200 -236 -355 -361 -653 -691 -425 -471 -61
3125 -61 -62 -325 -872 -1106 85 11 -154 -540 -525 -217 -545 -459 220 460 -357 -757 -321 105 10 45 -389 -136
3147 -136 -369 -257 40 299 141 18 -399 -137 156 705 659 120 -257 65 448 122 218 623 382 -460 -243
3168 -243 745 1015 672 75 104 384 495 487 778 489 41 -1 303 485 924 917 208 -216 113 565 680 469
3190 469 262 286 49 -118 80 747 426 -279 -533 22 615 570 472 -18 31 508 -71 192 434 634 -17
3211 -17 -245 -51 142 512 153 -255 -264 279 -24 -470 -148 38 -188 -700 -928 -53 339 -204 -590 -546 -203
3232 -203 -385 -359 -630 -170 -9 -428 -806 -522 388 209 -517 -821 -215 197 -260 -605 -33 -151 -591 -419
3252 -419 -422 -206 -55 -292 -354 -432 -85 195 -363 -799 -170 104 -373 -475 28 -17 -335 -336 -228 429 253 -9
3274 -9 -89 -69 84 170 -105 146 273 79 397 141 -119 129 677 170 111 315 474 130 -180 699 816 337
3296 337 126 -30 955 231 347 652 829 602 -182 162 578 593 254 502 40 280 519 608 610 321 189
3317 189 309 2 26 898 590 -90 -359 128 788 -10 -442 429 519 -273 -179 444 822 -175 -372 -168 447
3338 447 -174 6 214 -245 -251 -16 340 -261 -506 -275 12 -752 -702 335 379 -490 -1212 6 57 -356 -635
3359 -635 6 355 -751 -1063 -415 380 -634 -117 108 -439 -1043 -413 65 -25 -296 -293 -403 -959 -704 388
3379 388 482 -520 -900 -83 30 -322 -338 384 83 -968 -921 139 632 -112 -754 -435 -88 -407 24 399
3399 399 302 -643 83 21 10 -43 419 404 -549 -460 463 1270 -79 -828 206 433 100 29 850 736 -498
3420 -498 -315 464 798 360 -366 209 182 -52 341 928 501 7 49 347 20 106 752 754 -94 -307 344 951
3442 951 -65 -159 675 462 -63 -461 492 712 196 -85 565 517 -139 107 390 24 -2 152 355 -201 -288
3463 -288 372 505 -403 -745 -212 285 -593 -403 184 146 -726 -605 587 686 -345 -805 -52 -217 -378 65
3483 65 31 -482 -872 -282 76 -224 -276 -578 -251 -859 -287 415 198 -665 -671 -277 121 -285 -204 283 -81 -967
3505 -967 -824 78 76 -732 -382 -4 -239 -493 -376 286 -128 -328 207 74 -60 20 211 -100 -64 -68 538 -220
3527 -220 -598 -152 689 306 16 -128 240 318 144 283 549 522 -58 69 693 387 288 376 23 80 79 693
3549 693 555 -12 34 513 607 -387 553 949 154 -349 330 1026 994 -176 273 351 367 342 435 836 165 -139
3571 -139 -35 390 900 472 39 -234 -320 168 795 -146 -92 -202 63 -211 -218 634 716 -62 -585 -157 447 58
3593 58 -182 -458 77 -119 -573 -70 198 17 -231 -27 -570 -178 27 -86 -458 -497 -240 -53 -552 -841 -21
3614 -21 45 -602 -906 -256 -4 -513 -452 -336 -280 -553 -582 -174 5 -425 -788 -304 -430 61 -34 -94 -666 -589 -231
3637 -231 207 -447 -394 179 -89 -723 -558 122 530 -27 -308 -115 -66 152 227 145 70 -28 -264 194 229 300 2
3660 2 -12 -320 340 642 157 -99 5 443 120 160 254 548 321 -273 -207 552 488 178 216 66 361 295 299 763
3684 763 629 228 443 152 205 382 590 127 91 399 273 90 -7 197 243 487 41 41 319 184 183 -57 156
3707 156 19 -167 42 -43 189 -45 -196 132 56 30 -53 -256 -255 -225 -353 -367 -366 99 22 -51 39 -85 -69 -124 -503
3732 -503 -65 -236 -478 -597 -145 -121 30 -346 -456 -345 -120 176 -621 -641 -256 15 -193 -458 -74 -310 -91
3753 -91 -435 -176 52 21 -320 -151 -269 23 -90 -263 -36 46 60 -285 -580 33 -37 -112 -298 -450 -117 172
3775 172 -137 -228 289 442 -426 36 259 575 171 151 67 68 -9 263 100 314 294 546 332 11 701 504
3797 504 297 -117 85 475 506 -70 -320 274 130 45 162 400 657 185 31 145 317 351 341 -10 -368
3818 -368 98 120 -15 238 724 101 168 -331 -67 335 257 -325 -269 33 241 14 63 361 14 -236 -241 -39
3840 -39 139 80 -264 -263 -124 30 -311 -138 -201 -110 -260 -555 -313 3 56 -319 -912 -368 -311 -60 -226 -573 -368
3863 -368 -344 -703 -418 154 21 -257 -377 41 -410 -298 -135 -183 -388 -428 -535 -178 -76 -203 -120 -263 -375
3884 -375 -185 101 -151 -196 -280 -97 -303 -85 -133 18 -63 -263 -190 -27 345 -4 -378 43 80 44 -77 138
3906 138 495 277 -210 -215 214 310 72 -145 -62 325 215 77 301 219 234 200 -65 324 425 372 14 199 102
3929 102 534 69 47 298 556 297 -236 -19 457 324 97 82 269 396 126 394 169 274 191 92 197
3950 197 53 487 281 -4 -61 -55 259 17 -221 3 425 -116 -259 -189 363 179 -292 273 176 48 -250 -216
3972 -216 -162 -24 -184 -112 -548 -128 228 299 -380 -436 -167 12 -332 -548 86 135 -399 -514 -459 59 -92 -388
3994 -388 -354 -354 -323 -352 -196 37 -151 -1 -245 -313 -8 -195 -99 -390 -611 -164 487 185 -183 -195 -19 -367 -36
4017 -36 -192 384 -323 -546 -166 307 331 166 143 -477 16 -200 120 411 196 -140 31 -70 153 207 701
4038 701 -88 -198 -28 170 226 140 465 195 10 47 422 542 228 4 369 494 149 271 285 200 336 284
4060 284 412 165 229 365 66 16 257 -156 -45 -87 483 530 -65 -133 54 286 109 -219 152 199 265 41
4082 41 420 347 198 -400 -222 144 341 144 -140 -327 -344 -28 347 -28 -228 -108 -256 -439 -114 22 475
4103 475 -126 -923 -255 -189 -34 -145 -49 -264 -207 -194 -207 -10 -123 -467 -797 -452 -135 165 -149 -557 -481 100
4125 100 128 -306 -634 -253 -45 -455 -151 427 188 -460 -801 -270 611 -143 -496 -103 -211 -100 -104 -207 -168
4146 -168 -157 96 105 -249 -73 693 243 -521 -96 334 557 -530 -112 408 312 -166 73 170 322 -287 324
4167 324 303 207 289 115 -30 56 124 584 430 -190 115 573 442 42 132 310 277 -162 -63 646 881 -155
4189 -155 -306 386 190 -136 140 380 215 -2 66 256 147 185 49 263 82 318 454 327 -8 -231 245
4210 245 371 -246 -290 440 199 -261 104 56 354 -407 -127 -56 -121 -341 -244 -146 -23 69 -77 -205 -572 -178
4232 -178 228 97 -483 -261 -414 -176 -374 18 189 -105 -679 -325 84 214 -400 -220 -15 -361 -435 -139
4252 -139 255 66 -227 -186 -185 78 68 -56 70 -49 -369 74 17 -162 -254 0 -180 -279 -26 328 22 -198
4274 -198 -217 -7 -167 -17 80 124 -67 -312 38 237 310 -155 -240 -153 -10 373 545 230 -95 99 152 10
4296 10 -100 202 367 -67 -209 196 310 216 38 165 345 93 196 225 477 181 127 45 383 142 313 -37
4318 -37 61 38 356 49 -128 71 260 41 -314 -103 202 622 -110 -548 42 143 -139 -124 -4 19 -57 -476
4340 -476 -159 -27 155 -221 -146 -94 -185 -15 -192 -36 -187 -85 -74 -234 -411 211 303 -373 -716 -119 66 -190
4362 -190 -312 -362 -127 -323 -153 -278 -116 -432 -380 -423 -505 82 164 -348 -142 -155 144 -272 -112 -373 -259 -114
4384 -114 -88 -299 154 -173 -165 -94 -33 87 -71 16 124 -43 -24 -99 -408 -138 153 153 30 44 -32 216 210 -5 -137
4409 -137 282 11 110 -141 465 119 69 265 380 508 -71 65 29 534 219 217 34 425 210 133 107 13 155
4432 155 205 190 153 154 328 103 6 61 389 131 183 177 348 190 121 104 406 140 -37 285 183 101 57 -183 24
4457 24 -117 -139 -106 29 -159 -144 -57 -342 -103 47 224 256 -182 98 -105 39 -318 88 40 -137 -421 -311
4479 -311 51 -331 -93 -537 -159 -218 -162 -232 -118 -268 -408 -697 -387 -151 -113 -81 -617 -490 -466 246 -252 -180
4501 -180 -288 5 -399 -368 44 122 -31 -290 -226 28 -48 -27 -311 -152 -49 -64 -266 -102 232 45 -206 -165
4523 -165 21 522 468 -351 -266 -15 68 -197 283 122 344 -13 -87 202 -90 551 -1 -49 33 584 432 237
4545 237 -2 -85 94 41 -122 263 339 361 43 128 501 557 -99 201 -55 112 458 220 -47 662 323 -214
4567 -214 -97 165 91 -78 76 56 226 129 -48 -134 198 58 75 -83 -25 174 -16 -387 -144 37 -261 -219
4589 -219 22 -137 212 -366 -311 -42 -89 -46 -286 -39 -58 155 116 -163 -209 -42 -70 -296 -50 -143 -465 -240 -152
4612 -152 -181 -321 35 -76 91 143 -61 -172 -318 114 76 -331 -182 104 -72 -227 -103 -163 -215 -57 -391 -188
4634 -188 28 -64 -38 -167 -126 55 -47 -127 -90 165 512 -194 -146 145 202 208 -187 72 129 -20 -217 251 288 135
4658 135 -221 176 -59 416 444 -110 85 -34 267 340 146 66 357 472 98 -249 344 388 327 519 73 421
4680 421 337 212 253 387 256 51 156 306 307 234 -153 221 103 448 473 -113 70 309 -14 40 -312 365
4702 365 566 11 -75 3 159 10 -57 225 105 -147 -64 91 196 -97 -28 -103 19 -39 -146 -11 -157 -436
4724 -436 -2 260 -309 -228 1 132 -192 -458 533 68 -260 -326 -125 -146 -12 -117 -338 -521 -259 -317 -281 -13
4746 -13 -119 -75 -161 -381 -578 241 -24 -168 -592 -368 1 -462 -349 52 124 -449 -343 54 82 -559 -105 -151
4768 -151 165 69 -77 366 -62 71 104 120 -60 -101 -28 398 213 -45 242 407 -117 -241 351 175 105 -21
4790 -21 333 299 -265 -83 377 217 -10 102 354 259 -138 404 283 122 52 37 409 -161 -91 316 293 -93
4812 -93 -114 309 37 -27 148 731 419 -278 -177 468 380 -253 -6 259 -192 -145 81 345 116 -125 311 207
4834 207 113 -446 54 41 -93 -182 243 -113 -356 -241 40 158 -309 -191 -105 -114 -569 -280 124 -212 -437 -29
4856 -29 175 -139 -318 -116 -78 50 -494 -265 -101 40 -184 -99 -303 -299 -171 277 -128 -207 -409 139 90 -15
4878 -15 -140 220 -404 -680 -110 101 -18 -297 -89 -70 -57 310 69 -69 14 101 124 19 121 -21 488 -274
4900 -274 -533 298 407 52 -210 97 128 311 -118 237 492 -117 -161 38 345 124 153 211 212 -47 359 -18
4922 -18 -119 -171 190 269 -16 44 303 370 66 -87 62 500 279 -312 250 197 297 -124 48 50 206 258 121
4945 121 540 0 -34 38 166 326 298 -13 -144 197 59 79 111 49 -158 -135 32 -421 -21 194 -352 -297 17
4968 17 -152 -113 60 82 -198 -104 -129 -100 -251 -350 -220 74 -413 -326 139 -162 -156 -268 172 -184 -398 -186 97
4991 97 209 -283 -116 -103 -222 -546 -268 95 -140 -260 -333 -151 -164 24 -113 3 35 -19 -101 273 -201 -54
5013 -54 -128 -371 -107 -151 178 36 -5 88 184 -173 -273 133 333 169 55 97 -14 355 110 105 126 51 72 231
5037 231 52 314 277 363 -49 18 306 449 243 15 -55 189 82 -4 152 218 249 68 -100 258 202 135 -98
5060 -98 199 21 307 -64 78 257 2 96 104 -70 332 292 -6 -68 -204 178 9 15 122 376 -242 -147 -213
5083 -213 229 -87 -50 -219 128 121 262 -201 -94 57 43 81 -43 -101 -411 -125 -150 -158 125 128 -313 -429 -316 -66
5107 -66 -166 -333 -346 63 -230 -83 -173 -66 -161 9 -413 -98 -244 132 -193 -203 -308 61 -93 -350 -379 -262
5129 -262 -30 -210 -212 -130 -60 45 -198 56 309 215 19 -27 84 -144 20 -40 166 131 -18 18 -253 314 26
5152 26 43 439 60 -104 173 146 -50 10 235 -236 -143 319 146 7 145 -30 324 359 32 -15 55 428 -126
5175 -126 -46 311 271 108 360 198 235 -83 108 117 -79 -25 -109 -84 -38 322 181 81 61 15 147 178 43 37 157
5200 157 94 146 167 176 334 -39 -55 -288 -70 167 -90 157 -47 -17 -41 -219 -60 23 185 -77 -350 -14 -196
5223 -196 -76 -255 17 -211 -459 -71 -48 87 -212 -388 -242 -86 -123 -208 -185 41 -255 -29 -27 -104 -138 171 -213
5246 -213 -292 163 61 -158 -299 -233 -194 78 -113 -427 85 301 91 -118 -187 -20 58 27 220 -204 7 -146
5268 -146 12 -188 -12 18 -369 84 64 340 250 -1 148 409 104 184 -91 109 280 -101 -44 275 185 -184
5290 -184 192 156 195 261 -114 171 172 231 341 87 330 266 130 338 159 -81 222 327 -23 247 329 114 22
5313 22 -64 1 580 399 114 -167 -41 237 -8 -72 90 105 14 -20 42 224 250 -36 8 -56 109 -110 95 -29
5337 -29 -30 -331 145 -137 135 77 -320 -204 21 93 -19 -151 58 -112 -33 4 198 -67 -126 -178 -212 -72 6 133
5361 133 -290 -71 -275 22 -338 10 -84 -243 16 0 -116 -43 -110 -163 -259 94 -45 96 -303 -113 -215 -19
5383 -19 -97 -51 -273 -159 10 115 -17 -272 -165 59 -217 -128 190 -386 -226 129 402 29 -214 86 213
5404 213 163 91 168 -56 -123 78 300 213 193 105 -16 122 -65 84 134 83 119 -71 80 234 -46 164 318
5427 318 53 -2 172 241 208 -152 31 225 172 230 91 51 77 -81 -25 -149 116 90 -1 -158 3 273 71
5450 71 285 -160 75 -113 -52 150 122 255 -123 228 100 186 230 -149 -240 -128 127 0 286 -107 145 -69
5472 -69 -211 -85 14 -217 -267 -243 -75 -46 138 -298 -130 -80 -389 89 -105 -56 -315 231 -160 -181 180 -172 -78
5495 -78 -212 14 12 -243 147 -253 58 -359 66 -315 -61 -128 -229 -44 -29 -230 27 -66 -182 73 -71 -109
5517 -109 -28 192 99 52 166 -259 -68 23 208 -158 -312 261 264 -132 9 -128 306 -118 -60 346 32 84 -108
5540 -108 462 46 -41 110 353 90 -192 80 48 -140 101 228 7 202 -141 -19 278 -49 87 309 140
5561 140 -67 209 182 182 162 -379 460 152 114 372 223 -332 -260 327 374 124 140 -83 -103 -45 371 90 -187
5584 -187 -186 2 239 -127 -267 57 68 -84 -190 127 124 -42 -454 -348 -248 -130 90 -52 217 -118 -113 -30 -70
5607 -70 83 -254 -44 10 -134 -101 51 -60 -308 -220 -102 -215 -255 -228 -240 -232 -158 136 84 115 -244 -386 -115 -123 -231
5632 -231 -7 -144 -127 -77 45 -239 -109 9 -66 -18 58 -47 -187 71 -384 74 239 -106 -193 -56 294 335
5654 335 121 67 260 67 -125 125 93 207 -55 -6 146 247 414 -209 -10 -148 -73 436 40 137 252 -45
5676 -45 -160 76 358 318 -4 42 -51 277 186 -119 -114 -26 -21 -77 415 304 67 90 93 -6 -157 -73 115 -4 -207
5701 -207 155 40 150 16 141 91 263 -465 -105 -129 -44 -74 15 128 121 -102 74 -179 -87 217 -121 34 120
5724 120 -35 -99 -363 53 -155 -112 -194 88 -201 262 10 -295 103 190 -113 -222 -17 -203 185 -374 -208
5745 -208 5 -42 -98 -142 -274 9 96 -191 -156 -130 189 -137 -113 173 -93 -269 -146 -250 -21 213 -130 238
5767 238 100 -156 -35 -37 65 69 38 -31 136 82 -19 -24 -141 128 -74 175 63 163 6 10 48 198 -69 124
5791 124 372 -235 -210 131 -299 270 -165 -212 358 140 160 -40 209 151 -24 -320 210 301 115 232 131 290
5813 290 42 63 -73 -55 238 89 -87 123 146 -149 239 176 412 104 -55 203 193 125 109 -138 60 233
5835 233 -171 -116 -206 -228 352 46 181 271 -14 11 -183 35 -28 15 -183 -278 -95 19 -190 -202 46 -113 -355
5858 -355 6 -61 -4 -187 64 -210 0 -184 -158 -52 -191 -278 21 -291 -260 -34 -124 24 -166 -67 -108 -34 -242
5881 -242 66 -145 -60 201 -26 68 257 -45 -283 -373 -175 -247 -15 -132 -76 -163 14 253 171 270 -56 -161 153
5904 153 110 217 -36 25 17 52 -60 159 171 319 83 -23 80 96 -10 128 -10 -221 84 80 198 8 94
5927 94 -76 43 294 -36 140 358 -261 -87 53 163 -50 261 144 -108 -254 -8 84 20 148 -56 33
5948 33 -25 208 -85 119 -6 -17 164 -160 -185 64 141 33 94 -71 133 -207 -141 33 -280 -86 -31 226 -68
5971 -68 -98 70 28 -314 -30 120 20 -92 -220 -224 -304 -88 -325 -159 -180 -12 -258 -109 -140 -205 5 -178 152
5994 152 -194 80 -101 -70 -12 -16 -260 -413 -167 200 -96 95 -190 -405 -61 -93 -44 44 164 -281 17 -297
6016 -297 -26 154 -226 -95 148 -197 -207 -33 -110 246 158 202 69 -53 -13 54 197 -156 -82 427 -25 -45 198
6039 198 -52 125 -183 -60 271 30 -186 -51 128 58 -127 141 88 107 -301 145 -321 168 -11 -7 95 -54
6061 -54 176 305 348 -57 -84 360 217 -169 44 41 116 -147 42 143 239 -6 131 129 18 201 145 -26 86
6084 86 -133 281 386 135 -46 -170 106 -276 -112 203 439 124 -111 27 212 -92 -307 174 89 -404 -242
6105 -242 89 42 -155 -20 175 -19 -152 -446 38 -229 -254 -32 -88 -98 -306 -195 -94 -252 -158 -212 52 35
6127 35 -24 -92 -95 -365 -80 34 -224 -135 -216 229 57 -139 -306 45 58 -160 -148 285 316 -57 256 483 107
6150 107 25 213 128 2 46 304 52 -59 -96 139 368 122 59 234 -253 150 174 147 -41 -183 -11 -189
6172 -189 96 37 -101 350 139 -11 159 179 67 213 149 -72 105 159 106 7 96 88 316 177 61 -62 84
6195 84 301 40 89 15 264 -44 -145 94 201 15 141 579 212 -150 113 -155 -27 88 94 31 -181 -201
6217 -201 19 -161 -40 -60 -74 -47 -577 -40 -112 -135 -130 -194 121 -234 -245 -242 119 -120 -82 131 124 -41 177 -51 -42
6242 -42 -161 135 198 -118 -341 -450 224 -179 -231 -329 24 -237 -362 -129 303 237 -201 -5 -54 -255 -239 154
6264 154 -317 -123 96 37 238 -25 128 190 164 94 193 0 94 -143 67 359 118 -186 -96 254 17 150
6286 150 34 304 178 28 72 88 -17 -43 128 47 -127 162 227 130 81 134 -7 -61 -59 -93 -150 -371 -113 179
6310 179 338 -41 -146 404 -127 -251 4 510 11 77 -218 -91 109 15 106 306 -62 -166 344 177 -141
6331 -141 -423 -150 -130 287 41 -65 130 -248 -158 159 125 41 -154 -124 -50 -244 -98 105 105 -132 -120 141 -286
6354 -286 -307 -271 -239 -151 -262 -75 131 25 78 285 -184 -75 48 -163 28 -225 3 -39 73 -71 -198 -9
6376 -9 -136 181 -334 17 0 -157 56 -20 86 -141 -3 256 25 -163 -174 -192 31 -203 103 116 -276 292
6398 292 -21 -36 -10 202 -11 -74 -85 -179 46 188 -228 249 116 -1 -94 33 -191 -48 341 71 -2 68 124
6421 124 107 89 -18 131 156 -108 -114 -43 14 158 -75 124 -61 -42 -143 294 143 -38 183 161 -332 -149 161
6444 161 -166 41 40 -22 -241 -42 19 -85 189 -130 3 315 95 -82 -33 249 129 194 87 -49 -55 8 -225
6467 -225 -64 -313 32 43 180 77 -81 37 -59 -102 -85 -103 -150 -258 -1 -30 -31 -19 77 -46 -11 93 29 -98
6491 -98 -173 -269 53 153 -168 43 192 126 -65 -141 -82 -242 -336 -186 91 129 -266 -180 226 209 -229 -190 -132 77
6515 77 75 16 74 -79 261 -118 88 249 -49 -275 -217 190 273 222 -250 116 -60 163 74 148 238 60 216 125
6539 125 44 -54 216 264 -143 -80 137 197 77 210 51 -31 209 20 213 -33 147 14 -151 162 242 -149
6561 -149 277 310 81 -184 4 -37 -35 28 -343 -133 -25 142 74 -73 17 137 262 -81 -42 -134 -14 -38 316
6584 316 -227 -132 -129 143 23 153 -95 -152 -183 48 2 -194 -287 -102 -110 16 -272 87 -272 -25 21 -303 -220 -146
6608 -146 -268 -20 -275 -74 -97 -104 -194 -147 2 -272 -257 -157 -243 -190 -20 -257 -117 118 -96 -160 -189 129 -76
6631 -76 -273 -321 -91 205 93 -161 -133 -109 104 102 21 102 -23 80 31 181 -52 311 -109 107 -43 31 -15 -178
6655 -178 -37 330 16 36 -115 92 16 -182 -113 141 215 -130 268 256 30 86 244 5 35 205 -191 35
6677 35 -181 -144 174 -152 154 234 57 110 -79 73 -166 5 -95 325 75 296 7 474 392 132 -21 49
6699 49 -152 -151 209 -351 232 -62 -156 -152 74 159 87 -89 87 126 12 -283 236 117 -158 -53 -84 -297 131
6722 131 79 46 27 63 -26 -117 125 117 -7 -44 82 -192 -65 236 -112 -72 -92 -107 181 205 -32 -176 -213 -44 -2
6747 -2 185 -98 -183 -40 -71 -87 156 13 19 164 -156 -183 -6 -126 -224 -125 -78 -119 130 231 311 251 -88 23 -36
6772 -36 156 82 -137 110 116 153 -147 157 66 -415 -288 41 373 -101 -34 203 -162 182 -62 53 -124 -44 -55
6795 -55 321 -135 -18 -249 143 207 -3 5 101 -98 -282 -114 -66 17 371 217 58 242 -137 -133 97 -70 38
6818 38 77 -6 -72 17 108 -383 -187 146 -150 18 -204 -67 -265 -283 -2 11 92 96 90 66 -23 48 -67 13 -40 -79
6844 -79 -58 21 -47 -68 -30 121 -247 37 -241 58 -79 -533 58 -2 -220 -340 -59 -240 255 -118 123 173 164
6867 164 -90 -185 -91 359 -39 138 -165 -300 -56 17 -27 -119 48 -229 0 157 10 53 236 -304 119 -177
6889 -177 -217 -246 156 86 64 37 -95 -262 -64 -218 -30 -65 -149 -109 64 -74 485 203 67 81 -4 10 100 256
6913 256 129 -5 105 28 238 126 19 -72 -161 237 129 -63 71 272 193 138 143 216 -156 -180 -198 214 29
6936 29 267 72 -170 31 -58 139 -221 163 83 -178 -15 87 109 -175 7 -9 -159 169 34 -11 87 112 117
6959 117 -33 174 -133 16 101 137 213 91 -39 -212 10 -7 232 -143 -150 -192 -155 -151 -29 -38 -163 129 -30 -77
6983 -77 -23 -3 -278 51 58 15 -135 -1 -190 -197 274 405 -123 53 71 -43 36 -83 -65 65 -91 -45 -125 -119 19
7008 19 68 -28 81 -115 259 444 -58 30 -113 -310 142 -2 -400 51 -141 -63 -156 181 71 -152 -20 82
7030 82 -127 -81 112 -131 -48 115 229 161 58 25 164 89 -237 194 -41 75 22 -177 453 -40 130 70 17
7053 17 -174 48 -13 -27 119 289 -18 188 219 202 381 162 92 -152 -191 5 -27 25 -79 -168 -93 -129 -75 53
7077 53 176 -191 55 -89 -36 83 107 -233 110 207 -32 7 -34 225 -150 211 31 69 51 -25 83 -44 96
7100 96 128 -165 -187 -12 -11 203 -17 -225 -135 24 122 -209 -140 149 120 -145 85 -40 -152 98 -84 -291 233
7123 233 -161 -295 -78 305 -126 -135 115 -156 -220 -105 -49 -196 -195 227 -168 96 68 -224 -46 72 58 -24 -1
7146 -1 99 0 183 108 125 256 14 -90 72 108 -102 273 52 163 134 119 -20 88 -51 -169 -186 -69 45
7169 45 306 -7 -53 118 59 138 208 321 148 185 8 38 -78 177 201 -25 -78 203 109 72 66 166 -1 -135
7193 -135 -115 65 -378 -106 126 46 -74 113 106 194 213 -85 -63 -36 -164 -202 -157 95 127 -303 7 -227 359 -28
7217 -28 -89 145 -256 23 26 -179 -228 -87 -189 -62 -118 74 251 -273 -241 -185 153 266 36 118 62 10 -97 -424
7241 -424 -11 -215 -243 -40 93 -185 -154 -57 -175 -35 -105 -184 42 91 -82 48 -159 -305 -62 192 273 -222
7263 -222 223 337 76 -47 144 88 128 156 -277 -270 -240 -58 6 120 207 238 224 -166 117 50 19 -6 -59 86 100
7288 100 222 -24 58 24 336 395 352 116 -52 75 123 -3 -190 0 34 44 114 148 24 -327 121 51 -5 161
7312 161 -194 -3 122 -67 -214 94 34 -100 230 7 -31 -75 70 -199 138 -42 195 13 35 -94 -119 -47
7334 -47 -222 -65 -154 -55 25 -17 -73 -6 -127 70 21 -150 100 -164 27 -112 -401 3 -263 -43 145 42 -42
7357 -42 151 -176 -212 -290 -104 215 -2 -135 -187 -65 85 -99 30 54 -327 26 309 -134 -202 -90 -317 101
7379 101 56 -68 -147 171 -226 166 435 -141 107 32 10 -119 146 117 -61 -99 178 243 276 -25 -124 -88 -89 -177
7403 -177 -240 84 170 -101 195 370 42 186 104 48 -40 34 129 4 -25 -240 204 66 57 -148 3 350 93
7426 93 181 13 125 -64 -42 92 217 113 -174 8 -6 -27 61 -1 -2 36 27 129 190 127 99 69 335 24 -41 32
7452 32 -53 21 36 220 -59 118 -52 -154 -19 19 45 -207 105 -376 25 -207 -234 147 27 -90 152 35
7474 35 -83 207 -334 216 121 169 -294 1 -51 -1 -200 -121 -18 -235 -270 -197 -46 -151 -47 -128 -160 -27 -114 -53
7498 -53 -183 -332 7 -30 31 -122 228 115 -214 105 -34 -189 80 134 55 152 53 -223 -102 163 320 -284
7520 -284 24 4 217 12 291 55 21 -160 243 343 -200 -111 247 36 -159 -140 142 78 -236 -45 140 -25
7542 -25 -100 172 269 -114 70 271 54 -166 -75 32 39 290 87 26 -25 169 0 236 195 -135 94 -69 -42
7565 -42 208 365 137 166 41 -39 118 51 -86 -101 55 -8 2 27 111 -74 272 22 95 -14 -234 -123 36
7588 36 64 28 237 239 -180 -75 6 -22 -43 176 -128 -53 -255 24 -15 -137 -139 -134 98 -29 -280 -13 -19 -101 -107 -197 286
7615 286 -294 -30 -85 -117 39 1 -190 23 -137 -122 141 -115 -60 -120 -165 -61 -179 -2 33 -59 -112 -67 -96 98
7639 98 21 -230 -222 131 34 11 -75 275 -175 251 68 117 -15 -240 127 6 237 120 59 -104 177 127 39 -80
7663 -80 313 -76 -71 -25 -52 282 -68 25 216 71 124 53 240 -20 -123 247 -41 169 -9 -92 44 141 131 219
7687 219 -12 139 158 17 197 100 -34 411 19 -117 106 85 -202 -74 95 41 -110 -73 -117 114 -49 41
7709 41 49 -16 -41 -47 -351 -75 103 129 49 13 -345 -264 66 154 -26 -86 82 -14 116 98 -131 -95 -71 186 -156 28
7735 28 -246 -21 -351 -107 61 89 -26 -159 75 -160 15 -2 -161 35 167 -286 -192 186 -82 -115 133 41
7757 41 4 25 91 284 94 18 -141 65 19 -110 -2 -127 -122 -2 -38 -9 81 90 -41 -433 -12 -103 -181 56 -151
7782 -151 -110 -69 51 175 120 110 106 236 -84 279 -5 -18 -230 287 -109 -173 -31 -84 137 104 8 -135 -99 230
7806 230 13 114 111 14 147 210 58 -43 101 160 -110 158 92 166 105 90 233 53 156 -399 -169 -123 55
7829 55 157 7 33 52 110 -82 -90 112 -175 244 -208 -77 125 -102 -35 104 -125 44 -157 -160 -97 178 -161
7852 -161 167 21 -134 23 195 -128 -161 -33 -53 -11 131 64 -205 61 15 -206 -108 55 -102 -148 -127 -217 21
7875 21 -151 -178 342 -165 -150 -173 106 -114 -204 192 119 -52 -125 -234 59 127 163 -93 -176 -176 124 203 44 -104
7899 -104 69 28 -272 -27 -252 19 -17 -378 -192 94 182 -80 169 -42 203 -226 -86 63 177 128 68 91
7921 91 -189 -20 -117 -55 23 163 -71 17 -267 42 -68 73 -57 -173 -147 96 85 -91 144 -275 201 -34
7943 -34 -193 183 -110 84 60 136 169 232 19 -1 8 221 -3 -51 -161 13 -99 -30 -80 -49 91 95 124 108 11 -13
7969 -13 -124 -172 35 -34 123 125 53 -119 -156 -3 24 70 -193 -110 -151 45 89 -36 -222 -211 142 -199 44 -262
7993 -262 21 -86 -136 -153 -262 -83 54 -202 138 -195 59 -16 -114 -103 107 -100 -141 166 215 -282 -35 -76 -89
8016 -89 207 58 -153 -251 139 -4 161 105 199 -11 -317 -294 -69 10 34 -57 -175 1 16 34 9 -76 -5 77 -11
8041 -11 -80 60 -85 30 278 206 -126 149 -9 134 -73 54 -223 -73 -68 -143 -113 -113 222 -1 158 211 -17
8064 -17 -101 -107 -171 88 -56 153 -120 43 373 -20 -11 -60 -53 68 76 -16 116 -67 -78 104 177 -4 -165 10 -123
8089 -123 59 136 12 104 -7 44 -93 144 151 14 180 -275 165 130 168 -14 -10 -6 215 -287 -286 -141 -313 -116
8113 -116 124 -160 -387 -112 -51 -111 -18 -101 29 -273 -52 195 -11 117 -75 -184 129 -75 -213 72 127 -201
8135 -201 -89 10 152 -50 -9 -134 133 413 -113 56 -285 -33 105 230 329 305 6 -264 -243 8 102 151
8157 151 -293 -180 132 141 125 -48 120 -18 -100 150 -70 49 -102 400 -201 139 276 -137 42 -218 -63
8178 -63 218 219 36 45 170 -80 182 193 192 -277 -36 -102 399
8191C99
##END NTUPLES=NMR FID
##END=
