##TITLE=1H_LacDMe-C-f5
 CDCl3, 8 sc, 
 25.10.2019
##JCAMPDX= 6.0         $$ Bruker NMR JCAMP-DX V2.0
##DATA TYPE= NMR FID
##DATA CLASS= NTUPLES
##ORIGIN= UXNMR, Bruker Analytische Messtechnik GmbH
##OWNER= root
$$ XWIN-NMR		Version 3.5
$$ Fri Oct 25 14:12:13 2019 Russian Standard Time (UT+4h)  she@DPX200
##.OBSERVE FREQUENCY= 200.1315
##.OBSERVE NUCLEUS= ^1H
##.DELAY= (6, 6)
##.ACQUISITION MODE= SIMULTANEOUS
##.ACQUISITION SCHEME= undefined
##.AVERAGES= 8
##.DIGITISER RES= 18
##SPECTROMETER/DATA SYSTEM= spect
##.PULSE SEQUENCE= zg30
##.SOLVENT NAME= CDCl3
##.SHIFT REFERENCE= (INTERNAL, CDCl3, 0, 15.7039)
##AUDIT TRAIL= $$ (NUMBER, WHEN, WHO, WHERE, WHAT)
$$ ##TITLE= Audit trail, XWIN-NMR		Version 3.5
$$ ##JCAMPDX= 5.01
$$ ##ORIGIN= Bruker BioSpin GmbH
$$ ##OWNER= she
$$ F:/spectra/data/she/nmr/H-F/1/audita.txt
$$ ##AUDIT TRAIL=  $$ (NUMBER, WHEN, WHO, WHERE, WHAT)
(   1,<2019-10-25 14:11:19.95 +0400>,<she>,<DPX200>,
      <created by zg, POWCHK disabled, PULCHK disabled
       configuration hash MD5:
       00 E9 B6 7A A2 85 ED C7 34 08 36 98 17 FE 4E 26
       data hash MD5: 16K
       73 43 9F 8C F5 0D D6 4A 78 AD 9A B5 E1 99 D1 58>)
$$ ##END=
$$ 
$$ hash MD5
$$ 02 F2 4D 27 30 8E 15 6F 12 B4 B2 54 C2 7B 2D FF
##$RELAX= 
##$RELAX= 
##$RELAX= 
##$RELAX= 
##$RELAX= 
##$RELAX= 
$$ Bruker specific parameters
$$ --------------------------
##$DU= <F:/spectra>
##$EXPNO= 1
##$NAME= <H-F>
##$PROCNO= 1
##$TYPE= <nmr>
##$USER= <she>
##$AMP= (0..31)
100 100 100 100 100 100 100 100 100 100 100 100 100 100 100 100 100 100 
100 100 100 100 100 100 100 100 100 100 100 100 100 100 
##$AQSEQ= 0
##$AQ_mod= 1
##$AUNM= <au_zg>
##$AUTOPOS= <>
##$BF1= 200.13
##$BF2= 200.13
##$BF3= 200.13
##$BF4= 200.13
##$BF5= 200.13
##$BF6= 200.13
##$BF7= 200.13
##$BF8= 200.13
##$BYTORDA= 1
##$CFDGTYP= 0
##$CFRGTYP= 5
##$CHEMSTR= <none>
##$CNST= (0..31)
1 1 145 1 1 1 1 1 1 1 1 1 1 1 1 1 1 1 1 1 1 1 1 1 1 1 1 1 1 1 1 1 
##$CPDPRG= <>
##$CPDPRG1= <>
##$CPDPRG2= <>
##$CPDPRG3= <>
##$CPDPRG4= <mlev>
##$CPDPRG5= <mlev>
##$CPDPRG6= <mlev>
##$CPDPRG7= <mlev>
##$CPDPRG8= <mlev>
##$CPDPRGB= <>
##$CPDPRGT= <>
##$D= (0..31)
0 1.2 0 0 0 0 0 0 0 0.06 0 0.03 0 0 0 0 0.0002 0 0 0 0 0 0 0 0 0 0 0 0 
0 0 0 
##$DATE= 1571998279
##$DBL= (0..7)
120 120 120 120 120 120 120 120 
##$DBP= (0..7)
150 150 150 150 150 150 150 150 
##$DBP07= 0
##$DBPNAM0= <>
##$DBPNAM1= <>
##$DBPNAM2= <>
##$DBPNAM3= <>
##$DBPNAM4= <>
##$DBPNAM5= <>
##$DBPNAM6= <>
##$DBPNAM7= <>
##$DBPOAL= (0..7)
0.5 0.5 0.5 0.5 0.5 0.5 0.5 0.5 
##$DBPOFFS= (0..7)
0 0 0 0 0 0 0 0 
##$DE= 6
##$DECBNUC= <off>
##$DECIM= 24
##$DECNUC= <off>
##$DECSTAT= 4
##$DIGMOD= 1
##$DIGTYP= 9
##$DL= (0..7)
0 120 120 120 120 120 120 120 
##$DP= (0..7)
150 150 150 150 150 150 150 150 
##$DP07= 0
##$DPNAME0= <>
##$DPNAME1= <>
##$DPNAME2= <>
##$DPNAME3= <>
##$DPNAME4= <>
##$DPNAME5= <>
##$DPNAME6= <>
##$DPNAME7= <>
##$DPOAL= (0..7)
0.5 0.5 0.5 0.5 0.5 0.5 0.5 0.5 
##$DPOFFS= (0..7)
0 0 0 0 0 0 0 0 
##$DQDMODE= 0
##$DR= 18
##$DS= 0
##$DSLIST= <SSSSSSSSSSSSSSS>
$$ [...]
##$SUBNAM2= <"">
##$SUBNAM3= <"">
##$SUBNAM4= <"">
##$SUBNAM5= <"">
##$SUBNAM6= <"">
##$SUBNAM7= <"">
##$SUBNAM8= <"">
##$SUBNAM9= <"">
##$SW= 24.0689530833862
##$SWIBOX= (0..15)
0 0 2 0 0 0 0 0 0 0 0 0 0 0 0 0 
##$SW_h= 4816.95568400771
##$TD= 16384
##$TD0= 1
##$TE= 0
##$TE2= 300
##$TE3= 300
##$TEG= 300
##$TL= (0..7)
0 120 120 120 120 120 120 120 
##$TP= (0..7)
150 150 150 150 150 150 150 150 
##$TP07= 0
##$TPNAME0= <>
##$TPNAME1= <>
##$TPNAME2= <>
##$TPNAME3= <>
##$TPNAME4= <>
##$TPNAME5= <>
##$TPNAME6= <>
##$TPNAME7= <>
##$TPOAL= (0..7)
0.5 0.5 0.5 0.5 0.5 0.5 0.5 0.5 
##$TPOFFS= (0..7)
0 0 0 0 0 0 0 0 
##$TUNHIN= 0
##$TUNHOUT= 0
##$TUNXOUT= 0
##$USERA1= <user>
##$USERA2= <user>
##$USERA3= <user>
##$USERA4= <user>
##$USERA5= <user>
##$V9= 5
##$VALIST= <valist>
##$VCLIST= <CCCCCCCCCCCCCCC>
##$VD= 0
##$VDLIST= <DDDDDDDDDDDDDDD>
##$VPLIST= <PPPPPPPPPPPPPPP>
##$VTLIST= <TTTTTTTTTTTTTTT>
##$WBST= 1024
##$WBSW= 4
##$XGAIN= (0..3)
0 0 0 0 
##$XL= 0
##$YL= 0
##$YMAX_a= 311209
##$YMIN_a= -388397
##$ZGOPTNS= <>
##$ZL1= 120
##$ZL2= 120
##$ZL3= 120
##$ZL4= 120
##$ABSF1= 10
##$ABSF2= 0
##$ABSG= 5
##$ABSL= 3
##$ALPHA= 0
##$AQORDER= 0
##$ASSFAC= 0
##$ASSFACI= 0
##$ASSFACX= 0
##$ASSWID= 0
##$AUNMP= <proc_1d>
##$AZFE= 0.1
##$AZFW= 0.1
##$BCFW= 1
##$BC_mod= 2
##$BYTORDP= 1
##$COROFFS= 0
##$CY= 11.3945322036743
##$DATMOD= 1
##$DC= 2
##$DFILT= <>
##$DTYPP= 0
##$F1P= 19.5091578491511
##$F2P= -0.509923556040331
##$FCOR= 0.5
##$FTSIZE= 0
##$FT_mod= 4
##$GAMMA= 1
##$GB= 0.15
##$INTBC= 1
##$INTSCL= 1
##$ISEN= 128
##$LB= 0.24
##$LEV0= 0
##$LPBIN= 0
##$MAXI= 10000
##$MC2= 0
##$MEAN= 0
##$ME_mod= 0
##$MI= 1.114404
##$NCOEF= 0
##$NC_proc= 0
##$NLEV= 6
##$NOISF1= 3.799351
##$NOISF2= 2.8
##$NSP= 1
##$NTH_PI= 0
##$NZP= 0
##$OFFSET= 15.70392
##$PC= 1
##$PHC0= -9569.605
##$PHC1= 11.80083
##$PH_mod= 1
##$PKNL= yes
##$PPARMOD= 0
##$PSCAL= 0
##$PSIGN= 0
##$REVERSE= no
##$SF= 200.130013532006
##$SI= 16384
##$SIGF1= 3
##$SIGF2= 2
##$SINO= 400
##$SIOLD= 16384
##$SREGLST= <1H.CDCl3>
##$SSB= 0
##$STSI= 0
##$STSR= 0
##$SW_p= 3612.71676300578
##$SYMM= 0
##$S_DEV= 0
##$TDeff= 0
##$TDoff= 0
##$TI= <>
##$TILT= no
##$TM1= 0
##$TM2= 0
##$TOPLEV= 0
##$USERP1= <user>
##$USERP2= <user>
##$USERP3= <user>
##$USERP4= <user>
##$USERP5= <user>
##$WDW= 1
##$XDIM= 8192
##$YMAX_p= 0
##$YMIN_p= 0
$$ End of Bruker specific parameters
$$ ---------------------------------
##NTUPLES= NMR FID
##VAR_NAME=  TIME,          FID/REAL,        FID/IMAG
##SYMBOL=    X,             R,               I
##VAR_TYPE=  INDEPENDENT,   DEPENDENT,       DEPENDENT
##VAR_FORM=  AFFN,          ASDF,            ASDF
##VAR_DIM=   8192,          8192,            8192
##UNITS=     SECONDS,       ARBITRARY UNITS, ARBITRARY UNITS
##FACTOR=    0.0002076,     1,               1
##FIRST=     0,             0,               0
##LAST=      1.7004516,     0,               0
##MIN=       0,             -388397,         0
##MAX=       1.7004516,     311209,          0
$$ Real data points
##PAGE= N=1
##DATA TABLE= (X++(R..R)), XYDATA
0@%%%%Qj6J6j6K4l2L2m0N6p2Q8j04J26j50J76k08K45k86L29l81M43n08N77o57
28c50P49q47R52j071J206j354J510j682J874k084K313k564K843l150L487l858
44b026M274m739N258n848O523p302Q210r290J0599j2224J4303j7068K0962k6889
58a5257L7092n9406J89485j61944l66887L90169K50087k63351k21903L09999J44469
69B32553l28811j86138L51179K04452k77728k02201K23933J13249k08246m3742
79a21500K71064J9538l17884o4638L17555R2303k63479p5003K31821J9190k47414
90a38447L753K89541K0774k92841o8703K44018P2622j79113k5165J56512l2530
101E0421j84084M5706K11535j7278j94628k255J44018k4257j12426P5298J29438
$$ plain form
0 0 0 0 0 0 8 -8 8 -8 16 -16 16 -24 32 -40 48 -56 70 -80 96 -112 133 -153 176 -205 238 -270 307 -350
28 -350 399 -448 504 -567 639 -715 795 -887 987 -1097 1216 -1348 1495 -1655 1832 -2026
44 -2026 2248 -2491 2767 -3081 3442 -3860 4350 -4940 5659 -6565 7738 -9330 11632 -15257
58 -15257 21835 -37571 151914 -10030 -376917 13252 263339 -12 -221915 88084 232553
69 232553 -96258 -282396 68783 273235 -4493 -206694 17239 130488 -77758 -121500
79 -121500 149564 169102 -148782 -213420 104135 196438 -67041 -142044 89777 108967 -138447
90 -138447 -134694 154847 175621 -117220 -185923 58095 130717 -48396 -73561 82951 50421
101 50421 -133663 -87957 123578 106300 -88328 -90583 53435 29178 -83248 -7950 121488
112A21488r8036j65004P0621J68485k8562j22711K0525O7784n6396m8217R2710
123B2687O5594r2039p4410O4028M4249n4529O197Q6885k9919j34830J0261J55329
135F9503K3706j35150l0229J07618M393j05494K1390J31352j5769j48516j1807
146h9003J32176K7696r4235p869P1102k8799q0652M9260J05189l8576j10592J8461
158d5842Q7467j9330n8785M7211N5217p4625p5360P4480R1672n2736p7929M0274
170h286M7523n6601l1582Q7008M3991r8982o5688Q5061O9376o6179n1687O6294
182B0248L5698q2878m1353R0708O0448p5873o7388M8421N0445l4630k4073M1168
194B0941J0595n3986j2696N2747J3535m0609O69L6017k4609n0999L6564P4022
$$ plain form
112 121488 23452 -141552 -70931 97554 68992 -53719 -33194 34590 -21806 -70023 22687
123 22687 88281 -3758 -78168 -14140 30109 -24420 -18223 68662 38743 -96087 -85826 69503
135 69503 93209 -41941 -72170 35448 39841 -65653 -44263 87089 71320 -77196 -89003
146 -89003 43173 70869 -23366 -31235 39867 11068 -69584 -20324 84865 46289 -64303 -45842
158 -45842 41625 22295 -36490 10721 65938 -8687 -84047 -9567 82105 29369 -48560 -8286
170 -8286 39237 -17364 -48946 38062 82053 -16929 -82617 2444 71820 5641 -46046 20248
182 20248 55946 -26932 -68285 22423 82871 6998 -60390 -11969 38476 3846 -20227 20941
194 20941 31536 -22450 -35146 17601 31136 -9473 -8804 27213 2604 -48395 -11831 62191
206F2191k8308q5751J1911P8305p046o8305J5909O9399k2388q0961J2433Q4185
218D1574M255o9496j0730M6575k434l6629K1350M4842k7756n7237J7359N5403
230B7076p614m0727J3890L1567l1434m1264L7835O0671k3040o6534k19N0204P571
243A7982k8037N351K3421k0714l5848J7248M4970n73l2736o043J0020r559j900
256a6418L5085J8449m4542m2267L1341N0848j3286l8865J2249K9919k6959l9871
268d4317L4186O2944j7233p3468j0896N9742K5319l4935j6390K4644J137l3593
280b2860k70M3627J6729l4765k7817J0748J6297N325J1345L810k7339k6133K0443
293a0860L7123m889k6090M221J1750k3027j6721M1606M0658l7145o0627J3538
$$ plain form
206 62191 33883 -51868 -39957 38348 31302 -37003 -21094 48305 25917 -55044 -42611 41574
218 41574 45829 -23667 -34397 12178 9744 -26885 -5535 39307 11551 -45686 -28327 27076
230 27076 19462 -21265 -7375 24192 -7242 -48506 -10671 50000 26960 -39574 -39793 10411 17982
243 17982 -10055 -4704 18717 -1997 -37845 -20597 24373 23800 -8936 -14979 -4959 -14518 -16418
256 -16418 18667 37116 -7426 -49693 -18352 32496 19210 -19655 -7406 22513 -4446 -44317
268 -44317 -10131 52813 35580 -37888 -48784 10958 36277 1342 -15048 9596 10733 -22860
280 -22860 -23130 20497 37226 2461 -25356 -14608 1689 7014 18359 22169 -5170 -31303 -10860
293 -10860 26263 21374 -4716 -495 11255 -11772 -28493 13113 53771 16626 -44001 -30463
305c0463N6604K763l4845L674K4059k3261l6319K9263N4598j1625n5526q935L4201
318D188P565j1535J3380J1401l2915l0158K9740M2978j2218l2577K848J0198j7342
331a4447k389M0502J6569m7610l5855L1418L7117j3651j8960J5273N95l5075k669
344b9182M9880J9640m4756k9332K6462J7980j9842L150L3469j0943n4296k448
356d0218N9694J9130m5564k0524L1062M422l3047Q362M8367k490n7196j4617M6249
369C630K1145k4716q256J5603j3035k5175K1570L9172j3679l8751N721K4668j3472
382e575j4614L4547K2592m7618m3010M3045N4759k6971m8451K0807L5169k9921
394e241l3046M2071M6483l9459n7433K2726N1527q742l1756J2974J6898k8421
$$ plain form
305 -30463 26141 28904 -5941 -2267 21792 -1469 -37788 -8525 46073 34448 -21078 -30013 4188
318 4188 11753 218 13598 24999 -7916 -38074 -8334 34644 22426 -10151 -7303 2895 -14447
331 -14447 -16836 23666 40235 -7375 -43230 -11812 25305 11654 -7306 7967 8562 -26513 -29182
344 -29182 20698 40338 -4418 -33750 -7288 10692 -9150 -6000 27469 16526 -37770 -40218
356 -40218 19476 38606 -6958 -27482 3580 8002 -25045 -16683 31684 29194 -28002 -42619 3630
369 3630 24775 59 -8197 7406 -5629 -30804 -9234 29938 16259 -22492 -16771 7897 -5575
382 -5575 -20189 14358 36950 -10668 -53678 -10633 44126 17155 -31296 -10489 24680 -5241
394 -5241 -38287 3784 50267 10808 -46625 -23899 27628 18886 -12870 104 17002 -11419
406a1419j8021L8173K7582l2124k7592K2180J3040k4649L700M2248m642n9070
418c0594q587O0426K0208m8826j6977M1858M037m8498Q71O1808Q266o3723k0710
431d0441N0242K1177l5400o529L3651q397m4873R203N3373K63m8211l986L5076
444A5148p045l0382K2684M0995k8068n4707J7948N5591o640m3497Q205L1592k1373
457D51l3300L0501M2807k5849m6374J4690L4943j3385j9801K6066J6000m1680
469a4931k6277M4738L6253l6152l4399K9374K2807l5180j7532M7222K5287n0810
481i600l8161L9736L9823k4904k7820K1844J3444l0906j1272L8929J8948l4561
493d500k1918K2106J1300j7578N447K8056j3065m3013O326M7687L984l9410l519
$$ plain form
406 -11419 -29440 8733 36315 4191 -23401 -1221 11819 -12830 -9130 33118 28476 -30594
418 -30594 -39181 21245 41453 -7373 -24350 17508 21545 -26953 -26082 35726 43992 -19731 -40441
431 -40441 9801 30978 -4422 -10951 22700 14303 -30570 -21367 32006 32269 -15942 -19928 15148
444 15148 8103 -22279 405 41400 13332 -41375 -23427 32164 25524 -17973 -9768 21824 451
457 451 -32849 -2348 40459 14610 -31764 -17074 17869 4484 -15317 10749 26749 -14931
469 -14931 -41208 3530 39783 3631 -30768 -1394 21413 -13767 -31299 15923 41210 -9600
481 -9600 -47761 -8025 31798 6894 -20926 918 14362 -16544 -27816 11113 30061 -4500
493 -4500 -26418 -4312 6988 -10590 -5143 22913 9848 -33165 -26839 20848 24832 -14578 -18097
506a8097L1627q091l4462J5520M8174j0497n4055l177M6597Q721l1881r04K7093
519A6568j1272l3513J2585M2100l673l7560m169K3993m91j3803J4904J7061k3945
532a215k7167K0409L0907j1018k2145J0620J1429k1731j1162L3862K2295l4072
544A012l1489K3313L0248j5593j8776J8546J2957k8710j8798L1925K8455k2494
556A0596k9161J1058J7827j0191m981J9500L597k8784j1634K7807J6564j9200
568B998j1386J5909N98k3069K173L4106N892l6330j7585K6573J9321j6126r805
581f731J3704R96k1037j021K4984P079j9797q769J0216p14p965J3303J7283j8822
595B709k9987J1908L5092k730l0353L45K5045n525k8307P886L5935p93l7864j1668
$$ plain form
506 -18097 13530 5439 -29023 -13503 34671 24174 -29881 -33058 13539 22260 -9621 -10525 16568
519 16568 5296 -28217 -15632 26468 22795 -14765 -18934 5059 4568 -9235 5669 22730 -1215
532 -1215 -28382 -7973 22934 11916 -10229 391 11820 -9911 -21073 12789 35084 1012
544 1012 -30477 -7164 23084 7491 -11285 7261 20218 -8492 -27290 4635 33090 10596
556 10596 -18565 -7507 10320 129 -4852 14648 18245 -10539 -22173 5634 22198 2998
568 2998 -8388 7521 8119 -14950 -12777 21329 27221 -9109 -26694 -121 19200 3074 -6731
581 -6731 6973 7969 -13068 -14089 10895 17974 -1823 -10592 -376 -1090 -9055 4248 21531 2709
595 2709 -27278 -15370 19722 16992 -13361 -13016 12029 6504 -21803 -13917 22018 21225 -16639 -28307
609b8307K8061J6574j2929r914N088k030p763P223J2454m894r936M494J645j3192
623a3426R73K7062Q671l4132k2501K8442L0611j8463k7908J3999K2504j6787k3510
636b4465J9662K9844j3109l2934K253K4931L405j0582J846L051j3203n014J9488
649E173J1446j6802j1849J3135O080j6988j281K7706O231l3310j8251K9497K4748
662B5535j8222k0219J1900J1297j5513p925K2219J2369k0668j7000J3242J1904
674H919p891k02J3429o593k5676K465L2000P939k7672j1313J9332N865j8979Q32
688g545K6092J869l1545j1615K5967J6587j3668j0444P334j737j2325O982K0720
701A6672k740k1668l651J4610N07q094R361J0852j6306k1392J2602K7548l675
$$ plain form
609 -28307 -246 16328 3399 -6515 -1427 -3457 -11220 -3997 8457 3563 -6373 -1879 -234 -13426
623 -13426 -12453 14609 23280 -10852 -33353 -4911 25700 7237 -20671 -6672 15832 -955 -24465
636 -24465 -4803 25041 11932 -21002 -18749 6182 9587 -995 851 3902 -9301 -14315 5173
649 5173 16619 -183 -12032 1103 7183 -9805 -11086 16620 22851 -10459 -28710 787 25535
662 25535 7313 -12906 -1006 10291 -5222 -13147 9072 21441 773 -16227 -2985 8919
674 8919 1028 826 14255 7662 -18014 -15549 16451 24390 -3282 -14595 4737 10602 -8377 -7545
688 -7545 18547 20416 -11129 -22744 3223 19810 6142 -4302 3032 1295 -11030 -4048 16672
701 16672 13932 -7736 -11387 3223 3730 -4364 4997 15849 -457 -21849 -9247 18301 14626
714A4626k2504q17J3031o408r508J5652J6843j8223k5641J0660K4839l979j5778
727g207O930Q933j6908j3950K2480K4655j6789k8107N681J9668k690q056J0318
740D958N523j9930j2166K0266J6661j2216j1383Q621q6j6620N331L0412J292l6358
754a5695j3263L0955J7472k1814j1388K0967N122k8402q137L3302J8518k7261
766C76k2832J3822J5468o770j557J2251n335k2233J900K5694L797j9303j819J4853
780H312q350j9432J5369L1579j0372l8746k033L4548R158k2342n184J6361m286
793D582j9806O713K6255m67k3084m850J1277j84k545J4598O650k5327j8992K3189
807a991K6869j3980k3491J0714J5699j7138j5942K4559K5521k1794l3355Q770
$$ plain form
714 14626 -7878 -8695 4336 -2072 -11580 4072 20915 2692 -22949 -12289 12550 8571 -7207
727 -7207 -277 8656 -8252 -22202 278 24933 8144 -19963 -14282 5386 2696 -5360 4958
740 4958 10481 -9449 -21615 -1349 15312 3096 -8287 334 248 -16372 -11041 19371 20663 -15695
754 -15695 -28958 1997 19469 -2345 -13733 7234 12356 -16046 -24183 9119 27637 376
766 376 -22456 -8634 6834 64 -1493 10758 5423 -16810 -14910 10784 14581 -4722 -6541 8312
780 8312 -38 -19470 -4101 27478 17106 -21640 -23673 10875 20033 -2309 -7493 8868 4582
793 4582 -15224 -8511 17744 17277 -5807 -10657 620 436 -2109 12489 19139 -6188 -25180 -1991
807 -1991 24878 10898 -12593 -1879 13820 -3318 -19260 5299 30820 9026 -24329 -15559
819a5559K9280J354j5398R27M444j2182m896J8733J1567j4824j2807Q139L124
832A902j0756P528K2996p606l5089m254L5828J4804k6448j4304J8458N309k1190
845a2822j114K9916O480l1235j6717K1511J7009q982o337O583o319j5468Q713
858h782K4129j007k3090m296J3506j466q468J3269J5816j8677k8180J1125L1611
871A5490O00k3693j602J2945p709j3439J6736K3473j3888l0239L358K3507K758
884H297j0854M497O128j7411j2283K1018K2098j3132k2240M768J1963o179l363
897f693J7855O079k5769j6758K1694K3160j0538j7095N620N720j2047j922K2375
910A1681R608k3137j8354J3420J6621m258m209O747n218j8328K861K5980P579
$$ plain form
819 -15559 13721 15075 -323 604 5048 -7134 -12030 6703 18270 3446 -9361 -1222 1902
832 1902 -8854 -1326 21670 14064 -21025 -25279 10549 25353 -1095 -15399 3059 8368 -12822
845 -12822 -13936 15980 22460 -8775 -25492 -3981 13028 4046 -2291 4292 -2027 -17495 -8782
858 -8782 15347 14340 -8750 -13046 460 -1006 -9474 3795 19611 934 -27246 -16121 15490
871 15490 16090 -7603 -9205 3740 -3969 -17408 -672 22801 8913 -21326 -17968 5539 8297
884 8297 -2557 1940 8068 -9343 -21626 -608 21490 8358 -13882 -9114 2849 -3330 -6693
897 -6693 11162 17241 -8528 -25286 -3592 19568 9030 -8065 -2445 3275 -8772 -10694 11681
910 11681 21289 -1848 -20202 -6782 9839 5581 1372 8119 2901 -15427 -12566 13414 20993
923B0993k1412j1656J1328M638r658O295J8839p126k9087l294K8940J2859j7860
936C799j1317Q569J072j1030N833J9693o82k3029q517J4311R378k411P37P93j2955
951e756j0470J4508K0172p163j8960Q03J0267m728o380J4468J3089j8660k4282
964b3092J0830K7465K04j9219l323R149m260p258J1187J4161r763k0010J420J4464
978A955L533l277K467k626j4185l354K0129J2411j4637j4525O483P486p316n98
992f054J6172K949k2620j3187J9331J9018q398j5051L327M441p775q1J5380O216
1006A3668j7095j2872J0097J1005k643j668N167o528j4620M090K2183M539j8939
1019c616r218J1323M836q960L191J5637m085k3043l401K2534J1018j3334r729
$$ plain form
923 20993 -419 -12075 -747 3891 -5767 528 19367 12241 -16846 -20140 8800 21659 3799
936 3799 -7518 1051 2123 -8907 -3074 16619 15937 -7092 -15609 -1298 8080 5669 6406 7199 -5756
951 -5756 -16226 -1718 18454 11291 -7669 -6866 3401 -1327 -7707 6761 19850 1190 -23092
964 -23092 -12262 15203 15407 -3812 -7135 2014 -2246 -9504 1683 15844 6081 -13929 -12509 1955
978 1955 5488 2211 4678 2052 -12133 -15487 4642 17053 2416 -12109 -5626 1860 -5456 -6054
992 -6054 10118 13067 -9553 -22740 -3409 15609 7211 -7840 -4513 -72 -7847 -7928 7452 13668
1006 13668 -3427 -16299 -6202 4803 2160 492 5659 -869 -15489 -11399 10784 15323 -3616
1019 -3616 -12834 -1511 3325 -5635 -2444 13193 9108 -13935 -17336 5198 16216 2882 -6847
1032f847N590J312o973N801J3712k777j8050l249J2764M517m343L203L692j2844
1046d492j1742J4744K0250p340k0686P34J4161k784q728Q926J3950j2595k1497
1059a7099O457K3420K495j5626m811O396k354m160R813R706j0046j4283M304J0358
1073D570r96k473O890j487j6613m090K0385J2712j5436j5500Q703R752q564m270
1087f417J4906N695j9463j3428J5572J7255o408j2582J845L170o399P82J4064
1100H592K892j5828q564J0500O347m925J326P690o938j6802M140K2245M061j9047
1114d311q598J1832L895r010K613J4538l376k0449l182J8411R041j0014o246M052
1128h04l286n990Q622J3708o467j6358M39J2040n3o254P575O902j4145j4993J3465
$$ plain form
1032 -6847 -1257 55 -6918 -1117 12595 9818 -8232 -11481 1283 5800 1457 4660 8352 -4492
1046 -4492 -16234 -1490 18760 11420 -9266 -8532 5629 2845 -5883 3043 16993 4398 -17099
1059 -17099 -10642 12778 15273 -353 -5164 1232 -1122 -5282 4531 14237 4191 -10092 -5788 4570
1073 4570 3574 1101 7991 6504 -10109 -14199 6186 18898 3462 -12038 -3335 6417 -2147 -6417
1087 -6417 8489 14184 -5279 -18707 -3135 14120 7712 -4870 -3025 145 -6254 -5472 8592
1100 8592 11484 -4344 -12908 -2408 3939 -986 340 8030 1092 -15710 -11570 10675 14736 -4311
1114 -4311 -12909 -1077 2818 -6192 -3579 10959 7583 -12866 -16048 2363 11404 1390 -4856 -804
1128 -804 -4090 -10080 -1458 12250 5783 -10575 -10136 1904 1851 -4403 3172 10074 -4071 -19064 -5599
1143e599K1879n494k0398o76J3572j655q755P879J1840r822j7106M795J6359K251
1157I070q472j285N11o834K3J4816O267j5008j0813J0413P944p880k391J3658
1171A0019J345k0999q124K2250J6352j5460j7398P807J0962o259n162J1340N531
1184A2204j4431j0066J0512J1274l696m104J461m514q543Q149J6353l636j8746
1197g783j950J4797J460j1461L875J4346o960k1239K677K3561N359j8604q052
1210i974J0094L330o973L572J0325n529j5131J491J3591J493p336K422L189j0412
1224e848p395J5166J4742j1923j8714N428J4603l226q604P175Q127j2500j3360
1237a6329J1520J7167m509j4793P66O241l783j215J0819M063j4771r354J0938
$$ plain form
1143 -5599 16280 10786 -9612 -10288 3284 1629 -7126 753 12593 2771 -14335 -9540 6819 9070
1157 9070 598 -687 -176 -7010 -6987 7829 14096 -912 -11725 -1312 6632 -1248 -3639 10019
1171 10019 11364 -9635 -17759 4491 20843 5383 -12015 -4208 6754 495 -4667 6673 12204
1184 12204 -2227 -12293 -1781 9493 5797 1693 3154 -1360 -9903 -1754 14599 10963 -7783
1197 -7783 -9733 5064 6524 -4937 -1062 13284 6324 -14915 -12238 11323 16682 -1922 -9974
1210 -9974 120 3450 -3523 49 10374 4845 -10286 -8795 4796 6289 -1047 1375 4564 -5848
1224 -5848 -13243 1923 16665 4742 -13972 -8544 6059 2833 -5771 1404 9531 -2969 -16329
1237 -16329 -4809 12358 7849 -6944 -6178 63 -3720 -4935 5884 9947 -4824 -14178 -3240
1250c240J1115o379n699N954M86j2289o84J7353P123j5848j1638R809Q816o000
1264a121k129R326j057j4594l303J6953P888j1334q213O162K186o054K710J2334
1278I754j886j6118l430J3453O118o779j945M245m864q479P688J4553l469j6110
1292g269l34J0822jo884O063R257r714j5612O697J8694J054j5687l613Q185N94
1307B252n782N336Q640o046j2046K064R554J525l237K220j630j0181j118J4869
1321F420Q559j3182j2095P629R621o326n965J0929O370j4724j1608J1312J6014
1334A2954m317j2994r50N179r08j32O688Q55r562m533P167L932m103J313O459
1349G048n463j4517M039J9453L437j8904r030J2625Q682q763l932R472K285j2271
$$ plain form
1250 -3240 7875 1496 -4203 1751 2237 -10052 -10736 6617 13740 -2108 -13746 -3937 4879 -1121
1264 -1121 -3250 6076 5019 -9575 -12878 4075 11963 629 -7584 -1422 764 -5290 -2580 9754
1278 9754 7868 -8250 -11680 1773 7891 1112 -833 3412 -1452 -9931 -2243 12310 8841 -7269
1292 -7269 -7603 3219 3218 -3666 2397 11654 1940 -13672 -6975 11719 12773 -2914 -6527 1658 2252
1307 2252 -3530 1806 10446 4400 -7646 -5582 3972 5497 2260 4480 2850 -7331 -8449 6420
1321 6420 14979 1797 -10298 -2669 6952 626 -5339 5590 11960 -2764 -14372 -3060 12954
1334 12954 8637 -4357 -5307 -128 -1036 -1168 5520 6375 -3187 -7720 -553 3379 -724 589 7048
1349 7048 1585 -12932 -8893 10560 13997 -4907 -13937 -1312 7370 -1393 -5325 4147 6432 -5839
1363e839o229J1339R744m820q145n97k59L02O902O106p838j1169L959J0961j842
1378B575p888M802Q129q901j3525Q089J9024j096j8907m897J2721N456o765j454
1392b637O401j707r109K46R642L109n138k447J01l498M87J0078M095j1552r191
1407a1120Q373J0339n035p314O026N788r883p895J0790J3250p307j4269J739R843
1421C325J01l887L734K118q101n071Q531P825m804n611K579N92n841J350J2015
1436H855J338j3723o425J0991P294o887l839O628J72j0565o70J3334M795j2086
1450g88p028P658M724n468K15P366j842j1528m75J2341L290r096l141N462j020
1465F70o106M515J0206m493j2701Q49J1320M10p577K275O343o122r505O426J3349
$$ plain form
1363 -5839 -12068 -729 9015 4195 -3950 -4547 -4806 -4504 2398 8504 666 -10503 -6544 4417 2575
1378 2575 -5313 -511 7618 -1283 -14808 -6719 12305 11209 -7698 -12595 126 5582 -1183 -2637
1392 -2637 3764 2057 -7052 -6806 2836 5945 807 -1640 -1539 -5037 -4550 5528 9623 -1929 -11120
1407 -11120 -2747 7592 2557 -4757 1269 7057 -2826 -10721 69 13319 6012 -8257 -6518 3325
1421 3325 3426 -461 3273 5391 -2710 -7781 750 8575 3771 -1840 739 1331 -4510 -3160 8855
1436 8855 10193 -3530 -9955 1036 8330 1443 -2396 4232 4404 -6161 -6831 6503 11298 -788
1450 -788 -7816 -158 4566 -902 -687 6679 4837 -6691 -7166 5175 8465 -631 -3772 1690 670
1465 670 -5436 -921 9285 4792 -7909 -7060 4260 4670 -2907 -632 5711 -411 -9916 -3490 9859
1480I859l369j3070n63Q987O27o027L010O284n882r314M575R647j132o504J309
1495a563K211n418j667J0141N215j1101q670P948Q655n855n956P576M915j0852
1509d421p255J1156J1318p662j1664L330P623k164l404M977K595p667l846O860
1523b24M684m565j722M258k065p729L502J2649o76j4322k947J1517M574q885k388
1538d339R829K06j2056k075J2758O029r538o693M550L780l182J250N706l212q238
1553e225Q54Q711q7n506K376M499o414p575Q674J1759n897j4114K230J1569p90
1568E064q148K909P947n143j0654L790J2150k27r459j435M706j608k159N978L712
1583G423p891o861O427O799m793m151O309J870r982m209J2809P726j0723j0413
$$ plain form
1480 9859 6490 -6580 -7143 1844 2471 -3556 -546 5738 -144 -9458 -4883 4764 3632 -2872 -1563
1495 -1563 648 -4770 -6437 3704 8919 -2182 -10852 -2904 5751 -104 -6060 1516 6431 -4421
1509 -4421 -11676 -520 10798 3136 -8528 -5198 2425 261 -3143 1834 4429 -3238 -7084 -224
1523 -224 4460 -105 -1827 2431 366 -7363 -3861 8788 8112 -6210 -9157 2360 6934 -1951 -4339
1538 -4339 5490 5696 -6360 -8435 4323 10352 814 -5879 -1329 2451 -731 519 6225 3013 -5225
1553 -5225 -4371 4340 4253 -1253 1123 5622 -792 -8367 307 12066 6169 -7945 -5715 5854 5064
1568 5064 -3084 -175 7772 2629 -8025 -4235 7915 7688 -1771 -3206 1500 -108 -2267 3711 7423
1583 7423 -468 -7329 -902 5897 1104 -3047 3262 5132 -4850 -9059 3750 11476 753 -9660
1597i660P168Q292n214n459P385M052r653o650Q704Q881n389o609K313J614l816
1612d041J649Q355j443j0499j726R042K181o769J221P232m131j1151L185J4421
1626G526J340j3747m808R807L938p188J09P886j683j0398p06J0549L356o413k564
1641b996K482k275k119O624N784o655r181M003Q443k314n525N101M511q260q276
1656a0653Q937J2708n435j2714R54Q979m42m725L733M735o180p199M509Q446j367
1671D286m827O89K23m409J404R450J814j1239n702Q608O502n718k937O346O85
1686E175j0352k943J1962Q190r304r223L461O139j580j252M323k59p809k273Q039
1701B294M164m364k151J459k226m803N833R517l882j2717n14J0818K299o806m55
$$ plain form
1597 -9660 -2492 5800 586 -4873 2512 6564 -3089 -9739 -1035 7846 2457 -4152 -1839 -225 -4041
1612 -4041 -2392 5963 4520 -5979 -7705 1337 3518 -3251 -2030 5202 1071 -10080 -6895 7526
1626 7526 8866 -4881 -9689 118 4056 -3132 -3023 4863 3180 -7218 -7924 2625 5981 -432 -2996
1641 -2996 -514 -2789 -4908 1716 7500 845 -8336 -4333 4110 1796 -3729 1372 5883 -2377 -10653
1656 -10653 -1716 10992 5557 -7157 -6203 2776 2334 -2391 1342 6077 -103 -7302 -2793 5653 4286
1671 4286 -541 148 371 -4038 -2634 6816 8630 -2609 -8311 297 6799 1081 -1856 4490 5175
1686 5175 -5177 -8120 3842 12032 2728 -6495 -3034 3105 1525 273 4596 4337 -3472 -5745 2294
1701 2294 6458 2094 -57 1402 -824 -5627 206 9723 5841 -6876 -7390 3428 5727 -1079 -1534
1716a534O660l242j0134K661J2833J957j1166n367N890L283k100J688L101m557
1730b7o810K911P690j97m567O21R09n476j818J0003O479r355j0469M910R547j889
1746B462o122L746M525p375p010P576J1032l604j0810r21N965O16n90L325L09
1761C124o950l888O726N617l290l247K445j318n402J850J1202J759j2117o366
1775i855Q037P286m683l428M757Q53q020k380J0040O193o427p866K156L966n16
1790A13J204L865k961q086M21Q751K629n716r79L247l193n216N612R920k767j2603
1806e759j285R313L852o034j78M511l484p001K802J0178N70q501l036L920P35
1821F03n74L544K272o367o942N032Q422j810n339J433K101n538k387Q689O877
$$ plain form
1716 -1534 5126 1884 -8250 -5589 7244 9201 -1965 -7332 -1442 1841 -259 1429 4530 -27
1730 -27 -6837 -3926 3764 3567 -1000 -379 530 -4946 -6764 3239 9718 363 -10106 -5196 4351 2462
1746 2462 -3660 86 4611 -2764 -9774 -2198 8834 5230 -5580 -6501 -536 80 -510 2815 3124
1761 3124 -3826 -7714 -988 4629 1339 -1908 537 -781 -6183 -4333 6869 8628 -3489 -9855
1775 -9855 -1818 5468 785 -2643 2114 2967 -5053 -7433 2607 8800 2373 -5493 -3337 629 113
1790 113 1317 5182 2221 -5865 -5444 3307 5936 220 -759 2488 -705 -5921 -309 9611 6844 -5759
1806 -5759 -7044 2269 6121 87 -91 4420 936 -6065 -3263 6915 7485 -1016 -4052 -132 603
1821 603 29 3573 5845 -522 -7464 -2432 5990 4180 -1159 274 2375 -3163 -5550 3139 10016
1836A0016p993j0224L656R183j100m889K107K825o155m530O747Q539m032q374
1850d224K74L700m95L34M561l18q338k830P361M994m690k916L712q27o821J808
1866d715J0991J575j1718o100Q281O348m418l116M535L71p406j646R087M765o384
1881D50n404J492K161p58L612L212m676p706K719Q729m36n880J252M371m854o300
1897h016O213J1008l442j2683j135R609L456n317r95L655k267n432K534P204J89
1912D581n163j781Q66q99J758O369N96q985n879Q375P217m574n660M038L707p211
1928b645m264R141Q427p056j0621J812Q757R34l236n9O63m144j576N648L694l330
1944B145k742P02r02k858M195Q100k934j1787j773J0705N320p489m137N492J032
$$ plain form
1836 10016 2023 -8201 -4545 4638 3538 -1351 756 3581 -2574 -7104 -357 8182 4150 -4224
1850 -4224 -3950 -250 -745 -411 4150 3832 -4506 -7336 25 5019 329 -2587 1125 298 -6523 -4715
1866 -4715 6276 7851 -3867 -9967 -1686 4662 244 -2872 1663 2034 -5372 -7018 2069 6834 450
1881 450 -4954 -3462 -1301 -2059 1553 4765 89 -7617 -4898 3831 3395 -2485 -1233 3138 -1716 -8016
1897 -8016 -1803 9205 5763 -6920 -8055 1554 5010 -307 -1302 2353 86 -5346 -2812 4392 4581
1912 4581 -582 -2363 -1497 -2396 -638 5731 6327 -2658 -8537 -162 7055 2481 -3179 859 4566 -2645
1928 -2645 -6909 2232 10659 3603 -7018 -5206 3551 4485 1249 1190 1853 -2291 -3867 1781 5475 2145
1944 2145 -597 105 -797 -3655 540 8640 5706 -6081 -7854 2851 8171 682 -3455 2037 3069
1959C069p208n68R486L858r037o580M356N696q65p58J226l269n074L113P064j80
1975D329o122m67L332k573l299O065P162o312j0485J487J1180Q90o676q11L995
1990A695k964m896M209Q049k255q605j328N273J696j186J829J619o739m287O127
2005a763P391l335n930J790K002l231o46P538K578q342o926O043P394k420m319
2020b176K455J018n488j362Q265M736o983o828L051M904r57n59L059j507o503
2035d875n99P565L759m686l535K472o93l215L655P715k443j0512j485R126L866
2050F115n597j911L842j065o604J983R267J439q613m208M275L119m26J011J478
2065D105m239n264L707P067j433m650M77K247l714k669P684O228p570j0169L502
$$ plain form
1959 3069 -4139 -4707 4779 8637 -400 -6980 -2624 3072 2207 1449 2675 -594 -5668 -2555 4509 4329
1975 4329 -1793 -2260 1072 -1501 -4800 1265 8427 2115 -8370 -6883 4297 5187 -1489 -2300 1695
1990 1695 -1269 -6165 -1956 6093 3838 -4767 -6095 -822 874 -312 1517 3136 -3603 -7890 -1763
2005 -1763 5628 2293 -3637 -1847 155 -3076 -3722 3816 6394 -1948 -8874 -2831 4563 2143 -2176
2020 -2176 279 1297 -4191 -5553 2712 7448 465 -6363 -3312 1592 635 76 3135 1628 -4875
2035 -4875 -5474 2091 5850 1164 -2371 101 -592 -3807 -152 7563 5120 -5392 -6877 2249 6115
2050 6115 518 -1393 2449 1384 -5220 -3237 6030 7469 -1144 -5352 -1077 2042 1616 2627 4105
2065 4105 -134 -5398 -1691 5376 3943 -707 -230 2017 -1697 -4366 3318 9546 1976 -8193 -4691
2080d691R839M16o407j7L427k704m691M322O982k119o925j861L385J820J212K359
2096D347k185p002j108P761M377n277m075L492O91n391l20R696L043j0303p349
2111i603O539Q376j936n522R82J203l439o56N674L432m492m534P50K030J8K843
2127A665L186n490p436K750R336J429p145j973M254q37m625K721Q198j038j0048
2142e053l346P835N507l023l176R64j209k713K798N825p75n804j495K473L16K41
2158f35M466R66p008n637N929Q632k354p101N11L705k267k748N438N686n107q718
2174f242J175Q031K229m123n42O8l019j039N517M014l829n068J093K415r36J513
2190A257M502j382r026j756Q608N224n283n178K742K165l883k23P125K120q067
$$ plain form
2080 -4691 5148 5564 -843 -860 2567 -137 -4828 -506 6476 4357 -2568 -4429 -1044 776 1988 4347
2096 4347 2162 -4840 -5948 1813 6190 913 -3162 330 1021 -4370 -4690 5006 8049 -2254 -9603
2111 -9603 -3064 5312 3376 -2146 -1164 39 -3400 -4056 1618 5050 558 -3976 -3226 -1196 -1178 1665
2127 1665 4851 -639 -8075 -5325 4011 5440 -1705 -3678 576 -261 -4886 -2165 6033 4995 -5053
2142 -5053 -8399 -564 4943 1920 -1256 -292 -1501 -4214 -1416 4409 3634 -2170 -3665 -1192 -876 -635
2158 -635 3831 4797 -2211 -7848 -1919 6713 4359 -2742 -2231 1474 -793 -3541 1897 7583 2476 -6242
2174 -6242 -5067 2964 5193 1070 528 596 -2423 -3462 2055 6069 2240 -2828 -1735 680 -256 1257
2190 1257 5759 4377 -4649 -6405 2203 7427 2144 -3034 -292 1873 -2010 -2233 4892 7012 -1055
2205a055n860N315N939o68l001J99j258l042J570N853R27n819k504K672R78j505
2221a259K853M242m731q269K204R721J067p222k465M108M32m022J985O416j508
2236C552q102j653O309L357k320j284J32l026j495M192M958k850n490N89L225
2251I4j501j066M773K543o980o383N616Q597j949o943K4L866j797k191L762M820
2267E285m405o449J753N075P80j881O61j247l750M77O551K176n690l579L788J822
2283A367l377N95N994k29q384k942Q375N575n318n154K624K153k685k07N098J242
2299D727n935l187L799L031n15l43M20k541l805L468O364j333n865o69M112m96
2315A232l403L475M874l721q322J436Q557J864n915k356L446o16k598K138M859
$$ plain form
2205 -1055 -6915 -1600 4339 3671 670 869 -389 -3431 -1861 3992 4919 -900 -3404 -732 246 -1259
2221 -1259 1594 5836 1105 -7164 -4960 4761 5828 -1394 -3859 249 681 -3341 -1356 5060 3552
2236 3552 -4550 -6203 106 3463 1143 -141 -9 -3035 -4530 -338 4620 1770 -3720 -3131 94
2251 94 -1407 -2473 2300 4843 -2137 -8520 -2904 5693 3744 -3199 -3175 691 -1106 -3297 465 5285
2267 5285 880 -5569 -3816 1259 2039 158 819 -428 -4178 -3701 2850 5026 -664 -4243 -455 1367
2283 1367 -2010 -1415 4579 4350 -4034 -6976 1399 6974 1656 -3498 -874 1279 -1406 -1613 3485 4727
2299 4727 -1208 -4395 -596 2435 1920 1577 1997 -544 -4349 -881 5483 4150 -1715 -2384 1728 1232
2315 1232 -2171 1304 6178 2457 -5865 -4429 4128 5992 77 -2279 1167 551 -2047 91 4950
2330D950j784o040l04M232J349j591J348l20m179j920N560M451l946n315K193
2345a316L473l266j616N221L022o645n862M681P685k123n469K57K579j986j281
2360b646L646K978m019l959J707K962m83K16J995k356n511J027P448J564o387
2375a818k409L928J589m286N33N982K78p832k650O368M969l835l300J605L70k075
2391b583P92M378K09m834j384K781P08q47K311J630m751m341M121O390j119o547
2407c086L11M206q20l856L040N334k850p264J98P380J783m004j707J744j359j199
2423b149K778L499k486l956R66K504j522M21L648j62n974k945O722N393m607n137
2439c007K215L426k747k154M588L447n312n310K780N652r3l057m5l8k109O16M335
$$ plain form
2330 4950 3166 -2874 -3178 1054 2403 812 2160 1840 -2339 -4259 1301 5752 1806 -3509 -1316
2345 -1316 2157 -1109 -2725 2496 5518 -1127 -6989 -2308 5377 3254 -2215 -1958 621 -1365 -2646
2360 -2646 1000 3978 -41 -4000 -2293 669 186 402 2397 41 -5470 -4443 3005 4569 -1818
2375 -1818 -4227 -299 1290 -2996 -2463 3519 3797 -4035 -6685 -317 4652 817 -2483 -878 -508 -2583
2391 -2583 -1791 2587 2796 -2038 -3422 -641 67 -780 1531 3161 -1590 -5931 -1810 4580 3461 -3086
2407 -3086 -2775 1431 611 -3245 -205 5129 2279 -4985 -4787 2593 4376 372 -1335 409 -950 -2149
2423 -2149 629 4128 1642 -2314 -1348 1156 -366 55 3703 3541 -2433 -5378 1344 6737 2130 -3007
2439 -3007 -792 2634 -113 -2267 2321 5768 456 -4854 -2074 3578 3485 428 383 345 -1764 -1148 3187
2456C187N51m211j710K616M30k028J899M209k754p059K68P939K267o093k920L688
2472B79J567l419k88M997O81n875l037M491L571j624j190k01k149j056L228L607
2488C582j931m758R23L011j646j628L482L688n369o573L765P777k85o831r17L838
2504A28k85k444K142L836k042n307j2L923J732j243J92j082l471M90N176K410
2520D143m513l292K413K332k459m24M879J006o724m096N767N633k254m918O29
2535a878K333j486k54L184J616l648l340J992L126j06m62Q41k255l595K011O282
2551D361Q7n439k118L585R77k377J153M472j919o648m43O714L201m615k781J618
2567a72O64j787J643L674r44n292j078M125J359j191M41M89l045k684M185M855
$$ plain form
2456 3187 3738 -473 -2183 433 863 -1165 734 4943 2189 -4870 -4602 3337 5604 -489 -3409 279
2472 279 1846 -1573 -1861 3136 3817 -2058 -5095 -604 2967 1343 153 -48 -2197 -3253 -25 3582
2488 3582 1651 -3107 -2184 827 -819 -2447 1035 4723 -646 -7219 -3454 4323 4038 -2793 -3710 128
2504 128 -157 -2601 -459 3377 1335 -3972 -3984 -61 1671 428 620 -462 -3933 -3443 1733 4143
2520 4143 -370 -3662 -1249 1083 -1376 -1800 3079 4085 -2639 -6735 -968 4665 2411 -2507 -1878
2535 -1878 455 -1031 -1285 1899 3515 -133 -3473 -1481 1645 1539 1077 1918 -337 -3932 -1921 4361
2551 4361 4448 -991 -3109 476 1453 -924 229 4701 2782 -3866 -4309 2405 5606 991 -1790 -172
2567 -172 492 -1295 348 4022 3078 -2214 -3292 833 2192 1001 1442 1931 -1114 -3798 387 5242
2583E242k347n145J75L137q16j922L445K769m158o052L128O453j31m604j098K555
2599F31j300j136K795K775k931m407J045L313M73q12J135j108m138k07O186K224
2615D538m848l084K261K125k948j46M459J131o374l679N635N008k090m515N74
2630a953J327j037n1L452P18l837k199K115J633m08J286J284l798m084K942O601
2646C991m52n901j622M522O95l719J288N157j200o583j287O319L257l111k987
2661a633L12J77l50K697K000k272k989P16K314o24k94K415N78n460l095N707N832
2678F031l102o308J333M078n35l019K405L538l142n039J217M994J200k622j320
2693b91m17p73R74L827M42l943k257K739J562k196K84L450o30o263j392P034M015
$$ plain form
2583 5242 2895 -2250 -2075 1062 246 -1676 1769 4538 380 -5672 -2544 3909 3778 -826 -1924 631
2599 631 -669 -1805 990 3765 834 -3573 -2528 785 1258 446 1581 473 -3665 -3872 2314 4538
2615 4538 -310 -3394 -1133 992 -1956 -2102 2357 3488 -2886 -6565 -930 4078 1988 -2527 -1953
2630 -1953 -626 -1663 -1714 1738 2456 -1381 -3580 -1465 168 -240 1046 2330 -1468 -5552 -2610 3991
2646 3991 3539 -2362 -3984 538 1233 -2486 -1198 3959 2759 -3824 -5111 1208 4465 1354 -1633
2661 -1633 -1321 -1144 -1494 1203 3203 931 -2058 -1342 972 348 54 2469 3047 -2413 -5508 199 6031
2678 6031 2929 -3379 -2046 2032 1497 -1522 883 4421 1279 -3760 -2543 2451 3651 1029 -291
2693 -291 -708 -1481 -507 3320 3762 -181 -2438 301 1863 -333 -49 3401 2771 -3492 -4884 2150 6165
2710F165n010m546J942L272j671j234L314J180m485k957L213L453p72j654k45
2725c5j223j685K887L674j494m602l05L463J41j887J372K907l092n368K172O278
2741C203Q91n331k231K787J161j893R72L224j679m755KM055J525j263q89k88k061
2758b570l71L708K832k995m083Q49L323r61j229K807J485m781l581M301N336j494
2774B576m868j80K787o69p67J954K138k999l807J727L710K08j173m2j104k756
2790c265J525M540R58m394k747L087J677j948K88L719j101n229j569N769M414
2805E724m181l764J180J985j375M35K723%l805j526K534K133m51o43P35k907k057
2822c260L442M767k024m839n74L797J10k428J122L803k572n272R84N914J592m054
$$ plain form
2710 6165 1155 -3391 -1449 1823 152 -1082 2232 3412 -1073 -4030 -817 2636 1864 210 -35
2725 -35 -1258 -2943 -56 3618 2124 -2478 -2783 680 821 -1066 306 3213 121 -5247 -3075 3203
2741 3203 4094 -1237 -3468 -681 480 -1413 -441 2783 1104 -3651 -3649 406 1931 668 -221 -509 -2570
2758 -2570 -2941 767 3599 604 -3479 -2630 693 -268 -1497 1310 2795 -1986 -5567 -1266 4070 2576
2774 2576 -2292 -2472 315 -354 -1121 833 2971 -28 -3835 -2108 1602 1810 637 595 -509 -3265
2790 -3265 -1740 2800 3758 -636 -3383 -296 1381 -567 -279 3440 2339 -2890 -4459 1310 5724
2805 5724 1543 -2221 -1041 944 -431 4 2727 2727 -1078 -2604 -70 2063 1612 969 1704 -1203 -3260
2822 -3260 182 4949 2925 -1914 -2488 1309 1419 -1009 113 3916 1344 -3928 -2944 2970 4562 508
2838E08k429J354P96o47J520J637j908l547R21K984j5o18J105q90l921l99N313
2855A764L007l730m894J840L623j555j801K874J716m147l845L406N348j104l817
2870a315j023J312k74M77K521K34l509j695K153J720o29j31J717k293l739J424
2886c050N662J305n638k128K950K131k314K02K922m28m854j216M605L491k483
2901A157k801P0O70l66J457K419j439l614J42K643M31p84J237N61l628k367L479
2918g33N668k034n393n83M036m9j738J491K462k103m223M09M954J824l212j762
2934i86j75L49O67K483R41l226k432J513K229o49q9K152p63m619j274O162L128
2951E411l462n288J477L335l52j819K450J313l644l253K763M236k45k613j460
$$ plain form
2838 508 -1921 -567 229 -418 1102 2739 831 -2716 -1795 1189 1174 556 1661 771 -3150 -3549 1764
2855 1764 4771 1041 -3853 -2013 1610 55 -1746 1128 2844 -1303 -5148 -1742 3606 2502 -1315
2870 -1315 -2338 -1026 -1300 -823 1698 1932 -1577 -3272 -1119 601 -28 -159 1558 -735 -4474 -3050
2886 -3050 2612 3917 -1721 -3849 -899 1232 -1082 -880 2042 1614 -3240 -4456 149 3640 1157
2901 1157 -1644 -1574 -904 -1270 187 2606 1167 -2447 -2305 338 769 -15 1222 1783 -1845 -4212 -733
2918 -733 4935 2901 -2492 -3075 961 912 -826 665 3127 1024 -3199 -2790 2164 3988 776 -986
2934 -986 -1161 -812 -145 2338 3279 53 -2379 -866 1363 714 625 2777 2014 -2605 -3879 2283 5411
2951 5411 1949 -3339 -1862 1473 1121 -698 1752 3065 -579 -3832 -1069 3167 2922 309 -1151
2966a151j91k18K026K877q18m268j207L143J438j781L45K033j643m675J109O055
2982C074J717m969l814K612K376p07p24K054n88l638n04L205K115j153j438r18
2998a300j192q3L803K359k765m563J132L696j39k073J394J845l659l265L022N445
3014C657n94n272j382K819J629j107Q73Q51k290k398J225L146O97j340p10j383
3030a579j363J605L873J141m571l313L151L010j699j109K236M39m095j597M790
3045I19L798k645m701L06K870J40k30J208qk950j304K725K332r76p29k51j390
3062h86j704L033L617j233m977o54L761J346j873n49K486j199m196P22M927J692
3078D313l833k993J347K142q1K92R97j652k792R05L001M64j614j6j22j982n28
$$ plain form
2966 -1151 -1342 -1560 466 3343 2525 -1743 -2950 193 1631 -150 195 2228 585 -4090 -2981 3074
2982 3074 4791 -178 -3992 -1380 996 289 -435 1619 1031 -2607 -3111 94 2209 1056 -382 -1300
2998 -1300 -2492 -2575 1228 3587 822 -3741 -2609 1087 948 -1125 269 2114 -1545 -4810 -1788 3657
3014 3657 3063 -2209 -3591 -772 857 -250 623 1474 -816 -3214 -1989 1157 1854 514 -196 -1579
3030 -1579 -2942 -1337 2536 3677 -894 -4207 -1056 1954 255 -854 1382 1821 -2274 -3871 919
3045 919 4717 2072 -2629 -2323 547 687 457 1665 1657 -1293 -2597 128 2460 1484 755 504 -886
3062 -886 -2590 443 4060 2827 -2150 -2804 957 2303 430 -119 2367 1168 -3028 -2306 2621 4313
3078 4313 480 -2513 -1166 976 895 1187 2184 532 -2260 -1355 1646 2110 496 480 358 -1624 -2152
3095b152L846K657l036m781J416L825l8k403P84J804k589l100K468M730r32m076
3111a577n19J297O23L91J131q6k863j440K456K077p22j097O48p30k590R43M356
3128B298J091m796k686K639K977j213j386J578O03l388j378L963K859k115l554
3143b508K36J243P96R69Q27j378k746J19L033P13j305k25O33j154k676K931L836
3160C344q84n004j126L927J924k491j67J702q59l007O70L706J354k447k112j89
3176a659J216N94J654L88k509j821J263K791o80j455Q45Q75k705j632M327L317
3192D809l052m839R04L806L29k260O43J562k120j558J250L328m19k241j562J005
3208d15q1J037K225j124l451m94K686J801k142n98J828j82l538K3M771J813m359
$$ plain form
3095 -2152 1694 4351 1315 -3466 -2050 1775 1737 -666 118 1922 -667 -3767 -1299 3431 2499 -1577
3111 -1577 -2096 -799 -176 215 1346 1260 -1603 -3043 -587 1490 768 -329 319 -411 -3001 -2058 2298
3128 2298 3389 -1407 -4093 -1454 1523 310 -1076 502 1105 -2283 -3661 302 3161 1046 -2508
3143 -2508 -2272 -1029 -233 736 1563 185 -2561 -2442 591 1304 -1 -226 407 -747 -3423 -492 3344
3160 3344 2460 -2544 -3670 257 2181 -310 -477 1225 366 -2641 -1971 1735 3089 642 -1470 -1659
3176 -1659 -443 151 1805 2193 -316 -2137 -874 1917 1237 -218 627 1502 -1203 -2835 1492 4809
3192 4809 1757 -3082 -2178 1628 1957 -303 340 1902 -218 -1776 -526 2802 2383 142 -1420 -415
3208 -415 -496 541 2766 1642 -1809 -2303 383 2184 42 -556 1272 1090 -2448 -2425 2346 4159 -200
3225b00l348K208K906k43j510L86N36k019q94K129J928j027j096k34j100rK178
3242E91K048k349l515Q35L892M0k892L08K386j407l306J240M849J45m280k205
3258c620K660J768q54J9P21j158j657P80K146P19j549m19l37j033L69L091J462
3275C108l735l056K250L450j266j897J301J609k459k374K939L460j771l830nK637
3291C61N85o83L92Rj732p49K101J526j067p16L21o43j209J473K701j17l789j459
3309b695K985K054j969r21J909k43k530m44L475J608k646k782R85K051j30J41
3325H48O27p33k275O93K183Q18j374q00O18j382n68K188K571k359l414P83L059
3342A483L08j908j33J404j063k270J065L629J39l362j606J737J291j85N56j70
$$ plain form
3225 -200 -3548 -1340 1566 1323 -187 199 735 -1284 -2178 -49 1879 852 -244 -478 -1578 -1587 591
3242 591 2639 290 -3225 -2390 1502 1542 -1350 -1042 1344 -63 -3369 -2129 2720 2865 -1415 -3620
3258 -3620 -960 808 -46 -27 694 -464 -2121 -1341 805 1524 -25 -444 -781 -1814 -1445 1646 3108
3275 3108 -627 -3683 -1433 2017 751 -1146 155 1764 -695 -3069 -130 3330 1559 -2271 -2276 361
3291 361 946 263 655 664 -1068 -1817 284 1810 743 27 348 -295 -1504 -31 2670 2553 -1236 -2695
3309 -2695 290 2344 375 -546 1363 1120 -1410 -1854 1621 3229 583 -2199 -1214 837 707 848
3325 848 1475 742 -1533 -840 1343 2161 787 -13 605 -777 -1345 843 3414 1055 -2359 -1576 1483
3342 1483 1791 -117 -250 1154 91 -2179 -1114 2515 2654 -708 -2314 -577 714 529 1085 915
3358I15j936r65J521J993p24j188M28k11k154J40L991J326l731l297K262L167
3374A537m71k408J117J092j815j921K388K751j238k644o22J194J315J70O12j073
3390a6k297L72K362N44j063n39R37j034j837J169L871J25m634j437K904K540j649
3407C18j258J189L87k112l32K498J522j767j877K13O89M03J533J10j447k391J498
3424h24K765n65j717M52J531k104j622K246L282j548m128j68L676N13j473l61
3440d5J352j032j631J045K397j82j734p81L10q2O45J760j67k955r49K414J882
3457B247j470j520J361P45k413q51L323K113k808l380J330K869j19j223N7M21
3473F82j177r48J883J289r36j443m0M2j57J483J391j317k991M21K764N52k168
$$ plain form
3358 915 -1021 -1986 -465 1528 804 -384 44 -167 -2321 -2181 1810 3136 -595 -3892 -1630 1537
3374 1537 1066 -1342 -225 867 -948 -2869 -481 2270 1032 -1612 -2234 -1040 275 445 1057 -16
3390 -16 -2313 -1941 421 965 -98 -637 300 -734 -2571 -1402 2469 2594 -2040 -3477 -573 1967 318
3407 318 -940 249 636 -1476 -1808 690 2212 445 -1432 -1219 -530 -127 1406 1516 69 -2322 -824
3424 -824 1941 1376 -341 111 1642 -462 -2084 162 3444 1896 -2232 -2400 1276 1789 316 -45
3440 -45 1307 275 -1356 -311 2086 1904 170 -611 -301 -383 262 2022 1855 -1100 -2049 365 2247
3457 2247 777 -743 618 1363 -1050 -1901 1422 3535 727 -2653 -1323 1546 1427 204 261 682
3473 682 -495 -1443 440 1729 793 -650 -690 -648 -805 678 2069 752 -2239 -1818 946 1498 -670
3490f70k51J466l93k445N88L324P11l674j526J986K067n28j114O09n49r44L1J720
3508D08M81q72n62l77n00J98K124J070k557k677J629L146n43k243Q01J369j409
3525e14j870J849K948r58l420o60K507J165p82k77R9o50q13J584O20j65j001K47
3543i1k01j045J141K353j65l310j705K975K444j670j723J225J263k170r74K009
3559C56K451k161k392N62J933M90k33o6p83j155L26J702O09j398j44N26r12j194
3577a483J919K646j483l541Q0L406R33k148j002J631j14j897j7K927K58k181j503
3594a569R68J093K20R6M2j389j063J418J766r52j067M18L02j050j036K246K222
3611B665k135l494J183L447m46j806k3J183j069j331J367K267q88k353k66Q11
$$ plain form
3490 -670 -921 545 152 -2293 -1705 1619 2330 -1344 -2870 -884 1183 655 -459 150 -399 -1343 -1312 408
3508 408 889 17 -545 -922 -1422 -1224 900 1970 -587 -3264 -1635 1511 968 -1275 -474 895 -514
3525 -514 -2384 -535 2413 1455 -1965 -2625 -118 1047 265 -12 87 -563 -1376 208 828 663 -338 -91
3543 -91 -292 -1337 -196 2157 1992 -1318 -3023 -48 2396 726 -997 228 1491 -679 -1653 356
3559 356 2807 646 -1746 -1184 749 1239 1006 940 157 -998 -672 1030 1639 241 97 623 -289 -1483
3577 -1483 436 3082 1599 -1942 -1862 1544 2477 329 -673 958 844 -1053 -1070 1857 2115 -66 -1569
3594 -1569 -601 492 712 808 850 -539 -1602 -184 1582 630 -437 -19 283 -767 -1803 443 2665
3611 2665 530 -2964 -1781 1666 1220 -586 -609 574 -495 -1826 -459 1808 920 -1433 -1699 -888
3627h88Q59J77O20n62j902l58K240R26j335q52J311J2k116N01K989P13l475j904
3645c044J962K403p98j369O29P28j681p45K096J612j506j742l6R81O13O15M87
3662A205j452j572Q73K348l27j616N4J203r23j422J571K505p27l471o33K872J533
3679B021j443p99O54l7j162J81K349j78j093j164J50J68P36J265p3k291j562K547
3697B69J765r22j617J020M40j558q66K045K320j865l172O80K931L90j492k80M69
3714E57o39r44J234J459n08j379O5l98j10J342J300q64k840L1K397J127j772n93
3732e35Q47R7j721k22K950O86k530j966J123K308k22r18j25l49m38p1J374O21
3750I09j062q57O41n19k51J958Q69j949k369P75L082J87k261o3J178n27j655J172
$$ plain form
3627 -888 -29 148 768 206 -1696 -2054 186 1112 -223 -1075 236 248 -1868 -1367 1622 2335 -1140 -3044
3645 -3044 -1082 1321 523 -846 -217 511 -1170 -1915 181 1793 287 -1455 -1491 -510 103 718 1205
3662 1205 -247 -1819 -946 1402 1075 -541 -487 716 -207 -1629 -58 2447 1720 -1751 -2384 488 2021
3679 2021 578 -221 433 396 -766 -585 1764 1586 493 -671 -521 -353 383 1648 1575 -716 -2278 269
3697 269 2034 1112 -505 515 955 -603 -1469 576 2896 1031 -2141 -1461 1470 1860 368 88 557
3714 557 -82 -1026 208 1667 1159 -220 -155 -553 -663 679 1979 1115 -1725 -1694 703 1830 58 -535
3732 -535 312 409 -1312 -1534 1416 2102 -428 -2394 -1271 1037 815 -103 -228 -577 -1015 -1086 288 909
3750 909 -153 -1010 -369 -888 -1139 819 1688 -261 -2630 -1855 1227 1414 -847 -910 268 -259 -1914 -742
3768g42K624l29k979r10J624J630k54n66k44q02k36Q36J599r32j146L20K05p83
3786a085O69J657Q54k881k242K353K552n65k131L8J594j273q06J521J914j413
3802G56k485J83J965P01j2n46q38p54P0K116M20p81j087P01o34o51J108K103n13
3821A822l143j104L163J730j686j319M40O01q53k3J488R80j611j937P71J223L61
3838I03M12o14j181r34J181J783k53j746K84L80k85j012J820J747j722k858M56
3855a639K753O23j665j168J065m10p31O78K099k66k424m87R24Q09L12M02p69j519
3873a413k63J921J133r92j407O98L44q88k45K164Q46k656k145J746K683o19j905
3890i98J12R13p77o12J543J186p84k317J23J318L73N10K29j311j467O15K298K65
$$ plain form
3768 -742 1882 1553 -1426 -2336 -712 918 664 98 -146 -948 -1184 -348 1251 319 -827 -507 -302 -1085
3786 -1085 -416 1241 2095 -786 -3028 -675 1877 1312 -819 -781 813 -460 -1266 255 2169 756
3802 756 -1729 -1546 419 1120 1108 562 -276 -1030 -960 1156 1576 795 -292 409 -225 -876 232 2335 1822
3821 1822 -1321 -2425 738 2468 782 -537 -97 504 -349 -372 1116 2096 485 -1452 -681 542 903
3838 903 1315 701 -480 -1414 -233 1550 1297 -449 -165 215 -70 -1082 738 2485 763 -2095 -1639
3855 -1639 1114 1737 72 -1096 -31 -441 -1172 -494 1605 1339 -1085 -1572 -648 161 473 875 106 -1413
3873 -1413 -1676 245 1378 386 -1021 -323 21 -867 -1112 1052 1898 -758 -2903 -1157 1526 907 -998
3890 -998 -886 27 -750 -1362 181 1367 583 -1734 -1611 -293 80 590 819 -492 -1959 -1344 954 1219
3908A219j672n84J011K04j430P12K375l28k975q25K511J467j004j172j36O03o40
3925f64K01J466K85j615p29O26P53K10P17l7j819j070J655K032p59k029J19J187
3943E29n36p77J331J841j238k894L13K722O54j776o86L95K27l81P55P98l77j408
3961e08p5R09k60J91J207q66j758r0K071J456j559j974R46J092p62q58J563J263
3979A988j996k223Q38K659J54j382m66k88Q1K96R71L38j037q97M59L86o10J194
3997D65Q74j252k248O11K633P09k280q63J050M80j199J49J988q9k195n68J084
4014f51J653j05j037l83l91l76J142J189p74q96P6K98k74j16J336O65j940j996
4032b580J633K589n42k203j63J543P8j434J178J216n17k203J06J288J373o51m14
$$ plain form
3908 1219 -453 -1037 -26 178 -1252 -540 1835 1507 -1468 -2293 218 1685 681 -491 -627 -24 -664
3925 -664 -463 1003 1288 -327 -1056 -430 323 533 1250 1213 -606 -1676 -21 2011 1252 -777 -658 529
3943 529 -7 -784 547 2388 1150 -1744 -1431 1291 1945 169 -517 -122 105 -276 479 1277 900 -508
3961 -508 -583 326 66 257 1464 598 -1160 -1250 821 2277 718 -1256 -310 782 20 -838 725 1988
3979 1988 -8 -2231 -1393 1266 1420 38 -428 -716 -635 -339 632 970 -67 -964 -505 -119 -729 465
3997 465 1339 87 -2161 -1550 1083 1792 -488 -1351 -301 179 -1020 -871 1117 1028 -1167 -1735 -651
4014 -651 1002 897 -140 -523 -914 -1290 -148 1041 267 -629 -553 -255 -529 -645 691 1356 -584 -2580
4032 -2580 -947 1642 1100 -1103 -1266 277 355 -1079 99 1315 798 -1405 -1299 -11 1362 711 297
4049B97n85n98K42J520N81j676l65M25M93q46N83J313L9k622m55K232J655j600
4067F33j448M66R99m26n55J248Q08j537j165N38J319m3k77q7q65o02R81J289j58
4086A118j424k18J173o03m94J187J362j682j954J29K465J044j892j056P86M70
4102D11q45L93P61K31j464o62J034O08K65k79j97j240k27J621R91j246j335O14
4120e66R33p49o59J401J109j688j953R39K516k56j643o53Q76Q4l99N29Q14n53
4138H2j305M52M49K34L24N11j110j307N09K195L62j895r90J119Q83j107k65J622
4156G63M67k062j152J538J981o84j908O4O04q9M57N54l1r18m96N89J84M18K69
4175E48L43j385j063J128K336q14j822J82R84J00j042O76J215m63k186P1J949
$$ plain form
4049 297 -288 -886 -644 876 1457 -219 -584 -159 334 -512 71 1384 1423 -1199 -1654 578 2233 633
4067 633 -815 -349 650 224 -331 917 1725 188 -977 -439 880 837 560 473 -392 -994 -13 1276 1118
4086 1118 -306 -524 649 46 -448 739 2101 419 -1535 -1406 1059 2103 211 -845 -59 411
4102 411 -434 -41 720 951 -513 -1175 -141 467 732 453 256 -984 -1211 410 1401 155 -1180 -566
4120 -566 367 -382 -1041 360 1469 -219 -2172 -1233 1283 1027 -616 -1269 -393 -309 -708 -179 635 82
4138 82 -1223 -771 -322 -88 236 747 -363 -1670 -1161 1034 1396 -499 -1489 -370 513 -594 -859 763
4156 763 1230 -832 -1984 -446 1535 851 -1057 -993 -389 -478 -21 533 502 -416 -912 -323 -139 279 548
4175 548 891 -494 -1557 -429 1907 1093 -729 -547 437 537 -505 171 1386 923 -1263 -1192 757
4192G57R58j340r27N42J18k68N76P29n81r57J62L91j41N19N18m21j350n60J994
4211G19J466j384j865M55J295m82n87Q62J139j485j807Q93K146n3j237q53M27
4228c51M56j91N74M20r23n71K18N78n82O36P48j115j578M1K579P80j868j253J127
4247b75R56j052j82J218N07j779j157J165J543m29o24p03K57R0N81N11l93j067
4265h33K85N76j97j29N87O62j606j426J388J825j38k216k81J663J71j062O04Q35
4283G08J1j714j96J211O29k4p57m28j49L52J014J56j146m97M80O98p88K40R99
4302G99Q9j713q74J728J526n85j852LJ527j49q52O24R65p77j106K14J006N12n87
4321D98j48p22k92O32J686m84j539O1P51n4o53K56J142l65j731r7K008J010j885
$$ plain form
4192 757 1715 375 -552 -10 108 -160 416 1145 564 -393 -231 160 19 538 1056 635 -715 -1275 719
4211 719 2185 801 -1064 -609 686 204 -383 479 1618 133 -1674 -781 1365 1312 75 -778 -351
4228 -351 105 -86 488 908 -15 -586 -368 210 -372 264 1012 -103 -1681 -1640 939 1719 -149 -1402 -275
4247 -275 681 -371 -553 665 1172 -607 -1764 -599 944 515 -109 -812 -555 -465 116 627 234 -833
4265 -833 -548 28 -169 -298 289 951 -655 -2081 -693 1132 994 -1222 -1503 160 331 -731 -127 708
4283 708 719 -995 -1191 20 649 625 -132 -560 -709 -357 657 813 -333 -830 -350 348 -440 -200 799
4302 799 888 -825 -1699 29 1555 970 -882 -879 648 499 -353 271 1236 459 -647 -433 573 1085 498
4321 498 350 -372 -664 -32 1654 1170 -369 -308 443 389 -264 -8 1134 769 -962 -1059 949 1959 74
4340G4p60O09N43j14l50N82M14j317n95Q55R07Nl55l74q49q4J050J350j391j239
4360a039K59J131j28n15J24J365j078j649L97K426l3j702o33O74P32n44j27P24
4378C84l87o81j00O66L50j04R1m81r28N7J660O97j586r59Q97R52q98m56J088N16
4398G78j432r49R53J629j28j457j94P07N49l52P1J73p78m22N57L37J60J49o3o20
4418c32q12N64J692Mj822j87J177K91p53l60J510k75j407n61J600J184q29j197
4436e13M9M50J19J51K04k76m70J23N24j46j96O63r4r28p36J693R27q90j401J29
4456f18J332Np41J07R52m72j445J04J534P19j143n95J68L15R3L90K09n32q45M14
4476d9N89n95K1P35l69j304k58J664J036j360j168O38R78k88p64N58M57m65j161
$$ plain form
4340 74 -686 -77 466 352 2 584 998 -319 -914 -59 848 853 498 124 -725 -809 241 1591 200 -1039
4360 -1039 -780 351 223 -292 -168 1197 119 -1530 -1133 1293 1260 -442 -1075 -401 331 -213 -340 384
4378 384 -3 -684 -784 -118 232 128 219 -262 -1190 -1133 527 1224 -362 -1321 -424 528 -370 -826 262 778
4398 778 -654 -1603 -650 979 851 -606 -800 -93 456 104 175 348 -430 -852 -295 42 202 351 288 -332
4418 -332 -1144 -580 1112 1116 -706 -893 284 575 -178 -538 972 697 -710 -1271 329 1513 684 -513
4436 -513 -464 -14 105 256 460 184 -286 -163 361 215 19 682 588 -340 -1076 617 1544 654 -747 -618
4456 -618 714 719 -22 85 1037 565 -880 -776 758 1477 334 -261 -93 222 315 705 914 382 -463 -49
4476 -49 540 -55 -34 701 332 -972 -1230 434 1470 110 -1058 -420 558 270 -494 64 521 56 -1105
4495a105P27J221k19r09j16j9m9O87R5k23r16L49O38k49o70M63J004p14j557O41
4515i21K085l06j410m21Q81L06m31n73R73L5j093k43R85N30j00l05n95j40M80
4534b63P11J33n21r15M23P29j89o99R34N31j232j203R98K249o27j391n78R95J56
4553B41m96J51N75J05j278J32J075J98l84o3m35j61N46P56J97j205p88R80O28
4572G74q89j29J029k19j180m86J708Q98p42j675M74P64pl00J57M00n42k54J15
4591a04P57J6l33mp09l30Q70R49o03j161J58O05M14j033M75P52m32j580O22J363
4611F92P08j443j127J088M05q9k49K47k52k94l71Q33jL9p9m50n37j07J690K24
4631I27q94j300Q29R12o01l59M93O17r87j029P44J808o16j045k61L39K85j05L19
$$ plain form
4495 -1105 -378 843 624 -285 -401 -420 -469 218 313 90 -826 -477 161 -88 -758 -295 709 -5 -1562 -921
4515 -921 1164 858 -552 -973 -92 214 -217 -790 183 218 -875 -1118 -133 397 297 -8 -603 -743 -263
4534 -263 448 581 60 -855 -432 297 108 -591 343 874 -358 -1561 -563 1686 1059 -332 -910 85 241
4553 241 -255 -104 471 576 -702 -570 505 703 319 256 -179 -340 206 962 1159 -46 -834 146 774
4572 774 -115 -244 785 566 -614 -1100 608 1506 764 -911 -437 327 320 20 177 577 35 -219 -104
4591 -104 653 669 336 332 -377 -707 163 1112 509 -652 -494 111 525 -508 -33 719 287 -1293 -671 692
4611 692 1400 -43 -1170 -82 323 234 -15 232 -20 -314 -685 148 147 186 107 -343 -880 -987 703 927
4631 927 33 -1267 -438 474 -127 -486 7 624 -363 -1392 -648 1160 544 -501 -762 -423 -138 -243 76
4650G6J22l12m83L58L49j05J64n2l53p08K60J571j3j539o17J306M12p99j87J092
4670E42K15j451l03Q15J406q97q82r3N61L50J69j89k07m79J18M06K39J09J85k50
4690C64q72o26J275J525p08j495l76J479M66r10o5Q12k20q39l70J111P98p66r58
4709c75k3O21p9L91Q0p05m07N41K13K93m80N33j28j037l50J638O30r83j490M99
4729f18J255k74l71L6K29l2r72K07J166q6q29j67j03N65L57L04n11r90kQ57J88
4750B09k27k47N87m26r17J73J651K16j404r70O17J146m00o38O23j10k46n92P72
4769a83P40k03o46l97L7L45O44K09m02j167M02R76k74o03O34K93o62p57O85J575
4789A246n69j262l84J188O8k14j53M93n8r07l9O77N80n93O3n97J09M44N83k19
$$ plain form
4650 76 198 -114 -597 -239 110 5 169 117 -236 -944 -684 887 874 -665 -1282 24 436 -363 -550 542
4670 542 757 -694 -997 -182 1224 327 -555 -648 -87 263 432 243 36 -443 -325 81 320 429 614 364
4690 364 -508 -1134 141 1666 958 -537 -913 566 1032 122 57 869 649 -190 -560 551 1349 583 -375
4709 -375 -398 223 144 535 615 -90 -497 44 257 550 70 603 475 -562 -912 726 1356 373 -1117 -618
4729 -618 637 363 -8 28 257 225 -747 -540 626 540 -289 -456 -559 6 363 667 156 -834 -836 21 209
4750 209 -18 -265 322 -104 -1021 -848 803 1019 -385 -1355 -738 408 8 -630 -7 -117 -363 -955 -183
4769 -183 557 354 -292 -689 -652 -307 337 546 144 -1023 -621 355 81 -522 112 405 -257 -1014 -329 1246
4789 1246 677 -585 -969 219 287 73 -80 413 355 -552 -591 86 666 73 136 -461 -352 92 675 456
4809D56q08l89P09J126j080q0O10J98r58n64J203J113p05j674K64J047J68o15
4827B1P5K04j39l80O23Q5m6o1k94m17lO45R16n44j299N3J052J75p54J59M64Oj304
4850g63K6J572K30p18j284L09P03K99k33l53k3m0K1L74L17m8L5m63m45r6J248
4871F68L83p97j226N50P37j87o77L40L42Q6j117K42J240L3q52p69M55O97J40l39
4891e1M43r70J36K37N72m17p6J26k30m97J06J232K00j240p74R51N56k92q62P10
4911a40N83o18j030R37J251k82j210m01Q06J98M01k47k66j25m08P87K56m35O1
4930A18P3m01m99Q41R38j37j586n95J378J70j94l49N20K34o48k67P61M13o63o2
4950D5o72Q27K34K3Qm14n29M16P56j94j96K7Qm35o58J077R25p61j201k11J404
$$ plain form
4809 456 -352 -741 -32 1094 14 -66 544 742 -216 -780 423 1536 831 -843 -579 468 636 21
4827 21 96 300 161 -219 404 489 443 382 88 -329 -332 313 1229 685 -614 -561 491 666 -88 71 535 541 -763
4850 -763 -737 835 1065 347 -937 -628 75 374 141 -212 -235 -275 -254 120 437 389 424 -39 -484 -580 668
4871 668 1051 254 -972 -422 315 128 -549 -209 133 219 -898 -656 584 617 -235 -1004 -549 148 288 -51
4891 -51 392 -578 -442 -205 367 -50 -126 0 -230 -727 -621 611 811 -429 -1203 -252 304 12 -850 -140
4911 -140 443 -175 -1205 -268 983 701 -509 -910 -104 94 495 248 -18 -143 -551 236 492 57 118
4930 118 191 -210 -709 132 1070 933 -653 -1248 130 300 106 -243 277 511 -137 -404 357 770 107 45
4950 45 -627 200 434 457 465 51 -478 -62 694 500 304 331 339 -96 -754 323 1248 487 -714 -925 479
4971D79J72o28k7K41K3p62N86N53J2m55q17J87L86K39L79m11p21K88N65M34p67
4992d4p9M62P7j091j5J016N99j145r14P98Q46j07p55%L56k70k60M94N44M7q36
5013b77k70j38L34M64M01j032l52M1J085K01p08l1M22j27q03M63J205J21j258
5032b59o24M70R88l22p56O38Q3m45j91M95J37J55p46j00L64n6R14j48q96m36L67
5053c68R26k48p78L53P36p54o37Q11J252m45j378M5J025L25n91k3l28M8l86N22
5073A07J05j32J78j17n76K50O98J93kj296k64Q57O31l00n00J12P24r19k15J043
5093E77L41n24j311K57J255J74l94k91l85K50RK76o6o6j26j2m50K17N97M42p33
5114C7j061L46J267j68n62l06M04j5n10L39P05K08r24n94K73P94L07n81m22L1
$$ plain form
4971 479 651 23 -4 237 260 -502 84 637 649 194 -623 -436 -50 189 568 157 -564 -276 289 723 -44
4992 -44 -123 339 416 -675 -690 326 925 -220 -1134 -336 510 403 -352 -352 4 -266 -526 -32 512 559 -277
5013 -277 -547 -685 -351 113 514 -518 -870 -829 256 457 -251 -282 140 13 -790 -327 878 999 -259
5032 -259 -883 -413 575 253 -503 135 218 -227 -418 77 214 369 -377 -477 -113 -169 745 597 -299 -735 -368
5053 -368 558 310 -468 -115 621 -133 -770 41 1293 848 -530 -485 540 865 274 251 -77 -29 -415 107
5073 107 212 80 258 141 -435 -185 513 706 704 -592 -856 1 632 332 -168 -56 668 -251 -466 577
5093 577 918 394 -917 -660 595 769 375 84 -301 -51 -42 234 168 102 -24 -36 -486 -269 328 770 37
5114 37 -1024 -678 589 421 -141 -447 -43 -58 -568 -229 476 684 -240 -834 -561 233 540 -41 -463 -432
5134d32pM13L56k72m44K55j15k19J64P31L80j094o51P42P22j02r51J21Q09n12
5154a06m87K65P77j65q56p9K7N06M16m33j56j45J12Q23j27o00J4J21r6l04K45
5175b48R09J0r83n82J063P62n31q44M98K12l27j67K35O06n56n46MP04pK50l89
5196G3l89k56N52P06m95m19J04N54l90n49M63R62l65j151j22J285K80p33m54N36
5216A92L3l17j21N95K54p08l60L66K48K26O2k19o15P5N20O3l31l61K94N11n90
5237a83l43P75O13j106o13L76N84N25m95n55M62j04k19L52J09qm50j89K47J57
5257f5K91J2n53n12J56J039l0r29J57N06J13n34l02R43K61p71n77M44Q83m75k19
5278a62k55n6r6K08L33M6K08k62m74J67M6N28n2m07o10P21N01K32r40J10M48l81
$$ plain form
5134 -432 -439 -26 330 58 -386 -131 -246 -465 -301 430 810 -284 -935 -193 529 427 -524 -403 406 -106
5154 -106 -593 -328 449 284 -572 -651 -624 -118 298 -135 -291 -436 -324 499 372 -228 -214 -93 -189 -493 -248
5175 -248 661 671 -312 -894 169 931 400 -444 54 266 -61 -228 7 613 57 -489 -485 219 212 462 73
5196 73 -316 -572 -20 686 191 -228 -124 430 40 -509 -46 916 551 -600 -722 563 843 110 -344 192
5216 192 225 -92 -213 382 636 -72 -432 -66 182 408 470 251 -364 -289 231 294 -37 -398 -104 407 -183
5237 -183 -526 249 862 -244 -857 -481 103 628 133 -422 40 -64 -283 69 178 170 -280 -469 -222 -65
5257 -65 226 238 -315 -827 -671 368 338 -591 -434 72 185 -349 -651 292 553 -218 -795 -351 532 57 -162
5278 -162 -417 -473 -569 -361 -28 18 226 -36 -510 -343 -297 231 179 -228 -838 -117 384 616 -324 -214 234 -147
5300a47n91L71P92R4q94n1M94O87o65m44K04J98K45j38R9nKk27j24K81n8P14l98
5323D39q99j24O86P55l42r47N88K35l60l96N19P31n94p24m1O21L11l22m06K31
5343c9l7j5M76J84m13k80N7j23J95K7O64n2j321J53P39N71j088kM35K21l60m13
5365d21N63L68n14p26M26K62M57l21Rl07L3M8R0K62n83L21n2k13l2M50P03j039
5387b16p93N14Q01p2o51j29P30k0m37o05Q81K85p41l37L24P15k4l17k31k49L54
5408b18M53M3l40KL83j93n26J38Q43k24q38n32R44N34l6o77k44P33k25o3K08K85
5430D50l59k17l69M51K10R6l32p3m63N28M55M2p87M36L53k38n11J16R02k35p94
5451c39l64R46P97r73l02Q6O34m90J21O8J23p7n19R3J10O71q6k14p27k28J085
$$ plain form
5300 -147 -738 -367 425 519 -375 -426 68 755 90 -354 -150 48 293 155 254 249 251 24 -100 181 123 837 439
5323 439 -460 -584 102 857 515 -432 156 391 31 -365 154 885 291 -433 -474 147 458 136 -270 -39
5343 -39 -76 -91 385 569 156 -124 -67 -190 5 32 696 644 -677 -524 215 786 -302 -304 131 352 -8 -421
5365 -421 142 510 -4 -730 -304 -42 415 94 103 -204 -171 -123 -33 229 -354 -33 -85 -298 -330 120 823 -216
5387 -216 -1009 -495 306 234 -417 -546 184 164 -273 -878 3 288 -453 -790 -466 249 225 -92 -323 -572 -218
5408 -218 235 278 -62 -60 323 130 -396 -258 585 361 -477 -1009 -65 469 433 -244 -488 245 20 -43 165 450
5430 450 91 -126 -495 -44 166 262 -70 -143 -606 -78 377 419 -368 68 421 183 -328 -212 690 455 -339
5451 -339 -703 243 1040 67 -235 -149 485 -5 116 184 307 230 -289 -196 -86 585 499 285 -442 -670 415
5472D15J83l55m50J13K92k73j90K40M68j94j002N38P17Ml00o03M99l02J62K01
5492A63m8j21p6Ol19L12k6N40l16q08K73O85l5m01j63n7R50r55k69Q36N27j028
5514c30o67N43Q36j29m02l07L24k30Q4M86k19J40j83k05j1J19J73J18k41n43L76
5535b68O69j75l87n66P15o7k57J64M58L35p89n17Q77K85j87r2m22K41k08J12L31
5556B52l3j6j92n3j79L19N44l63m79m42O76P04n05k64R5K57j34m47J85O65m96
5577I4m80p0O02N65m57k28j75J12Q7M24J74m26j30k97J75o1M77L91k78j008j32
5598f41R50J73l65n45L90N65p05J8J04N19n39o58N05N08J53j21p30n5L99k49N60
5619B36l25l10N35l5m34L4N77J05m33r15L44Q33K53o35j96J78K08l96Q5L72L25
$$ plain form
5472 415 598 243 -207 -94 198 -75 -265 -25 443 249 -753 -215 502 506 206 -397 102 -200 -38 163
5492 163 115 -6 -82 -76 -395 -83 -109 431 115 -693 -420 265 230 -171 -334 -391 559 -396 -665 171 698 -330
5514 -330 -997 -454 382 253 -149 -456 -132 -362 -278 208 -11 129 -54 -259 -270 -151 22 140 -101 -644 -268
5535 -268 401 226 -161 -727 -12 -79 -336 -172 286 621 -168 -685 192 477 290 198 -224 17 -191 -79 252
5556 252 219 203 11 -42 -221 98 642 279 -200 -642 34 738 233 -31 64 321 187 -260 -75 590 94
5577 94 -386 -456 146 711 254 26 -149 -37 50 474 648 222 92 -205 -30 -91 386 777 499 -509 -641
5598 -641 309 482 117 -428 -38 527 -178 -160 -56 463 -76 -734 -229 279 432 311 -419 -474 -75 -324 236
5619 236 -89 -399 136 101 -333 -299 278 383 -50 -965 -621 212 465 -170 -366 -188 20 -376 -291 81 406
5640D06o59l12M63m9J68k68J50k15J06K82K19p48j22N77J05l53j00O22K68j025
5660d85l21L31Q75L2r31M2N07k45K70j96K43P3k47l70M58L35j47M04j055J9K3
5681c85O19Rm58J49L04K87n86j10R16n29l45n77J067K71m0j064N05K8M8q7k32
5702b10M59l17J44q7R2J18L73m39m60J60M89K77l26m81J37M10k91k39M57M31l80
5723C17q27Q1R11N8l28k53OJ71l23L00Lj5l72J34J36p4L26O3j04p62L51O09p4
5746C34m23k39J48M72l98k03L9N59m81l57K84L47K45m45l09K03J40j31L49j31
5766Cp4o4n09J34L52M02o5n15m24N82L42K77l60n66O31K8o70K57M53J41n63k95
5788e03K67R23m29l26l06N53j21r8j11K48oMl29N4j79N67K83o59m34K51R54o9
$$ plain form
5640 406 -253 -565 -102 -151 17 -251 -101 -316 -210 72 291 -457 -579 -2 103 -250 -350 272 540 -485
5660 -485 -806 -475 400 432 -499 -457 50 -195 75 -121 122 195 -52 -422 36 371 224 628 -427 -408 -385
5681 -385 234 243 -215 -66 238 525 -61 -171 745 216 -129 -706 361 632 592 -472 33 61 109 22 -210
5702 -210 249 -68 76 -11 81 199 572 133 -327 -167 322 599 273 -208 -71 339 48 -191 266 697 317
5723 317 -510 -429 482 540 212 -41 -35 136 -187 113 116 101 -271 -137 -1 -75 251 314 210 -552 -201 408 334
5746 334 -89 -328 -180 292 -106 -309 -270 289 -192 -549 -265 82 327 -118 -427 -224 -84 -215 134 3
5766 3 -71 -135 -644 -510 -158 244 179 -336 -760 -178 164 441 81 -485 146 174 -496 -239 214 355 -208 -503
5788 -503 -236 687 258 -68 -374 179 58 -40 -151 97 91 95 -234 -180 -359 208 491 -168 -602 -351 603 534
5810E34j182K54N85L3l97J05N81m69j86l30O20N83m80k34o7j68L51K44J25n95
5830i3l6J48J7o7L67P2k62l46J31K23M27j79q09K67O75k50m33K15N06n11L8r7
5852CJ81M20k89m37j67K3O19j23j04m9j69O0n0j30L04J49k98o19K99N84L65o76
5874a04l97K82M99k31k30K70J21k37m55L86M64j59l60N5r1j92L82K56k96n32P68
5895A99j20k02k13M10J89l98l22K35M85j41l79j13Q4K75l62J18M51j40l53J5p2
5916c54O32L27n39m99q9K56M97K14o53o6K95nk03j64O55k09j70n51P58K9K37p71
5938c73N1N47J01m99M8J82K9pj01m8K76l3p5m44M5N47J52k0n84J32J27J95k08
5961D0k08O41k32o74j06O74N86n24l91l8N57k87J28q9K08m58J19j0J25K52j52
$$ plain form
5810 534 -648 -394 191 224 -173 -68 513 44 -142 -472 148 731 251 17 -50 -218 133 377 502 -93
5830 -93 -129 19 36 -31 336 408 146 -200 -69 154 581 402 -407 -140 535 285 -148 67 573 62 100 3
5852 3 184 604 315 -122 -289 -266 353 230 126 77 -92 -32 -82 -212 92 241 -57 -676 -377 207 572 -104
5874 -104 -501 -219 280 49 -181 89 210 -27 -482 -96 368 209 -151 -96 -187 -379 3 259 -37 -569 199
5895 199 79 -123 -336 74 263 -135 -457 -222 263 122 -257 -370 -286 -11 -373 -255 196 56 -297 -282 -354
5916 -354 278 605 66 -433 -522 -266 231 445 -208 -274 21 16 -187 -351 304 95 -75 -626 132 161 398 -373
5938 -373 -322 225 326 -173 -125 57 86 79 -22 -70 206 173 98 -346 -301 246 398 378 -206 -74 53 248 40
5961 40 -168 473 241 -433 -539 135 721 197 -194 -232 325 38 166 77 285 -173 -54 -64 61 313 161
5982A61J35o62J36N30J98n80l14L62L82k32k53J60J63j05m31m6N04J93k92m08
6002c99M56k59K90M6o0M1j96J74k13p7K72J71m77j66L64L38L4l44n28M78M54m88
6024h9j06M77J31n04j96k0N78k01k92K04j45M77k89J27k93k10Q3J44J91m00O13
6045B80Rn25k51L46N78Jp35j82M54K43o60L32L95Q0n50O6M1J67R2J1p04M72N0
6068A0L55j38m00mL06O9j34k56M30M6l57m12L28N96j74o46J69M43n1j85j31L45
6090B09l46j08J10K77J62k31r6m6K13P8K07l92k36K41j45L2j03L7L86l68j51K21
6112d9L01J32o00k65J21L25L87n59j92L56p6j03j96N32P4l3m26M7l77M92K51m65
6134c23k38M15N62k53k73l2L00j04n70K93M40J32m43m25L30L76k06o7J65J42m73
$$ plain form
5982 161 296 -366 -230 300 498 -82 -396 -34 348 116 -137 23 186 81 -350 -396 108 301 9 -399
6002 -399 57 -202 88 134 74 115 -81 93 -120 -197 75 246 -231 -397 -33 305 339 -5 -533 -55 399 -89
6024 -89 -195 282 413 -91 -287 -307 271 70 -222 -18 -163 314 25 152 -141 -351 -268 -124 67 -333 280
6045 280 289 -236 -487 -141 437 438 -297 -479 -25 218 -442 -110 285 365 -185 -119 -78 89 181 192 -512 -40 10
6068 10 365 227 -173 -177 129 198 64 -192 238 284 -73 -485 -157 439 265 -381 -212 231 180 -5 -136 209
6090 209 -137 -245 -135 142 304 73 -23 -69 144 222 429 37 -199 42 -103 -71 -174 -137 249 -119 -270 -49
6112 -49 252 384 -216 -481 -360 -35 352 -207 -399 -43 -119 -222 -418 114 188 155 -271 -224 -601 -109 142 -323
6134 -323 -561 -146 416 163 -110 -142 158 54 -516 -223 217 349 -94 -519 -189 187 -19 -86 79 221 -252
6155b52Q4Q4RJ72j39j30k66K06N11n6l10l09L20J58J73m42P83l00m35m08M94N94
6177E41P3p67j52L75J05O0k79J46k71p0M18j52k7M08l38k15J01q8N68l64o54K67
6199c15N16J87l12j17K21L47q61J22K79M96l10l97j15L04R5K6l4k77K35J50j72
6220F8J9N4j36J40k55j62M29J70j51l42J2L85j36k87J32M99l32j40m01O64K35
6241D65l79m96L76M19n08L96j55K03j41k01K6n73N74M76n00k26q4M39L09p82M0
6262c22J78K98j63n1j52M91n62j77L66nK2Nk18L27M4J00m54N9j0L39k33N0J76
6285A08j78J70l20N3O4K13J57l87l63L33K90N7l88J66J55k07m27M57L89J41n80
6306i7j07K84j7J23J81m00o9J25n7l5K8k1Ok03NL34J08M8n38M0M13J64k97L2J76
$$ plain form
6155 -252 -168 -84 -75 97 -42 -172 -438 -232 279 223 -87 -396 -76 82 255 -187 596 296 -139 -547 -53 541
6177 541 614 -153 -305 70 175 235 -44 102 -169 -239 179 27 0 408 70 -145 -44 -132 436 72 -582 -315
6199 -315 201 388 76 -41 180 527 -334 -212 67 563 253 -144 -259 45 140 166 132 -145 90 240 68
6220 68 87 141 5 145 -110 -272 157 327 176 -166 -154 231 95 -192 -60 439 107 -33 -434 230 465
6241 465 86 -410 -34 385 -123 273 118 321 180 -21 5 -568 6 482 -18 -244 -328 111 420 -362 -322
6262 -322 -144 154 -9 -60 -212 279 -283 -460 -94 -99 -77 -72 -290 37 81 181 -273 -214 -224 115 -118 -68 108
6285 108 -70 100 -220 -167 -103 110 267 -120 -483 -150 140 197 -191 -25 130 -77 -504 -47 342 483 -97
6306 -97 -204 80 63 186 367 -33 -102 23 -34 -69 -41 -62 -56 -259 -254 80 188 236 -302 -262 151 315 18 50 226
6331B26K9m99k23O30N3N2k59k13J43M38k65L09q11J77M12j32P2J1J30k93M7j26
6353i2J47N45o83l13K02N88R0p28J05J25p5l3Q3J34K59l10K19m17k4K58j13K6
6375gk86K83j35K2O2j71L18k52j0j47M58L9k45m14J89O24m77M09m26M49m08O0
6397f5k20K18JN8l31pL64K03jl28k46K16K41k14m7q9L94m24j75M09K72k4j69m15
6421c79L39J11l20K63J3j94K28pm4mK99l58m24L19K50K19p3m79L1K40K47k70J67
6444A74P4j99J62o32M23L90l28O4k41k8J62Q0p1k57m5K19Q7j02j7J03K88o57L54
6467CN6L56n74j86M7N34m52m9N1L88J77o71K72L52J16n06K59k74K72k09K63l79
6489a54M0K04j40J64k13m2J74R4k99j20q3N06n75L25K14L30j37m28j75L96Kl58
$$ plain form
6331 226 255 -244 -467 163 216 268 9 -204 -61 377 112 421 -390 -213 199 67 139 150 280 -13 34 -92
6353 -92 55 600 -83 -396 -194 394 484 -244 -139 -14 -89 -122 -39 95 354 44 263 -154 -178 80 -33 -7
6375 -7 -293 -10 -145 -123 -61 -232 86 -166 -176 -323 135 174 -71 -485 -296 328 -149 260 -166 283 -125 -65
6397 -65 -285 -67 -66 -8 -339 -346 18 221 220 -108 -354 -138 103 -111 -158 -247 147 -277 -452 -43 229 205 36 -379
6421 -379 -40 71 -249 14 27 -167 61 54 10 6 305 -53 -477 -158 92 311 238 -241 -210 30 277 7 174
6444 174 248 49 211 -421 2 392 64 128 -113 -141 21 101 30 -227 -272 -53 34 -68 -85 18 306 -351 3
6467 3 59 415 -159 -345 -298 236 -216 -265 -214 174 351 -320 -48 304 420 -86 173 -101 171 -38 225 -154
6489 -154 -114 90 -50 114 -99 -141 33 127 -172 -292 -375 131 -444 -119 95 425 288 -140 -315 81 83 -275
6511b75m9M52J56k45j55k0o0J76J39j92Ko5N1M5k36K43L23l73o8qL64L03n98q3
6535a73J17J35O2k06J8L52L4m43J55J13j49j30j73J40L39Pl0j00j65l2J30m4n3
6558i6K36l4j49k65J99O47o31l5l4J00L45j75j60P2o9J42L3N2k7P4j85j79K92
6581A53J16l6N0n52P6L27J29n1n4K08Lk61l30N00j75J44j41l35N61q5m65J78J40
6604A00N7K8l30L89l5j37J3j31j47L63N3n89P3J38L63j12k97k28O38%j47m51O45
6627B56j26j24j73O7K56J36k59j51P9k50J91p0J69o4R4k0j80j8J23K78m32j52
6649c70M34J76J1j72rJ41k8l46r0L07Jl34j36K61K01p6j33K07k19O4J75r0J33
6672A08k13J60J50l72K5N47k59k14j11M94L0m77j30K99k72N6O3K09J81j58j50
$$ plain form
6511 -275 -324 128 284 39 -116 -136 -196 -20 119 -73 -71 -136 -85 -40 -276 -33 290 -83 -151 -159 205 508 -90 -173
6535 -173 -56 79 141 -65 -47 305 339 -104 51 164 15 -115 -288 -148 191 198 168 68 -97 -129 1 -43 -96
6558 -96 140 106 -43 -308 -109 538 -93 -128 -162 -62 283 108 -52 20 -49 93 126 178 151 225 40 -139 153
6581 153 269 233 283 -269 -193 134 263 212 158 366 369 108 -222 278 103 247 106 -229 332 247 -218 -40 100
6604 100 157 185 -145 244 209 72 85 -46 -193 170 223 -366 -293 -155 208 96 -201 -429 209 209 62 -389 256
6627 256 130 6 -167 -100 156 292 33 -118 -39 -289 -98 -168 1 -63 31 11 -169 -187 -64 214 -218 -370
6649 -370 64 240 251 79 70 211 183 -163 -253 54 55 -279 -415 -154 47 -29 -162 45 -174 -110 65 -25 108
6672 108 -105 55 205 -167 -142 405 146 -68 -179 315 345 -132 -262 37 -235 -179 -116 93 274 116 -34
6693c4K9J02J7J00J38m28R0o6q4J41M0J93q8M3k39K81O2j69j54O5K96j21j83l01
6717b70K15J29l5q7N9L24l40O6l39K51K88l56P5k09J57J41N2j55J69j15L51l49
6739B2m84P17q0R6o20O5O58j00l51n7J21J45j07j47pL41m18J82j31J74L02m14
6761i3l85L91l97N17k16Q1r1J60K36m08NK89J00l87j83k1O78k80j11J43JPj9j43
6785a26K17K45k39L7j94L8K82j75N6j30Q5k07J95M3l82L71l56P1m0L43J8j49j38
6808a35PL29k44J78Q7k10j08K61n1J26l18o0L17j30J13r0K10k03j44L43J66n54
6830a10J49O6k15J1k00L14J85l54K01j36K27K23n41J20J2j99J96L02k74L60j77
6851A60k33n1k40N33L3n3m03M7M41L1j62j03J13J21r0k94L4N54n98q1L23r7J01
$$ plain form
6693 -34 -5 97 114 214 352 -76 14 -52 -136 5 45 238 150 193 -46 235 297 128 -26 39 335 214 31 -270
6717 -270 -55 74 39 -48 11 335 -5 61 -278 -27 261 -95 -20 -229 -72 69 121 -34 135 20 371 22
6739 22 -462 255 175 271 -349 -284 374 274 -77 -134 -13 132 25 -122 -129 212 -206 -24 -155 19 321 -93
6761 -93 -478 -87 -484 33 -183 -102 -193 -33 203 -205 -200 89 189 -198 -381 -402 276 -4 -115 28 29 36 17 -126
6785 -126 91 336 97 134 -60 -22 260 85 141 11 96 -111 84 127 -255 116 -240 -169 -209 134 152 3 -135
6808 -135 -128 201 -43 135 222 12 -96 165 114 240 -78 -138 179 49 162 72 282 79 -65 278 444 -110
6830 -110 39 105 -110 -99 -299 15 200 -154 47 -89 138 361 -180 -60 -48 -247 -51 251 -23 337 160
6851 160 -73 -124 -364 169 202 149 -254 -207 234 265 103 0 113 234 144 -150 -116 438 -160 -241 82 -15 86
6874H6j20l59M77J7k5J66m45M49k99k28Q9K04j8K01Mn97L38J60l6l44K02J04J77
6897B03k42J1j37L90j42m21L24Q4K54P0k07k91J49j19j81J15L4%j11J21M35k79
6919F0J34l90R4K44M2l12j35J98M2K7m4N1J00l93J99j39k4j1N26n22Q2J45R7k3
6943D8o0J00J65j73n3l55M02R0j9n5P6L24l46J11k87O7J22j28k66L54M3j55k70
6966b65k26O77k37l18K98p0Q6R5K41k81j20K52n2j99J65j84M86j15k98M8l6K91
6988B38k07k32M57m31J23k72L97J1J7m03L49Q6K0j99L5q6J08p5K03l34J81K3J12
7011A21l79P6L65k46K0k26L27J9l6k0j29J31O1l23K74j37L31j75j13N2l3j29J80
7034A1J0j7l0K93j05k67n5J80M3p6j54l2M05m92K33m7K72j29m4p0L8k1j82K35
$$ plain form
6874 86 -34 -393 84 101 76 242 -203 246 -53 -281 -192 12 -6 195 199 -398 -60 100 64 -280 -78 26 203
6897 203 -39 -28 -165 225 83 -338 -14 70 324 394 187 -104 45 -74 -255 -140 -106 -106 -217 -96 339 60
6919 60 194 -196 -102 142 184 -128 -263 -65 -23 4 -40 11 111 -282 -83 -222 -246 -257 269 -253 -171 -26 71 48
6943 48 -12 88 253 80 27 -328 74 164 145 90 166 490 144 255 -32 35 157 29 -237 117 160 5 -265
6966 -265 -491 186 -51 -369 -71 -141 -55 40 281 0 -120 132 80 -119 46 -138 348 233 -65 -17 -53 238
6988 238 31 -201 256 -175 -52 -324 73 84 101 -302 47 133 153 -46 -11 -97 11 -64 139 -195 -14 9 121
7011 121 -258 -182 183 -63 -43 -269 58 77 41 21 -108 23 84 -239 35 -102 229 54 -59 -7 -40 -169 11
7034 11 21 4 -26 267 162 -105 -160 20 63 -13 -167 -199 206 -286 -53 -100 172 43 -1 -71 -33 -54 -236 -1
7058aJ38J57l21J59l15K58j0M1j11j57K0K42K5m81M91J87m00k26J97K74j30j58
7080a21L06k09J89Q4l73q0N20l00J13p4J91J79j54p7j2J6J08l90j67J51J40Q3
7102A23l82K07J81r7m4M0k99N16m14K6q4M08K89m07k41R8K44k13J73p2Q7Oj21
7125B4o7p2N4n4p5Mk87K27K80j35k3J65J8m7l15K36K2r5k8J22L5P6J24k98L5p0
7151a44R5J10k36O6Q4K94m82O3K47j72k9k87J66J72L43k68k07M74l13l23M32P1
7173A56j07J15Qm02L51j64K61k78N1K1k79K53j8J09l72L23J30J92k35J06n39j5
7195c33L66L01l90j07R7J56k20J96j23K72j02k41N7M39l61N8r4j97J61L01j50
7216H6k01J81j2N0j91p3K16K51m54k4K53k6K83j12k79P0J42k04L13l61J27j02
$$ plain form
7058 -1 137 294 -27 132 -183 75 65 106 -5 -162 -142 100 125 -356 135 322 -78 -304 -107 167 37 -121
7080 -121 185 -24 165 249 -124 -204 316 16 129 55 246 425 271 194 182 198 306 -84 -251 -100 40 123
7102 123 -259 -52 129 32 -12 28 -271 245 -169 -143 -227 181 470 63 -178 -80 164 -49 124 52 139 145 24
7125 24 -43 -115 -61 -115 -190 -186 -473 -246 34 -101 -124 41 59 12 -303 -67 -45 -140 -168 -46 -11 65 189 -109 -74 -144
7151 -144 -49 61 -175 -109 -25 269 -213 -150 97 -75 -104 -391 -225 -53 290 22 -185 289 -24 -347 85 156
7173 156 49 164 172 -230 121 -43 218 -60 -9 12 -267 -14 -32 77 -295 28 158 350 115 221 -318 -333
7195 -333 33 334 -56 -163 -66 90 -130 66 -57 215 113 -128 -71 368 7 65 -29 -226 -65 236 86
7216 86 -115 66 54 104 -87 -160 56 307 -147 -171 82 56 339 227 -52 18 160 -44 269 -92 35 -67
7238f7M5NK1k4M4K09k76J7J53j2L8k58R6P4k26mL77q1l65K37LJ85m16K72j33j81
7264b67L10j06k00L02j70K48k35N0R0l04N12l55l5J76L7q4k26K67l0J71k32j59
7286b40Q4K34k16K11j13O7rk03L71l93K38K2r8O0K69k49P7k28L6J90j29j79R2
7309a06k2K5q7pk3M15k48j70K34k02L35k27J2J4K89M8l31m11M47J7j88J66K48
7332B28l02J76j24k0RJ73n0k48O3J58K85k73k60M32r7l01J11J49p9J68k97L24
7354B25k38J0J17j68m5O5K15m33K09J80k5J37m80J1k9L16j9k33M9J03L47l66j20
7377a72j28K98j38J97j4K27j52k24j23J97Q4j22rj60N1L06k70R5J0K36p7k92M9
7400a31J42L11o54n5N42j1j13J33k72Q0k8j12J56q0L08k81k1J06l8k19K47K26
$$ plain form
7238 -67 -22 -17 4 -20 24 233 -43 -26 127 115 153 -105 -9 65 -161 -165 212 131 -234 3 6 191 -225 47 -86 -267
7264 -267 43 -63 -263 39 -131 117 -118 -68 22 -282 230 -125 -160 16 53 -31 -257 10 -20 151 -81 -240
7286 -240 -156 78 -138 73 -40 27 18 -185 186 -207 31 53 -45 15 284 35 112 -116 -80 110 -19 -198 -106
7309 -106 -128 -103 -190 -197 -220 195 -53 -223 11 -191 144 -83 -71 -57 232 280 -51 -462 -15 2 -186 -20 228
7332 228 -74 102 -22 -42 -33 140 90 -158 -95 63 348 75 -185 247 150 -151 -40 109 30 198 -99 225
7354 225 -13 -3 114 -54 -99 -34 181 -252 -43 137 112 249 -231 -220 -249 67 48 -185 -136 -33 314 -52 -172
7377 -172 -300 -2 -140 57 43 270 118 -106 -229 -32 52 -70 -79 -239 -188 118 -152 -57 -47 189 112 -180 -131
7400 -131 11 322 -332 -387 155 144 31 164 -108 -28 -56 -168 -12 -92 216 -65 -86 20 -18 -237 10 236
7422B36m88K38R6k65J11j82L78q7k90K47m7L22o73N48l79O10j23m28J67r3K05
7443A03j88j79M24k45M3o1R1K53k54K2Q6j51j09L56k41J79j71m7K18O8j30ko8
7466cJ5pq3J69J27j53j23j07J87j42P4J9K96m34J43o3K41j27k06j57L81J28m30
7489b55L4K45p8J02J13o1q6j99j7K8m1L25j71M3k21jJ97J38k34j4j30N73l26k24
7513b60K59j47L9j5j66L71J18j97O5o5j56J28l0k26K54K03k37j26J48lO0l11J51
7536a43K45r3K3k20K29j28J50j20Qj41J72J28l08R2J66O0j24j4l81O62k2j22k21
7559a02PK19j67J2j20K17K08l95oK39N7k8j49n0K32m02K62L8J10k57L4K49j61
7582D7J2j6J90n91M42jJ01m0k52L14q3j31p3K87q1l23L20j09K48N1n26L54m50
$$ plain form
7422 236 -252 -14 82 -183 -72 -254 124 37 -253 -6 -53 269 -404 144 -235 375 252 -176 -9 -102 103
7443 103 -85 -264 160 -85 -42 -103 -12 241 -13 9 95 -56 -165 191 -50 129 -42 -89 129 197 67 65 -3
7466 -3 12 5 -78 91 218 65 -58 -165 22 -120 -46 -27 269 -165 -22 -85 156 29 -177 -334 47 175 -255
7489 -255 -221 24 -54 48 161 100 14 -185 -202 -174 -215 110 -61 -18 -239 -240 -43 95 -139 -153 -283 290 -36 -260
7513 -260 -1 -148 -109 -124 -290 81 199 2 67 2 -154 -26 -56 -282 -28 175 -62 -188 -40 -43 17 -294 -143
7536 -143 102 9 32 -188 41 -87 63 -57 -49 -190 -18 110 -198 -106 60 120 -4 -18 -399 263 241 119 -102
7559 -102 -95 124 -43 -31 -151 66 274 -121 -127 112 169 141 -8 -58 174 -228 34 72 182 -75 -41 208 47
7582 47 59 43 233 -358 84 83 184 144 -108 206 123 -8 -81 206 125 -198 122 13 261 312 -214 140 -310
7605c10M79j77l59M15r1p8oJ20k21N80k20o5j20K89k03r8J69Pq4j91J22k02K59
7628A5q3j9pk0j9J35j18p1j15N18j14j05P3k48J78K2N9n4J36k07L7k12L29k1j08
7653a9j93K57J59m18N8J02J48K9l73J69q8KL92m48K91l90lM16j33J44j15J07n6
7676C8k25K33J85n20J22R9j61L24j18L4k22K65j09K95l76J65K72L1k85M5j84K20
7698A28j24J26j6j25K62k93Q3j04Q3M6LQ7J86l79OJ36k94J71J45l5l08N4J74j58
7722a46j17J97J33j81m7K60j43J2J69j21k08K87J23l29J6J17K21l41K24n2j60
7743h6k6J64L5k69K69j40L3L7P9l71J20K95m34K43M7j97J63J12J02J17k75K22
7765B40j27m01P2Q4M08l55M7Q8J48m3K7l85m4J83k22M68k9r5J6J35k05Q7p3K61
$$ plain form
7605 -310 169 -8 -367 48 -43 -121 -127 -7 -228 352 132 67 -53 236 33 -65 104 111 27 -164 -42 -244 15
7628 15 -68 -87 -94 -114 -133 2 -116 -187 -302 216 102 -3 70 -178 0 22 81 27 163 -44 -7 -219 110 89 -19
7653 -19 -212 45 204 -214 -156 -54 94 123 -250 -81 -169 -167 225 -223 68 -322 -325 91 -42 102 -13 94 38
7676 38 -187 46 231 -289 -167 -68 -229 95 -23 11 -211 54 -55 240 -136 29 301 332 47 92 -92 128
7698 128 4 130 114 -11 251 -42 41 -63 20 66 69 156 342 -37 -31 105 -189 -18 127 92 -216 -162 12 -146
7722 -146 -263 -66 67 -114 -161 99 -44 -32 137 16 -192 95 218 -111 -95 22 243 -98 126 74 -86
7743 -86 -112 52 87 -182 87 -53 -20 17 96 -275 -155 140 -294 -51 -4 -201 -38 74 176 293 18 240
7765 240 113 -288 -216 -132 276 -79 -32 56 204 161 188 -197 -241 -58 -280 188 159 64 80 215 10 97 24 285
7789B85k2o02L74n9J4m71L39L25j61J6K13k63M7m9K1J08k53M25l98J93M8k02n0
7812a22J9K86l54%J46K25r0k02j8J4j93L89K8n8J96j54q8j47o6M13j47j4k4M6
7836H5l04J42J09O5Oj25K51k75J8N0k20J26J09l7j9P7k74J74J27M0o0j40m0L07
7860A92j54J98k45Rk04N02n26K38J83k57O6J08p6o2K04k37j77J64Q8K38j69l07
7882b24oJ03r5k20O73m05L2M9k20L17R8k02J56k21K42j05k02J23K22k62K36k00
7904a11J00j40L21p3mK0K30l85j05J38J37j25j78M34j83L8l07L07l65L62J15k26
7926@j7K0k12m0L49K06k33j23j84M18l30o0L96j53n15M49j8K5k12l5L99K0J30
7949B80m78L11J28l19K07p1R9j04p6J6J37k44j47K17K80k70J68j51k71K50n0K88
$$ plain form
7789 285 263 -339 35 -24 -10 -481 -142 183 22 38 251 -12 35 -14 7 115 -138 287 -111 82 130 -72 -122
7812 -122 -103 183 -171 -171 -25 200 110 -92 -110 -96 -289 100 128 70 266 112 24 -123 -189 224 77 63 39 85
7836 85 -219 -77 32 97 103 -22 229 -46 -28 22 -198 -72 37 0 -19 58 -216 -42 85 125 65 -75 -115 192
7860 192 38 236 -9 0 -204 298 -228 10 193 -64 2 110 34 -28 176 -61 -238 -74 14 252 83 -224
7882 -224 -230 -127 -222 -442 231 -174 -142 -93 -313 4 102 -100 56 -165 77 -28 -230 -107 115 -147 89 -111
7904 -111 -11 -151 170 97 93 113 343 -42 -147 -9 128 3 -175 259 76 114 -193 114 -251 111 226 0
7926 0 -17 3 -209 -249 100 306 73 -50 -234 184 -146 -206 190 37 -478 -29 -47 -22 -234 -269 130 150 280
7949 280 -198 113 241 -78 129 58 157 53 -23 -7 130 -114 -261 -44 236 -34 134 -17 -288 -38 -88 200
7971B00q5m70K92K04Lj19M9K86m34R0k00K94l71N5L71j00R2Ok91J13pQ0j51J84
7995I1l97M90k1j33p8p9M9r9N1J86QR0o3j13l8j73L30n3j08k79O82l55o1J90j72
8020e5P1q7l00M04q0j01Q4L7Q9r2p0L12l37M06l97K04k85L30j02j71K18k8J14
8043A64q1k99N7J46J6J06l77M26j66j5n2q0R7p6L1k05L82j49M8n7J37K83j50l04
8067a18m9J38R2j86j63J70lJ07M6km9q1M8j38J60K03o1m0k0j2r0K7J90k13M9j84
8093a79r7J14K66J74j10k04J29J64k55K47O5n63K83K75l70O3K00J18k59k03J40
8114bmJ66k08J66k32K11J3J14k30k28K19L87n85J62r4R3K05k88L10k91K93k70
8136i3O1k6J21k07j39L46l12K03m1L0j19N1jJ74k29J55J59l5k3k73P1J12m5J44
$$ plain form
7971 200 115 -355 -63 141 144 25 74 360 -74 16 -184 110 -261 -206 165 65 157 163 -128 -15 -22 58 -93 91
7995 91 -306 184 163 30 -48 -127 -78 -177 -126 60 68 158 95 -18 -56 -229 101 48 -60 -339 343 -12 -73 117 -55
8020 -55 16 -71 -371 33 -47 -148 -64 -27 62 -30 -100 212 -125 281 -116 88 -197 133 31 -140 78 50 164
8043 164 83 -216 -159 -13 3 109 -268 158 -8 -23 -75 -155 -58 -134 -103 -308 74 -75 -27 -84 53 336 186 -118
8067 -118 -167 -29 63 -123 -286 -116 -119 -12 34 32 -17 -98 -50 -188 -28 175 114 74 54 42 -48 -21 169 -44 5 -179
8093 -179 -276 -162 104 278 168 -36 93 257 2 249 314 -249 34 309 -61 2 202 320 61 -142 -2
8114 -2 -6 160 -48 118 -114 97 110 224 -6 -234 -15 372 -213 -51 -145 -52 153 -135 175 -116 177 -93
8136 -93 -32 -58 63 -144 -283 63 -249 -46 -87 -57 -176 -125 -126 48 -181 -26 133 98 75 -198 -127 -15 -60 84
8160H4l63K93j57M1P2K43K63m30R6J04l68j26K92j7k49M40l47J79o9J49r6j8L5
8183E1j99L64n93K65n1N1J61k70
$$ plain form
8160 84 -279 14 -143 -102 -30 213 476 46 142 246 -122 -248 44 27 -222 218 -129 50 -19 130 34 16 51
8183 51 -148 216 -377 -112 -163 -112 49 -221
8191b21
$$ Imaginary data points
##PAGE= N=2
##DATA TABLE= (X++(I..I)), XYDATA
0@%%%%%%%Qj6J6j6J6k3L0l1M0m8N3o1P2q8J02j15J33j56J77j98K27k58K88l24
31a72L66m10M56n06N64o28O97p74Q58r49J047j158J285j427J583j758J963k200
49a163K474k800L195l686M314n149O314q049J0903j6387L0481j26834k82010M05870
63A7473K93736l04704k47602K85789J69032l15821j62468L51949J94936l17206
73c4886k14648K48641J60970k05350p4785K36672K0757k98256l9713L26872Q2836
84B09110k92192r1107K42475M7021k33210j395K69458K446k97957m6832K74356
95H2173P7688k09122n3629J60886o588j65933M6102K01988l4160k09367L365J70759
107F4162n066j22378N0095J15603r2653j48296Q9720J73277m7586j50437J8539
$$ plain form
0 0 0 0 0 0 0 0 0 8 -8 8 -8 8 -15 15 -16 24 -24 29 -32 40 -48 54 -61 72 -84 93 -105 122 -136 152 -172
31 -172 194 -216 240 -266 298 -330 367 -407 451 -498 549 -609 676 -751 832 -926 1037 -1163
49 -1163 1311 -1489 1706 -1980 2334 -2815 3499 -4550 6353 -10034 20447 -106387 -388397 17473
63 17473 311209 6505 -241097 44692 213724 -102097 -264565 87384 282320 -34886
73 -34886 -249534 -893 160077 -45273 -120058 116614 137371 -160885 -200598 126274 209110
84 209110 -83082 -174189 68286 115307 -117903 -119298 150160 152606 -145351 -192183 82173
95 82173 159861 -49261 -102890 57996 51408 -114525 -68423 133565 99405 -109962 -106597 64162
107 64162 59096 -63282 -13187 102416 9763 -138533 -48813 124464 76878 -73559 -55020
118e5020R3134l4671n1888P7448N5130r8201p3816P9247O4894n4318j8791O6152
130D9300k3454j11626K4918J50475P967j49059l1202J19790J9697j01887J1290
141c3791J16478k2928j43170L272J44281K3535j13402k2430P8663r967p2170M2091
153i538R3849m7192j11932K7209J01442j5025p0860L1100N2761o3454o3444P8500
165C416Q5838o4783q8933M3833O2791m5288l6163P1758L4364r6679n5365R4173
177H962P0403p4549o1784O2842M1502p3838l5939Q9401N0199q6554o6448O1798
189a4005O1367l8868l6804L5759J4794m8607j0125N5341J4530m7575q377L5988
201A3418j2989m1247L3005O2778l4527q2539J9637Q3906p784p2227J0581O6870
$$ plain form
118 -55020 38114 3443 -48445 29003 84133 -14068 -87884 -8637 56257 1939 -16852 49300
130 49300 25846 -85780 -60862 89613 97580 -51479 -82681 37109 56806 -45081 -33791
141 -33791 82687 59759 -83411 -80139 64142 87677 -25725 -48155 30508 20541 -51629 -9538
153 -9538 84311 37119 -74813 -47604 53838 38813 -32047 -947 51814 -11640 -75084 3416
165 3416 89254 24471 -64462 -20629 42162 -3126 -39289 32469 66833 -29846 -85211 8962
177 8962 79365 4816 -56968 5874 47376 -26462 -62401 27000 77199 -9355 -75803 -14005
189 -14005 47362 8494 -28310 7449 22243 -26364 -36489 18852 33382 -14193 -22570 13418
201 13418 429 -40818 -7813 54965 20438 -62101 -42464 41442 33658 -38569 -27988 38882
213C8882k0546p5065J9756Q4431l523p9129r824N7648O298l8727J2581L8834k6873
226D743n1454K3812N9257j1717m8587Q751L4186k2354l4038L7329N1429l2879
238A8478o6478J1090O0788P148l8316k712K2926j4498k8155K2099M2562r637m0673
251a5378n718K1430J022k984K3172P603m2852l0916M0149M9883k1416m6301J0319
264a1987L2817j8916l2361L2976N1566k8631p0896L143O8879K1136m6979k3518
276b2771K7254Q172k7065J593M0075P717m2492k4230K3258K4632J25l259l501
289I508k2032j5564K6526L4411j2203l3780J584J7587j2257j1396L4110K6862
301D3356m2374n2816K6114O1593l050m6522k650K7167j4095k7532K8894M6330
$$ plain form
213 38882 18336 -56729 -36973 47458 43935 -35194 -45018 12630 18928 -19799 -7218 31616 4743
226 4743 -46711 -22899 36358 24641 -23946 -15195 18991 -3363 -37401 -72 51357 18478
238 18478 -48000 -36910 23878 31026 -7290 -10002 12924 -1574 -29729 -7630 34932 25295 -15378
251 -15378 -21096 334 1356 -1628 21544 29147 -13705 -44621 -4472 45411 23995 -22306 -11987
264 -11987 20830 1914 -30447 2529 54095 25464 -45432 -42289 26590 47726 747 -22771
276 -22771 4483 12655 -14410 -12817 27258 34975 -7517 -31747 -8489 16143 16268 13009 9508
289 9508 -12524 -28088 -1562 32849 20646 -13134 -11550 6037 -6220 -17616 16494 43356
301 43356 982 -51834 -25720 35873 32823 -13699 -16349 10818 -3277 -30809 -1915 44415
313D4415k2572n8760R8M6563J1607k1468J150Q274k5257j9708L4594L8597k1597
326A5936m0747M815K1362p417l450K9334P023m6969k7097M0809L9760k1204k9821
339a7666J2090Q269k4075J043M4334J0694m9738k7183L5898K6313k0227p013K4377
352A7116r747m4588O317N9940J2032n4514k2055L7193J3545k9454L527M0606p860
365B2058n5082n362N4113K0233l4974j7249J8133k826j8120J9796L2950j8860
377A4810m1000Q109L2521o715j7696K3454J6336m3257l2485M7879N0936l4594
389A8298n3455K1460M1282k3772l1914L7406L8352m3048n3119L1773N6858j3801
401B6320m2447Q547K2649k0373j5597L5049K2731l6663k9501K6338K1337k1197
$$ plain form
313 44415 21843 -36917 -36819 9744 21351 -117 1033 9307 -15950 -35658 -1064 37533 15936
326 15936 -24811 -19996 1366 -6051 -9501 19833 26856 -20113 -47210 -6401 33359 12155 -17666
339 -17666 -5576 2693 -21382 -20339 23995 34689 -15049 -42232 -6334 19979 -248 -7261 17116
352 17116 7369 -37219 -30902 29038 41070 -13444 -35499 1694 15239 -14215 -10688 29918 22058
365 22058 -33024 -38386 15727 35960 986 -16263 1870 -956 -19076 720 33670 14810
377 14810 -26190 -18081 14440 7725 -9971 13483 29819 -13438 -45923 1956 52892 18298
389 18298 -35157 -13697 27585 3813 -28101 9305 47657 4609 -48510 -16737 40121 26320
401 26320 -16127 -7580 15069 -5304 -20901 14148 36879 216 -29285 -2947 18390 -2807
413b807l306L2252o757n1731j624O2454J5328n5069k0945M3856J0264m3709N21
426b1273N5502J442o4531j5684N8665K3016m2303j4812L2161k102l8887J1192
438a7614N0608n185n2866l747M1431J82l1019J4988L4439k7677m8434K4092N7193
451C6391j1666n0373N290L5940j3828l0511K7204L7909k9828m6507J9895M2371
463B2287j2181k6555J8300J6019l4961k0118M5097L2469m0686l7228L1309K8678
475B2430k9895j8739M1132K0105n0669l2272M7027M0972l1746l4874K1460J9586
487A4517k5041j0413L5985J4877l8433k1771K8431J8418j7912k554K1288j1409
499E983l5421J1127M7189l16m4357n586L4686j385l1786J3633M0849j4696n2403
$$ plain form
413 -2807 -6113 26139 19382 -32349 -33973 28481 43809 -11260 -32205 11651 21915 -21794 -21273
426 -21273 34229 35671 -28860 -44544 14121 37137 -5166 -19978 12183 10081 -28806 -17614
438 -17614 32994 27809 -25057 -28804 12627 12809 -18210 -3222 31217 3540 -44894 -20802 36391
451 36391 24725 -25648 -20358 15582 1754 -28757 -1553 36356 6528 -39979 -20084 22287
463 22287 10106 -16449 1851 17870 -17091 -37209 7888 40357 -329 -37557 -6248 22430
475 22430 -7465 -26204 14928 35033 -15636 -47908 -881 40091 8345 -26529 -5069 14517
487 14517 -10524 -20937 15048 29925 -8508 -30279 -1848 16570 -1342 -3896 17392 5983
499 5983 -29438 -18311 28878 28562 -15795 -21381 13305 11920 -19866 -6233 34616 19920 -32483
512c2483L441N2220P844l8850o825K8183n611k9233J3464L9057q689m1740j861
525b1083L1876L442j7926Q014J3570k1069k2100K3687L0616j5595k7767Q781J6288
538A0734j5177r349K8749J5397l5855k7584K9151L2167j8453k4961J5866J4838
550A5523k4150j4732L1798K3933k8760l0465J6038K4507q584j1191J4245K625
562A0787k5740p026K9968J5447k4273j5681J6075O286j8263J998K9155P53l7290
575a7804j2660L2681J9727k0442j5288J3656M009j6790J94K4267M349k3765r635
588a7501J4738N537p757P376J1565j7500k4069J6261L4217o970l3838P21K7180
601I960l043k5089P905L1855n337l8078n720L4392J5888k0507j4132P603L428
$$ plain form
512 -32483 -29042 23178 31022 -7828 -14653 13530 7919 -21314 -7850 31207 22518 -19222 -21083
525 -21083 10793 14235 -3691 4323 17893 -3176 -25276 -1589 29027 13432 -14335 -5554 10734
538 10734 -4443 -13792 14957 30354 -5501 -33085 -3934 28233 9780 -15181 685 15523
550 15523 -8627 -23359 8439 32372 3612 -26853 -10815 13692 5108 -6083 8162 10787
562 10787 -14953 -21979 7989 23436 -837 -16518 -443 5843 -12420 -10422 18733 19486 -17804
575 -17804 -30464 2217 21944 1502 -13786 -130 3879 -12911 -12717 11550 15899 -7866 -17501
588 -17501 -2763 2774 -4983 2393 13958 -3542 -27611 -11350 22867 15897 -17941 -17220 9960
601 9960 6917 -18172 -10267 21588 16251 -21827 -27547 6845 22733 2226 -11906 -4303 -875
614h75n208O433J0498o380j2404L784O516p849N49K0668K549l1860j6060L2903
628C264K8134k2963l0001J4492K4653j4364k1882J9027K7027j7727l2637Q049
640a4928L0051K359j8096k177N481p564k449J7334Q081j8850j2425J4599R231
653A0647j4451k322K2294K548l1807j2494L2940K2392k3260k3830J3547J5368
665A1572j2498q907J9519R657k3048j5337J7378J5355r375o709R451m064j9672
678a6678N238L0201K968l1192j0979K3141R638j8487j651K2174j138l0071o596
691b3432K9938J5404j9873j4929Q995M038p930N072J6842n997k2479q76J8496
704C269L472j0683M025Q268j3891j6239J5754K6005q498k6152q3J7956j828r630
$$ plain form
614 -875 -6083 350 10848 4468 -7936 -4152 2364 -5485 -4936 15732 18281 -13579 -29639 3264
628 3264 31398 8435 -21566 -7074 17579 3215 -18667 360 27387 9660 -22977 -14928
640 -14928 15123 17482 -614 -2791 2690 -4874 -7323 10011 18092 -758 -13183 1416 10647
653 10647 -3804 -6126 16168 18716 -13091 -25585 7355 29747 6487 -17343 -3796 11572
665 11572 -926 -9833 9686 19343 -3705 -19042 -1664 13691 4316 -2393 7058 2994 -16678
678 -16678 -11440 18761 21729 -9463 -20442 2699 12337 -6150 -7801 14373 13235 -16836 -23432
691 -23432 6506 21910 2037 -12892 -3897 141 -7789 -2717 14125 8128 -14351 -15227 3269
704 3269 6741 -3942 83 8351 -5540 -21779 -6025 19980 11482 -14670 -14753 3203 1375 -8255
718h255J1288J2146j8353k1819J5575K6193o174k0826L960J1406j1850j0443K1705
731D553J9364k0859k7688J0823K5297k757j3259O002N107j5997p864K1189J5436
744A9347j6077j5185R106N705j1503M687K3726l295l4841p458L4806J7088k5867
757B39j5493K0137P722k4490m623L2088J2789l1725k1792K0503K0697q859q693
770a500Q424l080j7769M744K5371J339k2784m434J6328k771j5666J2705K5393
783B6300j4324l6179L752L8166O760k8384q335J8038J89j7381P210K3259m642
796A4429k6081l172J7603M294o232P062K940k1476j2621K6003K4050j8541k6852
809a8594J0940J9049j2907j4251K1452J9936k4860l0438J5352L3286k520k2964
$$ plain form
718 -8255 3033 15179 -3174 -24993 -9418 16775 10601 -10225 -6265 5141 -6709 -17152 4553
731 4553 23917 3058 -24630 -13807 11490 8733 -4526 1476 6583 -9414 -17278 3911 19347
744 19347 3270 -11915 -2809 2896 -8607 -3920 19806 16511 -18330 -25788 9018 26106 239
757 239 -15254 4883 12605 -11885 -16508 15580 28369 -3356 -25148 -4645 16052 7193 -1500
770 -1500 6924 3844 -13925 -9181 16190 17529 -5255 -9689 6639 3868 -11798 907 26300
783 26300 11976 -24203 -20451 17715 24475 -3909 -12244 5794 5983 -11398 -4188 19071 14429
796 14429 -11652 -14824 2779 7073 841 7903 10843 -10633 -23254 2749 26799 8258 -18594
809 -18594 -7654 11395 -1512 -15763 5689 25625 765 -29673 -14321 18965 16445 -6519
821f519j835Q433o025l370J6536Q388j8375j3214J1063Q610p771K885J5679q855
835E630k9996K002L7431J0114l1008j6161K1241R585j8214k059K5558K971l2144
848a5050j1954K7319J8849j4596j2657O203j027j0110R397K0398n130k5306k556
861a6220J8713K891r110P288J0407j7284k2351J6497L1777m722k9137k503J7555
874C801k359j1218J3683J7852j7192k7836Q951K8344J244j7109j79O805j1459
887f672p273K0569J7601j7806k3968Q189J8029l752p035J1822L240k3250j1042
900b1348K5510K1158j6321k1422O662J1847q574k148J7833M744k4538j4708J9202
913b103J9534p906j1231L266j724j1736N406K3152K687k5415j0902J5872R570
$$ plain form
821 -6519 -8354 79 -5946 -9316 7220 15608 -2767 -15981 -4918 3692 -4079 -1194 14485 5630
835 5630 -24366 -22364 15067 25181 -5827 -21988 -747 8838 -9376 -11435 14123 17094 -15050
848 -15050 -27004 315 19164 4568 -8089 -1886 -2913 -13023 -3626 16772 11642 -13664 -16220
861 -16220 2493 5384 -3726 3562 13969 -3315 -25666 -9169 22608 17886 -11251 -13754 3801
874 3801 1442 -9776 3907 21759 4567 -23269 -14318 14026 15270 -1839 -2018 4787 -6672
887 -6672 -13945 6624 24225 6419 -17549 -9360 8669 4917 -2118 9704 12944 -10306 -21348
900 -21348 4162 25320 8999 -12423 -5761 6086 -2488 -4636 13197 17941 -6597 -21305 -2103
913 -2103 17431 9525 -1706 1560 -164 -11900 -6494 16658 19345 -6070 -16972 -1100 8470
926H470r151J652J3187q876k4497K307L0662R049k3990j3955J1837O905q245L373
940a272J5020m224k3179m117J9257J0619p582n452L39q192m641J5326J5690j1156
954F436k0884K662J5110j625p293R990Q523j8428j8744J6009K7227m995k4689
967a0701l099J3867P21o962Q253J0438j2191j8219O306J8734K232r121j770q52
981b364q656J055J8376Q584j8304j5182J0007J2051n180l581J1510O28k0738p421
995a9215K2327J7462j4302j8326M892R858m056j410J2011K319j7720r478J4056
1008a582J3294n784o440K617l355r621O396J9861Q7k1865q039J5354Q140q633
1022D30p24J1221m876j9737J090K3927Q238j8475j1774Q739O062n189K873J0640
$$ plain form
926 8470 -681 971 14158 5282 -19215 -16908 13754 22803 -1187 -15142 -3305 3600 -4645 -1272
940 -1272 13748 9524 -13655 -17772 1485 12104 4522 -930 -591 -8783 -13424 1902 17592 6436
954 6436 -14448 -11786 3324 1699 -5594 4396 12919 -5509 -24253 -8244 18983 13988 -10701
967 -10701 -13800 67 788 -6174 2079 12517 326 -17893 -11587 7147 9379 258 -1512 -2364
981 -2364 -11020 -9965 8411 16995 -1309 -16491 -6484 5567 387 -3194 8316 8944 -11794 -19215
995 -19215 3112 20574 6272 -12054 -7162 2696 -1360 -2770 9241 11560 -6160 -15638 -1582
1008 -1582 11712 5928 -512 2105 -1250 -10871 -4475 15386 15473 -6392 -14431 923 9063 430
1022 430 -294 10927 6051 -13686 -12596 11331 19569 1094 -10680 -1941 4121 -1068 1805 12445
1036A2445n832j7049J29J5832N194q227j573K556q407o754J4703J6504j1492k1905
1050a3876L438J7570n65j0669N806J0221j2364j7340J0535K3082j762k0177m783
1063a0884J0320J522l525O376O498j1402j2833P287J3690j324p143K949p99j1746
1077a1014m5J9457Q424j8837j5578J2152J3173p587o320J1043M358j8312r577
1090a8663J8540J6703j1270j5950K592Q094l111J79R951K60j5424o053J3236Q610
1104G694o360l179M965m808j2349O822K1090j54k2125o907J5361P135r617p5J1157
1119H650m338j7730Q15K0768O490j4431q603O207J734l739O735J0066q410j6355
1133a2141L725J5005O24q596L388N422j1590j0416J5092J9174r809k2164J795
$$ plain form
1036 12445 6613 -10436 -10307 5525 10719 2492 919 3475 -4932 -11686 3017 19521 8029 -13876
1050 -13876 -10438 7132 6567 -4102 1704 11925 -439 -17779 -7244 15838 14076 -6101 -10884
1063 -10884 -564 958 -2567 3809 10307 -1095 -13928 -6641 7049 5725 -1418 1531 732 -11014
1077 -11014 -11059 8398 16822 -2015 -17593 -5441 7732 145 -6175 4868 9226 -9086 -18663
1090 -18663 -123 16580 5310 -10640 -8048 46 -3065 -2886 7065 7325 -8099 -14152 -916 7694
1104 7694 1334 -1845 3120 -1688 -14037 -7215 13875 13721 -8404 -15311 50 7185 -2432 -2507 8650
1119 8650 4312 -13418 -12603 8165 14655 224 -8379 -2172 -438 -4177 2558 12624 4214 -12141
1133 -12141 -8416 6589 7213 -1383 2005 7427 -4163 -14579 513 19687 9878 -12286 -10491
1146a0491J7047M03r845M490R366r572j4395P441J7812n39j3332k351L571k310
1160b705R69J1343K723j6149q993J2861J0193q655n101J0436P15j7862m105K2968
1174H638J2449j9311j7797J0675J4465n924p732Q897M336j3906q027J3510J1351
1187A1624o669q642J678r36m154P542J2809o517j9059M96J7025K819j2840J242
1201c582J1997o657j7742N611K3513J235k1986p447J4194O259p700R12P843n375
1215A075j3239L683J4969P30j0221p87M614o439m287J3756J0918j4248j7231P726
1229h981J7585k940j1164M499O973j0127r693J2602J5562p828j6670J898J0254
1242A970r47k892P075J735j3373o529J3565J0643p949q639N211K740q891J79J6005
$$ plain form
1146 -10491 6556 6959 -2886 1604 10970 1398 -12997 -5556 12256 11717 -1615 -3966 -395 -2705
1160 -2705 -1736 9607 12330 -3819 -12812 49 10242 1587 -3514 6922 7637 -10225 -14330 8638
1174 8638 21087 1776 -16021 -5346 9119 3195 -4537 4360 8696 -5210 -13237 273 11624
1187 11624 4955 -3687 -2009 -2945 -7099 443 13252 6735 -12324 -11828 5197 8016 -4824 -3582
1201 -3582 8415 1758 -15984 -10373 13140 14375 -7611 -15058 -864 5395 -2305 -1393 6450 1075
1215 1075 -12164 -8481 6488 7218 -3003 -3790 824 -5615 -9902 3854 14772 524 -16707 -8981
1229 -8981 8604 5664 -5500 -1001 5972 -4155 -13848 -1246 14316 6488 -10182 -8284 1970
1242 1970 1023 -1869 5206 6941 -6432 -12961 604 11247 3298 -5341 -130 2610 -6281 -6102 9903
1257I903L594j7684j0158J3225J1012p062n314O466J10j1751o78J6813N848j4524
1271b00r277Q517N712n253O91R155l468j4682n10J5506N458r928n039M730j776
1286c64n418P109J2166o704j6077J164J3650J181q411K510P343q146j2686Q950
1300c733J8083k959j8258l126J1877K772o432K837O271o373j0793M336J1540P54
1314F796o858q99kn817Q60J3605M804j5462j1067J0587J1410o422p302Q129N061
1329G423j2949q928J3604J4688p860j5462K97R456J007k038L304L69q869k614
1343h572Q878M537n419j397M677m064r969O090J7179p25k0234o454J5733R556
1357I816r961o118Q389K726j1396l872J2944Q100q397r628J739M454J410L864
$$ plain form
1257 9903 13497 -4187 -14345 -1120 9892 2830 -2484 3982 4092 -7659 -8337 8476 14324 -200
1271 -200 -9477 -960 4752 -501 190 9345 5877 -8805 -9315 6191 11649 1721 -3318 1412 -364
1286 -364 -5782 1327 13493 6789 -9288 -8124 5526 6707 -1704 806 8149 3 -12683 -3733
1300 -3733 14350 11391 -6867 -9993 1884 4656 -1776 1061 7332 959 -9834 -5498 6042 6796
1314 6796 -62 -961 -963 -6780 -5920 7685 12489 -2973 -14040 -3453 7957 1535 -5767 2362 7423
1329 7423 -5526 -14454 -850 13838 5978 -9484 -9187 269 1276 -762 2542 2911 -5958 -8572
1343 -8572 306 4843 -576 -1973 2704 -1360 -11329 -5239 11940 11215 -9019 -15473 260 9816
1357 9816 -145 -6263 2126 4852 -6544 -10416 2528 10628 2231 -7397 -5658 -1204 206 4070
1371D070K666p903r303N941J1933k254r435K929P358o966j0248R031J6958n198
1385I579j9578k287J6482N776q934m085O113p03p609J476J0094J187p619l199
1399c307K126n21J710P486R94j1870o971J0562J0370o207r317M924O323p963o287
1414g948J0786J0813r689j4139M345J2392k84o620J037K475o127l186Q469P029
1428I353o823p444L110L411l819Q83Q838p07j3053m337J2740P172q585n821O303
1443A221J334q495O2J2524K425j3126n972R092O120n561k279N901j793r326J116
1458f757J2151J841j0636l531O692R50n099L154Q131n289j1728K832J2616M07
1472E734r768M33O531l905q066P123J1608m919j3779Q23J1167J391p175J307N592
$$ plain form
1371 4070 6736 -1167 -10470 -4529 7404 5150 -4285 -1356 6002 -964 -11212 -2181 14777 9579
1385 9579 -9999 -12286 4196 9972 1038 -3047 3066 2363 -5246 -3770 6324 7511 -108 -3307
1399 -3307 -1181 -1702 8 7494 8488 -3382 -10353 209 10579 4372 -4945 -21 6302 -1661 -7948
1414 -7948 2838 13651 3962 -10177 -5832 6560 6276 -344 693 3168 -2959 -6145 2324 9353
1428 9353 2530 -4914 -1804 1607 -2212 -1329 7509 6802 -6251 -10588 2152 9324 739 -5082 1221
1443 1221 2555 -5940 -5878 6646 9071 -4055 -10027 -935 5185 -376 -2655 3246 1453 -7873 -6757
1458 -6757 5394 7235 -3401 -6932 -240 710 -4389 -1235 6896 1607 -10121 -7289 5327 5734
1472 5734 -4034 -3601 2930 -975 -9041 -1918 9690 4771 -9008 -8185 2982 4373 -2802 -1495 4097
1487D097m953p642N252J0189k619q588Q25M230l139j161Q359K990j1310p137R718
1502h89R355o744p005O293M779r161n687J1944R322j0195j1312M995J0322k424
1516C593m954L095K278o124l189P381M885n949l383L994k62n528L686R738k570
1531F691j3898j311J3901L726j0133l149Q706P25j0743q23J2872M488j1755p121
$$ plain form
1487 4097 -856 -8498 -3246 6943 4324 -4264 -3439 791 -2348 -3509 4850 7840 -3470 -10607 -889
1502 -889 8466 1722 -5283 1010 5789 -3372 -9059 2885 12207 2012 -9300 -4305 6017 3593
1516 3593 -1361 1734 4012 -2112 -5301 2080 6965 1016 -2367 1627 1365 -4163 -477 9261 6691
1531 6691 -7207 -8518 5383 9109 -1024 -4173 4533 5258 -5485 -6308 6564 11052 -703 -7824
$$ [...]
8191a93
##END NTUPLES=NMR FID
##END=
