##TITLE=1H_LacDMe-B3
 CDCl3, 8 sc, 
 14.11.2019
##JCAMPDX= 6.0         $$ Bruker NMR JCAMP-DX V2.0
##DATA TYPE= NMR FID
##DATA CLASS= NTUPLES
##ORIGIN= UXNMR, Bruker Analytische Messtechnik GmbH
##OWNER= root
$$ XWIN-NMR		Version 3.5
$$ Thu Nov 14 16:32:03 2019 Russian Standard Time (UT+4h)  she@DPX200
##.OBSERVE FREQUENCY= 200.1315
##.OBSERVE NUCLEUS= ^1H
##.DELAY= (6, 6)
##.ACQUISITION MODE= SIMULTANEOUS
##.ACQUISITION SCHEME= undefined
##.AVERAGES= 8
##.DIGITISER RES= 18
##SPECTROMETER/DATA SYSTEM= spect
##.PULSE SEQUENCE= zg30
##.SOLVENT NAME= CDCl3
##.SHIFT REFERENCE= (INTERNAL, CDCl3, 0, 15.7039)
##AUDIT TRAIL= $$ (NUMBER, WHEN, WHO, WHERE, WHAT)
$$ ##TITLE= Audit trail, XWIN-NMR		Version 3.5
$$ ##JCAMPDX= 5.01
$$ ##ORIGIN= Bruker BioSpin GmbH
$$ ##OWNER= she
$$ F:/spectra/data/she/nmr/H-F/1/audita.txt
$$ ##AUDIT TRAIL=  $$ (NUMBER, WHEN, WHO, WHERE, WHAT)
(   1,<2019-11-14 16:31:09.46 +0400>,<she>,<DPX200>,
      <created by zg, POWCHK disabled, PULCHK disabled
       configuration hash MD5:
       00 E9 B6 7A A2 85 ED C7 34 08 36 98 17 FE 4E 26
       data hash MD5: 16K
       82 F1 83 05 9A C8 A8 56 DD DE B9 3B 6E 0A D5 32>)
$$ ##END=
$$ 
$$ hash MD5
$$ 13 AD 2D 61 7B 0B 09 5E AE F2 84 DB 23 B3 BB DC
##$RELAX= 
##$RELAX= 
##$RELAX= 
##$RELAX= 
##$RELAX= 
##$RELAX= 
$$ Bruker specific parameters
$$ --------------------------
##$DU= <F:/spectra>
##$EXPNO= 1
##$NAME= <H-F>
##$PROCNO= 1
##$TYPE= <nmr>
##$USER= <she>
##$AMP= (0..31)
100 100 100 100 100 100 100 100 100 100 100 100 100 100 100 100 100 100 
100 100 100 100 100 100 100 100 100 100 100 100 100 100 
##$AQSEQ= 0
##$AQ_mod= 1
##$AUNM= <au_zg>
##$AUTOPOS= <>
##$BF1= 200.13
##$BF2= 200.13
##$BF3= 200.13
##$BF4= 200.13
##$BF5= 200.13
##$BF6= 200.13
##$BF7= 200.13
##$BF8= 200.13
##$BYTORDA= 1
##$CFDGTYP= 0
##$CFRGTYP= 5
##$CHEMSTR= <none>
##$CNST= (0..31)
1 1 145 1 1 1 1 1 1 1 1 1 1 1 1 1 1 1 1 1 1 1 1 1 1 1 1 1 1 1 1 1 
##$CPDPRG= <>
##$CPDPRG1= <>
##$CPDPRG2= <>
##$CPDPRG3= <>
##$CPDPRG4= <mlev>
##$CPDPRG5= <mlev>
##$CPDPRG6= <mlev>
##$CPDPRG7= <mlev>
##$CPDPRG8= <mlev>
##$CPDPRGB= <>
##$CPDPRGT= <>
##$D= (0..31)
0 1.2 0 0 0 0 0 0 0 0.06 0 0.03 0 0 0 0 0.0002 0 0 0 0 0 0 0 0 0 0 0 0 
0 0 0 
##$DATE= 1573734668
##$DBL= (0..7)
120 120 120 120 120 120 120 120 
##$DBP= (0..7)
150 150 150 150 150 150 150 150 
##$DBP07= 0
##$DBPNAM0= <>
##$DBPNAM1= <>
##$DBPNAM2= <>
##$DBPNAM3= <>
##$DBPNAM4= <>
##$DBPNAM5= <>
##$DBPNAM6= <>
##$DBPNAM7= <>
##$DBPOAL= (0..7)
0.5 0.5 0.5 0.5 0.5 0.5 0.5 0.5 
##$DBPOFFS= (0..7)
0 0 0 0 0 0 0 0 
##$DE= 6
##$DECBNUC= <off>
##$DECIM= 24
##$DECNUC= <off>
##$DECSTAT= 4
##$DIGMOD= 1
##$DIGTYP= 9
##$DL= (0..7)
0 120 120 120 120 120 120 120 
##$DP= (0..7)
150 150 150 150 150 150 150 150 
##$DP07= 0
##$DPNAME0= <>
##$DPNAME1= <>
##$DPNAME2= <>
##$DPNAME3= <>
##$DPNAME4= <>
##$DPNAME5= <>
##$DPNAME6= <>
##$DPNAME7= <>
##$DPOAL= (0..7)
0.5 0.5 0.5 0.5 0.5 0.5 0.5 0.5 
##$DPOFFS= (0..7)
0 0 0 0 0 0 0 0 
##$DQDMODE= 0
##$DR= 18
##$DS= 0
##$DSLIST= <SSSSSSSSSSSSSSS>
$$ [...]
##$SUBNAM2= <"">
##$SUBNAM3= <"">
##$SUBNAM4= <"">
##$SUBNAM5= <"">
##$SUBNAM6= <"">
##$SUBNAM7= <"">
##$SUBNAM8= <"">
##$SUBNAM9= <"">
##$SW= 24.0689530833862
##$SWIBOX= (0..15)
0 0 2 0 0 0 0 0 0 0 0 0 0 0 0 0 
##$SW_h= 4816.95568400771
##$TD= 16384
##$TD0= 1
##$TE= 0
##$TE2= 300
##$TE3= 300
##$TEG= 300
##$TL= (0..7)
0 120 120 120 120 120 120 120 
##$TP= (0..7)
150 150 150 150 150 150 150 150 
##$TP07= 0
##$TPNAME0= <>
##$TPNAME1= <>
##$TPNAME2= <>
##$TPNAME3= <>
##$TPNAME4= <>
##$TPNAME5= <>
##$TPNAME6= <>
##$TPNAME7= <>
##$TPOAL= (0..7)
0.5 0.5 0.5 0.5 0.5 0.5 0.5 0.5 
##$TPOFFS= (0..7)
0 0 0 0 0 0 0 0 
##$TUNHIN= 0
##$TUNHOUT= 0
##$TUNXOUT= 0
##$USERA1= <user>
##$USERA2= <user>
##$USERA3= <user>
##$USERA4= <user>
##$USERA5= <user>
##$V9= 5
##$VALIST= <valist>
##$VCLIST= <CCCCCCCCCCCCCCC>
##$VD= 0
##$VDLIST= <DDDDDDDDDDDDDDD>
##$VPLIST= <PPPPPPPPPPPPPPP>
##$VTLIST= <TTTTTTTTTTTTTTT>
##$WBST= 1024
##$WBSW= 4
##$XGAIN= (0..3)
0 0 0 0 
##$XL= 0
##$YL= 0
##$YMAX_a= 445712
##$YMIN_a= -397251
##$ZGOPTNS= <>
##$ZL1= 120
##$ZL2= 120
##$ZL3= 120
##$ZL4= 120
##$ABSF1= 10
##$ABSF2= 0
##$ABSG= 5
##$ABSL= 3
##$ALPHA= 0
##$AQORDER= 0
##$ASSFAC= 0
##$ASSFACI= 0
##$ASSFACX= 0
##$ASSWID= 0
##$AUNMP= <proc_1d>
##$AZFE= 0.1
##$AZFW= 0.1
##$BCFW= 1
##$BC_mod= 2
##$BYTORDP= 1
##$COROFFS= 0
##$CY= 11.3945322036743
##$DATMOD= 1
##$DC= 2
##$DFILT= <>
##$DTYPP= 0
##$F1P= 16.9975609425685
##$F2P= -3.02152046262296
##$FCOR= 0.5
##$FTSIZE= 0
##$FT_mod= 4
##$GAMMA= 1
##$GB= 0.15
##$INTBC= 1
##$INTSCL= 1
##$ISEN= 128
##$LB= 0.24
##$LEV0= 0
##$LPBIN= 0
##$MAXI= 10000
##$MC2= 0
##$MEAN= 0
##$ME_mod= 0
##$MI= 1.114404
##$NCOEF= 0
##$NC_proc= 0
##$NLEV= 6
##$NOISF1= 3.799351
##$NOISF2= 2.8
##$NSP= 1
##$NTH_PI= 0
##$NZP= 0
##$OFFSET= 15.70392
##$PC= 1
##$PHC0= -9453.851
##$PHC1= 15.40088
##$PH_mod= 1
##$PKNL= yes
##$PPARMOD= 0
##$PSCAL= 0
##$PSIGN= 0
##$REVERSE= no
##$SF= 200.130013532006
##$SI= 16384
##$SIGF1= 3
##$SIGF2= 2
##$SINO= 400
##$SIOLD= 16384
##$SREGLST= <1H.CDCl3>
##$SSB= 0
##$STSI= 0
##$STSR= 0
##$SW_p= 3612.71676300578
##$SYMM= 0
##$S_DEV= 0
##$TDeff= 0
##$TDoff= 0
##$TI= <>
##$TILT= no
##$TM1= 0
##$TM2= 0
##$TOPLEV= 0
##$USERP1= <user>
##$USERP2= <user>
##$USERP3= <user>
##$USERP4= <user>
##$USERP5= <user>
##$WDW= 1
##$XDIM= 8192
##$YMAX_p= 0
##$YMIN_p= 0
$$ End of Bruker specific parameters
$$ ---------------------------------
##NTUPLES= NMR FID
##VAR_NAME=  TIME,          FID/REAL,        FID/IMAG
##SYMBOL=    X,             R,               I
##VAR_TYPE=  INDEPENDENT,   DEPENDENT,       DEPENDENT
##VAR_FORM=  AFFN,          ASDF,            ASDF
##VAR_DIM=   8192,          8192,            8192
##UNITS=     SECONDS,       ARBITRARY UNITS, ARBITRARY UNITS
##FACTOR=    0.0002076,     1,               1
##FIRST=     0,             0,               0
##LAST=      1.7004516,     0,               0
##MIN=       0,             -397251,         0
##MAX=       1.7004516,     445712,          0
$$ Real data points
##PAGE= N=1
##DATA TABLE= (X++(R..R)), XYDATA
$$ [...]
$$ plain form
2683 -157 41 1196 101 -2146 -479 1789 1015 -892 -497 704 -616 -1096 1765 2549 -1014 -2687
2699 -2687 341 2373 829 -494 766 412 -774 -475 2187 2056 -929 -1233 655 620 148 632 1663
2716 1663 -191 -1776 108 2167 1069 -1014 -307 551 -616 -390 1991 1328 -1396 -1993 579 1990
2732 1990 303 -843 8 67 -485 -198 1489 491 -1070 -672 221 306 -51 524 292 -1323 -1645 501
2750 501 1568 36 -1525 -605 278 -117 -76 789 464 -1339 -1302 452 643 -370 -790 -247 -310 -612 187
2769 187 395 32 -752 -652 1 -377 -88 312 -78 -1155 -849 511 503 -509 -758 -5 164 -208 -475 -157
2789 -157 231 40 -116 -195 -200 -157 523 496 -142 -258 -148 -157 8 268 675 -257 -750 -467 149 658 562 46 -445
2812 -445 -638 -319 640 1455 815 -536 -1342 -661 839 1790 659 -702 -896 -419 857 1343 1539 82
$$ packed form
2683a57J98J155j095k247J667K268p74j907L95J201j320m80K861P84l563j673
2699b687L028K032j544j323J260l54j186K99K662j31k985l04J888l5m72M84J031
2716A663j854j585J884K059j098k083P07Q58j167K26K381o63k724n97K572J411
2732A990j687j146Q51N9n52K87J687r98j561L98Q93Q5l57N75k32j615l22K146
2750E01J067j532j561R20Q83l95M1Q65l25j803L7J754J91j013m20N43o3l02P99
2769A87K08l63p84J00O53l78K89M00l90j077L06J360qj012k49P53J69l72k67L18
2789a57L88j91j56p9nM3O80k7o38j16J10rJ65K60M07r32m93K83O16N09r6n16m91
2812d45j93L19R59Q15o40j351q06O81J500R51j131j361j94M77J276M86J96j457
$$ plain form
2830 82 -691 -1048 126 1042 1666 714 -795 -1669 -459 1594 2076 670 -712 -995 -381 561 1343 1551
2848 1551 -119 -1690 -1213 1049 1701 893 -464 -721 -556 -290 858 1742 969 -1515 -1432 -186 628 808
2866 808 540 -191 -1552 -1213 1165 1202 -600 -973 -112 -23 -717 -76 1175 550 -1145 -1347 483 323 -624
2885 -624 -401 584 -456 -1379 -210 906 -15 -1295 -193 260 -868 -961 475 565 -1285 -997 787 -69
2903 -69 -1018 -829 1236 533 -1642 -1112 821 534 -999 -249 589 -434 -1469 -181 1490 76 -1229
2920 -1229 -123 566 -696 -621 1719 1067 -1579 -1684 832 1528 -353 -390 509 -94 -1489 74 2225
2937 2225 912 -2125 -894 1568 921 -709 555 1140 -858 -1444 790 2419 101 -753 530 472
2953 472 -549 81 2124 1032 -2254 -1043 1891 1636 -849 -475 1166 -230 -1471 900 2316 207
$$ packed form
2830H2p73l57J174R16O24r52j509q74J210K053M82j406j382k83O14R42P82K08
2848A551j670j571M77K262O52q08j357k57J65K66J148Q84p73k484Q3J246Q14J80
2866H08k68p31j361L39K378L7j802l73Q61Q9o94O41J251o25j695k02J830j60r47
2885f24K23R85j040r23J169J116r21j280J102M53j128r3J436R0j850K88J784q56
2903f9r49J89K065p03k175N30J933k87j533P50Q38j023j035J288J671j414j305
2920a229J106O89j262P5K340o52k646j05K516O96j881l7Q99o03j395J563K151
2937B225j313l037J231K462o47j630J264N85j998n86K234J629k318q54J283n8
2953D72j021O30K043j092l286J211K934k55k485L74J641j396j241K371J416k109
$$ plain form
2969 207 -2130 -76 1746 40 -577 937 641 -1522 -1267 2088 1786 -817 -1165 791 157 -1314 912
2986 912 2397 -615 -2718 -107 2490 644 -1726 99 1229 -653 -1564 1129 1661 -1087 -2043 372
3002 372 1217 -659 -411 1212 115 -2013 -183 2131 455 -2408 -737 1557 -327 -1711 706 2061
3018 2061 -1066 -2675 584 2234 -712 -2307 797 1281 -1243 -1751 1319 1353 -1440 -1078 1424 26
3034 26 -1768 -57 1692 75 -2377 95 2132 -807 -2171 899 2562 -695 -2384 575 1827
3049 1827 -816 -1488 1455 1196 -2475 -1527 2323 1760 -1554 -1252 1355 88 -1676 516 2807 -246
3065 -246 -2545 260 2443 89 -1190 1361 1508 -1945 -1863 2392 2684 -1454 -2273 1230 1564 -745 -437
3082 -437 2126 291 -2517 -563 2799 1283 -1888 -232 1354 -547 -1537 1597 2790 -1326 -3020
$$ packed form
2969B07k337K054J822j706o17J514k96k163K55L355l02k603l48J956o34j471K226
2986I12J485l012k103K611K597j846k370J825J130j882r11K693N32k748r56K415
3002C72Q45j876K48J623j097k128J830K314j676k863J671K294j884j384K417J355
3018B061l127j609L259J650k946j595L104M84k524n08L070L4k793L62K502j398
3034B6j794J711J749j617k452K472K037k939j364L070J663l257j689K959J252
3049A827k643o72K943k59l671R48L850n63l314L02K607j267j764K192K291l053
3065b46k299K805K183k354j279K551J47l453Q2M255K92m138q19L503L34k309L08
3082d37K563j835k808J954L362j516l171J656J586j901r90L134J193m116j694
$$ plain form
3097 -3020 827 2339 86 -733 1582 610 -2595 -1433 3160 2271 -2029 -1736 1507 525 -1227 329
3113 329 2470 -594 -2449 71 2232 -188 -1674 1131 1129 -1883 -2027 2362 1821 -2056 -1920 1901 1271
3130 1271 -1757 -1227 1886 233 -2570 -392 1871 -57 -2896 -251 2164 -264 -2199 354 1150
3145 1150 -1558 -1947 1369 1639 -1891 -1815 1269 594 -1784 -885 2351 450 -3040 -676 2167 171
3161 171 -2524 -220 2191 -172 -2168 338 1904 -1042 -1725 1604 1810 -1644 -2169 1446 1690 -1309
3177 -1309 -878 1869 450 -2917 -703 2833 1117 -2308 44 1971 -710 -2322 1173 3382 -755
3192 -755 -3167 441 2707 261 -1367 1300 1633 -1632 -997 2238 1795 -1463 -658 2213 573 -1876
3208 -1876 219 2404 -300 -2646 522 3285 -176 -2494 185 2046 -651 -1283 1712 1760 -1943 -2343
$$ packed form
3097c020L847J512k253q19K315r72l205J162M593q89m300K93L243r82j752J556
3113C29K141l064j855K520K161k420j486K805kl012j44M389n41l877J36L821o30
3130A271l028N30L113j653k803K178K263j928k839K645K415k428j935K553P96
3145A150k708l89L316K70l530P6L084o75k378Q99L236j901l490K364K843j996
3161A71k695K304K411k363j996K506J566k946o83L329K06l454n25L615K44k999
3177a309M31K747j419l367K214L536j716l425K352J927k681j612L495K209m137
3192g55k412L608K266k446j628K667L33l265O35L235m43l258Q05K871j640k449
3208a876K095K185k704k346L168K763l461k318K679J861k697o32K995M8l703m00
$$ plain form
3224 -2343 1822 2399 -725 -1260 1032 240 -2098 433 3098 390 -2597 -543 2012 79 -1430 1255
3240 1255 2437 -1938 -3346 1069 2989 -670 -2089 645 1127 -1755 -1222 2026 1166 -2279 -1182 1605
3256 1605 815 -1984 -415 1811 -568 -2219 369 2176 -876 -2646 347 1793 -1272 -1899 1010
3271 1010 1323 -1894 -1391 1881 1270 -2200 -1484 1525 838 -1564 -576 1470 -143 -2136 341 1828
3287 1828 -627 -2130 764 1839 -1204 -1955 1078 1271 -1503 -1372 2062 1336 -1856 -1455 1711 1093
3303 1093 -1186 -233 1418 -342 -2548 186 2696 608 -1904 -361 1179 -419 -1096 1658 1598 -2000
3319 -2000 -2127 1629 1980 -1180 -535 1593 511 -2350 -420 2883 1449 -1772 -707 1542 576 -1035
3335 -1035 537 2018 -815 -1988 1033 2609 -405 -1385 829 1147 -1099 -552 1691 810 -1996 -1094
$$ packed form
3224b343M165N77l124n35K292p92k338K531K665k708k987K054K555j933j509K685
3240A255J182m375j408M415J920l659j419K734M82k882N33L248q60l445J097K787
3256A605p90k799J569K226k379j651K588J807l052j770K993J446l065o27K909
3271A010L13l217N03L272o11l470P16L009o87k402R88K046j613j993K477J487
3287A828k455j503K894J075l043p51L033J93k774J31L434p26l192M01L166o18
3303A093k279R53J651j760k206K734K510k088k512J543J540j598o77K754o0l598
3319b000j27L756L51l160O45K128j082k861J930L303j434l221J065K249r66j611
3335a035J572J481k833j173L021J576l014r80K214L18k246N47K243q81k806R02
$$ plain form
3351 -1094 1889 1079 -1451 -312 1844 -166 -1720 402 2257 -388 -2279 -38 1815 -67 -1529
3366 -1529 443 767 -1192 -1137 1253 1129 -1736 -1208 1244 670 -1589 -677 1473 3 -2130 -439 1959
3383 1959 197 -2115 -299 909 -408 -1473 361 1282 -1150 -1834 1012 1427 -679 -1062 473 147
3399 147 -1057 -422 1406 134 -1590 -498 1199 252 -1406 321 1124 -583 -1799 691 1958 -562
3415 -562 -1543 156 756 -706 -867 770 607 -1160 -713 1170 745 -1077 -471 936 300 -752 206
3432 206 992 -484 -979 452 1615 -500 -1237 755 1333 -149 -714 1051 983 -1049 -809 1271 1387
3449 1387 -263 -514 755 202 -354 737 1572 -397 -1434 -40 1763 339 -731 674 678 -894 -794
3466 -794 1359 1367 -637 -1531 612 1063 -167 246 791 -108 -1205 -96 1609 751 -660 -350 84 -301
$$ packed form
3351a094K983q10k530J139K156k010j554K122J855k645j891K241J853j882j462
3366a529J972L24j959N5K390j24k865N28K452n74k259R12K150j470k133J691K398
3383A959j762k312J816J208j317j065J834R21k432o84K846M15k106l83J535l26
3399A47j204O35J828j272j724J092J697r47j658J727Q03j707j216K490J267k520
3415e62r81J699O00j462j61J637j63j767M47J883m25j822O06J407o36j052R58
3432B06P86j476m95J431J163k115p37J992N78j482n65J765o8k032K40K080J16
3449A387j650k51J269n53n56J091Q35j969j037J394J803j424j070J405Mj572J00
3466g94K153Qk004q94K143M51j230M13N45q99j097J109J705q58j411L10M34l85
$$ plain form
3484 -301 -150 1106 1073 -808 -1000 262 1178 -136 -581 510 151 -1057 -1010 959 648 -787 -1072 -305
3502 -305 372 59 -207 257 -567 -1362 -45 761 0 -799 -196 274 -547 -510 401 -25 -972 -966 344 217
3522 217 -670 -579 313 230 -525 -597 108 441 -566 -234 563 6 -412 -456 21 33 -65 331 -38 -872 -434 81
3544 81 615 -149 -428 104 337 -23 286 358 191 -644 -353 429 786 314 55 107 -424 58 392 624 442
3565 442 -353 -315 -275 456 865 197 -490 -412 241 595 461 256 33 -62 31 272 306 457 133 -345 -223 207
3587 207 1056 317 -352 -722 -179 491 803 376 45 -240 -444 71 728 395 -190 -382 -15 135 328 152
3607 152 -88 -494 -159 167 507 13 -44 116 -372 -496 285 544 426 -1037 -692 454 353 -96 -616 -85
3627 -85 -268 -93 214 185 46 -518 -366 -4 5 98 115 17 -622 -456 373 -59 -371 -391 35 -252 -434 56 299
$$ packed form
3484c01J51J256l3j881j92J262R16j314m45J091l59j208M7J969l11j435k85P67
3502c05O77l13k66M64q24p95J317Q06p61p99O03M70q21L7R11m26r47OJ310j27
3522B17q87R1Q92q3p55p2P05L33j007L32P97n57m18m4M77J2r8L96l69q34M38N15
3544H1N34p64k79N32K33l60L09P2j67q35K91P82L57m72k59N2n31M82L34K32j82
3565D42p95L8M0P31M09o68o87P8O53L54j34k05k23r5R3K41L4J51l24m78J22M30
3587B07Q49p39o69l70N43O70L12m27l31k85k04N15O57l33n85j92L67J50J93j76
3607A52k40m06L35L26L40m94n7J60m88j24P81K59j18j463L45J146j01m49n20N31
3627h5j83J75L07k9j39n64J52L62RR3J7r8o39J66Q29m32l12k0M26k87j82M90K43
$$ plain form
3650 299 -431 -996 -634 645 240 -831 -192 368 -104 170 269 190 -502 -141 643 310 -412 53 515 45
3670 45 -607 211 979 -186 -916 -92 827 50 -482 33 562 -209 -551 478 699 -113 -734 293 1180
3689 1180 95 -64 460 191 -637 364 1179 284 -735 -165 663 607 -273 537 1089 -281 -1338 683
3707 683 1363 326 -690 -367 302 -340 131 963 980 -954 -412 517 732 -399 -47 427 -236 -730 555
3726 555 1374 118 -1332 -28 749 -114 -507 673 885 -895 -1013 692 1036 -363 -973 174 324
3743 324 -623 106 792 -588 -1319 -270 1111 434 -1049 -34 633 -617 -992 701 1117 -493 -1511
3760 -1511 -71 821 -628 -832 558 235 -908 -934 1178 411 -1620 -868 1038 409 -992 -284 791
3777 791 -527 -1111 332 830 -455 -1120 403 737 -708 -728 1013 879 -1245 -992 909 771 -879
$$ packed form
3650B99p30n65L62J279m05j071O39N60m72K74R9p9o92L61P84l33p22M65M62m70
3670D5o52Q18P68j165p30Q24R19p77n32N15N29p71l42J029K21q12o21J027Q87
3689A180j085j59N24k69q28J001Q15q95j019N70Q28n6q80Q10N52j370j057K021
3707F83O80j037j016L23O69o42M71Q32J7j934N42R29K15j131L52M74o63m94J285
3726E55Q19j256j450J304P77q63l93J180K12j780j18J705L44j399o10J147J50
3743C24r47P29O86j380p31J049J381o77j483J015O67j250l75J693M16j610j018
3760a511J440Q92j449k04J390l23j143k6K112p67k031P52J906o29j401P08J075
3777G91j318n84J443M98j285o65J523L34j445k0J741j34k124K53J901j38j650
$$ plain form
3794 -879 -747 673 -139 -772 472 1467 -190 -1300 -69 1464 44 -1029 411 756 -785 -715 1426
3811 1426 1155 -665 -636 1402 964 -592 -367 1458 122 -1564 -29 1773 383 -1368 -286 1070
3827 1070 111 -759 794 858 -877 -941 1152 1337 -775 -1088 732 661 -814 -40 1665 581 -1754 -393
3845 -393 1774 669 -823 -325 927 -388 -927 599 1475 -420 -1577 -64 1139 -155 -752 654
3861 654 499 -1252 -674 1652 657 -1780 -1178 1206 465 -1188 68 1213 -468 -1805 -142 1944
3877 1944 190 -1572 -19 756 -636 -1094 1406 968 -1435 -1620 889 1092 -958 -636 1132 -11
3893 -11 -1866 -248 1850 -16 -1826 -44 1048 -83 -1324 583 1245 -674 -1506 549 1531 -558
3909 -558 -1030 593 778 -1014 -401 1256 308 -1393 -252 1774 364 -1615 -270 1724 43 -1140
$$ packed form
3794h79J32J420q12o33J244R95j657j110J231J533j420j073J440L45j541P0K141
3811A426k71j820K9K038m38j556K25J825j336j686J535J802j390j751J082J356
3827A070r59q70J553O4j735o4K093J85k112l13J820p1j475P74J705j084k335J361
3845c93K167j105j492M98J252j315n39J526Q76j895j157J513J203j294n97J406
3861F54j55j751N78K326r95k437O02K384p41j653J256J145j681j337J663K086
3877A944j754j762J553P75j392m58K500m38k403j85K509K03k050L22J768j143
3893a1j855J618K098j866j810J782J092j131j241J907O62j919q32K055R82k089
3909e58m72J623J85j792O13J657r48j701J141K026j410j979J345J994j681j183
$$ plain form
3925 -1140 674 1495 -695 -1710 735 1438 -270 -1063 720 1027 -959 -731 1727 1032 -1213 -592 1374
3942 1374 703 -876 137 1211 -84 -1341 748 1784 -645 -1631 830 1897 -442 -968 715 970
3958 970 -947 -1126 1290 1288 -908 -1148 935 528 -826 352 1294 -541 -2014 99 1792 207 -958
3975 -958 168 990 -825 -1208 1353 1615 -827 -1560 976 1244 -1172 -703 1080 900 -1351 -651 1415
3992 1415 164 -1402 -484 1388 50 -1294 203 1143 -888 -1720 974 1595 -964 -1630 694 1120
4008 1120 -930 -712 1154 374 -1718 -936 1412 710 -1383 -789 870 -608 -1744 326 1887 -601
4024 -601 -2041 128 1010 -533 -969 906 799 -1419 -1007 1472 880 -1384 -901 1171 726 -1304 -440
4041 -440 1116 -102 -1416 301 1598 -89 -1412 -270 937 -423 -740 1276 879 -1287 -1258 1326
$$ packed form
3925a140J814Q21k190j015K445P03j708p93J783L07j986K28K458o95k245O21J966
3942A374o71j579J013J074j295j257K089J036k429r86K461J067k339n26J683K55
3958I70j917j79K416kk196k40K083m07j354J178R42j835j473K113J693j585j165
3975i58J126Q22j815l83K561K62k442p33K536K68k416M69J783j80k251P00K066
3992A415j251j566R18J872j338j344J497R40k031q32K694O21k559o66K324M26
4008A120k050K18J866p80k092P82K348p02k093N94J659j478j136K070J561k488
4024f01j440K169Q82j543m36J875j07k218M12K479n92k264M83K072m45k030Q64
4041d40J556j218j314J717J297j687j323J142J207j360l17K016l97k166K9K584
$$ plain form
4057 1326 1359 -834 -1133 825 464 -1337 -24 1816 265 -1466 -356 1537 182 -1410 439 1682
4073 1682 -284 -1154 593 1306 -410 -701 817 1052 -580 -1037 1188 300 -1156 -36 1574 326
4089 326 -1716 -316 1414 562 -1062 105 1122 -896 -1253 879 1674 -388 -1297 375 777 -425
4105 -425 -659 1487 856 -1217 -929 1144 981 -924 -521 971 -225 -1286 295 1184 -543 -1647 56
4122 56 1680 -60 -948 280 755 -1082 -1040 962 1006 -856 -851 321 28 -888 -162 1210 -262 -1630
4140 -1630 -378 1584 584 -1435 -14 702 -774 -930 413 1264 -813 -1123 730 974 -716 -809 501
4157 501 510 -1199 -430 761 325 -1039 -165 942 142 -589 130 1126 -332 -1024 623 1406 -469 -932
4175 -932 420 1050 -438 -1014 909 758 -682 -324 1117 746 -767 -369 1058 380 -515 305 888 73
$$ packed form
4057A326L3k193k99J958l61j801J313J840j551j731J110J893j355j592J849J243
4073A682j966q70J747P13j716k91J518K35j632m57K225q88j456J120J610j248
4089C26k042J400J730q52j624J167J017k018l57K132P95k062r09J672M02j202
4105d25k34K146o31k073K88K073j63j905M03J492j196j061J581Q89j727j104J703
4122E6J624j740q88J228M75j837M2K002M4j862NJ172k93r16P26J372j472j368
4140a630J252J962j000k019J421P16j476j56J343Q51k077l10J853K44j690r3J310
4157E01Rj709P69J191m36j364Q74J107q00p31P19R96j458o92J647P83j875m63
4175i32J352O30j488n76J923j51j440L58J441l71j513L98J427o78q95Q20N83q15
$$ plain form
4193 73 -793 543 1148 -13 -549 404 595 -361 -539 1208 656 -999 -738 1237 1180 -368 -464 406 216
4212 216 -553 -198 697 -34 -1143 -96 464 -68 -402 621 511 -435 -532 640 886 -520 -794 551
4230 551 550 -407 -33 916 -116 -1167 -348 1160 403 -1071 -614 125 -272 -353 251 598 -475 -698 60
4249 60 220 -216 -348 126 -47 -750 -448 720 274 -972 -897 405 -167 -438 -36 495 -440 -1063 172
4268 172 839 235 -1041 -380 142 -334 -371 466 265 -881 -281 417 330 -369 -91 578 -246 -598 311 814
4288 814 -78 -1005 -527 764 622 -379 -9 682 145 -174 184 440 -119 -135 372 276 -183 -71 458 8
4308 8 -611 184 597 194 -334 -69 465 380 -63 313 639 -246 -208 389 662 275 -593 25 440 575 259
4329 259 320 -58 -216 66 150 143 225 -189 148 -283 -318 533 650 -106 -655 -269 562 354 -55 -151 -67 140 14
$$ packed form
4193G3q66J336O05j161n36R53J91r56j78J747n52j655K61J975n7j548r6Q70j90
4212B16p69L55Q95p31j109J047N60n32l34J023j10r46r7J172K46j406k74J345
4230E51jr57L74R49j032j051Q19J508p57j474M57P39l97q1O04L47j073k23P58
4249F0J60m36j32M74j73p03L02J168m46j246P5J302n72k71M02N31r35o23J235
4268A72O67o04j276O61N22m76l7Q37k01j146O00O98q7o99K78O69q24l52R09N03
4288H14q92r27M78J291j42j001L70O91n37l19L58K56n59j6N07r6m59J12N29m50
4308Ho19P95M13m03n28K65N34q5m43L76L26q85L8N97K73l87q68O18M15J35l16
4329B59O1l78j58K82Q4pQ2m14L37m31l5Q51J17p56n49L86Q31k08m09r6Q4K07j26
$$ plain form
4352 14 482 378 -182 -437 -242 400 318 222 23 -74 -160 179 371 -57 -190 -397 -18 37 35 484 322 -532 -443
4375 -443 136 383 -65 -218 -389 -149 40 250 -141 -349 -286 -294 -326 140 447 -130 -173 -185 -128 -12 -16 15 -344
4398 -344 -232 -139 163 419 -11 -174 -311 -275 -34 82 180 -329 -564 -178 487 -53 -108 -236 347 51 -161
4419 -161 244 335 102 -551 -102 8 199 189 -8 -36 -68 177 626 -59 -401 -132 131 215 -85 138 270 -130
4441 -130 -245 726 511 145 -366 257 378 -80 25 242 386 -305 9 534 479 27 -198 278 66 11 298
4462 298 369 -372 -478 485 652 0 -488 28 224 -446 -5 424 221 -515 -513 317 669 -135 -423 309 -188
4483 -188 -484 206 679 13 -808 -201 325 -162 86 378 -110 -1174 -624 914 710 -746 -739 103 204 -624
4503 -624 -36 567 -203 -1094 -720 497 282 -541 -172 131 -429 -95 15 779 -395 -1088 -169 398 -112
$$ packed form
4352A4M68j04n60k55J95O42q2r6j99r7q6L39J92m28j33k07L79N5kM49j62q54Q9
4375d43N79K47m48j53j71K40J89K10l91k08O3ql2M66L07n77m3j2N7J16mL1l59
4398c44J12R3L02K56m30j63j37L6K41J16R8n09k35L86O65n40n5j28N83k96k12
4419a61M05R1k33o53M49J10J91j0j97k8l2K45M49o85l42K69K63Q4l00K23J32m00
4441a30j15R71k15l66n11O23J21m58J05K17J44o91L14N25n5m52k25M76k12n5K87
4462B98P1p41j06R63J67o52m88N16J96o70M41M29k03p36KQ30L52q04k88P32m97
4483a88k96O90M73o66q21O07N26m87K48K92m88j064N50J538k04j456PQ42J01q28
4503f24N88O03p70q91L74J217k15q23L69L03n60L34J10P64j174o93R19N67n10
$$ plain form
4522 -112 -325 612 195 -799 -280 1003 444 -835 -707 396 225 -664 -129 530 13 -780 219 683 48
4541 48 -456 305 375 -531 -69 1180 303 -816 -513 953 440 -422 -455 821 419 -425 -209 1047 16
4560 16 -541 37 997 348 -735 160 415 120 -227 607 695 -392 -549 840 813 -518 -244 1065 430
4579 430 -955 65 1388 253 -1020 -392 1232 250 -455 475 612 -433 -1011 626 1028 -139 -737
4596 -737 414 186 -412 -135 750 277 -1072 -342 799 706 -814 -258 729 -484 -962 434 1275 -438
4614 -438 -1324 308 935 -205 -665 255 156 -1085 -517 708 854 -702 -709 630 -222 -1147 66 1115
4632 1115 -187 -1569 -281 1029 -109 -1073 99 736 -710 -791 429 876 -896 -1085 619 837 -1026
4649 -1026 -691 1089 268 -741 -138 1168 64 -812 -68 896 -269 -593 331 851 -868 -1104 907
$$ packed form
4522a12k13R37m17r94N19J283n59j279J28J103j71q89N35O59n17p93R99M64o35
4541D8n04P61P0r06M62J249q77j119L03J466n13q62l3J276m02q44K16J256j031
4560A6n57N78R60o49j083Q95K55k95l47Q34Q8j087j57J389k7j331K74J309o35
4579D30j385J020J323j135j273O28J624r82p05R30J37j045n78J637M02j167n98
4596g37J151k28n98K77Q85m73j349P30J141r3j520N56R87j213m78J396Q41j713
4614d38q86J632O27j140m60R20r9j241N68J225J46j556pJ339q52r25J213J049
4632A115j302j382J288J310j138r64J172O37j446q1J220M47j772j89J704K18j863
4649a026L35J780q21j009O03J306j104q76P44R64j165l24R24N20j719k36K011
$$ plain form
4666 907 1045 -454 -1137 751 896 -544 -385 808 466 -1061 -507 1197 281 -723 -47 1036 -329
4683 -329 -953 225 889 -169 -718 588 995 -524 -772 656 905 -634 -600 968 569 -1128 -561 1501
4701 1501 662 -1049 -150 735 89 -1073 116 961 -1 -1131 95 1094 -462 -602 731 757 -860
4718 -860 -1184 1359 1002 -711 -601 795 328 -1069 -162 988 72 -1417 19 1281 84 -1086 -344
4735 -344 956 -213 -773 901 696 -872 -938 652 965 -471 -553 883 66 -1443 -286 1469 655
4752 655 -1332 -837 943 136 -757 215 934 -612 -1646 117 1125 -365 -931 570 444 -878 -497
4769 -497 1201 371 -1147 -505 1154 596 -855 -231 1010 88 -1157 129 1285 -129 -1571 260
4785 260 1194 227 -853 443 649 -962 -1016 994 762 -1045 -912 607 534 -838 -193 1235 110 -1411
$$ packed form
4666I07J38j499o83J888J45j440J59J193l42j527N54J704r16j004O76J083j365
4683c29o24J178O64j058n49J306M07j519k48J428K49j539L4J568l99j697N67K062
4701A501q39j711Q99Q85o46j162J189Q45r62j130J226R99j556j40J333K6j617
4718h60l24K543l57j713J10J396m67j397R07J150r16j489J436J262j197j170P42
4735c44J300j169n60J674k05j568o6J590L13j436q2J436q17j509J157J755q14
4752F55j987M95J780q07q93R72P19j546j034J763J008j490n66J501j26j322L81
4769d97J698q30j518O42J659n58j451O24J241r22j245J286J156j414j442J831
4785B60R34r67j080J296K06j611n4K010k32j807J33J519p3j372O45J428j125j521
$$ plain form
4803 -1411 121 1334 362 -814 116 1228 -130 -929 596 1052 -311 -661 753 991 -786 -517 742
4820 742 831 -849 -117 1140 -27 -929 218 1308 207 -829 142 834 -79 -853 754 1411 -341
4837 -341 -1226 477 1076 -262 -911 655 155 -924 -478 1211 505 -1035 -498 731 217 -886 10
4854 10 812 -368 -1175 332 1086 -458 -1312 346 876 -454 -1015 921 515 -950 -1208 732 727 -602
4872 -602 -500 541 -175 -1150 443 1077 -310 -1397 -281 1020 -157 -802 406 538 -767 -1478 825
4889 825 1200 -579 -778 309 203 -631 -268 849 -37 -1262 -460 1069 488 -726 -193 465 -425 -571
4907 -571 441 1154 -610 -792 383 810 -422 -522 622 549 -877 -709 1101 666 -696 -290 863
4924 863 382 -455 194 1087 5 -751 352 1015 1 -690 491 763 -546 -635 598 787 -331 -462
$$ packed form
4803a411J532J213r72j176R30J112j358p99J525M56j363l50J414K38j777K69J259
4820G42Q9j680P32J257j167r02J147J090j101j036R71O92r13p74J607O57j752
4837c41q85J703N99j338o49J566n00j079M46J689p06j540N37J229n14j103Q96
4854A0Q02j180q07J507P54j544q54J658N30j330n61J936m06j465k58J940nj329
4872f02J02J041p16r75J593O34j387j087J116J301j177o45J208J32j305p11K303
4889H25L75j779j99J087j06q34L63J117q86j225Q02J529n81j214N33O58q90j46
4907e71J012P13j764j82J175M27j232j00J144p3j426J68J810m35j362M06J153
4924H63m81q37O49Q93j082p56J103O63j014o91J181K72j309q9J233J89j118j31
$$ plain form
4942 -462 595 379 -486 71 651 662 -601 17 745 209 -823 -164 871 42 -589 59 739 117 -446
4961 -446 738 592 -906 -630 676 710 -548 -336 769 80 -759 167 846 69 -633 -218 676 -31 -215
4980 -215 63 468 -346 -743 314 1062 -194 -549 -56 237 -488 -96 580 34 -957 -407 615 199 -558
4999 -558 -169 233 -295 -330 250 1010 -121 -968 -5 518 -51 -359 174 -20 -688 -560 836 347 -456 -564
5019 -564 305 40 -437 -60 462 -56 -690 127 631 38 -611 156 350 -215 -61 217 716 40 -909 321
5039 321 530 121 -19 109 187 -343 326 613 68 -447 129 308 -30 -417 79 438 -88 -665 124 717
5059 717 158 -403 161 549 48 -251 428 294 -357 -34 556 394 -256 -315 367 166 94 247 105 -501 -395
5080 -395 462 290 -24 -590 200 515 13 -21 64 172 -396 -350 35 67 -53 -153 -141 -315 -326 346 220 -318
$$ packed form
4942d62J057k16q65N57N80J1j263O18P28n36j032O59J035q29o31O48O80o22n63
4961d46J184j46j498K76J306L4j258K12J105o89q39R26O79p77p02M15Q94p07j84
4980b15K78M05q14l97J057P48j256l55M93K93p25L92O76n46r91N50J022m16p57
4999e58L89M02n28l5N80P60j131q47R63N23n69l08N33j94o68J28J396m89q03j08
5019e64Q69k65m77L77N22n18o34Q17N04n93o49P67J94n65J54K78M99o76r49J230
5039C21K09m09j40J28P8n30O69K87n45n15N76J79l38l87M96L59n26n77P89N93
5059G17n59n61N64L88n01k99O79j34o51L23N90j62o50n9O82k01p2J53j42o06J06
5080c95Q57j72l14n66P90L15n02l4Q5J08n68M6L85L2j20j00J2j74j1O72j26n38
$$ plain form
5102 -318 -284 -287 408 -66 -195 231 -85 -398 -207 132 236 -242 -491 37 -145 -42 7 74 -385 -296 -163 232
5124 232 432 -55 -563 -201 -189 210 209 205 -190 -594 228 305 189 113 -446 -318 -323 -70 183 208 -263 -193 -259 255
5148 255 205 99 -46 64 -95 -24 243 -151 40 -257 -265 99 285 172 -188 -145 -184 15 217 131 -14 25 -70
5171 -70 354 109 100 -80 -44 127 -20 248 49 116 -210 437 162 135 -291 464 -6 -46 -94 358 174 -7 100
5194 100 4 145 275 -9 3 14 37 501 390 128 -610 160 125 181 -143 261 296 -221 -236 286 391 -158 -132
5217 -132 41 119 99 373 75 -170 -504 88 26 30 -134 -189 187 -323 -47 142 137 -470 -258 -50 -12 -138 6
5240 6 196 -297 -503 -191 105 170 -439 -408 113 -33 -78 133 -146 -569 -200 545 -34 247 -225 97 75 -316
5262 -316 238 419 172 -503 -62 313 283 -20 213 360 -278 -554 455 483 123 -739 307 417 -139 -324
$$ packed form
5102c18L4lO95m74j29M26l16l13J91L39J04m78k49N28j82J03M9O7m59Q9J33L95
5124B32K00m87n08L62J2L99jml95m04Q22P7j16p6n59J28nK53K53K5m71P0o6N14
5148B55n0j06j45J10j59P1K67l94J91k97qL64J86j13l60M3l9J99K02q6j45L9r5
5171g0M24k45rj80L6J71j47K68j99O7l26O47k75k7m26P55m70m0m8M52j84j81J07
5194A00r6J41J30k84J2J1K3M64j11k62p38P70l5N6l24M04L5n17j5N22J05n49K6
5217a32J73P8k0K74k98k45l34N92o2Mj64n5L76n10K76J89no07K12K08L8j26J44
5240FJ90m93k06L12K96O5o09L1N21j46m5K11k79m23L69P45n79K81m72L22k2l91
5262c16N54J81k47o75M41L75l0l03K33J47o38k76J009K8l60q62J046J10n56j85
$$ plain form
5282 -324 328 -8 -555 -172 716 220 -470 -444 347 -59 -395 29 556 19 -545 31 787 38 -218 251
5302 251 433 -211 -149 123 414 -419 -443 321 234 -343 -168 557 94 -232 -131 635 -85 -312 -109 605 30
5323 30 -286 155 543 -43 -476 270 677 -440 -652 132 445 -186 -450 -21 23 -697 297 852 -242 -940
5343 -940 -329 384 -377 -327 -93 477 -196 -821 455 1103 -303 -598 92 224 -351 -202 686 82 -1015
5362 -1015 -576 299 607 -222 -268 206 -129 -889 -25 501 -320 -881 64 442 -310 -310 269 477 -1009 -667
5382 -667 431 575 -451 -365 83 -19 -480 38 723 -341 -738 -342 953 78 -702 206 449 -189 -331
5401 -331 577 551 -774 -973 606 880 -724 -310 687 308 -624 -332 988 374 -803 -202 562 89 -565
5420 -565 432 804 -293 -618 658 796 -653 -374 870 512 -468 -522 730 407 -675 -308 713 243
$$ packed form
5282c24O52l36n47L83Q88m96o90K6P91m06l36M24N27n37n64N76P56p49k56M69
5302B51J82o44O2K72K91q33k4P64q7n77J75P25m63l26J01P66p20k27K03P14n75
5323C0l16M41L88n86m33P46M07j117k12P84L13o31k64M29M4p20R94N55j094o98
5343i40O11P13p61N0K34N70o73o25J276O48j406k95O90J32n75J49Q88o04j097
5362a015M39Q75L08q29m6M74l35p60Q64N26q21n61R45L78p52%N79K08j486L42
5382f67J098J44j026Q6M48j02m61N18O85j064l97L96J295q75p80R08K43o38j42
5401c31R08k6j325j99J579K74j604M14R97l79r32K92J320o14j177O01P64m73o54
5420e65R97L72j097l25J276J38j449K79J244l58r80n4J252l23j082L67J021m70
$$ plain form
5438 243 -509 -132 598 60 -699 354 355 199 -1144 85 983 -4 -333 220 641 -653 -137 826 475
5457 475 -635 -539 560 367 -582 -317 805 152 -615 150 975 256 -954 -74 609 -122 -469 360 263
5476 263 -514 -457 544 408 -1080 -660 306 367 -814 -231 830 -90 -1396 -232 652 50 -695 -10 434
5495 434 -325 -787 294 729 -360 -968 15 569 -318 -563 525 365 -845 -140 794 541 -956 -543
5513 -543 545 170 -818 -59 710 -161 -598 339 1075 -2 -920 219 399 -343 -367 735 590 -645 -551
5532 -551 514 454 -493 -150 492 166 -1059 206 1078 -86 -829 172 592 -339 -614 549 669 -376
5550 -376 -800 521 895 -333 -512 544 373 -677 59 852 221 -596 -96 1073 74 -752 126 983
5568 983 84 -634 349 714 -559 -703 409 1121 -321 -645 446 659 -491 -468 756 245 -508 -288
$$ packed form
5438B43p52L77P30n38p59J053Jj56j343J229Q98r87l29N53M21j294N16R63l51
5457D75j110R6J099j93r49K65J122o53p67P65Q25p19j210Q80O83p31l47Q29r7
5476B63p77N7J001j36j488M20R66O1j181N83J061r20j306J164Q84o02p45O85M44
5495D34p59m62J081M35j089o08R83N54q87k45J088j60j210P05R34k53j497M13
5513e43J088l75r88P59P69q71m37R37P36j077r18J139J80p42k4J102j45j235R4
5532e51J065o0r47L43O42l26j225J265Q72j164p43J001M20r31k75J163J20j045
5550c76m24J321L74j228j79J056j71j050P36P93o31q17N00J169r99q26Q78Q57
5568I83q99p18R83L65j273j44J112P12j442l24J091K13j150K3J224n11p53K20
$$ plain form
5586 -288 836 269 -508 -70 384 40 -655 161 740 -311 -626 294 826 -349 -871 495 92 -693 -435
5605 -435 1009 477 -843 -568 645 -1 -608 -189 507 -325 -1106 -86 868 -88 -793 142 423 -593
5623 -593 -543 788 556 -893 -750 308 134 -623 -240 751 130 -900 -304 848 534 -760 -274 450
5641 450 -210 -678 174 578 -507 -602 458 684 -518 -546 540 533 -627 -190 770 264 -852 -227 781
5660 781 355 -608 66 873 82 -714 96 1019 -263 -681 503 623 -279 -321 302 302 -762 -349 826 695
5680 695 -827 -356 648 418 -656 -51 821 305 -555 167 910 -143 -931 119 789 197 -343 310
5698 310 512 -422 -354 524 740 -386 -357 275 135 -652 -161 911 -222 -782 -161 1220 274 -489 236
5717 236 469 -188 -640 537 524 -430 -492 466 451 -312 132 475 15 -690 -278 1064 202 -796 -108 328
$$ packed form
5586b88J124n67p77M38M54l44o95Q16N79j051l15R20N32j175n22J366m03p85K58
5605d35J444n32j320K75J213o46o07M19O96q32p81J020R54r56p05R35K81j016
5623e93N0J331k32j449J43J058j74p57L83R91o21j030N96J152l14j294M86P24
5641D50o60m68Q52M04j085r5J060K26j202k8J086pj160M37R60n06j116O25J008
5660G81m26r63O74Q07p91p96Q10R23j282m18J184J20r02m2O23%j064M13J175j31
5680F95j522M71J004k30j074O05Q72n16q60P22P43j053p88J050O70n92n40O53
5698C10K02r34O8Q78K16j126K9O32j40p87M91J072j133n60O21J381r46p63P25
5717B36K33o57m52J177j3r54o2R58j5p63M44L43m60p05M12J342q62r98O88M36
$$ plain form
5737 328 -72 -725 164 297 -788 -763 504 875 -352 -758 -73 52 -543 -251 475 -35 -493 -454 282 483
5757 483 -243 -255 524 -374 -593 272 468 -367 -512 32 313 -171 -261 121 270 -424 -371 425 336 -206 -446
5778 -446 184 -75 -275 -284 645 100 -711 -66 603 -85 -523 24 155 -591 -159 411 487 -331 -465 260 543
5799 543 -156 -310 467 7 -605 -22 614 344 -163 -204 711 -74 -205 308 338 43 -388 487 469 -250 -303
5820 -303 323 226 190 -168 269 94 -346 -50 501 370 -517 -138 306 -9 -213 -133 62 -199 -162 177 182 50
5842 50 -251 320 -137 -88 54 427 -152 -661 -443 220 596 -445 -151 240 130 -216 -101 727 81 -602
5862 -602 -263 197 -65 90 -98 88 -80 -171 279 160 -248 -211 -74 -114 -100 92 334 -77 -594 -82 636
5883 636 175 -139 -571 21 -38 22 123 337 -202 -16 -101 68 353 -86 -132 -338 -188 -133 355 170 -103 -304
$$ packed form
5737C28m00o53Q89J33j085K5J267L71j227m06O85J25n95K92P26n10m58L9P36K01
5757D83p26j2P79q98k19Q65J96q35j45N44K81m84r0L82J49o94N3P96q9n42k40
5778d46O30k59k00rR29n45q11O45O69o88m38N47J31p46M32N70P6q18j34P25K83
5799E43o99j54P77m60o12N83O36k70n07m1R15p85j31N13L0k95m31Q75j8p19n3
5820c03O26r7l6l58M37j75m40K96N51j31q87L79M44l15k04Q0J95k61L7L39Nj32
5842E0l01N71m57M9J42L73n79n09K18O63L76j041K94L91j10l46J15Q28o46o83
5862f02L39M60k62J55j88J86j68r1M50j19m08L7J37m0J4J92K42m11n17N12P18
5883F36m61l14m32N92n9O0J01K14n39J86q5J69K85m39m6k06J50N5M88j85k73k01
$$ plain form
5905 -304 68 10 -143 -184 264 -298 -247 213 368 -73 19 -275 -281 437 208 285 -63 -182 -126 176 245 -220 234
5928 234 305 -95 -20 232 289 -281 211 -58 184 -35 -19 -115 -119 -43 -126 -19 -136 200 -89 24 106 151 138 -116
5952 -116 -264 94 -81 -7 289 -123 18 132 23 305 89 -48 -73 -131 -20 193 -134 -53 32 -162 336 108
5974 108 -2 -241 30 -65 198 218 -99 -292 -181 -246 99 257 -203 -104 -120 -275 -151 160 21 -188 -166 -138
5996 -138 94 -150 -7 12 -328 -327 244 461 -1 -433 -87 87 -395 -109 187 163 -148 -401 -164 238 123
6017 123 -69 -286 -20 -479 -114 209 2 -125 -181 505 37 -62 -41 222 -69 -320 96 552 -315 -484 24
6038 24 184 235 -248 264 174 150 -74 129 339 198 -73 210 173 153 192 132 -294 -340 387 664 250 -491 171
6061 171 227 108 -142 70 -2 -187 -360 350 340 86 -145 21 24 -70 -84 387 -46 -535 118 270 -106 -59 290
$$ packed form
5905c04L72n8j53m1M48n62N1M60J55m41R2k94oP18k29P7l48j19N6L02O9m65M54
5928B34P1m00P5K52N7n70M92k69K42k19J6r6mP6q3J07j17L36k89J13Q2M5j3k54
5952a16j48L58j75P4K96m12J41J14j09K82k16j37k5n8J11K13l27Q1Q5j94M98k28
5974A08j10k39K71r5K63K0l17j93J11o5L45J58m60R9j6j55J24L11j39k09K2K8
5996a38K32k44J43J9l40JN71K17m62m32L46J74m82K86K96k4l11k53K37M02j15
6017A23j92k17K66m59L65L23k07j27n6O86m68r9K1K63k91k51M16M56q67j69N08
6038B4J60N1m83N12r0k4k24K03K10j41k71K83l7k0L9o0m26m6P27K77m14p41O62
6061A71N6j19k50K12p2j85j73P10j0k54k31J66Lr4j4M71m33m89O53J52l76M7L49
$$ plain form
6084 290 44 -275 -220 809 348 -357 -383 -136 227 321 44 358 113 -745 -241 342 73 -293 -241 -74 -268
6105 -268 -274 60 105 -122 -554 7 341 -90 -223 134 -135 -707 -76 485 567 -549 -472 392 176 -565 -128
6126 -128 382 -219 -453 -238 433 225 -412 -16 193 63 -121 155 258 -462 -214 382 512 -435 -621 113
6146 113 24 -326 -72 622 79 -825 -209 619 78 -548 9 325 -483 -320 616 343 -408 -220 405 541
6166 541 49 -281 511 404 -727 -149 787 457 -235 -185 689 544 -35 -38 530 -62 -408 147 413 -317 -507
6187 -507 361 602 -287 -236 400 333 -541 -514 671 274 -448 -196 552 257 -429 -116 1115 36 -702 -99
6207 -99 612 -152 -721 229 159 -212 -258 182 300 -580 -440 251 304 -554 -320 364 -239 -1128 57 1032 152
6228 152 -981 -69 519 -289 -550 179 654 -571 -878 352 821 -260 -668 396 -54 -557 -488 427 160
$$ packed form
6084B90k46l19N5J029m61p05k6K47L63R4k77L14k45q58N04N83k69l66N2J67j94
6105b68oL34M5k27m32N61L34m31j33L57k69n72O31N61Q2j116P7Q64k16p41M37
6126a28N10o01k34K15O71k08o37L96K09j30j84K76J03p20K48N96J30r47j86P34
6146A13q9l50K54O94n43r04O16Q28n41o26N57L16q08J63R36k73p51J88O25J36
6166E41m92l30P92j07j131N78R36l30o92N0Q74j45n79lN68n92l46N55K66p30j90
6187e07Q68K41q89N1O36o7q74K7J185l97p22K52P48k95o86L13J231j079p38O03
6207i9P11p64n69R50p0l71m6M40J18q80J40O91N3q58K34O84o03q89J185R75q80
6228A52j133R12N88q08k61P29M75j225l07J230M69j081m08J064m50n03O9R15k67
$$ plain form
6247 160 -781 -282 384 363 -693 25 467 -171 -869 277 935 -175 -739 -138 753 -347 -415 144 235 -536
6267 -536 -582 847 612 -630 -415 624 -202 -462 93 845 -34 -891 -74 785 -54 -517 194 386 -669
6286 -669 -393 577 625 -407 -491 485 380 -474 -215 543 359 -564 -97 491 -4 -591 -119 822 -227 -415
6306 -415 175 425 -412 -715 621 851 -273 -583 460 616 -147 -46 615 25 -724 -111 889 136 -323
6325 -323 -392 432 -180 -364 253 619 -581 -368 598 662 -269 -638 611 681 -409 -441 574 479 -903 -395
6345 -395 839 179 -458 -538 704 -245 -368 238 779 -185 -899 34 239 -261 -384 467 421 -589 -620 423
6365 423 568 -602 -389 406 122 -498 -195 525 188 -1080 12 568 -77 -703 -138 637 -378 -960 400
6384 400 402 -399 -410 426 650 -291 -422 374 386 -844 -363 844 110 -927 -322 416 172 -253 -112 907
$$ packed form
6247A60r41M99O66k1j056P18M42o38o98J146O58j110n64O01Q91j100o8N59R1p71
6267e36m6J429k35j242K15J039q26k60N55P52q79q57Q17Q59q39m63P11J92j055
6286f69K76R70M8j032q4R76j05q54K59P58j84r23M67N88m95n87M72R41j049j88
6306d15N90K50q37l03J336K30j124l10J043J56p63J01O61n90p49O13J000p53m59
6325c23o9Q24o12j84O17L66j200K13R66O4r31l69J249P0j090l2J015r5j382N08
6345c95J234o60o37q0J242r49j23O06N41r64p14R33K05n00j23Q51m6j010l1J043
6365D23J45j170K13P95k84o20L03P20l37j268J092N56o45o26N65P75j015n82J360
6384D00Kq01j1Q36K24r41j31P96J2j230M81J207p34j037O05P38k44m25J41J019
$$ plain form
6404 907 -545 -623 283 811 -165 -701 -40 317 -298 -456 351 320 -548 -297 544 243 -370 -220 904 -58
6424 -58 -379 -57 471 -9 -619 67 735 82 -286 30 523 -371 -177 342 -27 -675 -504 408 520 -364
6444 -364 -67 772 -151 -489 123 583 276 -813 -32 400 -201 -446 361 568 -205 -502 83 492 -437 -333
6464 -333 212 34 -260 47 274 45 -835 8 643 -108 -386 24 350 -211 -647 530 298 -467 -978 128
6484 128 204 -451 -648 110 275 -505 -19 680 372 -555 -35 167 -284 -286 -34 563 71 -824 -48 844 -159
6505 -159 -575 636 450 -535 -331 379 611 -589 -434 167 381 -254 -340 256 -141 -791 -170 675 -334
6524 -334 -437 186 489 168 -435 352 449 -247 -484 261 362 -376 -155 214 438 -237 160 490 269 -557
6544 -557 -154 604 333 -243 -3 105 167 27 216 483 -191 -274 223 453 -215 151 161 205 23 -195 368
$$ packed form
6404I07j452p8R06N28r76n36O61L57o15j58Q07l1q68K51Q41l01o13J50J124r62
6424e8l21L22N28m80o10O86O68o53l68L16M93q94J94N19l69o48J71R12J12q84
6444c64K97Q39r23l38O12M60l07j089P81M32o01k45Q07K07p73k97N85M09r29J04
6464c33N45j78k94L07K27k29q80Q43O35p51k78M10L26n61m36J177k32p65n11J106
6484A28P6o55j97P58J65p80M86O99l08r27N20K02m51kK52N97m92q95P76Q92j003
6505a59m16J211j86r85K04P10K32j200J55O01K14o35q6N96l97o50O21Q45j009
6524c34j03O23L03l21o03P87R7o96k37P45J01p38K21L69K24o75L97L30k21q26
6544e57M03P58k71n76K40J08O2j40J89K67o74q3M97K30o68L66J0M4j82k18N63
$$ plain form
6565 368 300 -223 -77 662 204 -58 10 458 -61 -560 -143 462 -35 -351 174 253 101 -81 548 -9 -129
6586 -129 -448 318 175 -223 -241 258 108 -436 -88 70 -18 -227 -114 518 60 -194 -123 224 -156 -21 503
6607 503 292 -355 -118 82 -55 -45 -200 212 -207 -449 17 268 84 -370 -157 -42 357 -28 -56 67 -274
6628 -274 -296 5 99 -82 -410 -28 98 111 151 157 -278 -229 -159 166 -116 -59 -111 -103 201 -152 355 368 -45 -435
6652 -435 -108 229 108 -328 170 -61 -488 99 184 287 -200 -202 217 -86 -1 150 135 -210 -117 -15 353 291
6674 291 -293 147 -181 71 -267 244 274 -132 179 36 145 -385 39 97 41 -84 327 199 191 8 -122 165
6696 165 51 -154 -260 -328 -114 133 -25 218 -140 -339 61 59 -181 -202 -5 -165 130 24 112 443 226 -35
6718 -35 16 164 34 376 -60 -247 135 37 200 184 -23 -43 -220 91 27 145 -25 -339 -244 -2 208 -20
$$ packed form
6565C68o8n23J46P39m58k62O8M48n19m99M17O05m97l16N25P9j52j82O29n57j20
6586a29l19P66j43l98j8M99j50n44L48J58q8k09J13O32m58k54P1L47l80J35N24
6607E03k11o47K37K00j37J0j55M12m19k42M66K51j84m54K13J15L99l85k8J23l41
6628b74k2L01R4j81l28L82J26J3M0Om35M9P0L25k82N7n2QL04l53N07J3m13l90
6652d35L27L37j21m36M98k31m27N87Q5J03m87kM19l03Q5J51j5l45R3J02L68o2
6674B91n84M40l28K52l38N11L0m06L11j43J09n30M24N8n6j25M11j28qj83j30K87
6696A65j14k05j06o8K14K47j58K43l58j99M00kk40k1J97j60K95j06Q8L31k17k61
6718c5N1J48j30L42m36j87L82r8J63j6k07k0j77L11o4J18j70l14R5K42K10k28
$$ plain form
6740 -20 203 -347 -258 15 167 119 -226 109 -187 -621 -2 129 -91 -113 -210 -76 30 128 -181 -283 127 -34
6762 -34 -52 128 -122 -86 -63 185 -15 249 54 -185 -187 -176 277 174 -85 192 -50 -162 88 -156 -153 -284 -103
6785 -103 -180 366 77 -16 242 -148 -143 158 139 129 -34 -37 147 -5 131 172 305 37 -51 325 362 -327 -232 -32
6809 -32 299 181 413 294 -121 -205 -217 105 296 -313 275 72 -124 -266 142 377 -268 -249 92 166 69 148
6831 148 229 263 -187 -37 158 105 -28 -100 61 23 -78 -61 108 -271 -251 199 476 -25 -154 -115 98 -97 -170
6854 -170 53 -190 -351 -473 577 31 -435 -75 219 70 -650 189 272 -6 -488 -108 489 -91 -88 -73 -178
6875 -178 -188 57 188 127 -445 -539 172 206 -423 -544 134 242 -278 -143 440 -53 -65 -368 455 17 -375 -9
6897 -9 55 -505 -563 350 219 -32 -452 342 208 -130 -149 257 178 -212 -124 704 492 -202 139 350 -23 -413
$$ packed form
6740b0K23n50Q9K73J52m8l45L35k96m34O19J31k20k2r7J34J06R8l09j02M10j61
6762c4j8J80k50L6K3K48k00K64j95k39kJ1M53j03k59K77k42j12K50k44Lj31J81
6785a03p7N46k89r3K58l90NL01j9j0j63lJ84j52J36M1J33k68q8L76L7o89R5K00
6809c2L31j18K32j19m15q4j2L22J91o09N88k03j96j42M08K35o45J9L41P4r7P9
6831A48Q1L4m50J50J95n3j33p2J61l8j01J7J69l79K0M50K77n01j29L9K13j95p3
6854a70K23k43j61j22J050n46m66L60K94j49p20Q39Q3k78m82L80N97n80LJ5j05
6875a78j0K45J31o1n72r4P11L4o29j21O78J08n20J35N83m93j2l03Q23m38l92L66
6897iO4n60n8R13j31k51m20P94j34l38j9M06p9l90Q8Q28k12o94L41K11l73l90
$$ plain form
6919 -413 253 819 32 -191 -172 197 -55 -41 78 475 -319 101 504 210 -423 -211 222 219 61 -93 441
6940 441 -222 -199 -48 544 68 -249 217 111 -150 -293 298 314 -255 -224 236 336 -7 -341 72 111 -62
6961 -62 -11 547 -116 -550 -79 371 -316 -619 134 372 -101 -622 233 401 -233 -458 71 201 -396 -114 430
6982 430 -113 -335 -165 255 238 -397 -14 347 47 -275 -28 278 -167 -384 327 497 -112 -659 176 281
7002 281 -226 -484 247 -267 -498 -575 236 80 -413 -195 158 -63 -561 166 664 -107 -582 48 463 70
7022 70 -496 162 329 -201 -489 245 567 -351 -165 226 270 -527 -225 336 -23 -840 -85 655 52 -214 -94
7043 -94 290 -160 -142 584 574 -91 -365 214 677 -200 1 460 260 -476 -332 576 355 -387 -380 173 201 -592
7065 -592 135 585 -359 -496 448 662 -254 -239 181 507 -6 -464 158 1 -459 13 380 189 -640 -472
$$ packed form
6919d13O66N66p87k23J9L69k52J4J19L97p94M20M03k94o33K12M33lj58j54N34
6940D41o63K3J51N92m76l17M66j06k61j43N91J6n69L1M60J00l43l34M13L9j73
6961f2N1N58o63m34M71M50o87l03P53K38m73n21Q55J68o34k25N29J30n97K82N44
6982D30n43k22J70M20j7o35L83L61l00l22K47L06m45k17P11J70o09n47Q35J05
7002B81n07k58P31n14k31p7Q11j56m93K18L53k21m98P27M98p71m75O30M15l93
7022G0n66O58J67n30k88P34L22r18J86L91M4p97L02N61l59q17P55P40o03k66J20
7043i4L84m50J8P26j0o65k74N79M63q77K01M59k00p36J44R08k21p42PN53K8p93
7065e92P27M50r44j37R44K14r16J5M20L26n13m58O22j57m60M72L67j91q29J68
$$ plain form
7085 -472 451 234 -519 94 459 -187 -645 198 626 33 -404 85 349 -241 -325 518 515 -566 -619 108 -38
7106 -38 -457 -103 418 -311 -381 -234 411 23 -359 372 595 48 -518 0 299 -231 -421 412 195 -244 -216
7127 -216 81 -66 -245 247 485 -143 -714 -262 509 207 -416 -118 470 -183 -658 249 828 -383 -615 -197
7147 -197 501 -351 -439 344 273 -482 -74 764 215 -695 -145 421 321 -316 196 775 -148 -519 233 549 -11
7168 -11 -509 320 434 -208 -301 555 524 -142 -154 495 416 -92 -263 223 107 -584 -24 388 120 -371 -279 452
7190 452 174 -62 223 537 -144 -368 102 498 -251 -421 263 67 -287 -131 476 234 -366 -103 642 114
7210 114 -413 -135 182 57 -355 339 445 -484 -449 212 737 -276 -579 338 349 -159 -326 330 -50 -664
7230 -664 -157 408 222 -435 -213 305 -203 -384 80 546 -56 -434 68 175 -104 -400 187 161 -594 -340
$$ packed form
7085d72R23k17p53O13L65o46m58Q43M28n93m37M89K64n90q4Q43lj081n3P27j46
7106c8m19L54N21p29p0J47O45l88l82P31K23n47n66N18K99n30j90Q33k17m39K8
7127b16K97j47j79M92K38o28n71M52P71l02o23K98N88o53m75R07N79j211k32M18
7147a97O98q52q8P83p1p55M08Q38n49r10N50N66j00o37N12N79r23l71P52L16n60
7168a1m98Q29J14o42r3Q56l1o66j2O49p9n08j71M86j16o91N60M12k68m91R2P31
7190D52k78k36K85L14o81k24M70L96p49j70O84j96l54J56O07k42o00K63P45n28
7210A14n27K78L17j25m12O94J06r29L5O61N25j013l03R17J1n08j67O56l80o14
7230f64N07N65j86o57K22N18n08j81M64M66o02l78N02J07k79k96N87k6p55K54
$$ plain form
7250 -340 109 461 -623 -357 95 277 -284 -352 354 -233 -350 142 438 245 -30 -119 145 -35 -386 -115
7270 -115 532 -549 -436 159 466 -450 42 367 -17 -160 -341 561 -123 -709 -143 472 119 -200 737 814
7290 814 -394 -257 214 266 -222 -160 226 366 -170 -400 649 422 -382 19 632 246 -297 -272 367 45
7310 45 -15 -152 401 -30 -368 130 330 -179 -80 296 73 -220 -211 618 45 -383 -497 -47 153 -198 61 268
7332 268 -3 -385 -222 683 -142 -239 4 106 -129 -45 112 74 -349 -139 192 274 -241 -164 150 -103 -494 -289
7354 -289 189 55 -672 -74 325 45 -493 37 382 -389 -256 179 392 -188 -336 -170 224 -187 -217 343
7374 343 147 -242 107 567 41 -312 -296 -223 -64 -259 227 137 -323 -330 -48 184 -157 -296 -60 121 -102 155
7396 155 323 -2 -168 -323 278 41 -173 -242 169 106 -342 -106 400 20 -230 243 166 172 -190 113 196 32
$$ packed form
7250c40M49L52j084K66M52J82n61o8P06n87j17M92K96j93k75q9K64j80l51K71
7270a15O47j081J13N95L07r16M92L25l84j43j81R02o84n86N66O15l53l19R37P7
7290H14j208J37M71N2m88O2L86J40n36k30J049k27q04M01O13l86n43K5O39l22
7310D5o0j37N53m31l38M98K00n09R9L76k23k93RQ29n73m28j14M50K00l51K59K07
7332B68k71l82J63R05q25r7K43J02k35Q4J57l8m23K10L31Q2n15P7L14k53l91K05
7354b89M78j34p27N98L99k80n38N30L45p71J33M35K13n80j48J66L94m11l0N60
7374C43j96l89L49M60n26l53J6P3J59j95M86r0m60pK82K32l41j39K36J81k23K57
7396A55J68l25j66j55O01k37k14o9M11o3m48K36N06l80k50M73p7Ol62L03Q3j64
$$ plain form
7418 32 8 436 457 -266 -37 131 71 34 163 170 -89 -379 -9 -52 102 -157 223 408 -98 82 167 334 -161
7441 -161 -41 333 155 47 -228 311 201 50 99 381 -27 -145 -116 120 201 -10 167 99 -68 -45 51 -17
7463 -17 -18 -163 -4 260 -200 -32 234 -146 -55 -41 238 400 -197 -111 -222 65 -41 -33 -49 186 -295 -64 -70 160
7487 160 46 -85 -55 -116 -200 39 54 -247 -291 -100 42 89 9 -239 -132 -233 -14 30 151 -28 -283 -65 130
7510 130 -33 -141 -170 -90 38 111 247 68 51 23 -36 31 -110 -3 -6 21 -29 22 -93 170 -146 230 -143 -63
7534 -63 86 44 -111 -23 -100 213 119 -15 55 -16 168 314 339 15 71 205 -56 -309 239 522 -103 -95 454 233
7558 233 2 279 80 28 -92 230 82 -183 -210 -118 1 34 300 2 88 -391 -227 356 42 166 162 23
7580 23 61 189 40 -89 340 -171 37 238 -15 113 165 -10 -235 -71 208 219 -111 -104 -41 -148 -340 -22
$$ packed form
7418C2k4M28K1p23K29J68o0l7J29Pk59k90L70m3J54k59L80J85n06J80Q5J67m95
7441a61J20L74j78j08k75N39j10j51M9K82m08j18K9K36Q1k11J77o8j67K3R6o8
7463a7jj45J59K64m60J68K66l80R1J4K79J62n97Q6j11K87j06Qj6K35m81K31oK30
7487A60j14j31L0o1q4K39J5l01m4J91J42M7q0k48J07j01K19M4J21j79k55K18J95
7510A30j63j08k9Q0J28P3J36j79j7k8n9O7j41J07lK7n0N1j15K63l16L76l73Q0
7534f3J49m2j55Q8p7L13r4j34P0p1J84J46K5l24N6J34k61k53N48K83o25QN49k21
7558B33k31K77j99n2j20L22j48k65k7R2J19L3K66k98Q6m79J64N83l14J24mj39
7580B3L8J28j49j29M29n11K08K01k53J28N2j75k25J64K79J1l30PO3j07j92L18
$$ plain form
7602 -22 134 -168 -255 30 160 56 -377 65 -109 -95 -336 -48 143 -348 -1 114 -2 -85 -126 97 -54 -163
7624 -163 119 277 180 -369 189 78 -78 -284 66 35 -329 -267 10 1 -126 45 132 -9 -422 -72 -16 135
7646 135 -298 118 426 315 -243 -246 0 -111 -251 246 414 188 -478 98 425 47 -198 371 355 -267 -64
7667 -64 272 -80 -117 176 557 471 -122 -17 124 15 95 -81 251 -170 -274 164 315 -23 -162 129 210 125
7689 125 -264 54 514 -48 -347 349 25 -268 122 508 219 -226 213 351 12 -343 132 11 -55 -103 205
7710 205 192 -301 -433 213 199 -267 -166 304 380 -60 -209 437 46 -147 -191 -109 67 -197 -157 175 -121 -245
7732 -245 411 298 -299 -272 60 234 -106 -201 350 244 -284 -584 308 11 -507 -296 -10 -370 -170 386 360
7753 360 -71 -312 174 301 -57 -512 219 24 -232 -104 458 360 -289 -193 354 448 -218 -56 216 97 -489
$$ packed form
7602b2J56l02q7K85J30j04m33M42j74J4k41K88J91m91L47J15j16q3m1K23j51j09
7624a63K82J58r7n49N58j11j56k06L50l1l64O2K77rj27J71Q7j41m13L50N6J51
7646A35m33M16L08j11n58lK46j11j40M97J68k26o66N76L27l78k45N69j6o22K03
7667f4L36l52l7K93L81q6n93J05J41j09Q0j76L32m21j04M38J51l38j39K91Q1q5
7689A25l89L18M60n62k99O96l24k93L90L86k89m45M39J38l39l55M75j21o6m8L08
7710B05j3m93j32O46j4m66J01M70P6m40j49O46l91j93m4Q2J76k64M0L32k96j24
7732b45O56j13n97K7L32J74l40r5N51j06n28l00Q92k97n18K11K86l60K00N56k6
7753C60m31k41M86J27l58m55P31j95k56J28N62r8o49R6N47R4o66J62K72j19n86
$$ plain form
7774 -489 -217 370 -16 -476 287 546 20 -274 387 154 -237 -304 75 323 11 -222 83 225 -490 -51
7794 -51 488 15 -374 -328 507 -104 -97 113 51 -96 -525 176 425 -159 -433 123 122 1 -340 394 152 -238
7816 -238 -159 346 313 -74 -40 239 319 -282 161 144 133 -388 118 464 -2 -305 474 161 154 116 634 194 -246
7839 -246 -59 460 170 -292 67 112 -182 -634 94 519 -136 -584 -177 360 -86 -274 145 129 -118 -266 245
7860 245 118 -425 -392 224 139 -303 -118 289 54 -675 -64 345 171 -316 29 110 -29 -461 288 384 -367
7881 -367 -284 280 486 -74 -256 -29 44 -183 189 538 131 -389 14 375 157 -480 396 366 -75 -147 -192 149
7903 149 -185 -271 16 363 23 -238 279 86 -391 -452 681 317 -464 -235 187 -51 -163 -164 369 -263 -307
7924 -307 139 491 53 -441 473 242 -185 -464 164 377 38 -320 382 184 -160 -367 240 215 -507 -227
$$ packed form
7774d89K72N87l86m60P63K59n26k94O61k33l91o7L79K48l12k33L05J42p15M39
7794e1N39m73l89M6Q35o11PK10o2j47m29P01K49n84k74N56jj21l41P34k42l90
7816b38P9N05l3l87L4K79Q0o01M43j7j1n21N06L46m66l03P79l13pl8N18m40m40
7839b46J87N19k90m62L59M5k94m52P28M25o55m48M07N37m46j88M19j6k47j48N11
7860B45j27n43L3O16q5m42J85M07k35p29O11M09j74m87L45Q1j39m32P49R6p51
7881c67Q3N64K06n60j82K27P3k27L72L49m07n20M03L61k18o37Q76l0m41p2m5L41
7903A49l34q6K87L47l40k61N17j93m77o1J133l64p81K29M22k38j12jN33o32m4
7924c07M46L52m38m94R14k31m27k79O28K13l39l58P02j98l44k07O07k5p22K80
$$ plain form
7944 -227 236 149 -259 -116 375 43 -510 256 204 -189 -277 215 198 -369 -491 116 76 15 -293 456 52 -548
7966 -548 -371 322 47 -350 -388 367 -118 13 276 257 -203 -301 148 111 -40 -292 229 196 -434 -359 12 149
7988 149 -331 14 -76 249 -228 -244 79 -243 -121 -197 408 419 -547 -52 269 45 52 -212 267 -484 -315 369
8010 369 332 -194 -129 112 280 -323 -344 258 109 -300 -223 377 -125 -306 16 76 -184 -381 170 348 -261 -129
8032 -129 -40 243 -26 -116 124 309 -7 94 394 221 -125 -287 361 312 -415 279 486 227 -475 43 407
8053 407 -63 -211 -17 188 -262 -232 346 78 -400 -136 71 379 -121 -230 360 175 -278 -117 236 -199
8073 -199 -184 79 475 -140 -275 182 317 30 -149 157 247 -137 -153 283 137 -223 -61 188 -416 -348 -122
8094 -122 193 -88 -385 -129 89 126 -269 55 164 -113 -429 -151 39 -137 -284 -63 -239 -195 -71 214 -64
$$ packed form
7944b27M63q7m08J43M91l32n53P66n2l93q8M92j7n67j22O07m0o1l08P49m04o00
7966e48J77O93k75l97l8P55m85J31K63j9m60r8M49l7j51k52N21l3o30P5L71J37
7988A49m80L45r0L25m77j6L23l22J22p6O05J1r66M95L21k24Pk64M79p51J69O84
8010C69l7n26O5K41J68o03k1O02j49m09P7O00n02j81L22O0k60j97N51J78o09J32
8032a29Q9K83k69r0K40J85l16J01L00j73l46j62O48m9p27O94K07k59p02N18L64
8053D07m70j48J94K05m50L0N78k68m78K64K07L08n00j09N90j85m53J61L53m35
8073a99J5K63L96o15j35M57J35k87j79L06R0l84j6M36j46l60J62K49o04O8K26
8094a22L15k81k97K56K18L7l95L24J09k77l16K78J90j76j47K21j76M4J24K85k78
$$ plain form
8115 -64 -227 -316 8 29 -209 -7 174 -182 -149 55 24 -54 -248 85 254 -117 -4 67 -44 -229 -189 280 68
8138 68 132 -142 114 -47 -170 -78 479 39 -295 163 -59 87 -121 70 131 -19 -112 -52 330 -108 61 -93
8160 -93 282 1 23 -110 -13 -153 310 386 -88 -212 51 365 -315 -120 123 -123 -244 45 12 -6 -223 -215 84
8183 84 -12 -75 -109 -362 -67 -130 -144 71
$$ packed form
8115f4j63q9L24K1k38K02J81l56L3K04l1p8j94L33J69l71J13P1j11j85M0M69k12
8138F8O4k74K56j61j23R2N57m40l34M58k22J46k08J91O1j50r3O0L82m38J69j54
8160i3L75k81K2j33R7j40M63P6m74j24K63L14o80J95K43k46j21K89l3j8k17QK99
8183H4r6o3l4k53K95o3j4K15
8191G1
$$ Imaginary data points
##PAGE= N=2
##DATA TABLE= (X++(I..I)), XYDATA
$$ plain form
0 0 0 0 0 -8 8 -8 8 -16 16 -24 24 -32 43 -56 64 -79 96 -112 128 -152 179 -209 241 -278 321 -367 418 -475
28 -475 539 -608 686 -770 863 -965 1077 -1199 1335 -1482 1645 -1822 2020 -2237 2474 -2739
44 -2739 3038 -3370 3744 -4171 4661 -5231 5905 -6714 7708 -8963 10605 -12853 16140 -21414
58 -21414 31261 -55879 242756 260433 -397251 -204866 199677 132322 -163262 36443 222475
69 222475 -47636 -294304 16338 274179 40012 -209747 -27960 114988 -47402 -113700
79 -113700 108053 143907 -99488 -161047 69468 122831 -65643 -89129 101497 106876 -82406
90 -82406 -100683 71557 93649 -41186 -53222 51394 31311 -63753 -17181 92658 39232
101 39232 -92666 -78147 30149 44665 637 8049 4452 -64879 -69501 39005 84290 -11585
$$ packed form
0@%%%qJ6j6J6k4L2m0M8n6P5r9J20j43J75k08K40k80L31l88M50n19N99o88P85q93
28d75J014j147J294j456J633j828K042k276K534k817L127l467L842m257M711n213
44b739N777o408P114p915Q832r892J1136j2619J4422j6671J9568k3458K8993l7554
58b1414N2675q7140K98635J7677o57684J92385M04543o7355k95584J99705J86032
69B22475k70111k46668L10642K57841k34167k49759J81787J42948j62390o6298
79a13700K21753L5854k43395o1559K30515N3363j88474k3486J90626N379j89282
90h2406j8277J72240K2092j34835j2036J04616k0083r5064M6572J09839n3426
101C9232j31898J4519J08296J4516m4028P412l597o9331m622J08506M5285r5875
$$ plain form
113 -11585 -76818 -19855 28024 7080 12846 37713 -11926 -70670 -12885 67282 24012 -43977
125 -43977 2521 53950 -16539 -77902 -5012 65619 8926 -50565 -7215 28680 -20452 -46765
137 -46765 5823 34215 -4993 -29993 -14488 -9585 -5625 28980 39360 -19402 -64909 -19878
149 -19878 47644 45281 -2370 -23875 -11454 4131 11491 10456 1299 -5060 -4258 -3760 2173 16521
163 16521 12317 -21990 -35886 3374 37310 8672 -32018 -15908 20792 11641 -16402 -4584
175 -4584 19187 4355 -19281 -2622 25724 17998 -3959 -2478 3175 -6659 -2191 23812 23619 -8397
189 -8397 -15196 10466 9887 -15978 -5738 29700 15544 -31610 -25772 21412 26114 -5412 -8845
202 -8845 577 -18814 -19931 29536 48653 -10314 -50510 -6217 35007 11205 -8227 11729 5657
$$ packed form
113a1585o5233N6963M7879k0944N766K4867m9639n8744N7785Q0167m3270o7989
125d3977M6498N1429p0489o1363P2890P0631n6693n9491M3350L5895m9132k6313
137d6765N2588K8392l9208k5000J5505M903L960L4605J0380n8762m5507M5031
149a9878O7522k363m7651k1505J2421J5585P360j035r157o359Q02M98N933J4348
163A6521m204l4307j3896L9260L3936k8638m0690J6110L6700r151k8043J1818
175d584K3771j4832k3636J6659K8346p726k1957J481N653r834M468K6003j93l2016
189h397o799K5662n79k5865J0240L5438j4156m7154N838M7184M702l1526l433
202h845R422j9391j117M9467J9117n8967m0196M4293M1224k3802j9432J9956o072
$$ plain form
215 5657 -29767 -12133 40501 29958 -24974 -25630 8604 -404 -15593 21443 37980 -22823 -61418
228 -61418 -3686 47301 9246 -30316 -4527 11981 -22114 -23713 25128 32032 -18245 -32884
240 -32884 3123 11202 -10327 2113 26705 2271 -34557 -16233 18911 9580 -8328 7362
252 7362 10606 -26291 -35123 14579 40652 -639 -36348 -14873 9368 -2498 -7360 13915 14359
265 14359 -17756 -28533 -2247 14279 7841 6673 5305 -16014 -26632 5581 34800 12414 -21170
278 -21170 -12609 8347 -750 -7868 16555 25283 -11734 -33607 -4938 22336 10642 -1373 7145
291 7145 -1229 -26252 -15011 27813 32206 -5677 -22576 -6745 1913 3286 21011 25713 -8524
304 -8524 -33203 -5734 28063 18940 -331 4187 1605 -19391 -12985 26106 35011 -3242 -26756
$$ packed form
215E657l5424J7634N2634j0543n4932o56L4234r008j5189L7036J6537o0803l8595
228f1418N7732N0987l8055l9562K5789J6508l4095j599M8841O904n0277j4639
240c2884L6007Q079k1529J2440K4592k4434l6828J8324L5144r331j7908J5690
252G362L244l6897q832M9702K6073m1291l5709K1475K4241j1866m862K1275M44
265A4359l2115j0777K6286J6526o438j168j368k1319j0618L2213K9219k2386l3584
278b1170Q561K0956r097p118K4423Q728l7017k1873K8669K7274j1694j2015Q518
291G145q374k5023J1241M2824M393l7883j6899J5831Q658J373J7725M702l4237
304h524k4679K7469L3797r123j9271M518k582k0996O406L9091Q905l8253k3514
$$ plain form
317 -26756 -9318 7203 5427 11859 18358 -3786 -27687 -10749 21719 19198 -2979 -4297 1529
330 1529 -8133 -8533 15030 23705 -2187 -18903 -3063 10361 2011 722 13728 5935 -19183 -17351
344 -17351 12062 20820 -1733 -13319 -3165 1012 -5069 -128 8340 -826 -14029 -6975 6531
357 6531 3615 -4320 -233 2216 -8816 -11115 4170 11824 -1474 -10974 -2432 4695 -2146 -5899
371 -5899 579 1839 -5995 -5670 3020 3130 -6231 -9258 -1318 1713 -4192 -7018 -2314 2136 1205 -3801
387 -3801 -7148 -6001 -801 3540 2503 -2883 -4907 -2180 1568 2523 661 -1458 -4228 -3840 456 6946
403 6946 8060 -111 -10438 -10635 1088 11047 8540 -1399 -8376 -8535 -2086 7318 11317 2731 -11168
418 -11168 -13638 215 15135 14707 1115 -9823 -10087 -2081 8545 14966 10969 -2271 -11184 -7338
$$ packed form
317b6756J7438J6521j776O432O499k2144k3901J6938L2468k521k2177j318N826
330A529r662m00K3563Q675k5892j6716J5840J3424q350j289J3006p793k5118J832
344a7351K9413Q758k2553j1586J0154M177o081M941Q468r166j3203P054J3506
357F531k916p935M087K449j1032k299J5285P654j3298r500Q542P127o841l753
371e899O478J260p834L25Q690J10r361l027P940L031n905k826M704M450r31n006
387c801l347J147N200M341j037n386k024K727L748R55j862k119k770L88M296O490
403F946J114q171j0327j97J1723R959k507r939o977j59O449R404L999q586j3899
418a1168k470J3853J4920m28j3592j0938k64Q006J0626O421l997j3240q913L846
$$ plain form
432 -7338 4516 13779 14043 3529 -11328 -15647 663 20413 17931 -3091 -15265 -9768 -1241 5877
446 5877 14908 15285 -4683 -22352 -12135 12275 19155 7330 -2696 -7957 -11335 -2776 16260 20692
460 20692 805 -16191 -12236 673 9039 14922 12083 -6892 -22431 -10667 12934 15378 -224
473 -224 -6685 -3965 -6780 -9093 2043 13499 6118 -11502 -15547 -4903 5688 8469 5918 -2008
487 -2008 -10840 -11210 -1440 9117 10200 2541 -6535 -10514 -7355 1817 9953 8660 -3095 -13739 -12273
502 -12273 -146 8987 7773 -1021 -9470 -13582 -8653 3909 12285 5767 -8517 -13180 -6395 1952
516 1952 5452 7206 3936 -5417 -11815 -5891 7991 13804 5688 -4925 -9267 -7258 485 10356 13229
531 13229 2485 -11789 -14180 -1332 10180 10339 3109 -4943 -11608 -9104 5384 15989 8688 -6635
$$ packed form
432g338J1854R263K64j0514j4857m319J6310J9750k482k1022j2174N497Q527P118
446E877R031L77j9968j7669J0217K4410O880j1825j0026n261l378Q559J9036M432
460B0692j9887j6996L955J2909Q366N883k839j8975j5539J1764K3601K444j5602
473b24o461K720k815k313J1136J1456p381j7620m045J0644J0591K781k551p926
487b008q832l70R770J0557J083p659r076l979L159R172Q136j293j1755j0644J466
502a2273J2127R133j214q794q449m112M929J2562Q376o518j4284m663O785Q347
516A952L500J754l270r353o398N924J3882N813q116j0613m342K009P743R871K873
531A3229j0744j4274k391J2848J1512J59p230q052o665K504J4488J0605p301j5323
$$ plain form
545 -6635 -10671 -4252 2079 8574 15043 8481 -11029 -16847 2689 20262 13037 -3175 -5844 -2197
559 -2197 -898 4395 12172 7327 -6862 -9229 1018 5746 3146 4712 5597 -5605 -13386 -656
573 -656 14727 7563 -7342 -5907 3864 2538 -2147 3983 7535 -2125 -7224 2643 10288 2390 -4247
588 -4247 1408 2964 -3739 -2150 6885 3575 -8451 -6129 7400 5007 -8766 -7267 3631 434
602 434 -7977 -419 9127 -1888 -14695 -4230 8918 1995 -6892 449 3708 -7499 -7228 9507
616 9507 9267 -10729 -12483 6582 8619 -8491 -7125 8918 3052 -14636 -8374 8234 2711 -10077
630 -10077 -2417 5407 -6872 -12575 3989 10173 -8291 -12883 6055 9281 -10592 -10674 10661 11459
644 11459 -9554 -11053 5546 5667 -3971 2468 9980 -4869 -15386 784 14099 1223 -7855
$$ packed form
545f635m036O419O331O495O469o562j9510n818J9536J7573p225j6212k669L647
559b197J299N293P777m845j4189k367J0247M728k600J566Q85j1202p781J2730
573f56J5383p164j4905J435R771j326m685O130L552r660n099R867P645p898o637
588d247N655J556o703J589R035l310j2026K322J3529k393j3773J499J0898l197
602D34q411P558R546j1015j2807J0465J3148o923q887P341L259j1207K71J6735
616I507k40j9996j754J9065K037j7110J366J6043n866j7688O262J6608n523j2788
630a0077P660P824j2279n703J6564O184j8464m592J8938L226j9873q2K1335P98
644A1459k1013j499J6599J21r638O439P512j4849j0517J6170J3315j2876r078
$$ plain form
657 -7855 3511 4414 -12746 -10304 15097 16943 -10084 -17344 2320 8393 -2857 1775 14083 1291
671 1291 -19211 -8294 16607 14915 -1457 -1500 1532 -8942 -7826 16443 23497 -4074 -21553 -1847
685 -1847 14628 2639 -3017 11354 8027 -17933 -17928 14383 24901 525 -13731 -4091 -786 -5081
699 -5081 8585 22429 1842 -23946 -10956 16195 12670 -2948 3514 7702 -12894 -18637 11456
712 11456 28470 2346 -19919 -7083 4293 -3601 1604 19419 7077 -23997 -19158 12386 15000
725 15000 -5231 -3040 8225 -7197 -21310 1888 24107 4398 -18193 -4611 7833 -6831
737 -6831 -9541 14757 16956 -13726 -21547 5383 12392 -7171 -4936 13272 1631 -22662 -9410
750 -9410 18481 9071 -14394 -7124 9118 -4257 -15688 5234 18117 -4341 -18861 -1297 9765
$$ packed form
657g855J1366R03j7160K442K5401J846k7027p260J9664O073j1250M632J2308j2792
671A291k0502J0917K4901j692j6372m3L032j0474J116K4269P054k7571j7479J9706
685a847J6475j1989n656J4371l327k5960NL2311J0518k4376j4256R640L305m295
699e081J3666J3844k0587k5788J2990K7151l525j5618O462M188k0596n743L0093
712A1456J7014k6124k2265J2836J1376p894N205J7815j2342l1074M839L1544K614
725A5000k0231K191J1265j5422j4113K3198K2219j9709k2591J3582J2444j4664
737f831k710K4298K199l0682p821K6930P009j9563K235J8208j1641k4293J3252
750i410K7891r410k3465P270J6242j3375j1431K0922J2883k2458j4520J7564J1062
$$ plain form
763 9765 -3285 -4241 11483 3411 -19751 -10511 19103 14225 -13153 -11181 8905 2719 -12438 2240
777 2240 18723 477 -20688 -6352 13335 5259 -3096 5927 2447 -17522 -11893 18843 20099
790 20099 -8847 -14697 4570 4285 -9466 3881 22864 3209 -24587 -9293 18957 11482 -7016
803 -7016 1730 9518 -9779 -15568 12271 23226 -3383 -16408 3203 9384 -7436 -3168 16881
816 16881 6838 -18861 -7982 19794 10145 -15017 -5945 14655 2111 -13824 3359 18187
828 18187 -3088 -17883 3333 17475 -1771 -11848 5473 8564 -11296 -8927 16372 14107 -14210
841 -14210 -16475 7264 9084 -6125 -371 12298 -3166 -20761 -3631 18837 5346 -13086 -1903
854 -1903 8323 -8234 -14224 10365 19234 -8302 -21818 555 13091 -3476 -7514 8386 4714
$$ packed form
763I765j3050r56J5724q072k3162R240K9614m878k7378J972K0086o186j5157J4678
777B240J6483j8246k1165J4336J9687q076q355R023l480j9969N629L0736J256
790B0099k8946n850J9267k85j3751J3347J8983j9655k7796J5294K8250p475j8498
803g016Q746P788j9297n789K7839J0955k6609j3025J9611O181j6820M268K0049
816A6881j0043k5699J0879K7776r649k5162R072K0600j2544j5935J7183J4828
828A8187k1275j4795K1216J4142j9246j0077J7321L091j9860K369K5299k265k8317
841a4210k265K3739J820j5209N754J2669j5464j7595J7130K2468j3491j8432J1183
854a903J0226j6557n990K4589Q869k7536j3516K2373J2536j6567m038J5900l672
$$ plain form
867 4714 -16251 -10803 12860 8135 -12856 -5942 11026 -1117 -16989 100 15880 -3032 -18013
880 -18013 1954 14308 -6583 -14996 8082 13345 -12589 -16305 10938 14065 -10345 -11891 9555
893 9555 5987 -13346 -4632 14658 3190 -15667 -3546 11987 -692 -10074 7438 12229 -12380
906 -12380 -18478 9892 20481 -2732 -12291 3675 4404 -10955 -2705 19498 10882 -15269 -12697
919 -12697 7877 7355 -2158 5649 10773 -7921 -18162 2632 20195 7022 -6658 -696 236 -9681
933 -9681 -1719 20179 14602 -12854 -15852 6042 11016 -1935 390 10852 -775 -16192 -2316
946 -2316 17891 9439 -8647 -4415 4428 -2661 -3756 11684 12119 -9612 -14756 6379 13169 -2877
960 -2877 -6326 6898 2684 -11876 -3071 15550 7048 -13247 -7784 9590 3524 -8713 1290
$$ packed form
867D714k0965N448K3663m725k0991O914J6968j2143j5872J7089J5780j8912j4981
880a8013J9967J2354k0891q413K3078N263k5934l716K7243L127k4410j546K1446
893I555l568j9333Q714J9290j1468j8857J2121J5533j2679r382J7512M791k4609
906a2380o098K8370J0589k3213r559J5966P29j5359Q250K2203q616k6151K572
919a2697K0574n22r513P807N124j8694j0241K0794J7563j3173j3680N962R32r917
933i681P962K1898n577k7456k998K1894M974j2951K325J0462j1627j5417J3876
946b316K0207q452j8086M232Q843p089j095J5440M35k1731n144K1135O790j6046
960b877l449J3224m214j4560Q805J8621q502k0295N463J7374o066j2237J0003
$$ plain form
973 1290 11320 -3443 -14840 424 12313 55 -8487 2247 4385 -8373 -6124 9728 7127
986 7127 -11352 -8300 8180 4541 -10848 -3635 11388 2536 -13501 -5495 9448 1530 -9241
999 -9241 -361 7882 -3642 -11052 1565 8465 -3216 -8341 3445 4839 -7322 -6800 7135 5618
1013 5618 -8168 -5900 6017 1708 -8754 -222 10707 -678 -13215 -1682 11810 1538 -10081
1026 -10081 -631 7753 -1442 -7219 3329 6961 -3652 -6609 4386 6190 -4275 -2915 5585 1161
1040 1161 -7329 318 10765 1904 -9565 -2056 7934 1916 -4145 3484 5872 -5555 -7574 6583
1054 6583 11707 -1424 -8223 153 4717 -686 962 6752 1380 -7621 -3513 6769 5741 -750
1068 -750 1007 1400 -5418 -4664 8007 12016 -2109 -10585 -1887 5909 2421 633 4332 935 -8765
$$ packed form
973A290J0030j4763j1397J5264J1889j2258q542J0734K138j2758K249J5852k601
986G127j8479L052J6480l639j5389P213J5023q852j6037Q006J4943p918j0771
999i241Q880Q243j1524p410J2617O900j1681n125J1786J394j2161N22J3935j517
1013E618j3786K268J1917m309j0462Q532J0929j1385j2537J1533J3492j0272j1619
1026a0081R450Q384r195n777J0548L632j0613k957J0995J804j0465J360Q500m424
1040A161q490P647J0447q861j1469P509R990o018o061P629K388j1427k019J4157
1054F583N124j3131o799Q376M564n403J648N790n372r001M108J0282j028o491
1068g50J757L93o818P54J2671M009j4125q476Q698P796l488j788L699l397r700
$$ plain form
1083 -8765 -5829 7719 9776 -1466 -5455 -1551 -1894 -2194 4634 8802 -1045 -10414 -4442 4553 3236
1098 3236 357 3046 -654 -10127 -6382 7745 9916 -3770 -9252 -1002 1655 -3127 -842 6720
1112 6720 1785 -9200 -7037 2863 3673 -830 226 478 -6008 -7007 2965 7588 -934 -6529 -986
1127 -986 789 -4170 -1979 6018 3674 -6573 -6722 1615 2731 -2418 -528 4448 -939 -8443 -4267
1142 -4267 5122 5490 -877 -3298 -2071 -3048 -773 4775 4968 -1387 -5466 -1728 1065 411 2805 5552
1158 5552 139 -8663 -5432 6174 9031 1167 -4034 -1993 -1135 -1072 3484 8033 3020 -6268 -6482 1128
1174 1128 6161 4968 1688 -2019 -4805 -2007 4114 6561 3323 -303 -2221 -3326 -1064 5342 8990
1189 8990 2079 -7169 -5609 3321 7644 3593 -762 -1612 -1863 -895 1931 4832 3401 -772 -3665 -3081
$$ packed form
1083h765K936J3548K057j1242l989L904l43l00O828M168r847r369N972Q995j317
1098C236k879K689l700r473L745J4127K171j3686n482Q250K657m782K285P562
1112F720m935j0985K163R900Q10m503J056K52o486r99R972M623q522n595N543
1127i86J775m959K191P997k344j0247j49Q337J116n149J890M976n387p504M176
1142d267R389L68o367k421J227r77K275N548J93o355m079L738K793o54K394K747
1158E552n413q802L231J1606K857p864n201K041Q58O3M556M549n013r288k14P610
1174A128N033j193l280l707k786K798O121K447l238l626j918j105K262O406L648
1189H990o911r248J560Q930M323m051m355q50k51R68K826K901j431m173k893N84
$$ plain form
1205 -3081 1218 5253 3710 -1492 -3738 -1097 2399 3178 1165 -231 -1576 -1690 -18 2330 2266 -97
1221 -97 -2426 -1941 685 1830 246 -1830 -1403 359 490 -813 -998 -117 -359 -1365 -978 8 153 -1577
1239 -1577 -2314 -1313 616 678 -811 -2378 -2007 -426 590 434 -653 -1877 -2556 -1510 1025 1741 -602
1256 -602 -2913 -2342 -426 622 -301 -1304 -1152 -1244 -775 -1290 -577 920 783 -1874 -2768 -451 2696 1670
1274 1670 -1892 -2212 79 1758 846 -1200 -1432 520 2793 940 -2334 -1383 1729 1540 -771 121
1290 121 2267 335 -3081 -941 3583 3132 -1351 -2207 -325 645 2062 3777 1401 -3115 -2685 1624
1306 1624 3173 1679 2564 1581 -3522 -5064 3307 9110 2747 -5690 -3897 2067 2449 1337 3598 2389
1322 2389 -3984 -5723 1540 5709 3142 -19 -886 -3468 -3900 2589 8132 3311 -5623 -5134 970 2717
$$ packed form
1205c081M299M035j543n202k246K641L496P79k013j396j345j14J672K348o4k363
1221i7k329M85K626J145j584k076M27J762J31j303j85Q81k42j006L87R86J45j730
1239a577p37J001J929O2j489j567L71J581J016j56j087j224o79J046K535P16k343
1256f02k311N71J916J048r23j003J52r2M69n15P13J497j37k657q94K317L147j026
1274A670l562l20K291J679r12k046k32J952K273j853l274R51L112j89k311Q92
1290A21K146j932l416K140M524m51m483q56J882R70J417J715k376m516M30M309
1306A624J549j494Q85r83n103j542Q371N803o363q437J793N964L82j112K261j209
1322B389o373j739P263M169k567l161q67k582m32O489N543m821q934M89O104J747
$$ plain form
1338 2717 1450 3350 1628 -5428 -6525 2100 7605 1570 -4068 -2133 -156 -2656 -1516 5207 4833
1353 4833 -4753 -7788 -667 4313 1621 -819 -472 -3081 -5311 -48 5434 739 -4711 -1835 1276
1368 1276 -2334 -3255 3121 4832 -3908 -7538 198 4777 -1183 -3872 1643 2088 -4610 -4740 3078 4053
1384 4053 -2182 -3120 484 -651 -3391 317 3878 -568 -3887 121 2399 -2604 -3120 4652 5489 -4397
1400 -4397 -7118 2102 6412 125 -3352 1303 1416 -3803 -1928 5578 4225 -2595 -2685 1209 171 -1387
1416 -1387 3541 5495 -2375 -6737 980 6910 1799 -2774 1375 2348 -3280 -1439 7964 6089 -5202
1431 -5202 -5664 3881 5105 -1225 6 4880 -50 -6247 467 8739 2924 -5306 -1430 3734 -840
1446 -840 -2201 5778 5640 -5994 -7249 5069 7776 -2337 -3609 4101 1538 -6190 -779 9055 2511
$$ packed form
1338B717j267J900j722p056j097Q625N505o035n638J935J977k500J140O723l74
1353D833r586l035P121M980k692k440L47k609k230N263N482m695n450K876L111
1368A276l610r21O376J711q740l630P736M579n960k689N515M45o698j30P818R75
1384D053o235r38L604j135k740L708L561m446l319M008K278n003n16P772Q37r886
1400d397k721R220M310o287l477M655J13n219J875P506j353o820r0L894j038j558
1416a387M928J954p870m362P717N930n111m573M149R73n628J841R403j875j1291
1431e202m62R545J224o330J231M874m930o197O714Q272n815q230L876N164m574
1446h40j361P979j38j1634j255J2318K707j0113j272P710k563p728N411R834o544
$$ plain form
1461 2511 -8530 -3224 6858 2384 -5314 279 5556 -3176 -7702 2593 7888 -1883 -7014 1162
1475 1162 3552 -3684 -2743 5666 1608 -9022 -4623 8457 4900 -7597 -4358 5094 665 -7484
1489 -7484 24 8349 -573 -9925 -2336 6613 -139 -5506 1815 3597 -6224 -7138 4866 6503 -5261
1504 -5261 -6895 3359 2249 -6806 -2273 7925 2072 -9410 -3690 6925 874 -7935 411 8099
1518 8099 -1257 -9892 81 7774 -359 -5859 2660 5096 -5108 -5929 5505 6196 -4748 -4418 4857
1533 4857 1882 -6677 -617 9473 2330 -8908 -3260 7258 2299 -4634 1946 6542 -3464 -7982
1547 -7982 4310 10000 -1518 -7216 2095 5135 -2567 -1987 7259 4195 -8084 -4760 7372 5742
1561 5742 -3783 -901 4518 -2234 -7000 4542 12178 -917 -11273 -1805 7853 1062 -2383 5397
$$ packed form
1461B511j1041N306J0082m474p698N593N277q732m526J0295N295r771n131Q176
1475A162K390p236R41Q409m058j0630M399J3080l557j2497L239R452m429q149
1489g484P508Q325q922r352P589Q949o752n367P321J782r821r14J2004J637j1764
1504e261j634J0254j110r055M533J0198n853j1482N720J0615o051q809Q346P688
1518H099r356q635R973P693q133n500Q519K436j0204q21J1434O91j0944L30R275
1533D857k975q559O060J0090p143j1238N648J0518m959o933O580M596j0006m518
1547g982J2292N690j1518n698R311L040p702N80R246l064j2279L324J2132j630
1561E742r525K882N419o752m766J1542P636j3095j0356R468R658o791l445P780
$$ plain form
1575 5397 3967 -8453 -7671 7651 10198 -2597 -4868 2595 -623 -6818 2103 12178 1713 -11247
1589 -11247 -3919 6631 1308 -4258 3782 5877 -6932 -9786 5089 9693 -3474 -7263 3469
1602 3469 4073 -6850 -4439 7668 4389 -7881 -4315 6193 1482 -7410 -195 7751 -1573 -8630
1616 -8630 1489 7511 -4053 -9046 3408 8322 -4306 -7951 3337 5086 -5893 -5297 6315
1629 6315 4192 -7814 -4747 6664 2979 -7875 -2544 7045 776 -7845 -558 6775 -1757 -6972
1643 -6972 2776 7298 -3695 -7744 3430 6591 -4483 -5089 6747 5194 -7940 -6305 7450 6324
1657 6324 -4701 -3266 5283 225 -7073 582 9401 638 -8312 -608 6740 -1035 -4660 4849 6618
1672 6618 -5066 -7018 5076 7688 -3119 -4153 5683 3822 -5863 -1873 7907 2882 -7376 -1351
$$ packed form
1575E397j430j2420P82J5322K547j2795k271P463l218o195Q921J0075j0465j2960
1589a1247P328J0550n323n566Q040K095j2809k854J4875M604j3167l789J0732
1602C469O04j0923K411J2107l279j2270L566J0508m711q892P215P946r324p057
1616h630J0119O022j1564m993J2454M914j2628l645J1288J749j0979N96J1612
1629F315k123j2006L067J1411l685j0854N331R589o269q621P287P333q532n215
1643f972R748M522j0993m049J1174L161j1074o06J1836j553j3134J635J3755j126
1657F324j1025J435Q549n058p298P655Q819q763q950P704P348p775l625R509J769
1672F618j1684j952J2094K612j0807j034R836j861r685L990R780n025j0258O025
$$ plain form
1686 -1351 8252 2290 -6621 -897 5724 68 -4168 3594 6132 -4556 -6949 4034 7007 -2420
1700 -2420 -3855 3918 1471 -6555 -1516 9926 4986 -7336 -5187 3741 2045 -2689 3036 6084
1714 6084 -4211 -9490 1336 8425 771 -5135 652 1785 -5008 -3353 6719 4503 -7004 -6465
1728 -6465 3132 2578 -3755 157 5590 -2146 -9233 -13 8595 1193 -7531 -1594 3667 -1871 -4187
1743 -4187 3763 4615 -5595 -7152 3157 5067 -3338 -3657 3355 64 -7293 -1861 7136 2139 -6936
1758 -6936 -3019 4266 -1008 -5299 2249 6029 -3115 -8279 1238 6390 -1447 -4724 3176 3692 -4900
1773 -4900 -5179 4331 4975 -2676 -2497 2999 -221 -5707 685 7644 1224 -6876 -1504 4929 -217 -3816
1789 -3816 3129 5682 -3481 -7484 2107 7170 470 -2450 1993 1426 -4731 -1589 7761 5655 -4327
$$ packed form
1686a351R603n962q911N724O621n656m236P762K538j0688k393J0983K973r427
1700b420j435P773k447q026N039J1442m940j2322K149Q928j696m734N725L048
1714F084j0295n279J0826P089p654n906N787J133o793J655J0072k216j1507N39
1728f465R597n54o333L912N433p736p087R220Q608p402q724N937N261n538k316
1743d187P950Q52j0210j557J0309J910q405l19P012l291p357N432Q997m997r075
1758f936L917P285n274m291P548L780r144n164R517N152p837l277P900N16q592
1773d900k79R510O44p651J79N496l220n486O392O959o420q100N372O433n146l599
1789c816O945K553r163m003R591N063o700k920M443n67o157L142R350k106r982
$$ plain form
1804 -4327 -4026 2999 2373 -865 2658 4682 -2608 -6479 1665 7603 1368 -4046 849 2309 -3345
1819 -3345 -2161 5920 5803 -3963 -6001 1593 4410 177 -318 2393 -1273 -5064 897 6719 2246
1834 2246 -4658 -1657 2143 -496 -1745 3665 4124 -3795 -5706 1530 4581 -655 -2265 1584 322
1849 322 -4281 -1265 4593 2102 -4882 -3428 2345 1230 -1934 96 1979 -2186 -3425 1289 2907
1864 2907 -1761 -2978 1457 1899 -2593 -2085 2645 1436 -4212 -2753 2944 1645 -3296 -1743 2010
1879 2010 -52 -3328 -437 2660 -872 -3908 135 3082 -375 -2726 -63 1198 -1625 -1255 2623
1894 2623 1291 -3189 -1509 3025 1369 -3147 -1217 3361 844 -3464 -513 3635 974 -3314 -824
1909 -824 2812 1044 -1801 642 1653 -730 -1270 2181 1868 -1811 -1758 3008 2817 -1314 -1417 2074 1154
$$ packed form
1804d327L01P025o26l238L523K024p290l871Q144N938o235n414M895J460n654
1819c345J184Q081j17r766k038P594K817m233m95K711l666l791N961N822m473
1834B246o904L001L800k639j249N410M59p919j911P236L051n236j610L849j262
1849C22m603L016N858k491o984J454N773j115l164K030J883m165j239M714J618
1864B907m668j217M435M42m492N08M730j209n648J459N697j299m941J553L753
1879B010k062l276K891L097l532l036M043K947l457k351K663J261k823L70L878
1894B623j332m480J680M534j656m516J930M578k517m308K951M148k661m288K490
1909h24L636j768k845K443J011k383n40L451l13l679N3M766j91m131j03L491r20
$$ plain form
1926 1154 -1762 401 4071 1227 -3382 -887 3401 1972 -1217 70 1574 -1080 -1921 1912 3927
1941 3927 249 -2333 -1161 487 388 1675 2680 -566 -3679 -1377 3464 3175 -364 -1437 -312 -1002
1957 -1002 -1205 2033 3383 -658 -3745 -1853 1281 1821 1256 825 -1218 -3302 -1851 2057 3073 594
1973 594 -2752 -2889 -1124 638 2504 1337 -1951 -3388 -1237 1010 1330 524 -422 -1844 -2599 -1677 1216
1990 1216 2201 -98 -2664 -2788 -709 1031 1414 -65 -1620 -1680 -926 -219 636 695 -363 -1417 -1468 -344
2008 -344 965 562 -390 -935 -484 -274 -380 -43 245 72 -966 -1108 -819 960 993 45 -803 -593 462
2027 462 50 -178 -39 1214 602 -1131 -1471 362 1641 1552 -13 -929 -566 538 1614 1251 587 -145
2045 -145 -24 156 600 1937 1958 85 -2042 -503 1590 2028 982 228 170 -1151 -723 2035 3053 334
$$ packed form
1926A154k916K163L670k844m609K495M288j429l189J287J504k654q41L833K015
1941C927l678k582J172J648r9J287J005l246l113K302M841k89l539j073J125o90
1957a002k03L238J350m041l087J892L134N40n65m31k043k084J451L908J016k479
1973E94l346j37J765J762J866j167l288j437K151K247L20q06r46j422p55R22K893
1990A216R85k299k566j24K079J740L83j479j555o0P54P07Q55N9j058j054n1J124
2008c44J309m03r52n45M51K10j06L37K88j73j038j42K89J779L3r48q48K10J055
2027D62m12k28J39J253o12j733l40J833J279q9j565r16L63J104J076l63o64p32
2045a45J21J80M44J337K1j873k127J539K093M38j046p54n8j321M28K758J018k719
$$ plain form
2063 334 -1648 -1078 1143 1522 1982 1185 -959 -1803 152 2484 1540 20 -250 -205 -796 -503 2337 2331 -1083
2082 -1083 -2925 -577 2285 1570 -183 -699 -375 -1803 -299 2434 2182 -1465 -2967 -486 1009 858
2098 858 562 647 -1648 -2651 251 2799 664 -2021 -996 201 -1531 -1174 2396 2149 -2799 -4587
2114 -4587 -58 3381 517 -1639 -416 -439 -2014 -659 2082 1073 -2911 -2434 722 248 -1190 998
2130 998 1588 -2043 -3988 620 3400 -330 -2399 35 1361 -2166 -2061 3080 2533 -2859 -2989 1630
2146 1630 2108 -1678 -1255 1731 534 -2826 -866 2363 582 -1795 616 1905 -1909 -2337 2032 3799
2162 3799 -815 -2822 990 2013 -1713 -1338 3494 2552 -2861 -2740 2491 2624 -574 277 2477 -702
2178 -702 -3481 150 4589 2183 -2737 -872 888 -830 -225 3985 2734 -3132 -3925 1886 3686 -447
$$ packed form
2063C34j982N70K221L79M60p97k144q44J955K332r44j520k70M5n91K93K840ol414
2082a083j842K348K862p15j753n16L24j428J504K733k52l647j502K481J495j51
2098H58k96Q5k295j003K902K548k135k685J025J197j732L57L570k47m948j788
2114d587M529L439k864k156J223k3j575J355K741j009l984M77L156m74j438K188
2130I98N90l631j945M608K780l730k069K434J326l527J05N141n47n392j30M619
2146A630M78l786M23K986j197l360J960L229j781k377K411J289l814m28M369J767
2162C799m614k007L812J023l726L75M832r42n413J21N231J33l198Q51K200l179
2178g02k779L631M439k406m920J865J760j718O05M210j251n866p93N811J800m133
$$ plain form
2194 -447 -458 2292 56 -4381 -479 5570 3324 -3012 -2898 895 597 -126 2370 2655 -2663 -4476 1003
2211 1003 4343 288 -1542 541 -57 -3619 -841 4908 2423 -4125 -3637 1628 1333 -1735 633 2936
2227 2936 -1927 -5516 -438 5105 1138 -3501 -1314 1030 -1490 -1420 2535 2211 -3712 -3555 1927 1958
2243 1958 -2500 -1159 2814 -75 -4927 -1692 4118 1838 -4230 -1474 2860 -285 -3712 861 3715
2258 3715 -1234 -4061 1111 3158 -1837 -3134 2332 2969 -2672 -2684 2515 1864 -3021 -399 4079 642
2274 642 -4931 -289 4761 354 -3757 438 4078 -927 -4684 1411 4892 -925 -3697 1590 3389
2289 3389 -1448 -1849 3124 2079 -3495 -1563 4583 2295 -3844 -1116 4054 1258 -2888 909 4255
2304 4255 -691 -4496 1514 5412 -125 -3821 1153 3409 -1815 -2251 3763 3977 -3200 -3462 2629 3115
$$ packed form
2194d47j1K750k236m437L902O049k246o336J14L793k98p23K496K85n318j813N479
2211A003L340m055j830K083n98l562K778N749k485o548M88N265k95l068K368K303
2227B936m863l589N078N543l967m639K187K344k520P0L955l24n923J57N482L1
2243A958m458J341L973k889m852L235N810k280o068K756M334l145l427M573K854
2258C715m949k827N172K047m995j297N466O37n641j2N199o51m885K622M478l437
2274F42n573M642N050m407m111M195L640n005l757O095L481n817k772N287J799
2289C389m837m01M973j045n574J932O146k288o139K728N170k796m146L797L346
2304D255m946l805O010L898n537l696M974K256n224m36O014K14p177k62O091M86
$$ plain form
2320 3115 -1182 -557 2913 -84 -4169 790 5307 579 -4122 179 3747 -577 -3141 2079 3824
2335 3824 -2752 -4186 2611 4252 -2171 -3466 1665 2051 -2914 -1196 3560 616 -4867 -1846 4250
2350 4250 1726 -3046 -695 1526 -2350 -3148 3178 4205 -2999 -5573 1109 2844 -1903 -1830 3359 1383
2366 1383 -5622 -3873 4138 3459 -2866 -2333 1444 -1098 -3621 1428 4477 -984 -5030 -509 2946
2381 2946 -921 -2912 2255 2452 -3690 -3856 3002 2971 -3133 -2616 3308 1360 -4378 -1694 4194 1381
2397 1381 -4466 -1157 4121 605 -3832 178 3670 -575 -3414 1731 3216 -1741 -2914 2892 2943
2412 2943 -3326 -2800 4097 2978 -3881 -2269 3854 2223 -3331 -320 4385 457 -4664 -130 4822
2427 4822 931 -3114 616 2460 -2099 -2975 3434 4826 -1733 -3812 923 2117 -1222 572 4870
$$ packed form
2320C115m297O25L470k997m085M959M517m728m701M301L568m324k564N220J745
2335C824o576j434O797J641o423j295N131L86m965J718M756k944n483L021O096
2350D250k524m772K351K221l876p98O326J027p204k574O682J735m747P3N189j976
2366A383p005J749Q011o79o325N33L777k542k523N049L049n461m046M521L455
2381B946l867j991N167J97o142j66O858l1o104N17N924j948n738K684N888k813
2397A381n847L309N278l516m437M010L492m245k839N145J485m957j173N806N1
2412B943o269N26O897j119o859J612O123j631n554L011M705l928n121M534M952
2427D822l891m045L730J844m559q76O409J392o559k079M735J194l339J794M298
$$ plain form
2442 4870 723 -6094 -2048 5258 3390 -2519 -806 2706 -1483 -4404 2098 5720 -59 -4660 -807
2457 -807 2374 -418 -1019 3336 1780 -4610 -3421 3451 3124 -2565 -2044 1992 -279 -3630 551 4214
2473 4214 -472 -5113 -722 4008 12 -3410 709 2771 -2377 -3781 2480 3500 -2389 -3868 787
2488 787 1864 -1775 -715 2417 -150 -4316 -780 3944 891 -3553 -758 2414 -1280 -3556 1714
2503 1714 3892 -1507 -4069 1377 2957 -1767 -2659 2279 1911 -3151 -2540 2950 1929 -3043 -1236 2920
2519 2920 409 -3288 -344 2882 -407 -2551 1638 3064 -2001 -3524 2134 4077 -1499 -3129 2011
2534 2011 2412 -1864 -1592 2950 2260 -2493 -1572 3057 1285 -1966 82 2804 -68 -2695 1114 3809
2550 3809 -605 -2977 1051 3267 -640 -2012 2177 1945 -2681 -1818 3754 3287 -2567 -2426 2323 1856
$$ packed form
2442D870m147o817M046P306j868n909J713L512m189k921O502L622n779m601L853
2457h07L181k792o01M355j556o390J189O872l27n689N21M036k271l351M181L663
2473D214m686m641M391M730l996l422M119K062n148j404O261J020n889j479M655
2488G87J077l639J060L132k567m166L536M724l053m444K795L172l694k276N270
2503A714K178n399k562N446J580m724q92M938l68n062O11N490j021m972J807M156
2519B920k511l697K944L226l289k144M189J426n065j523N658J943n576j630N140
2534B011M01m276K72M542o90m753R21M629j772l251K048K722k872k627L809K695
2550C809m414k372M028K216l907j372M189k32m626Q63N572m67n854J41M749m67
$$ plain form
2566 1856 -1482 -148 2834 15 -3320 -243 3372 761 -1937 113 1456 -1639 -1767 3065 3192
2581 3192 -2638 -3710 1308 2910 -787 -1194 1683 301 -3637 -936 3778 1791 -3059 -2293 1494
2596 1494 -222 -1726 1021 2300 -1866 -3799 -41 2854 5 -1481 380 -177 -2289 -1049 3265
2611 3265 1438 -3584 -2993 1246 1167 -1575 -229 2005 -996 -3520 -419 2776 359 -2146 -478 878
2627 878 -1223 -1298 1778 1243 -2291 -2506 838 1713 -1290 -821 1470 300 -2421 -572 2440 439 -2098
2644 -2098 -444 1983 -274 -2372 336 2447 -203 -1989 298 1012 -789 -867 1393 1252 -1604 -920
2660 -920 1655 886 -1401 100 2117 -112 -2333 -112 2609 934 -1422 -143 1352 -549 -915 1926
2676 1926 2132 -1008 -2381 989 2008 -21 -186 1195 268 -1426 -394 2691 1476 -1289 -1138 861
$$ packed form
2566A856l338J334K982k819l335L077L615k611k698K050J343l095j28M832J27
2581C192n830j072N018J602l697m07K877j382l938K701M714j987m850P66L787
2596A494j716j504K747J279m166j933L758K895k849j486J861n57k112J240M314
2611C265j827n022N91M239p9k742J346K234l001k524L101L195k417k505J668J356
2627H78k101p5L076n35l534k15L344Q75l003M69K291j170k721J849L012k001k537
2644b098J654K427k257k098K708K111k650j786K287P14j801p8K260j41k856O84
2660i20K575p69k287J501K017k229k221K221K721j675k356J279J495j901l66K841
2676A926K06l140j373L370J019k029j65J381r27j694J032L085j215k765J51J999
$$ plain form
2692 861 -38 -290 1508 2101 -1106 -2338 817 2798 600 -1445 -84 913 -938 -324 1959 1228 -1560
2709 -1560 -1697 784 1095 11 -268 833 -506 -1933 156 1914 620 -2033 -739 305 -189 -175
2725 -175 1059 854 -1711 -1858 815 2058 -262 -1628 -112 409 -376 -369 936 226 -1203 -1365 569
2742 569 589 -542 -17 59 -1202 -1263 882 1519 -304 -1633 -752 675 43 -65 308 265 -1340 -920 841
2761 841 1077 -573 -966 -68 -173 -263 92 780 8 -891 -172 402 59 144 535 -38 -798 -283 768 871
2781 871 -410 -452 298 582 -250 -97 494 451 102 131 205 110 515 873 812 300 2 14 331 443 724 610
2803 610 -396 -392 98 838 843 392 -463 -258 -463 137 875 1033 88 -890 -1080 146 1362 1235 -25 -1417
2823 -1417 -762 256 747 1161 223 -299 -1357 -470 690 1559 753 -504 -1430 -1416 74 1932 1192 -565
$$ packed form
2692H61q99k52J798N93l207j232L155J981k198k045J361R97j851O14K283p31k788
2709a560j37K481L11j084k79J101j339j427K089J758j294k653J294J044m94J4
2725a75J234k05k565j47K673J243k320j366J516N21p85PJ305p10j429j62J934
2742E69K0j131N25P6j261o1K145O37j823j329Q81J427o32j08L73m3j605M20J761
2761H41K36j650l93Q98j05r0L55O88p72q99P19N74l43Q5L91n73p60N15J051J03
2781H71j281m2P50K84q32J53N91m3l49K9P4r5M05L58o1n12k98J2L17J12K81j14
2803F10j006MM90P40Nm51q55K05k05O00P38J58r45r78j90J226J216j27j260j392
2823a417O55J018M91M14r38n22j058Q87J160Q69q06j257r26J4J490J858p40j757
$$ plain form
2841 -565 -1806 -1305 -25 931 930 46 -1142 -1713 -579 1254 1585 -243 -1315 -953 -319 319 879 701
2859 701 -472 -1870 -946 523 991 600 -96 -974 -1604 -837 1224 821 -679 -1279 -565 166 -568 -89
2877 -89 780 27 -1338 -763 521 1044 -364 -568 430 -133 -1028 78 1227 1 -1295 -44 535 -321
2895 -321 -260 584 1068 -559 -1011 486 897 -699 -265 1383 505 -1452 -836 1854 1203 -625 -47 974
2913 974 -46 -898 438 1749 207 -1004 54 1074 128 157 1506 928 -1312 -1235 1393 2052 -460
2930 -460 -874 545 240 -1087 382 2390 536 -2034 -1022 1883 1376 -686 167 1266 -540 -1284
2946 -1284 1023 2210 -313 -1659 2 757 -403 82 1667 153 -2385 -1184 2224 1656 -1473 -1092
2962 -1092 649 237 -1391 457 1873 -502 -2371 -221 1853 -227 -1291 262 566 -1468 -1463 1667
$$ packed form
2841e65j241N01J280R56jq84j188n71J134J833L31j828j072L62O34O38N60j78
2859G01j173j398R24J469M68l91o96q78o30P67K061m03j500o00P14P31p34M79
2877h9Q69p53j365N75J284N23j408k04R98n63q95J106J149j226j296J251N79q56
2895c21O1Q44M84j627m52J497M11j596M34J648q78j957O16K690o51j828N78J021
2913I74j020q52J336J311j542j211J058J020r46K9J349n78k240P7K628O59k512
2930d60m14J419l05j327J469K008j854k570J012K905n07k062Q53J099j806p44
2946a284K307J187k523j346J661P55j160M85J585j514k538J201L408n68l129L81
2962a092J741m12j628J848J416k375j869K150K074k080j064J553L04k034NL130
$$ plain form
2978 1667 1687 -1767 -1735 308 657 -1002 -115 1401 -979 -2738 95 2445 -125 -2369 -675 1571
2994 1571 -485 -1463 652 1519 -1342 -2071 588 1571 -736 -984 894 -50 -1932 -294 2279 435
3010 435 -2573 -1075 1982 331 -1550 331 1701 -986 -2527 1089 2312 -691 -1976 895 2021
3025 2021 -882 -1217 1463 1578 -1252 -1146 1537 876 -1569 -250 1983 119 -1871 361 2457 -257
3041 -257 -1511 1077 2751 -1058 -2155 873 2352 -141 -1335 1703 1279 -1711 -1221 2778 1838 -1733
3057 -1733 -1162 1832 1112 -1400 503 2326 -151 -2553 116 2540 -61 -1676 421 1450 -1528
3072 -1528 -1830 2480 2529 -1916 -2665 1428 2409 -1048 -997 1420 341 -2267 -164 2650 607 -2356 -662
3089 -662 1374 -413 -1593 1038 1917 -1720 -2930 692 2728 -343 -2026 908 72 -2641 -1037 2805
$$ packed form
2978A667K0l454L2K043L49j659Q87J516k380j759K833K350k570k244J694K246
2994A571k056r78K115Q67k861p29K659R83k307k48J878r44j882J638K573j844
3010D35l008J498L057j651j881J881J370k687j541L616J223l003j285K871J126
3025B021k903l35K680J15k830J06K683o61k445J319K233j864j990K232K096k714
3041b57j254K588J674l809j097L028J479k493j194L038m24k990M90L999r40l571
3057a733N71K994p20k512J903J823k477k402K669K424k601j615K097J029k978
3072a528l02M310M9m445p49M093R81l457N1K417j079k608K103K814k043k963J694
3089f62K036j787j180K631Q79l637j210L622K036l071j683K934q36k713J604L842
$$ plain form
3105 2805 1490 -2854 -2221 1404 1103 -1521 -284 1949 -634 -3022 -134 2186 -357 -2110 271
3120 271 1050 -1426 -1609 1623 1658 -2119 -2108 1919 1296 -2202 -1475 1940 650 -2126 -711 2238 -40
3137 -40 -2565 95 2275 -174 -2106 207 1801 -905 -1562 1829 1731 -1261 -1563 1414 1580 -1557 -770
3154 -770 2435 536 -2197 -729 2842 650 -2397 -244 2416 146 -2278 182 2191 -363 -1680
3169 -1680 1716 1971 -1408 -1773 1815 2077 -1042 -931 1826 919 -2370 -490 3185 1275 -2404 -567
3185 -567 2117 137 -1645 1210 2750 -1047 -3185 852 2988 -113 -1925 860 1433 -1631 -947 2398
3201 2398 1362 -2028 -1352 2116 872 -1950 -198 2281 -504 -2554 528 2807 -306 -2932 -130
3216 -130 2361 -532 -1700 927 1332 -2355 -2258 1968 2309 -1329 -2196 692 649 -1650 126 2392 -312
$$ packed form
3105B805j315m344O33L625l01k624J237K233k583k388K888K320k543j753K381
3120B71P79k476j83L232L5l777J1M027o23l498P27L415j290k776J415K949k278
3137d0k525K660K180k449j932K313J594k706o57L391r8k992l02K977J66l137P87
3154g70L205j899k733J468L571k192l047K153K660k270k424K460K009k554j317
3169a680L396K55l379l65L588K62l119J11K757r07l289J880L675j910l679J837
3185e67K684j980j782K855J540l797k138M037K136l101j812K785N73l064O84L345
3201B398j036l390O76L468j244k822J752K479k785k050L082K279l113k626K802
3216a30K491k893j168K627M05l687R7M226L41l638q67K888m3k299J776K266k704
$$ plain form
3233 -312 -3071 -1131 2175 209 -1837 511 1699 -1682 -2578 1295 2848 -1030 -2635 323 1459
3248 1459 -1417 -1190 1408 822 -2137 -1206 1772 684 -1803 -387 1725 -520 -2140 412 2017 -793
3264 -793 -2082 811 2138 -829 -1929 851 1544 -1504 -1434 1887 1420 -1768 -1185 2171 1113 -1707
3280 -1707 -517 1745 399 -1663 471 2020 -547 -1816 761 2048 -972 -1850 1201 1533 -932
3295 -932 -1490 1844 1643 -1609 -1344 1899 1622 -1143 -832 1459 141 -1754 587 2963 493 -2575
3311 -2575 -268 1735 33 -431 1041 1149 -1479 -1712 1876 2452 -1173 -1462 1325 501 -2128 -351
3327 -351 2713 910 -2659 -1358 1594 872 -1161 -121 991 -905 -2075 930 1930 -1272 -2069 807
3343 807 1101 -983 -808 1346 827 -2148 -1310 1965 848 -2121 -846 1189 160 -1872 340 1817
$$ packed form
3233c12k759J940L306j966k046K348J188l381q96L873J553l878j605K958J136
3248A459k876K27K598n86k959R31K978j088k487J416K112k245j620K552J605k810
3264g93j289K893J327k967j100K780O93l048P0L321m67l188N83L356j058k820
3280a707J190K262j346k062K134J549k567j269K577J287l020q78L051L32k465
3295i32n58L334k01l252K65L243k77k765L11K291j318j895K341K376k470l068
3311b575K307K003j702m64J472J08k628k33L588N76l625k89K787q24k629J777
3327c51L064j803l569J301K952p22k033J040J112j896j170L005J000l202p97K876
3343H07K94k084J75K154n19k975Q38L275j117k969J275K035j029k032K212J477
$$ plain form
3359 1817 -512 -2659 -269 1808 -264 -1368 54 965 -1342 -987 1360 738 -1501 -1638 857 345
3375 345 -1336 -703 1557 112 -2080 -91 1925 238 -1908 -345 1531 -217 -1172 490 1230 -942
3391 -942 -1392 946 1765 -549 -1638 569 1011 -559 -139 1334 157 -1557 -286 1858 407 -1167
3407 -1167 604 1519 -461 -1312 1074 2232 125 -1439 245 1584 -190 -686 857 773 -646 -322
3423 -322 983 736 -995 -409 974 619 -826 181 1224 14 -801 463 1434 -333 -1286 336 1443
3440 1443 -304 -828 900 922 -1136 -867 946 1428 -857 -1153 426 645 -259 525 889 -626 -1601 108
3458 108 1495 -38 -830 -274 570 -713 -701 1050 1060 -1205 -1649 302 1300 -106 -331 230 -280 -1472
3476 -1472 -292 1226 282 -1431 -901 426 60 73 338 184 -1300 -1247 330 1195 -194 -1136 81 152
$$ packed form
3359A817k329k147K390K077k072j104J422R11k307L55K347o22k239j37K495n12
3375C45j681O33K260j445k192J989K016j687k146J563J876j748r55J662P40k172
3391i42m50K338Q19k314j089K207M42j570M20J473j177j714J271K144j451j574
3407a167J771R15j980q51K386J158k107j564J684J339j774m96J543q4j419L24
3423c22J305k47j731N86J383l55j445J007J043j210q15J264R71j767r53J622J107
3440A443j747n24J728K2k058K69J813M82k285k96J579K19r04P84L64j515r75J709
3458A08J387j533p92N56Q44j283J2J751J0k265m44J951R98j406k25N61n10j192
3476a472J180J518r44j713N30J327l66J3K65j54j484N3J577Q65j389r42J217P1
$$ plain form
3494 152 -1206 -480 852 527 -1453 -1179 287 948 -128 -66 23 -543 -954 137 869 160 -814 -70 135
3513 135 134 -310 211 552 -976 -539 640 553 -573 -414 278 171 -403 -398 764 351 -457 -316 420 430 -202
3534 -202 -61 165 182 305 606 237 -349 -193 1000 565 -19 -287 215 288 42 359 497 -38 -324 10
3554 10 846 706 327 -48 -134 -230 258 501 367 225 -254 -289 215 827 719 -51 -468 -427 87 694 426 168
3576 168 -510 -32 106 131 275 243 -200 -631 -175 -64 518 -45 -671 -494 -178 516 51 -172 -453 -300 -351
3597 -351 231 583 101 -546 -757 -19 -77 201 4 -822 -578 -131 358 62 79 -438 -277 -174 -319 330 340
3618 340 -328 -679 -109 580 387 -342 -560 -212 -238 300 458 98 -147 -394 -120 348 106 -157 96 83 -276
3639 -276 214 253 424 -365 -293 325 127 -223 310 404 -119 -333 137 886 711 -664 -465 396 188 -145 -41
$$ packed form
3494A52j358P26J332l25j980K74J466O61j076O2Q9n66m11J091P32p09r74P44K05
3513A35jm44N21L41j528M37J179q7j126J59O92j07n74NJ162m13q08J41P36J0o32
3534b02J41K26J7J23L01l69n86J56J193m35n84k68N02P3k46L17J38n35k86L34
3554A0Q36j40l79l75q6r6M88K43j34j42m79l5N04O12j08p70m17M1N14O07k68k58
3576A68o78M78J38K5J44l2m43m31M56J11N82n63o26J77L16O94m65k23k81J53n1
3597c51N82L52m82o47k11P38n8K78j97q26K44M47M89k96J7n17J61J03j45O49J0
3618C40o68l51N70O89j93p29k18L48k6N38J58l60k45k47K74M68k42k63K53j3l59
3639b76M90L9J71p89P2O18j98l50N33R4n23k14M70P49j75j375J99Q61k08l33J04
$$ plain form
3660 -41 249 -247 -114 705 449 -139 -185 716 393 -381 150 841 113 -840 1 1189 367 -659 116 549
3680 549 3 -96 438 820 -420 -594 520 1062 -158 -191 281 200 -249 307 752 165 -887 -48 819 345
3700 345 -635 121 501 -573 -1446 -20 1285 -135 -1029 -411 463 20 -357 502 -6 -1416 -951 391
3718 391 584 -431 -531 292 -249 -691 226 1034 -183 -1635 -249 729 -100 -729 313 433 -1325 -1352
3736 -1352 675 992 -676 -1448 31 411 -449 -285 410 -74 -1090 -277 1298 -77 -932 -67 954
3753 954 -561 -1000 528 1092 -648 -1418 590 1020 -583 -748 217 323 -825 -163 1351 548 -1111
3770 -1111 -712 1190 589 -704 -100 1026 -132 -942 454 1071 -251 -1020 714 1188 -724 -462 1058
3787 1058 921 -873 -805 1309 966 -780 -963 1215 551 -492 328 1202 115 -1003 284 1666 249
$$ packed form
3660d1K90m96J33Q19k56n88m6R01l23p74N31O91p28r53Q41J188q22j026P75M33
3680E49n46r9N34L82j240j74J114N42j220l3M72q1m49N56M45n87j052Q39Q67m74
3700C45r80P56L80j074q73J426J305j420q94O18Q74m43l77Q59n08j410M65J342
3718C91J93j015j00Q23n41m42R17Q08j217j452J386R78q29o29J042J20j758k7
3736a352K027L17j668p72J479L80q60J64O95m84j016Q13J575j375q55Q65J021
3753I54j515m39J528N64j740p70K008M30j603j65R65J06j148O62J514q03j659
3770a111L99J902o01j293O04J126j158q10J396O17j322p69J734M74j912K62J520
3787A058j37j794O8K114l43j746j83K178o64j043Q20Q74j087j118J287J382j417
$$ plain form
3804 249 -991 363 1172 -382 -467 945 982 -953 -825 1183 833 -822 -379 1461 215 -1241 136
3821 136 1477 170 -1380 -113 1498 275 -980 -10 800 -1054 -1047 996 1374 -1300 -1364 753 834 -930
3839 -930 -571 1141 277 -1641 -747 1556 333 -1202 -691 1042 -417 -1391 601 1216 -822 -1929 181
3856 181 1440 -208 -980 521 558 -1090 -803 1326 808 -1753 -1153 968 465 -1229 -394 1224 -252
3873 -252 -1718 406 1914 -143 -1913 -280 1178 -296 -613 940 981 -1528 -1331 1033 1249 -805
3889 -805 -717 1093 89 -1401 -141 1727 138 -1754 -71 1699 33 -1168 390 1567 -681 -1385
3905 -1385 596 1530 -412 -1483 800 1246 -925 -479 1208 901 -1021 291 1844 241 -1553 -130
3921 -130 1749 359 -981 114 1498 -515 -1332 1060 1725 -348 -1253 679 966 -866 -327 1303
$$ packed form
3804B49j240J354Q09j554q5J412L7j935J28K008l50j655M43J840j246j456J377
3821A36J341j307j550J267J611j223j255R70Q10j854PK043L78k674o4K117Q1j764
3839i30L59J712q64j918Q94K303j223j535N11J733j459r74J992O15k038j107K110
3856A81J259j648p72J501L7j648K87K129n18k561O00K121n03j694Q35J618j476
3873b52j466K124J508k057j770J633J458j474l17J553M1k509J97K364K16k054
3889h05Q8J810j004j490J260J868j589j892J683J770j666j201J558J177k248p04
3905a385J981R34j942j071K283M46k171M46J687l07j922J312J553j603j794J423
3921a30J879j390j340J095J384k013q17K392O65k073r05J932K87j832N39J630
$$ plain form
3937 1303 843 -1290 -798 1162 784 -1086 -316 1124 -237 -1075 464 1590 -497 -2075 496 1608
3953 1608 -561 -1727 359 864 -1079 -909 1237 809 -1539 -1283 574 755 -1081 -96 975 -322
3969 -322 -1988 -4 1753 173 -1399 -365 783 -752 -1415 1294 1224 -1315 -1684 683 1063 -813
3985 -813 -587 1001 478 -1613 -862 1446 301 -1564 -739 1293 -139 -1256 148 752 -717 -1601 566
4002 566 1258 -1289 -1901 909 1536 -720 -1039 1036 369 -1478 -655 1961 710 -1354 -842 907 288
4019 288 -1129 537 1652 -581 -1908 234 1611 -156 -833 713 776 -1035 -773 1471 1121 -1549
4035 -1549 -937 1536 888 -1213 -297 1371 468 -1289 290 1576 170 -1340 215 1563 -32 -904
4051 -904 721 1169 -673 -866 1509 1261 -835 -1170 983 412 -871 -192 1641 463 -1696 -94 1756
$$ packed form
3937A303m60k133M92J960l78j870P70J440j361q38J539J126k087j578K571J112
3953A608k169j166K086N05j943J70K146m28k348K56J857J81j836R85J071j297
3969c22j666J984J757j580j572J034J148j535o63K709p0k539l69K367L80j876
3985h13K26J588n23k091P51K308j145j865Q25K032j432j117J404O04j469q84K167
4002E66O92k547o12K810O27k256l19K075o67j847Q23K616j251k064N12J749o19
4019B88j417J666J115k233j327K142J377j767o77J546O3j811K62K244l50k670
4035a549O12K473o48k101R16J668r03j757J579J286j406j510J555J348j595q72
4051i04J625M48j842j93K375k48k096l35K153n71j283O79J833j178k159J602J850
$$ plain form
4068 1756 428 -1487 223 1242 -293 -1389 66 1282 -474 -940 745 906 -1030 -854 838 638
4084 638 -939 -752 1264 155 -1706 -476 1811 714 -1451 -306 1168 -587 -1467 429 1727 -548
4100 -548 -1631 233 1221 -306 -751 607 533 -984 -923 1061 761 -923 -940 480 -84 -1002 165 1231
4118 1231 -358 -1973 286 1853 -15 -1357 -32 917 -735 -931 973 806 -813 -1140 782 691
4134 691 -847 -186 973 84 -1498 -284 1737 396 -1252 -457 837 -331 -834 698 1211 -921
4150 -921 -1169 733 1383 -491 -731 678 437 -667 -810 905 614 -887 -203 994 398 -708 277
4167 277 1038 -135 -1008 718 1537 -428 -1203 616 1450 -282 -822 363 888 -615 -240 1150 830
4184 830 -1130 -402 1236 519 -457 41 738 -70 -867 235 1169 112 -1244 276 702 -410 -689 879
$$ packed form
4068A756j328j915J710J019j535j096J455J216j756m66J685J61j936J76J692k00
4084F38j577J87K016j109j861J230K287j097k165J145J474j755q80J896J298k275
4100e48j083J864R88j527m45J358p4j517O1J984l00j684j7J420n64r18J167J066
4118A231j589j615K259J567j868j342J325R49j652j96J904j67j619l27J922r1
4134F91j538O61J159q89j582J214K021j341j648P95J294j168n03J532N13k132
4150i21k48J902O50j874k40J409k41j104j43J715k91j501O84J197n96j106R85
4167B77P61j173q73J726Q19j965p75J819Q34j732n40J185N25j503L75J390l20
4184H30j960P28J638p17r76M98O97q08p97J102R34j057j356J520M26j112k79J568
$$ plain form
4202 879 547 -961 -642 783 737 -813 -919 440 272 -856 -252 820 -257 -1256 -215 597 114 -777
4220 -777 227 589 -370 -557 541 963 -984 -1190 113 583 -700 -561 605 1 -1037 -407 1073
4237 1073 507 -923 -718 487 134 -625 228 343 -609 -883 422 916 -344 -401 195 144 -255 91 720
4256 720 120 -907 -633 807 458 -233 -216 786 -66 -615 61 998 93 -743 -135 612 274 -173 242
4275 242 476 -351 -293 731 856 -12 -445 360 174 -158 103 772 273 -711 -37 1040 607 -552 0
4294 0 807 231 -27 151 341 -234 -140 289 492 -32 -34 459 167 -330 257 387 370 -335 -238 630 218 -86
4316 -86 288 214 -375 -276 637 499 5 -552 -347 263 296 -105 -322 -321 -293 -44 299 -58 -124 -38 105 11 -61 134
4340 134 146 -425 -1087 -30 316 84 -214 -367 -213 -299 162 170 353 -522 -586 -353 365 -9 133 -307 -626
$$ packed form
4202H79l32j508L19J425m6j550j06J359j68j128O04J072j077r99J041Q12m83q91
4220g77J004L62r59j87J098M22j947k06J303M70j283J39J166o04j038O30J480
4237A073n66j430K05J205l53p59Q53J15r52k74J305M94j260n7N96n1l99L46O29
4256G20o00j027K74J440l49o91J7J002q52n49O76R37r05q36O08P47l38m47M15
4275B42K34q27N8J024J25q68m33Q05j86l32K61O69m99r84O74J077m33j159N52
4294@Q07n76k58J78J90n75R4M29K03n24kM93k92m97N87J30j7p05R7Q68m12l04
4316h6L74p4n89R9R13j38m94n57K05O10L3m01k17JK8K49L43l57o6Q6J43r4p2J95
4340A34J2n71o62J057L46k32k98j53J54q6M61QJ83q75o4K33P18l74J42m40l19
$$ plain form
4361 -626 73 23 353 -34 74 -217 -357 -111 160 22 -137 -422 -472 94 503 -56 -400 -650 -41 349 342
4382 342 -166 -38 11 -220 -80 172 -147 -171 -194 -229 219 428 -48 -4 -254 -255 331 424 368 -108 30 287 219
4405 219 349 421 317 76 -328 365 647 -23 -502 118 204 -91 -79 202 172 -38 -260 72 437 92 108 -2
4427 -2 -126 -272 377 384 78 -530 -232 562 270 -11 -180 242 -175 -153 501 486 -244 -437 220 646 -52 -162
4449 -162 228 297 -206 -328 330 67 -374 -268 284 -31 -206 194 197 -443 -241 -157 707 -434 -751 -116 219
4470 219 4 -201 393 200 -1161 -583 617 563 -242 -508 279 -229 -84 -190 668 -101 -1063 69 543
4489 543 32 -318 -297 -211 -719 -545 808 590 -796 -688 284 367 -403 -271 442 84 -940 -287 921 677
4509 677 -501 -442 146 -102 -278 679 895 -255 -856 -5 699 -93 -341 668 302 -758 97 1128 586
$$ packed form
4361f26O99n0L30l87J08k91j40K46K71j38j59k85n0N66M09n59l44k50O09L90p
4382C42n08J28M9k31J40K52l19k4k3l5M48K09m76M4k50jN86R3n6m76J38K57o8
4405B19J30P2j04k41m04O93K82o70m79O20Q6k95J2K81l0k10k22L32L65l45J6j10
4427bj24j46O49Pl06o08K98P94k92k81j69M22m17K2O54j5p30j93O57M26o98j10
4449a62L90O9n03j22O58k63m41J06N52l15j75M00Lo40K02Q4Q64j141l17O35L35
4470B19k15k05N94j93j361N78J200n4q05k66P87n08J45j06Q58p69r62J132M74
4489E43n11l50K1Q6n08J74J353k18j386J08R72Q3p70J32P13l58j024O53J208k44
4509F77j178N9N88k48j76R57K16j150o01Q51P04p92k48J009l66j060Q55J031n42
$$ plain form
4528 586 -645 -663 781 498 -179 246 652 -312 -737 90 920 19 -481 278 522 -249 -235 719 469 -727
4548 -727 -406 952 796 -538 -319 451 555 -468 -117 740 -143 -890 146 1048 -93 -751 166 927
4566 927 -234 -494 442 647 -779 -572 618 344 -647 -408 347 -201 -732 -63 1194 261 -1229 -226
4584 -226 1098 399 -1138 -54 627 -530 -697 544 747 -321 -755 315 308 -378 -170 588 -54 -1121
4602 -1121 -588 1129 688 -657 -207 462 -393 -996 216 856 -650 -1713 407 1052 -261 -971 -68
4619 -68 445 -645 -540 799 642 -1042 -922 861 348 -423 226 1133 -401 -1224 403 1237 -16 -1161
4637 -1161 195 803 -355 -1081 816 992 -823 -639 900 738 -1061 -430 618 613 -738 -75 1137
4654 1137 15 -1132 -120 1185 71 -890 127 1038 -379 -934 1009 1422 -878 -1082 666 935
$$ packed form
4528E86j231j8J444k83o77M25M06r64m25Q27Q30r01n00P59K44p71J4R54k50j196
4548g27L21J358j56j334K19P70J04j023L51Q57q83p47J036R02j141o58R17P61
4566I27j161k60R36K05j426K07J190k74r91K39P55n48n31O69J257r33j490J003
4584b26J324o99j537J084O81j157j67J241K03j068m34J070po86K08P58o42j067
4602a121N33J717m41j345M50O69q55o03J212O40j506j063K120O45j313p10R03
4619f8N13j090J05J339j57j684J20J783n13p71O49R07j534q23J627Q34j253j145
4637a161J356O08j158p26J897J76j815J84J539j62j799O31J048nj351O63J212
4654A137j122j147J012J305j114r61J017R11j417n55J943M13k300k04J748K69
$$ plain form
4670 935 -132 -456 804 420 -927 -391 1254 1015 -649 -99 1000 -206 -1253 195 1134 -268 -900
$$ packed form
4670I35j067l24J260l84j347N36J645k39j664N50J099j206j047J448R39j402o32
$$ [...]
8191A2
##END NTUPLES=NMR FID
##END=
