##TITLE=1H_LacDMe-B2-B
 CDCl3, 8 sc, 
 14.11.2019
##JCAMPDX= 6.0         $$ Bruker NMR JCAMP-DX V2.0
##DATA TYPE= NMR FID
##DATA CLASS= NTUPLES
##ORIGIN= UXNMR, Bruker Analytische Messtechnik GmbH
##OWNER= root
$$ XWIN-NMR		Version 3.5
$$ Thu Nov 14 16:26:12 2019 Russian Standard Time (UT+4h)  she@DPX200
##.OBSERVE FREQUENCY= 200.1315
##.OBSERVE NUCLEUS= ^1H
##.DELAY= (6, 6)
##.ACQUISITION MODE= SIMULTANEOUS
##.ACQUISITION SCHEME= undefined
##.AVERAGES= 8
##.DIGITISER RES= 18
##SPECTROMETER/DATA SYSTEM= spect
##.PULSE SEQUENCE= zg30
##.SOLVENT NAME= CDCl3
##.SHIFT REFERENCE= (INTERNAL, CDCl3, 0, 15.7039)
##AUDIT TRAIL= $$ (NUMBER, WHEN, WHO, WHERE, WHAT)
$$ ##TITLE= Audit trail, XWIN-NMR		Version 3.5
$$ ##JCAMPDX= 5.01
$$ ##ORIGIN= Bruker BioSpin GmbH
$$ ##OWNER= she
$$ F:/spectra/data/she/nmr/H-F/1/audita.txt
$$ ##AUDIT TRAIL=  $$ (NUMBER, WHEN, WHO, WHERE, WHAT)
(   1,<2019-11-14 16:25:12.60 +0400>,<she>,<DPX200>,
      <created by zg, POWCHK disabled, PULCHK disabled
       configuration hash MD5:
       00 E9 B6 7A A2 85 ED C7 34 08 36 98 17 FE 4E 26
       data hash MD5: 16K
       8E E1 C1 A9 39 15 15 06 14 B5 64 7A 6E FA 44 FB>)
$$ ##END=
$$ 
$$ hash MD5
$$ 0D 88 8F CC 0F 16 2A D4 71 45 65 19 3F F7 08 32
##$RELAX= 
##$RELAX= 
##$RELAX= 
##$RELAX= 
##$RELAX= 
##$RELAX= 
$$ Bruker specific parameters
$$ --------------------------
##$DU= <F:/spectra>
##$EXPNO= 1
##$NAME= <H-F>
##$PROCNO= 1
##$TYPE= <nmr>
##$USER= <she>
##$AMP= (0..31)
100 100 100 100 100 100 100 100 100 100 100 100 100 100 100 100 100 100 
100 100 100 100 100 100 100 100 100 100 100 100 100 100 
##$AQSEQ= 0
##$AQ_mod= 1
##$AUNM= <au_zg>
##$AUTOPOS= <>
##$BF1= 200.13
##$BF2= 200.13
##$BF3= 200.13
##$BF4= 200.13
##$BF5= 200.13
##$BF6= 200.13
##$BF7= 200.13
##$BF8= 200.13
##$BYTORDA= 1
##$CFDGTYP= 0
##$CFRGTYP= 5
##$CHEMSTR= <none>
##$CNST= (0..31)
1 1 145 1 1 1 1 1 1 1 1 1 1 1 1 1 1 1 1 1 1 1 1 1 1 1 1 1 1 1 1 1 
##$CPDPRG= <>
##$CPDPRG1= <>
##$CPDPRG2= <>
##$CPDPRG3= <>
##$CPDPRG4= <mlev>
##$CPDPRG5= <mlev>
##$CPDPRG6= <mlev>
##$CPDPRG7= <mlev>
##$CPDPRG8= <mlev>
##$CPDPRGB= <>
##$CPDPRGT= <>
##$D= (0..31)
0 1.2 0 0 0 0 0 0 0 0.06 0 0.03 0 0 0 0 0.0002 0 0 0 0 0 0 0 0 0 0 0 0 
0 0 0 
##$DATE= 1573734312
##$DBL= (0..7)
120 120 120 120 120 120 120 120 
##$DBP= (0..7)
150 150 150 150 150 150 150 150 
##$DBP07= 0
##$DBPNAM0= <>
##$DBPNAM1= <>
##$DBPNAM2= <>
##$DBPNAM3= <>
##$DBPNAM4= <>
##$DBPNAM5= <>
##$DBPNAM6= <>
##$DBPNAM7= <>
##$DBPOAL= (0..7)
0.5 0.5 0.5 0.5 0.5 0.5 0.5 0.5 
##$DBPOFFS= (0..7)
0 0 0 0 0 0 0 0 
##$DE= 6
##$DECBNUC= <off>
##$DECIM= 24
##$DECNUC= <off>
##$DECSTAT= 4
##$DIGMOD= 1
##$DIGTYP= 9
##$DL= (0..7)
0 120 120 120 120 120 120 120 
##$DP= (0..7)
150 150 150 150 150 150 150 150 
##$DP07= 0
##$DPNAME0= <>
##$DPNAME1= <>
##$DPNAME2= <>
##$DPNAME3= <>
##$DPNAME4= <>
##$DPNAME5= <>
##$DPNAME6= <>
##$DPNAME7= <>
##$DPOAL= (0..7)
0.5 0.5 0.5 0.5 0.5 0.5 0.5 0.5 
##$DPOFFS= (0..7)
0 0 0 0 0 0 0 0 
##$DQDMODE= 0
##$DR= 18
##$DS= 0
##$DSLIST= <SSSSSSSSSSSSSSS>
$$ [...]
##$SUBNAM2= <"">
##$SUBNAM3= <"">
##$SUBNAM4= <"">
##$SUBNAM5= <"">
##$SUBNAM6= <"">
##$SUBNAM7= <"">
##$SUBNAM8= <"">
##$SUBNAM9= <"">
##$SW= 24.0689530833862
##$SWIBOX= (0..15)
0 0 2 0 0 0 0 0 0 0 0 0 0 0 0 0 
##$SW_h= 4816.95568400771
##$TD= 16384
##$TD0= 1
##$TE= 0
##$TE2= 300
##$TE3= 300
##$TEG= 300
##$TL= (0..7)
0 120 120 120 120 120 120 120 
##$TP= (0..7)
150 150 150 150 150 150 150 150 
##$TP07= 0
##$TPNAME0= <>
##$TPNAME1= <>
##$TPNAME2= <>
##$TPNAME3= <>
##$TPNAME4= <>
##$TPNAME5= <>
##$TPNAME6= <>
##$TPNAME7= <>
##$TPOAL= (0..7)
0.5 0.5 0.5 0.5 0.5 0.5 0.5 0.5 
##$TPOFFS= (0..7)
0 0 0 0 0 0 0 0 
##$TUNHIN= 0
##$TUNHOUT= 0
##$TUNXOUT= 0
##$USERA1= <user>
##$USERA2= <user>
##$USERA3= <user>
##$USERA4= <user>
##$USERA5= <user>
##$V9= 5
##$VALIST= <valist>
##$VCLIST= <CCCCCCCCCCCCCCC>
##$VD= 0
##$VDLIST= <DDDDDDDDDDDDDDD>
##$VPLIST= <PPPPPPPPPPPPPPP>
##$VTLIST= <TTTTTTTTTTTTTTT>
##$WBST= 1024
##$WBSW= 4
##$XGAIN= (0..3)
0 0 0 0 
##$XL= 0
##$YL= 0
##$YMAX_a= 585992
##$YMIN_a= -479823
##$ZGOPTNS= <>
##$ZL1= 120
##$ZL2= 120
##$ZL3= 120
##$ZL4= 120
##$ABSF1= 10
##$ABSF2= 0
##$ABSG= 5
##$ABSL= 3
##$ALPHA= 0
##$AQORDER= 0
##$ASSFAC= 0
##$ASSFACI= 0
##$ASSFACX= 0
##$ASSWID= 0
##$AUNMP= <proc_1d>
##$AZFE= 0.1
##$AZFW= 0.1
##$BCFW= 1
##$BC_mod= 2
##$BYTORDP= 1
##$COROFFS= 0
##$CY= 11.3945322036743
##$DATMOD= 1
##$DC= 2
##$DFILT= <>
##$DTYPP= 0
##$F1P= 16.9975609425685
##$F2P= -3.02152046262296
##$FCOR= 0.5
##$FTSIZE= 0
##$FT_mod= 4
##$GAMMA= 1
##$GB= 0.15
##$INTBC= 1
##$INTSCL= 1
##$ISEN= 128
##$LB= 0.24
##$LEV0= 0
##$LPBIN= 0
##$MAXI= 10000
##$MC2= 0
##$MEAN= 0
##$ME_mod= 0
##$MI= 1.114404
##$NCOEF= 0
##$NC_proc= 0
##$NLEV= 6
##$NOISF1= 3.799351
##$NOISF2= 2.8
##$NSP= 1
##$NTH_PI= 0
##$NZP= 0
##$OFFSET= 15.70392
##$PC= 1
##$PHC0= -9453.358
##$PHC1= 13.80088
##$PH_mod= 1
##$PKNL= yes
##$PPARMOD= 0
##$PSCAL= 0
##$PSIGN= 0
##$REVERSE= no
##$SF= 200.130013532006
##$SI= 16384
##$SIGF1= 3
##$SIGF2= 2
##$SINO= 400
##$SIOLD= 16384
##$SREGLST= <1H.CDCl3>
##$SSB= 0
##$STSI= 0
##$STSR= 0
##$SW_p= 3612.71676300578
##$SYMM= 0
##$S_DEV= 0
##$TDeff= 0
##$TDoff= 0
##$TI= <>
##$TILT= no
##$TM1= 0
##$TM2= 0
##$TOPLEV= 0
##$USERP1= <user>
##$USERP2= <user>
##$USERP3= <user>
##$USERP4= <user>
##$USERP5= <user>
##$WDW= 1
##$XDIM= 8192
##$YMAX_p= 0
##$YMIN_p= 0
$$ End of Bruker specific parameters
$$ ---------------------------------
##NTUPLES= NMR FID
##VAR_NAME=  TIME,          FID/REAL,        FID/IMAG
##SYMBOL=    X,             R,               I
##VAR_TYPE=  INDEPENDENT,   DEPENDENT,       DEPENDENT
##VAR_FORM=  AFFN,          ASDF,            ASDF
##VAR_DIM=   8192,          8192,            8192
##UNITS=     SECONDS,       ARBITRARY UNITS, ARBITRARY UNITS
##FACTOR=    0.0002076,     1,               1
##FIRST=     0,             0,               0
##LAST=      1.7004516,     0,               0
##MIN=       0,             -479823,         0
##MAX=       1.7004516,     585992,          0
$$ Real data points
##PAGE= N=1
##DATA TABLE= (X++(R..R)), XYDATA
$$ plain form
0 0 0 0 0 0 0 8 0 0 0 8 -5 0 -8 8 -8 12 -16 21 -24 28 -32 39 -46 52 -61 75 -83 93 -106 123 -141 157 -175 202
34 202 -226 249 -278 311 -346 384 -426 470 -522 575 -636 705 -781 864 -957 1064 -1181 1319
52 1319 -1475 1654 -1865 2097 -2342 2514 -2227 -855 45393 585992 325513 -400482 -243018
65 -243018 253805 97539 -267376 26087 375196 33409 -367179 -53950 338489 108953
75 108953 -201561 8769 205043 -64902 -234006 100711 321676 25937 -216873 -7353
85 -7353 161292 -16794 -90525 154996 221211 -75287 -198399 89641 275501 74542 -103290
96 -103290 13939 118702 29315 15176 157531 152953 -39392 -79478 89277 144604 29452
107 29452 17575 120695 83810 -51892 -18250 132142 129016 6766 -5610 60403 47028
$$ packed form
0@%%%%%Qq%%Qj3NqJ6j6K0k8L7m5N2o0P1q5R8j13J36j58J76j99K29k64K98l32L77
34B02m28M75n27N89o57P30q10Q96r92J097j211J341j486J645j821K021k245K500
52A319k794L129l519L962m439M856m741J372M6248N40599k60479p25995J57464
65b43018M96823j56266l64915K93463L49109l41787m00588L13229L92439k29536
75A08953l10514K10330J96274k69945j69104L34717K20965k95739k42810K09520
85g353J68645j78086p3731K45521O6215k96498j23112K88040J85860k00959j77832
96a03290J17229J04763q9387j4139J42355m578j92345m0086J68755N5327j15152
107B9452j1877J03120l6885j35702L3642J50392l126j22250j2376O6013j3375
$$ plain form
118 47028 26987 102966 133472 22356 -45112 42494 110835 64385 55924 118696 75808 -47786
130 -47786 -14801 147891 153543 -8779 -46746 86320 126700 15066 -19621 75535 97208
141 97208 2372 -24811 52262 75537 26277 31732 70485 20238 -48709 17621 122921 72098
153 72098 -48582 -17785 97732 75812 -27278 -4415 83235 39654 -52758 6924 118419
164 118419 61379 -69660 -42316 74499 62102 -31883 -25757 39585 22746 -24805 1088 30717
176 30717 -9845 -32442 14245 24345 -34019 -36068 39528 47713 -37109 -64499 1371 30782
188 30782 -11859 -21862 12187 -1857 -47741 -28657 25388 9514 -48713 -45028 -3599 -11244
200 -11244 -36657 -10425 12389 -39798 -88328 -41798 23087 -2446 -59163 -47730 -14024 -36902
$$ packed form
118D7028k0041P5979L0506j11116o7468Q7606O8341m6450q461O2772m2888j23594
130d7786L2985J62692N652j62322l7967J33066M0380j11634l4687R5156K1673
141I7208r4836k7183P7073K3275m9260N455L8753n0247o8947O6330J05300n0823
153G2098j20680L0797J15517k1920j03090K2863Q7650m3581r2412N9682J11495
164A18419n7040j31039K7344J16815j2397r3985O126O5342j6839m7551K5893K9629
176C0717m0562k2597M6687J0100n8364k049P5596Q185q4822k7390O5870K9411
188C0782m2641j0003L4049j4044m5884J9084N4045j5874n8227L685M1429p645
200a1244k5413K6232K2814n2187m8530M6530O4885k5533n6717J1433L3706k2878
$$ plain form
212 -36902 -60117 -19953 10049 -36638 -80126 -47311 -8740 -22529 -31094 -11689 -35591 -92540
224 -92540 -71762 15426 26598 -54270 -88998 -44748 -26866 -52671 -36865 1345 -31904 -98126
236 -98126 -83183 -13907 -2494 -42663 -55074 -49290 -66919 -68220 -24197 749 -33394 -64236
248 -64236 -54269 -49881 -58203 -28709 13620 -14022 -86069 -90286 -23228 11770 -15223 -42936 -49562
261 -49562 -58870 -56102 -20623 6153 -16948 -52742 -55858 -44540 -39026 -19543 4006 -12293 -59650
274 -59650 -66955 -24140 4614 -5717 -19489 -24209 -38558 -45743 -14436 24798 15785 -26661 -43908
287 -43908 -25365 -5447 6038 15774 8685 -21638 -39303 -16582 17050 22399 5851 -8838 -18756
300 -18756 -20180 -1153 27634 32095 5644 -17225 -12419 6163 22404 33658 31480 9763 -9854
$$ packed form
212c6902k3215M0164L0002m6687m3488L2815L8571j3789q565J9405k3902n6949
224i2540K0778Q7188J1172q0868l4728M4250J7882k5805J5806L8210l3249o6222
236i8126J4943O9276J1413m0169j2411N784j7629j301M4023K4946l4143l0842
248f4236R967M388q322K9494M2329k7642p2047m217O7058L4998k6993k7713o626
261d9562r308K768L5479K6776k3101l5794l116J1318N514J9483K3549j6299m7357
274e9650p305M2815K8754j0331j3772m720j4349p185L1307L9234r013m2446j7247
287d3908J8543J9918J1485R736p089l0323j7665K2721L3632N349j6548j4689r918
300a8756j424J9027K8787M461k6451k2869M806J8582J6241J1254k178k1717j9617
$$ plain form
313 -9854 222 30942 47101 37809 21106 9491 5357 16465 42321 57173 40107 8494 662
326 662 21279 43600 48083 38314 24626 14527 16803 33537 49610 48336 32796 20491 21332 30855
340 30855 44691 56745 54517 32949 13975 23116 51521 64982 51199 32006 26673 30633 39227
353 39227 52319 57217 38611 14227 18465 45472 57088 42347 29184 28691 24476 21981 36465
366 36465 53032 43050 19325 18507 34039 37354 32707 37918 37182 17998 11477 36405 53317 33956
380 33956 11311 18539 28304 18556 17323 37061 37831 7973 -5844 17160 32186 17146 7050
393 7050 16082 12002 -4493 3359 30192 28030 -2901 -14728 1403 11934 12054 18346 17314 -7359
407 -7359 -24637 -3543 24374 16797 -6085 -9361 -6086 -14039 -9488 15664 17938 -18735 -43769
$$ packed form
313i854J0076L0720J6159r292j6703j1615m134J1108K5856J4852j7066l1613p832
326F62K0617K2321M483r769j3688j0099K276J6734J6073j274j5540j2305Q41R523
340C0855J3836J2054k228k1568j8974R141K8405J3461j3783j9193n333L960Q594
353C9227J3092M898j8606k4384M238K7007J1616j4741j3163m93m215k495J4484
366C6465J6567r982k3725q18J5532L315m647N211p36j9184o521K4928J6912j9361
380C3956k2645P228R765r748j233J9738P70k9858j3817K3004J5026j5040j0096
393G050R032m080j6495P852K6833k162l0931j1827J6131J0531J20O292j032k4673
407g359j7278K1094K7917p577k2882l276L275p953M551K5152K274l6673k5034
$$ plain form
420 -43769 -22162 7292 5929 -7867 -11933 -22299 -37509 -27569 4435 11863 -16960 -37977 -29865
433 -29865 -18365 -14197 -5252 221 -20777 -47481 -39288 -7916 2261 -12294 -21957 -28679 -43450
446 -43450 -43460 -11601 12094 -11324 -51031 -53662 -28417 -14171 -14942 -15913 -25656 -47891 -53501 -27508
460 -27508 -1162 -7747 -30825 -43568 -44152 -37900 -20944 -2852 -8898 -37180 -53089 -39701 -17730
473 -17730 -10619 -15127 -23377 -37493 -48654 -39448 -11635 1261 -17416 -43875 -49029 -35775 -22185
486 -22185 -12427 -6456 -18004 -46119 -56348 -28353 2921 -367 -24885 -38069 -37103 -32703 -16052
499 -16052 7259 4822 -30371 -53004 -33402 -2736 4661 -3282 -13747 -28641 -39229 -22400 6714
512 6714 8975 -13563 -26185 -22218 -19746 -13114 7378 15484 -12003 -39554 -25164 7911 14485
$$ packed form
420d3769K1607K9454j363j3796m066j0366j5210R940L2004P428k8823k1017Q112
433b9865J1500M168Q945N473k0998k6704Q193L1372J0177j4555r663o722j4771
446d3450j0L1859K3695k3418l9707k631K5245J4246p71r71r743k2235n610K5993
460b7508K6346o585k3078j2743n84O252J6956J8092o046k8282j5909J3388K1971
473a7730P111m508q250j4116j1161R206K7813J2896j8677k6459n154J3254J3590
486b2185R758N971j1548k8115j0229K7995L1274l288k4518j3184R66M400J6651
499a6052K3311k437l5193k2633J9602L0666P397p943j0465j4894j0588J6829K9114
512F714K261k2538j2622L967K472O632K0492Q106k7487k7551J4390L3075O574
$$ plain form
525 14485 313 -4210 -3490 -14255 -17606 3592 23339 15929 -4605 -11406 -4790 4885 18044 24410
539 24410 9609 -11958 -8987 14256 24700 17262 12442 12093 950 -6190 12069 36787 31313
552 31313 5331 -2540 11350 22561 23793 26643 24593 12388 6595 19981 33971 32318 25793
565 25793 22875 17087 12561 23757 41785 39987 21483 13696 21331 28432 29635 33120 32265 21595
579 21595 16297 25831 34392 31668 27410 27947 23790 18361 25841 40455 38574 22515 16476 26154 34512
594 34512 32874 29010 25614 23433 26759 31918 29947 23179 22953 26055 22910 18895 25369 32873 25639
609 25639 10998 10034 23495 29696 22260 13073 12487 17431 19340 17669 16361 17920 17104 10363 5164
624 5164 11454 23781 23923 8382 -3512 2701 16487 18368 8258 2532 3804 3118 -559 2023
$$ packed form
525A4485j4172m523P20j0765l351K1198J9747p410k0534o801O616R675J3159O366
539B4410j4801k1567K971K3243J0444p438m820l49j1143p140J8259K4718n474
552C1313k5982p871J3890J1211J232K850k050j2205n793J3386J3990j653o525
565B5793k918n788m526J1196J8028j798j8504p787P635P101J203L485q55j0670
579B1595n298R534Q561k724m258N37m157n429P480J4614j881j6059o039R678Q358
594C4512j638l864l396k181L326N159j971o768k26L102l145m015O474P504p234
609B5639j4641r64J3461O201p436r187n86M944J909j671j308J559q16o741n199
624E164O290J2327J42j5541j1894O213J3786J881j0110n726J272o86l677K582
$$ plain form
638 2023 10520 10329 -3328 -14238 -9600 3915 10885 4968 -8706 -18777 -14256 259 7390 -229
652 -229 -11214 -13902 -13167 -13483 -6926 4727 2619 -18441 -32127 -20574 -587 3801 -7714 -20457
666 -20457 -27648 -27373 -16373 -3396 -3432 -16612 -29522 -31267 -25538 -14723 -4577 -6668 -23720 -39704
680 -39704 -35968 -15552 -809 -5549 -23819 -36841 -33786 -20879 -10433 -8845 -13414 -24104 -37192
693 -37192 -38277 -19374 431 -4524 -28372 -43104 -36664 -19834 -6608 -6227 -20880 -37629 -38689
706 -38689 -24228 -12294 -9635 -11534 -20609 -37840 -42101 -17886 7707 244 -28957 -41628 -28690
719 -28690 -13118 -6824 -4835 -10972 -26292 -34954 -25475 -8545 -254 -3429 -16584 -34195 -36112 -12544
733 -12544 10640 2967 -22060 -30652 -20819 -12789 -8087 1860 4007 -14767 -31893 -23157 367 9938
$$ packed form
638B023Q497j91j3657j0910M638J3515O970n917j3674j0071M521J4515P131p619
652b29j0985k688P35l16O557J1653k108k1060j3686J1553J9987M388j1515j2743
666b0457p191K75J1000J2977l6j3180j2910j745N729J0815J0146k091j7052j5984
680c9704L736K0416J4743m740j8270j3022L055J2907J0446J588m569j0690j3088
693c7192j085J8903J9805m955k3848j4732O440J6830J3226L81j4653j6749j060
706c8689J4461J1934K659j899r075j7231m261K4215K5593p463k9201j2671J2938
719b8690J5572O294J989o137j5320q662R479J6930Q291l175j3155j7611j917K3568
733a2544K3184p673k5027q592R833Q030M702R947K147j8774j7126Q736K3524R571
$$ plain form
747 9938 3053 -7951 -18927 -22868 -9119 12790 14591 -5477 -20070 -13761 -3186 1474 7677
760 7677 11047 -983 -18863 -16257 5584 19106 12112 -699 -8030 -8709 -138 14929 20667 7917
774 7917 -5805 -4209 6751 12727 15669 17747 10662 -2732 -4277 12175 27430 24614 9437 -537
788 -537 2902 14570 23720 22983 14100 7775 8474 12240 18229 26084 26438 13535 2365 8868 25736
803 25736 32795 24811 14194 9581 13033 22882 29688 25388 17982 16706 18807 18051 20863 30666 30572
818 30572 15373 6527 18071 32387 29837 20488 18336 18260 15647 18988 27561 28470 20027 14689 16566
833 16566 19289 22255 27020 25624 13867 7172 16387 29070 27898 18028 12425 12154 11955 16877 25667
848 25667 25211 12960 3307 7317 18026 22028 18300 11963 5231 1277 7784 20809 22846 8971
$$ packed form
747I938o885j1004j0976l941J3749K1909J801k0068j4593O309J0575M660O203
760G677L370j2030j7880K606K1841J3522o994j2811p331o79Q571J5067N738j2750
774G917j3722J596J0960N976K942K078p085j3394j545J6452J5255k816j5177r974
788e37L439J1668R150p37q883o325O99L766N989P855L54j2903j1170O503J6868
803B5736P059p984j0617m613L452R849O806m300p406j276K101p56K812R803r4
818C0572j5199q846J1544J4316k550r349k152p6k613L341Q573R09q443n338J877
833A6566K723K966M765j396j1757o695R215J2683j172r870n603k71j99M922Q790
848B5667m56j2251r653M010J0709M002l728o337o732l954O507J3025K037j3875
$$ plain form
862 8971 -4115 -1839 7214 12431 13943 12824 3745 -7334 -6071 6919 14483 9051 47 -6360
876 -6360 -9458 -4227 9332 13333 -1224 -15702 -13151 -3384 -472 725 3147 -4635 -20280 -22095
890 -22095 -4764 6896 -801 -13119 -18225 -18780 -14263 -3428 1588 -9449 -24548 -23939 -14579 -8624
904 -8624 -6407 -6032 -14910 -28554 -28654 -12873 -1663 -8274 -19635 -24927 -24967 -21679 -12341 -5965 -12084
919 -12084 -25404 -31342 -25027 -14340 -7771 -9821 -20936 -31005 -30166 -18853 -9483 -8614 -15893 -25442
933 -25442 -31052 -25832 -12593 -5122 -11691 -24290 -29551 -25199 -15709 -8335 -7976 -16949 -28752 -28754 -17281
948 -17281 -7220 -7012 -13862 -21209 -25875 -22147 -10646 -3183 -8902 -19782 -22182 -16850 -12352 -8603
962 -8603 -4707 -8023 -19115 -23438 -12198 -594 -2344 -10240 -13353 -13964 -13900 -7668 967 3 -10202
$$ packed form
862H971j3086K276R053N217J512j119r079j1079J263J2990P564n432r004o407
876f360l098N231J3559M001j4557j4478K551R767K912J197K422p782j5645j815
890b2095J7331J1660p697j2318n106n55M517J0835N016j1037j5099O09R360N955
904h624K217L75q878j3644j00J5781J1210o611j1361n292m0L288R338O376o119
919a2084j3320n938O315J0687O569k050j1115j0069Q39J1313R370Q69p279r549
933b5442n610N220J3239P471o569j2599n261M352R490P374L59q973j1803kJ1473
948a7281J0061K08o850p347m666L728J1501P463n719j0880k400N332M498L749
962h603L896l316j1092m323J1240J1604j750p896l113o11O4O232Q635r64j0205
$$ plain form
977 -10202 -15151 -10342 -4369 -1894 1054 -795 -9317 -14008 -4939 5209 3965 -2359 -4746 -4778 -5430
992 -5430 -652 7617 7823 -1600 -7020 -2002 4736 6782 5912 4936 620 -1400 3132 9506 10707 7043
1008 7043 3521 2206 3660 9040 13861 12326 5475 2802 7127 11607 13256 12521 10525 7246 6781
1023 6781 10742 16239 16881 12288 8091 8191 13031 17505 18589 14397 10398 10175 12951 16263 19330 19396
1039 19396 14160 9048 10907 18644 23479 19599 13132 11275 13836 17298 20547 22115 18326 12591 10737
1054 10737 15335 21246 22976 19927 14643 10062 11334 19941 25516 20847 13018 11038 13423 15741 19108
1069 19108 22895 19701 9274 5363 14216 22659 21427 15282 11572 9206 7930 13484 22082 20455
1083 20455 10080 3306 6103 11917 16059 18179 14520 4217 -1683 6044 16449 16670 8997 3943
$$ packed form
977a0202m949M809N973K475K948j849q522m691R069J0148j244o324k387l2o52
992e430M778Q269K06r423n420N018O738K046q70r76m316k020M532O374J201l664
1008G043l522j315J454N380M821j535o851k673M325M480J649p35j996l279m65
1023F781L961N497O42m593m197J00M840M474J084m192l999k23K776L312L067O6
1039A9396n236n112J859P737M835l880o467j857K561L462L249J568l789n735j854
1054A0737M598N911J730l049n284m581J272Q607N575m669p829j980K385K318L367
1069A9108L787l194j0427l911Q853Q443j232o145l710k366j276N554Q598j627
1083B0455j0375o774K797N814M142K120l659j0303n900P727J0405K21p673n054
$$ plain form
1097 3943 1520 233 4831 14674 15432 3399 -6916 -3731 4739 8744 8601 5872 -2424 -9823 -6495
1112 -6495 4612 9653 3421 -5583 -10014 -9677 -4371 3747 5477 -3840 -14661 -14918 -7555 -1387 -201
1127 -201 -2495 -10291 -18698 -17560 -6845 1167 -2775 -13458 -19507 -18823 -13248 -6124 -3332 -9341 -19078
1142 -19078 -23830 -18676 -9512 -4673 -9045 -18203 -24829 -22427 -14259 -8157 -8447 -15158 -23042 -26211 -20442
1157 -20442 -10403 -6126 -13111 -23082 -26639 -21417 -13456 -8798 -11714 -19311 -24098 -22545 -17165 -11812
1171 -11812 -9364 -12796 -21036 -26873 -21175 -9430 -5692 -13504 -20848 -21231 -18506 -15369 -10174 -7238 -11897
1186 -11897 -20749 -22473 -14197 -6575 -6314 -10625 -15287 -18878 -15997 -7884 -2644 -7017 -13425 -13560 -11432
1201 -11432 -10453 -6454 -1312 -2897 -12838 -16110 -7138 773 -1189 -6000 -6687 -7023 -7889 -3638 2410 1738
$$ packed form
1097C943k423j287M598R843P58j2033j0315L185Q470M005j43k729q296p399L328
1112f495J1107N041o232r004m431L37N306Q118J730r317j0821k57P363O168J186
1127b01k294p796q407J138J0715Q012l942j0683o049O84N575P124K792o009r737
1142a9078m752N154R164M839m372r158o626K402Q168O102k90o711p884l169N769
1157b0442J0039M277o985r971l557N222P961M658k916p597m787J553N380N353
1171a1812K448l432q240n837N698J1745L738p812p344l83K725L137N195K936m659
1186a1897q852j724Q276P622K61m311m662l591K881Q113N240m373o408j35K128
1201a1432R79L999N142j585r941l272Q972P911j962m811o87l36q66M251O048o72
$$ plain form
1217 1738 -4729 -7035 -3745 -710 351 3277 3415 -2736 -6028 -87 6970 6401 1596 521 1171 1577
1233 1577 4433 8677 7835 3024 868 4452 7515 8117 7884 7952 5463 3769 6557 11501 12063 7385
1249 7385 4480 7137 11275 12313 10274 9163 9756 9242 9386 11133 13898 13988 10529 8914 10676 14175
1265 14175 15598 13669 10428 9585 12308 15545 15513 13025 12735 12550 11638 10890 14560 18372 16709 10020
1281 10020 7440 12637 18187 18055 13639 10909 11169 12791 14816 16656 16518 13397 9915 9085 13193 17942
1297 17942 18696 14167 8854 6975 11242 17156 18446 13177 8118 7974 10540 12609 14704 14695 11092 4951
1313 4951 4326 10496 15861 14667 9535 4949 3461 5724 11666 14706 10896 3848 2007 4137 7208
1328 7208 9907 10689 7076 -31 -2276 3224 9900 10125 4231 -2045 -4002 -1013 4438 7477 4393
$$ packed form
1217A738o467k306L290L035J061K926J38o151l292N941P057n69m805j075O50M06
1233A577K856M244q42m811k156L584L063O02k33O8k489j694K788M944N62m678
1249G385k905K657M138J038k039j111N93n14J44J747K765R0l459j615J762L499
1265A4175J423j929l241q43K723L237l2k488k90j85r12p48L670L812j663o689
1281A0020k580N197N550j32m416k730K60J622K025J840j38l121l482q30M108M749
1297A7942P54m529n313j879M267N914J290n269n059j44K566K069K095rl603o141
1313D951o25O170N365j194n132m586j488K263N942L040l810p048j841K130L071
1328G208K699P82l613p107k245N500O676K25n894o276j957K989N451L039l084
$$ plain form
1343 4393 -1655 -4703 -4058 -1430 2002 4010 868 -6176 -10459 -5524 2242 3808 -2708 -9386 -10762
1358 -10762 -6899 -3341 -2146 -2450 -5668 -11536 -14385 -10928 -4060 -1514 -6228 -14456 -17380 -12837 -6182
1373 -6182 -4459 -8650 -14108 -16956 -15296 -11643 -7672 -6577 -10783 -17459 -20439 -16086 -9035 -6122 -10577
1388 -10577 -18048 -20642 -16048 -11326 -10805 -12300 -14178 -17919 -20434 -16648 -9760 -8486 -14276 -19647 -18904
1403 -18904 -16348 -12776 -9386 -10198 -16639 -20530 -16492 -11087 -10886 -12042 -12479 -14357 -18444 -15594 -7944
1418 -7944 -6391 -12567 -16389 -15046 -12534 -10157 -6564 -6313 -12262 -17038 -12865 -5950 -5798 -8263 -8073 -8589
1434 -8589 -11731 -10751 -4238 -493 -4988 -10671 -9787 -5387 -2661 -1308 -1747 -4604 -7773 -5673 -984 1023
1450 1023 -605 -1068 -1998 -3362 -2187 2343 5202 1613 -3289 -2007 2803 5366 4103 3098 2618 2027
$$ packed form
1343D393o048l048O45K628L432K008l142p044m283M935P766J566o516o678j376
1358a0762L863L558J195l04l218n868k849L457O868K546m714q228k924M543O655
1373f182J723m191n458k848J660L653L971J095m206o676k980M353P051K913m455
1388a0577p471k594M594M722N21j495j878l741k515L786O888J274n790n371P43
1403a8904K556L572L390q12o441l891M038N405K01j156m37j878m087K850P650
1418g944J553o176l822J343K512K377L593K51n949m776M173O915J52k465J90n16
1434h589l142R80O513L745m495n683Q84M400K726J353m39k857l169K100M689K007
1450A023j628m63r30j364J175M530K859l589m902J282M810K563j263j005m80n91
$$ plain form
1466 2027 1978 4194 7636 7806 4699 1975 3307 7279 9862 9223 6068 3988 4870 8666 11641 10714
1482 10714 8418 6920 6670 8018 10923 13146 12481 8399 5759 7658 12559 14949 12659 9317 7842
1497 7842 8490 10890 14152 15663 12627 7752 7094 10941 14666 15301 13338 10397 8330 8671 12794 16480
1513 16480 14944 9918 7571 8943 12679 15221 15295 12204 7608 6213 10098 14868 15408 11869 8807
1528 8807 6696 7043 10850 15432 14686 8245 3371 6289 11372 13222 12185 9720 6642 3528 5083
1543 5083 11584 15074 10716 4235 2117 4520 8506 11467 10545 6190 1112 1069 5818 9180 8751 6051
1559 6051 2167 -953 -444 6064 10108 6499 -434 -2742 -274 3248 5247 5555 2732 -2856 -4748
1574 -4748 -1092 4345 5082 1159 -3991 -5569 -3799 226 3030 1325 -3834 -7665 -7361 -3762 -42
$$ packed form
1466B027m9K216L442J70l107k724J332L972K583o39l155k080Q82L796K975r27
1482A0714k296j498k50J348K905K223o65m082k640J899M901K390k290l342j475
1497G842O48K400L262J511l036m875o58L847L725O35j963k941k067L41M123L686
1513A6480j536n026k347J372L736K542P4l091m596j395L885M770N40l539l062
1528H807k111L47L807M582p46o441m874K918N083J850j037k465l078l114J555
1543E083O501L490m358o481k118K403L986K961r22m355n078m3M749L362m29k700
1559F051l884l120N09O508M044l609o933k308K468L522J999L08k823n588j892
1574d748L656N437P37l923n150j578J770M025K804j705n159l831L04L599L720
$$ plain form
1589 -42 646 -3527 -8500 -10345 -6848 -2357 -1047 -4412 -9210 -10852 -9064 -5578 -3596 -4179 -7564 -12027
1605 -12027 -12860 -8810 -4566 -4402 -8769 -12739 -13627 -10734 -8323 -7031 -7571 -11285 -15432 -15213 -10041 -6653
1621 -6653 -8474 -12416 -14835 -14621 -12777 -9502 -7835 -10503 -14868 -15216 -12589 -10601 -9744 -9422 -11643 -15607
1637 -15607 -15826 -10348 -6578 -9913 -13485 -13529 -12514 -12570 -11082 -7454 -8805 -13592 -14905 -10810 -7881 -9209
1653 -9209 -9938 -9641 -11281 -11919 -9091 -5172 -7036 -10213 -10519 -8512 -7341 -6401 -4422 -5226 -9130 -9633 -5471
1670 -5471 -2744 -4157 -6045 -5634 -5245 -5408 -3489 -787 -1629 -4937 -5773 -2590 21 830 -389 -1552
1686 -1552 -2274 -1888 434 3025 2989 980 -574 467 2553 4475 5342 3823 881 1054 3748 7161
1702 7161 7116 5115 3665 3665 4453 6610 8929 9132 6454 4062 4823 8301 11210 10432 7802 5547 5893
$$ packed form
1589d2O88m173m973j845L497M491J310l365m798j642J788L486J982n83l385m463
1605a2027q33M050M244J64m367l970q88K893K411J292n40l714m147K19N172L388
1621f653j821l942k419K14J844L275J667k668m365l48K627J988Q57L22k221l964
1637a5607k19N478L770l335l572m4J015n6J488L628j351m787j313M095K929j328
1653i209p29K97j640o38K828L919j864l177l06K007J171R40J979q04l904n03M162
1670e471K727j413j888M11L89j63J919K702q42l308q36L183K611Q09j219j163
1686a552p22L86K322K591l6k009j554J041K086J922Q67j519k942J73K694L413
1702G161m5k001j450%P88K157K319K03k678k392P61L478K909p78k630k255L46
$$ plain form
1719 5893 8254 11297 12154 10609 8092 5855 7031 11201 14267 12825 8944 6698 7912 10638 13208
1734 13208 13789 11383 7257 6841 9726 13371 14329 12402 9134 6200 7083 12436 15641 12881 8449 6998
1750 6998 7659 9207 11842 14199 12028 6431 4185 8072 12771 12687 10387 7442 5405 4791 8723 13275
1766 13275 11960 7084 3622 4301 6445 9314 11310 9252 3713 851 4064 8888 9674 7009 4669
1781 4669 2047 1163 3576 8391 9010 4448 -792 -596 2685 4911 6152 5088 1214 -2401 -1707 3020
1797 3020 5906 3781 77 -2430 -2728 -738 2548 4287 850 -4035 -5036 -2568 298 1258 1016 -2052
1813 -2052 -6518 -6396 -2349 1195 -447 -4157 -6421 -6476 -5261 -2401 -772 -2661 -6500 -8783 -7422 -4057
1829 -4057 -1996 -3026 -6823 -9671 -8690 -5937 -4054 -4797 -6433 -8529 -10362 -8671 -5701 -4511 -6537
$$ packed form
1719E893K361L043Q57j545k517k237J176M170L066j442l881k246J214K726K570
1734A3208N81k406m126m16K885L645R58j927l268k934Q83N353L205k760m432j451
1750F998O61J548K635K357k171n597k246L887M699q4k300k945k037o14L932M552
1766A3275j315m876l462O79K144K869J996k058n539k862L213M824P86k665k340
1781D669k622q84K413M815O19m562n240J96L281K226J241j064l874l615O94M727
1797C020K886k125l704k507k98J990L286J739l437m885j001K468K866R60k42l068
1813b052m466J22M047L544j642l710k264n5J215K860J629j889l839k283J361L365
1829d057K061j030l797k848R81K753J883p43j636k096j833J691K970J190k026
$$ plain form
1844 -6537 -9537 -11060 -10290 -7682 -5571 -6159 -9429 -11244 -10241 -8550 -7610 -7245 -7351 -9799 -12022 -10669
1860 -10669 -7387 -6063 -8851 -11138 -10836 -10261 -9516 -7819 -7304 -9497 -12058 -11327 -8635 -7729 -8514 -8646 -9223
1877 -9223 -10543 -10292 -7223 -6027 -8093 -10279 -9439 -7647 -7544 -6639 -5813 -7551 -9549 -8555 -6012 -4895
1893 -4895 -6587 -6996 -6661 -6878 -6933 -4895 -2828 -4666 -7549 -6816 -3607 -2376 -3405 -4225 -4237 -4588 -4208 -1902
1911 -1902 -455 -1103 -2617 -3067 -2326 -741 522 1136 -385 -2156 -1488 1470 3293 1537 602 731 763
1928 763 1212 2945 4930 4555 2003 613 2198 5030 6529 6083 3950 2682 3642 6316 7517 7427 6213
1945 6213 5002 4463 5461 8400 9914 8652 6050 4681 6111 9220 10911 10135 7416 5686 6834 9055
1961 9055 10339 11025 10023 7398 5916 7647 11341 12378 10192 7517 6712 7864 9864 12301 11839 8714
$$ packed form
1844f537l000j523P70K608K111n88l270j815J003J691R40L65j06k448k223J353
1860a0669L282J324k788k287L02N75P45J697N15k193k561P31K692R06p85j32n77
1877i223j320K51L069J196k066k186Q40J792J03R05Q26j738j998R94K543J117
1893d895j692m09L35k17n5K038K067j838k883P33L209J231j029q20j2l51L80K306
1911a902J447o48j514m50P41J585J263O14j521j771O68K958J823j756r35J29L2
1928G63M49J733J985l75k552j390J585K832J499m46k133j268R60K674J201r0j214
1945F213j211n39R98K939J514j262k602j369J430L109J691p76k719j730J148K221
1961I055J284O86j002k625j482J731L694J037k186k675q05J152K000K437m62l125
$$ plain form
1977 8714 5960 6736 9617 11482 11127 9555 7678 6070 6336 10055 12493 10160 6567 4965 6351 8459
1993 8459 10029 10247 7695 4409 4250 6953 9081 8830 7433 5541 3702 3106 5923 9268 8275 3684
2009 3684 1266 3205 5332 6178 5668 4826 2389 611 1578 4728 5928 3763 1311 -246 -348 2141
2025 2141 4757 3659 336 -2460 -990 1537 1329 1374 947 -870 -3804 -3266 557 2530 -408 -3630
2041 -3630 -4364 -3104 -1783 -245 -346 -2739 -5107 -5185 -3344 -1660 -1702 -2878 -4370 -6547 -6000 -3477 -1814
2058 -1814 -3035 -6003 -6947 -6286 -5058 -3927 -4048 -5280 -7407 -7467 -6532 -4575 -4184 -6010 -7549 -8226 -7174
2075 -7174 -5581 -5215 -5448 -6933 -8717 -8358 -6137 -5014 -6384 -7972 -8245 -7722 -7341 -6634 -5844 -7038 -8554
2092 -8554 -9274 -7718 -6285 -6033 -6929 -8324 -8986 -8267 -6190 -5412 -6641 -8233 -8178 -7510 -7028 -6518 -5507 -6156
$$ packed form
1977H714k754P76K881J865l55j572j877j608K66L719K438k333l593j602J386K108
1993H459J570K18k552l286j59K703K128k51j397j892j839n96K817L345r93m591
2009C684k418J939K127Q46n10q42k437j778R67L150J200k165k452j557j02K489
2025B141K616j098l323k796J470K527k08M5m27j817k934N38L823J973k938l222
2041c630p34J260J321J538j01k393k368p8J841J684m2j176j492k177N47K523J663
2058a814j221k968r44O61J228J131j21j232k127o0R35J957L91j826j539o77J052
2075g174J593L66k33j485j784L59K221J123j370j588k73N23L81P07P90j194j516
2092h554p20J556J433K52q96j395o62P19K077P78j229j592N5O68M82N10J011o49
$$ plain form
2110 -6156 -7739 -8859 -6888 -4347 -4510 -6863 -7849 -7011 -6097 -5409 -4877 -4772 -6135 -7231 -6288 -4457 -3649
2127 -3649 -4083 -5081 -6007 -6165 -4098 -2119 -2513 -4258 -5418 -4363 -2847 -2188 -1590 -1334 -3084 -4656 -3463
2144 -3463 -517 602 -681 -1877 -2810 -2082 -702 716 1364 42 -1648 -1914 162 2037 2850 1927
2160 1927 81 -667 463 3158 4453 4334 2281 1054 1399 3572 5646 5573 4798 2656 2284 3772 6131
2177 6131 7540 5601 3828 3413 4269 5872 7693 8220 6340 3474 3756 6653 8981 8628 7090 5802
2193 5802 4924 5849 8130 9744 9185 6755 5311 5869 7976 9671 9695 8229 5698 5240 7435 9703 10069
2210 10069 8532 6778 5574 6023 7777 9940 9676 7209 5141 5546 7818 9144 8729 7221 5939 5146
2226 5146 5494 7756 9458 7893 5229 4018 5072 5985 7543 7990 5681 3532 2968 4727 6365 6419
$$ packed form
2110f156j583j120J971K541j63k353r86Q38R14O88N32J05j363j096R43J831Q08
2127c649m34r98r26j58K067J979l94j745j160J055J516O59N98K56j750j572J193
2144c463K946J119j283j196r33P28J380J418O48j322j690k66K076J875Q13r23
2160A927j846p48J130K695J295j19k053j227L45K173K074p3p75k142l72J488K359
2177F131J409j939j773m15Q56J603J821N27j880k866K82K897K328l53j538j288
2193E802q78R25K281J614n59k430j444N58K107J695K4j466k531m58K195K268L66
2210A0069j537j754j204M49J754K163k64k467k068M05K272J326m15j508j282p93
2226E146L48K262J702j565k664j211J054R13J558M47k309k149n64J759J638N4
$$ plain form
2242 6419 4646 3688 2240 2082 4269 6065 5074 2134 795 1718 2526 3313 3854 2772 659 -1069 512
2259 512 2484 2648 1394 -335 -1020 -843 -152 1203 681 -882 -2317 -2097 -1230 -603 -329 -1216 -2905 -3543
2277 -3543 -3386 -1444 -1269 -2240 -3675 -4306 -4116 -3386 -2537 -2562 -3780 -5368 -5419 -4270 -3338 -3273 -4707 -5594 -5874
2296 -5874 -5208 -4557 -4261 -5073 -5643 -6368 -6088 -4892 -5050 -5263 -6288 -6405 -6559 -5971 -5318 -5162 -6014 -7134 -6767
2315 -6767 -6352 -5448 -5813 -6251 -6410 -7149 -6611 -5651 -5044 -6322 -7264 -6769 -6265 -6065 -5651 -5180 -6056 -7274 -6738
2334 -6738 -5330 -4782 -5482 -6311 -6154 -5784 -5623 -5097 -4284 -4975 -6358 -5995 -4800 -4048 -4193 -4202 -5336 -5916 -5333
2353 -5333 -3663 -2824 -3429 -4702 -5067 -4615 -3577 -2802 -2340 -3079 -4252 -4669 -3138 -1288 -1488 -2294 -3155 -3560
2371 -3560 -3053 -1446 -591 -726 -1868 -3167 -2616 -1042 543 632 -477 -1759 -1968 -991 1190 2292 942
$$ packed form
2242F419j773r58j448j58K187J796r91k940j339R23Q08P87N41j082k113j728J581
2259E12J972J64j254j729o85J77O91J355n22j563j435K20Q67O27K74q87j689o38
2277c543J57J942J75r71j435o31J90P30Q49k5j218j588n1J149R32O5j434q87k80
2296e874O66O51K96q12n70p25K80J196j58k13j025j17j54N88O53J56q52j120L67
2315f767M15R04l65m38j59p39N38R60O07j278r42M95N04K00M14M71q76j218N36
2334f738J408N48p00q29J57L70J61N26Q13o91j383L63J195P52j45rj134n80N83
2353e333J670Q39o05j273l65M52J038P75M62p39j173m17J531J850k00q06q61m05
2371c560N07J607Q55j35j142j299N51J574J585Q9j109j282k09R77K181J102j350
$$ plain form
2388 942 -587 -1018 10 1222 3252 2714 1309 -283 118 2366 4055 3974 2366 1351 1315 2081 3703
2405 3703 4712 4593 2539 1417 2551 4765 5848 5595 4148 2595 2657 4133 6592 7023 5593 3612
2421 3612 3238 4479 5748 7397 7106 5305 3269 4001 6591 7919 7434 6025 5048 4432 5203 7361 8629
2438 8629 7683 4950 4077 5633 7304 7979 7878 6499 4876 4466 6211 8064 8606 6991 4915 4804 5417
2455 5417 6836 8029 7089 5002 3786 4548 6029 6710 6456 5606 3941 3110 4378 6321 7107 4886 3012
2472 3012 2895 3656 4619 5232 5486 3514 1848 2216 3771 4616 4314 2699 1281 1095 1831 3190 3575 2329
2490 2329 477 42 552 1040 1930 1782 491 -1668 -1417 -12 921 465 -937 -2075 -2204 -1375 -648 -234
2508 -234 -1433 -2571 -3085 -2940 -2098 -1318 -1924 -3496 -4170 -4003 -3375 -2882 -2817 -3970 -5039 -4956 -4323 -3296 -3363
$$ packed form
2388I42j529m31J028J212K030n38j405j592M01K248J689q1j608j015l6P66J622
2405C703J009j19k054j122J134K214J083k53j447j553O2J476K459M31j430j981
2421C612l74J241J269J649k91j801k036P32K590J328m85j409r77o16P71K158J268
2438H629r46k733q73J556J671O75j01j379j623m10J745J853N42j615k076j11O13
2455E417J419J193r40k087j216P62J481O81k54q50j665q31J268J943P86k221j874
2472C012j17P61R63O13K54j972j666L68J555Q45l02j615j418j86P36J359L85j246
2490B329j852m35N10M88Q90j48j291k159K51J405R33m56j402j138j29Q29P27M14
2508b34j199j138n14J45Q42P80o06j572o74J67O28M93O5j153j069Q3O33J027o7
$$ plain form
2527 -3363 -4541 -5109 -5864 -5190 -4311 -3804 -4410 -5917 -6119 -5462 -5028 -4553 -4816 -5628 -6460 -6482 -5709 -4236 -4605
2546 -4605 -5747 -6624 -6340 -5635 -5414 -5119 -5186 -6156 -6919 -6317 -5074 -4227 -5341 -6245 -6211 -6138 -5520 -4493 -4577 -5796
2566 -5796 -6543 -5650 -4839 -4521 -4210 -3990 -5181 -6050 -5390 -3122 -2925 -4279 -5596 -5005 -4282 -3834 -3111 -2423
2584 -2423 -3561 -4939 -4725 -3132 -1901 -1979 -2889 -3708 -4376 -3167 -1598 -1024 -1627 -2834 -3529 -2515 -1589
2601 -1589 -529 -262 -1142 -2814 -2754 -1009 489 679 -618 -1572 -1750 -628 585 1300 1108 -220 -1175
2618 -1175 -593 1168 2342 1978 714 -147 -64 1025 2463 3108 1948 909 449 1539 2869 3573 3300
2635 3300 2032 1180 1553 2909 4536 4402 3255 2203 2077 2691 4595 5378 4432 3052 2100 3302 4865
2652 4865 5376 5006 4422 3592 3184 4001 5677 6163 4924 3541 3256 4445 5924 6073 5756 4712 3914 4365
$$ packed form
2527c363j178n68p55O74Q79N07o06j507k02O57M34M75k63q12q32k2P73J473l69
2546d605j142q77K84P05K21K95o7r70p63O02J243Q47j114r04L4P3O18J027q4j219
2566e796p47Q93Q11L18L11K20j191q69O60K268J97j354j317N91P23M48P23O88
2584b423j138j378K14J593J231p8r10q19o68J209J569N74o03j207o95J014R26
2601a589J060K67q80j672O0J745J498J90j297r54j78J122J213P15j92j328r55
2618a175N82J761J174l64j264q61Q3J089J438O45j160j039m60J090J330P04k73
2635C300j268q52L73J356J627j34j147j052j26O14J904P83r46j380r52J202J563
2652D865N11l70n84q30m08Q17J676M86j239j383k85J189J479J49l17j044p98M51
$$ plain form
2670 4365 5416 6281 6045 5229 4491 4176 4862 6079 6806 5783 3793 3771 5151 6000 5932 5481 5075 4386 3772
2689 3772 4968 5930 6020 4479 3710 3731 4645 5331 5587 4953 3508 2848 3736 4849 4884 4191 3733 2832 2540
2708 2540 3455 4238 3973 2626 2100 1959 2896 2948 3130 2673 1814 1125 1381 2430 2480 1640 562 293 585
2727 585 758 1155 1241 265 -949 -899 -40 312 277 -730 -1450 -1955 -1007 -775 -907 -1606 -2160 -2157 -2475 -1857 -1564
2748 -1564 -1811 -2885 -3334 -3562 -2833 -2125 -2372 -3956 -4463 -4211 -3518 -3408 -3150 -3825 -4617 -4905 -4627 -3845 -3366
2767 -3366 -4113 -5266 -5603 -4969 -4273 -4108 -4184 -5092 -5944 -5894 -4709 -3888 -4629 -5259 -5842 -6148 -5679 -4749 -3913 -5001
2787 -5001 -5900 -6332 -5540 -4470 -4599 -4537 -5097 -5847 -5848 -4925 -3716 -3737 -5049 -5568 -5374 -4935 -3866 -3148 -3518 -4626
2807 -4626 -5649 -4712 -3186 -2665 -3118 -3789 -4388 -4636 -3552 -2068 -1970 -3138 -4062 -3632 -2990 -1911 -1168 -1402
$$ packed form
2670D365J051Q65k36q16p38l15O86J217P27j023j990k2J380Q49o8m51m06o89o14
2689C772J196R62R0j541p69K1R14O86K56o34j445o60Q88J113L5o93m58r01k92
2708B540R15P83k65j347n26j41R37N2J82m57q59o89K56J049N0q40j078k69K92
2727E85J73L97Q6r76j214N0Q59L52l5j007p20n05R48K32j32o99n54Ll18O18K93
2748a564k47j074m49k28P29P08k47j584n07K52O93J10K58o75p92k88K78P82M79
2767c366p47j153l37O34O96J65p6r08q52N0J185Q21p41o30n83l06M69R30Q36j088
2787e001q99m32P92J070j29O2n60p50jR23J209k1j312n19J94M39J069P18l70j108
2807d626j023R37J526N21m53o71n99k48J084J484R8j168r24M30O42J079P43k34
$$ plain form
2825 -1402 -2730 -3435 -2852 -1361 -139 -876 -1886 -2310 -2379 -1666 -142 303 -304 -1832 -1861 -911 488 1132
2843 1132 474 -328 -1196 -1049 455 1977 2003 552 -555 -346 701 2051 2636 2088 922 139 849 2807
2861 2807 3161 2488 1455 1084 1400 2120 3168 4158 3066 1518 1428 2510 3896 3928 3755 2816 2017 2487
2879 2487 3897 4537 4599 3426 2546 2645 3696 4761 4809 4451 3318 2790 3508 4472 5062 4774 3907 3027 3123
2898 3123 4194 5056 5279 4203 2952 3202 4494 5082 5050 4861 4037 3090 3541 4583 5443 4318 3812 3208
2916 3208 3514 3865 4718 4872 4062 3276 3106 4117 4260 4420 4088 3390 2747 2746 3590 4285 3850 3023 2161 2650
2936 2650 2959 3133 3417 3206 2544 1919 2393 2894 3082 2269 1455 1727 2004 2160 2205 1971 1481 771 686 1361
2956 1361 1442 870 755 479 521 417 888 522 -328 -602 -718 -211 -338 -191 -689 -1031 -1629 -1365 -797 -619
$$ packed form
2825a402j328p05N83J491J222p37j010m24o9P13J524M45o07j528k9R50J399O44
2843A132o58q02q68J47J504J522K6j451j107K09J047J350N85n48j166p83P10J958
2861B807L54o73j033l71L16P20J048R90j092j548r0J082J386L2j73r39p99M70
2879B487J410O40O2j173q80R9J051J065M8l58j133n28P18R64N90k88q67q80R6
2898C123J071Q62K23j076j251K50J292N88l2j89q24r47M51J042Q60j125n06o04
2916C208L06L51Q53J54q10p86j70J011J43J60l32o98o43jQ44O95m35q27q62M89
2936B650L09J74K84k11o62o25M74N01J88q13q14K72K77J56M5k34m90p10q5O75
2956A361Q1n72j15k76M2j04M71l66q50k74j16N07j27J47m98l42n98K64N68J78
$$ plain form
2976 -619 -1301 -2143 -2353 -1793 -1672 -1542 -1790 -2213 -2723 -2954 -2784 -2078 -2152 -3023 -3632 -3345 -3179 -2962 -2946 -3312 -3741
2997 -3741 -4548 -3941 -3363 -3072 -3702 -3869 -4366 -4499 -3940 -3573 -3382 -4723 -5360 -4736 -4531 -4080 -3598 -4305 -4738
3016 -4738 -5424 -5062 -4238 -3629 -4372 -4926 -5019 -5289 -4381 -3688 -3433 -4303 -5275 -5024 -4497 -3866 -3651 -3946 -4602 -4875
3036 -4875 -4522 -3200 -2713 -3439 -4132 -4452 -3995 -3579 -2413 -2595 -2672 -3758 -4153 -2995 -2147 -2025 -2253 -3020 -2980
3055 -2980 -2821 -2111 -1208 -1269 -1809 -2434 -2536 -1263 -752 -120 -849 -1660 -1886 -917 89 554 435 -948 -897
3074 -897 -659 -335 1065 1333 412 -251 -452 710 1888 1894 1406 536 390 1059 1804 2806 2361 1433 877
3093 877 1254 2448 2941 2978 2307 1454 1666 2192 3005 3448 3326 2480 1733 2262 3338 3875 3812 3004 2637 2805
3113 2805 3717 3950 3795 3699 3105 2891 3066 3726 4477 3909 3257 2640 3043 3928 4219 4275 3503 3001 3009 3393 3943
$$ packed form
2976f19o82q42k10N60J21J30k48m23n10k31J70P06p4q71o09K87J66K17J6l66m29
2997c741q07O07N78K91o30j67m97j33N59L67J91j341o37O24K05M51M82p07m33
3016d738o86L62Q24O09p43n54r3k70R08O93K55q70r72K51N27O31K15k95o56k73
3036d875L53J322M87p26o93l20M57M16J166j82p7j086l95J158Q48J22k28p67M0
3055b980J59P10R03o1n40o25j02J273N11O32p29q11k26R69J006M65j19j383N1
3074h97K38L24J400K68r21o63k01J162J178Om88q70j46O69P45J002m45r28n56
3093H77L77J194M93L7o71q53K12N26Q13M43j22q46p47N29J076N37o3q08l67J68
3113B805R12K33j55r6n94k14J75O60P51n68o52o17M03Q85K91N6p72n02QL84N50
$$ plain form
3134 3943 4221 4087 2975 2774 3404 3983 4116 3876 2986 2665 3071 3590 3741 3718 3444 2894 2564 2972 3590 3900
3154 3900 3000 2729 2495 2910 3186 3313 3188 2767 1967 1906 2622 2998 2718 2146 1971 2002 1832 2416 2588 2032
3174 2032 1491 960 1711 1992 2260 1868 931 782 850 865 1494 1448 477 195 225 756 766 864 450 -266 -491 -169
3196 -169 349 411 -93 -898 -1073 -564 -487 -103 -865 -1208 -1664 -1405 -1077 -876 -819 -1801 -2115 -2453 -1928 -1598 -1203
3217 -1203 -1838 -2461 -2898 -2419 -2177 -1992 -2241 -2956 -3062 -3408 -2828 -1857 -2471 -3010 -3430 -3475 -3148 -2813 -2706 -3075
3237 -3075 -3785 -4045 -3772 -3342 -2911 -3229 -3880 -4430 -4231 -3310 -2750 -2987 -4135 -4376 -4112 -3822 -3259 -3122 -3364
3256 -3364 -4076 -4488 -4167 -3343 -3018 -3246 -4034 -3854 -3712 -3620 -2993 -2641 -3165 -4045 -3899 -3256 -2480 -2373 -2699 -3156
3276 -3156 -3588 -3238 -2252 -1799 -1991 -2628 -3148 -2746 -2104 -1650 -1314 -1907 -2188 -2470 -1910 -1045 -995 -1211 -1484 -1535
$$ packed form
3134C943K78j34j112k01O30N79J33k40q90l21M06N19J51k3k74n50l30M08O18L10
3154C900r00k71k34M15K76J27j25m21q00o1P16L76k80n72j75L1j70N84J72n56
3174B032n41n31P51K81K68l92r37j49O8J5O29m6r71k82L0N31J0R8m14p16k25L22
3196a69N18O2n04q05j75N09P7L84p62l43m56K59L28K01N7r82l14l38N25L30L95
3217a203o35o23m37M79K42J85k49p15j06l46N80R71o14n39m20m5L27L35J07l69
3237c075p10k60K73M30M31l18o51n50J99R21N60k37j148k41K64K90N63J37k42
3256c364p12m12L21Q24L25k28p88J80J42R2O27L52n24q80J46O43P76J07l26m57
3276c156m32L50R86M53j92o37n20M02O42M54L36n93k81k82N60Q65N0k16k73n1
$$ plain form
3296 -1535 -1642 -1044 -68 -129 -760 -1223 -1267 -395 503 350 -33 -414 -738 96 794 1254 1078 485 -82 764
3316 764 982 1810 2062 1078 888 789 1536 2429 2017 2061 1559 1500 1458 2346 2706 2645 2039 1606 2091 2759 3252 2951
3338 2951 2935 2556 2414 2692 3402 3452 3133 2770 2791 3062 3470 3253 3746 3184 2540 2694 3617 3611 3357 3208 2926
3359 2926 3263 3302 3503 3913 3382 2540 2768 3133 3435 3534 3280 3001 2471 2674 3075 3388 3352 2828 2143 2551 2867
3380 2867 2768 2810 2904 2566 2431 2614 2496 2785 2404 2190 1792 1889 2131 2172 2134 1822 1429 1899 2005 2121 1902 1793
3402 1793 1066 1137 1306 1531 1448 1136 571 494 1080 1077 1072 764 356 224 570 344 591 498 3 -275 -259 65 194
3425 194 151 -103 -336 -705 -384 -313 -154 -731 -827 -1256 -1308 -672 -630 -860 -1569 -1660 -1854 -1235 -1065 -1286 -1613 -1912
3447 -1912 -2064 -2131 -1395 -1186 -2002 -2368 -2401 -2591 -1935 -1851 -1948 -2554 -2897 -2833 -2549 -1878 -2033 -2616 -2716 -3215 -2788
$$ packed form
3296a535j07N98R76o1o31m63m4Q72Q98j53l83l81l24Q34O98M60j76n93n67Q46
3316G64K18Q28K52r84j90r9P47Q93m12M4n02n9m2Q88L60o1o06m33M85O68M93l01
3338B951j6l79j42K78P10N0l19l63K1K71M08k17M93n62o44J54R23ok54j49k82
3359B926L37L9K01M10n31q42K28L65L02R9k54k79n30K03M01L13l6n24o85M08L16
3380B867r9M2R4l38j35J83j18K89l81k14l98R7K42M1l8l12l93M70J06J16k19j09
3402A793p27P1J69K25q3l12n65p7N86lnl08m08j32L46k26K47r3m95k78J6L24J29
3425A94m3k54k33l69L21P1J59n77r6m29n2O36M2k30p09r1j94O19J70k21l27k99
3447a912j52o7P36K09q16l66l3j90O56Q4r7o06l43O4K84O71j55n83j00m99M27
$$ plain form
3468 -2788 -2377 -2195 -2563 -3175 -3256 -3137 -2636 -2485 -2347 -2720 -3548 -3702 -2653 -2324 -2321 -3038 -3359 -3558 -2976 -2728
3488 -2728 -2309 -2434 -3156 -3522 -3404 -2552 -2271 -2567 -2673 -3348 -3329 -2912 -2156 -2077 -2366 -2480 -3293 -2794 -2243 -2166 -1934
3509 -1934 -2459 -2864 -2727 -1522 -1278 -1843 -1680 -1894 -2141 -1719 -1213 -697 -1467 -1805 -1895 -1308 -903 -541 -415 -943
3529 -943 -1505 -1385 -876 110 -17 -163 -934 -717 -305 319 566 479 90 -385 352 727 1110 1060 999 333 51
3550 51 904 1598 1981 1609 1024 846 1264 1972 1928 1997 1709 1499 1670 2195 2433 2448 2143 1910 1708 2138 2790
3571 2790 2832 2590 2223 1903 2458 2947 3066 2722 2617 2702 2376 2921 3325 3166 2613 2278 2671 2946 3189 3266 3026
3592 3026 2850 2635 2794 3121 3555 2913 2478 2441 2646 2894 3078 3021 2562 2250 2271 2648 2855 2620 2442 2176 2049
3613 2049 2252 2667 2623 2394 2060 2002 1845 2403 2035 1931 1561 1654 1342 1413 1690 1768 943 948 1143 1231 1201 1357 1281
$$ packed form
3468b788M11J82l68o12q1J19N01J51J38l73q28j54J049L29Lp17l21j99N82K48
3488b728M19j25p22l66J18Q52K81k96j06o75J9M17P56P9k89j14q13M99N51P7K32
3509a934n25m05J37J205K44n65J63k14k47M22N06N16p70l38r0N87M05L62J26n28
3529i43n62J20N09R86j27j46p71K17M12O24K47q7l89m75P37L75L83n0o1o66k82
3550E1Q53O94L83l72n85j78M18P08m4O9k88k10J71N25K38J5l05k33k02M30O52
3571B790M2k42l67l20N55M89J19l44j05Q5l26N45M04j59n53l35L93K75K43P7k40
3592C026j76k15J59L27M34o42m35l7K05K48J84n7m59l12K1L77K07k35j78k66j27
3613B049K03M15m4k29l34n8j57N58l68j04l70R3l12P1K77P8q25NJ95Q8l0J56p6
$$ plain form
3636 1281 684 464 782 1031 1063 534 244 248 196 279 777 188 -124 -343 43 112 -48 49 -166 -379 -921 -777
3658 -777 -331 -277 -474 -1011 -1035 -673 -869 -522 -1025 -1021 -1706 -1285 -1394 -844 -937 -1237 -1781 -1718 -1741 -1306 -1404 -1251 -1703
3681 -1703 -2287 -1467 -1442 -1096 -1877 -1761 -2205 -2031 -1800 -1598 -1561 -2261 -2782 -2439 -2265 -2104 -2110 -2216 -2558 -2696 -2559
3702 -2559 -1965 -1766 -2055 -2186 -2671 -2546 -2099 -1637 -1885 -2079 -2563 -2799 -2325 -2279 -1690 -1844 -2537 -2836 -2558 -2089
3722 -2089 -1772 -2078 -2337 -2603 -2182 -2249 -1916 -1789 -1864 -2354 -2692 -2041 -1758 -1338 -1936 -2319 -2145 -1876 -1741 -1708 -1169
3743 -1169 -1636 -2131 -1975 -1525 -1110 -1018 -1025 -1414 -1508 -1295 -763 -561 -647 -984 -1213 -863 -977 -181 -247 -443 -818 -513
3765 -513 -351 -8 47 -240 -249 -124 -88 331 382 701 392 43 358 732 721 867 729 413 702 1112 1262 1136
3787 1136 771 946 943 1139 1328 1564 1685 1441 1049 1475 1711 1915 1939 1791 1677 1623 2028 2209 2474 2032 1931
$$ packed form
3636A281n97k20L18K49L2n29k90Mn2Q3M98n89l12k19L86O9j60R7k15k13n42J44
3658g77M46N4j97n37k4L62j96L47n03Mo85M21j09N50r3l00n44O3k3M35r8J53m52
3681a703n84Q20K5L46p81J16m44J74K31K02L7p00n21L43J74J61oj06l42j38J37
3702b559N94J99k89j31m85J25M47M62k48j94m84k36M74M6N89j54o93k99K78M69
3722b089L17l06k59k66M21o7L33J27p5m90l38O51K83M20n98l83J74K69J35L3N39
3743a169m67m95J56M50M15R2pl89r4K13N32K02q6l37k29L50j14P96o6j96l75L05
3765e13J62L43N5k87rJ25L6M19N1L19l09l49L15L74j1J46j38l16K89M10J50j26
3787A136l65J75lJ96J89K36J21k44l92M26K36K04K4j48j14n4M05J81K65m42j01
$$ plain form
3808 1931 2050 2198 2259 2608 2736 2107 2247 2295 2380 2607 2572 2609 2037 2347 2564 2711 2763 2331 2180 2181 2243 2649 2578
3831 2578 2413 2368 2151 2277 2280 2756 2523 2226 1830 2178 2209 2436 2226 2070 1926 1440 1924 1851 2267 1994 1516
3852 1516 1627 1502 1863 1502 1768 1451 1196 979 1309 1370 1237 1070 847 835 926 959 1164 577 518 552 334 718
3874 718 681 621 401 -219 -16 137 259 303 -30 -632 -545 -211 -415 -284 -235 -862 -929 -702 -618 -683 -575 -912 -1458
3897 -1458 -1094 -995 -920 -935 -1103 -1653 -1534 -1443 -1045 -1032 -1117 -1436 -1700 -1651 -1498 -1229 -1283 -1568 -1840 -1851 -1816 -1722 -1461
3920 -1461 -1786 -2199 -2035 -1918 -1294 -1492 -1834 -2290 -2208 -1951 -1996 -1585 -1654 -2193 -2101 -2293 -2149 -1895 -1755 -1885 -2099
3941 -2099 -2045 -2259 -1537 -1511 -1944 -2027 -2125 -1888 -1822 -1431 -1828 -1641 -2111 -2070 -1819 -1777 -1435 -1368 -1630 -2053 -1659 -1422
3963 -1422 -1085 -1354 -1641 -1516 -1978 -1410 -1171 -1023 -1260 -1425 -1513 -1365 -975 -939 -820 -1143 -1119 -1256 -994 -471 -734
$$ packed form
3808A931J19J48O1L49J28o29J40M8Q5K27l5L7n72L10K17J47N2m32j51JO2M06p1
3831B578j65m5k17J26LM76k33k97l96L48L1K27k10j56j44m86M84p3M16k73m78
3852A516J11j25L61l61K66l17k55k17L30O1j33j67k23j2R1L3K05n87n9L4k18L84
3874G18l7o0k20o20K03J53J22M4l33o02Q7L34k04J31M9o27o7K27Q4o5J08l37n46
3897a458L64R9P5j5j68n50J19R1L98J3q5l19k64M9J53K69n4k85k72j1L5R4K61
3920a461l25m13J64J17O24j98l42m56Q2K57m5M11o9n39R2j92J44K54J40j30k14
3941b099N4k14P22K6m33q3r8K37O6L91l97J87m70M1K51M2L42O7k62m23L94K37
3963a422L37k69k87J25m62N68K39J48k37j65q8J48L90L6J19l23K4j37K62N23k63
$$ plain form
3984 -734 -715 -981 -1226 -707 -476 -463 -425 -609 -483 -466 -126 -129 -40 -39 -282 -150 -114 114 224 183 262 -52 268 225
4008 225 380 720 553 491 400 664 1088 744 506 733 690 1219 638 1138 1041 971 1013 1129 1284 1567 1419 1047
4030 1047 1510 1503 1188 1634 1814 1708 1549 1584 1853 1930 1779 1749 1704 1585 1810 1804 1824 1750 1693 1524 2419 2420 2064 1908
4054 1908 1988 1795 2044 1901 2310 2050 1659 1904 1922 2046 2035 1977 1735 1824 1609 2005 2023 1927 1836 1632 1542 1895 1946
4077 1946 1996 1822 1984 1674 1582 1639 1623 1677 1180 1169 924 1502 1409 1575 1201 993 991 827 1099 1084 802 612 621 568
4101 568 575 1038 481 857 285 -22 522 268 207 208 -350 -130 120 113 216 -107 -462 -897 -445 -258 125 -325
4123 -325 -742 -812 -960 -799 -598 -883 -1138 -1190 -1649 -1163 -811 -774 -1491 -1118 -1470 -1556 -1368 -923 -1235 -1635 -1750
4144 -1750 -1546 -1409 -1310 -1295 -1474 -1809 -1872 -1526 -1381 -1480 -1466 -2084 -1974 -1698 -1882 -1668 -1489 -1791 -2212 -1876 -1905 -1596
$$ packed form
3984g34J9k66k45N19K31J3L8j84J26J7L40lQ9Jk43J32L6K28J10m1P9l14L20m3
4008B25J55L40j67o2r1K64M24l44k38K27m3N29n81N00r7p0M2J16J55K83j48l72
4030A047M63pl15M46J80j06j59L5K69P7j51l0m5j19K25oK0p4n7j69Q95Jl56j56
4054A908Q0j93K49j43M09k60l91K45J8J24j1n8k42Q9k15L96J8r6r1k04r0L53N1
4077A946N0j74J62l10r2N7j6N4m97j1k45N78r3J66l74k08kj64K72j5k82j90Rn3
4101E68PM63n57L76n72l07N44k54o1Jn58K20K50pJ03l23l55m35M52J87L83m50
4123c25m17p0j48J61K01k85k55n2m59M86L52L7p17L73l52q6J88M45l12m00j15
4144a750K04J37R9J5j79l35o3L46J45r9J4o18J10K76j84K14J79l02m21L36k9L09
$$ plain form
4166 -1596 -1693 -1865 -1852 -1843 -2047 -1794 -1252 -1476 -1482 -1975 -2110 -1408 -1712 -1273 -1680 -1816 -1939 -1852 -1458 -1141 -1465 -1468 -1410
4189 -1410 -1540 -1036 -1122 -1124 -1385 -1334 -1419 -995 -792 -1123 -961 -1048 -1011 -796 -846 -664 -603 -953 -919 -824 -458 -309 -511
4212 -511 -670 -921 -577 -275 -630 -247 -383 -291 -283 -382 -231 121 105 116 -450 -262 64 503 -25 17 162 26
4234 26 136 356 341 529 299 79 580 716 601 726 681 452 676 801 946 958 931 699 471 720 1187 1211
4256 1211 1022 818 1008 881 1402 1262 1171 1038 1440 1068 1373 1459 1338 1188 1270 1422 1582 1347 1584 1276 1376
4277 1376 1293 1236 1576 1334 1502 1523 1306 1621 1610 1543 1605 1332 1500 1519 1407 1622 1701 1308 1612 1530 1500 1709 1650
4300 1650 1299 1347 1014 1517 1498 1645 1503 1717 1245 1156 1294 1427 1286 1255 1017 936 1162 1192 1036 911 1116 917
4322 917 946 1188 1206 853 589 770 267 497 913 719 569 215 228 664 361 381 194 8 216 141 217 -50
$$ packed form
4166a596r7j72J3Rk04K53N42k24om93j35P02l04M39m07j36j23Q7L94L17l24lN8
4189a410j30N04q6kk61N1q5M24K03l31J62q7L7K15n0J82O1l50L4R5L66J49k02
4212e11j59k51L44L02l55L83j36R2Qr9J51L52j6J1n66J88L26M39n28M2J45j36
4234B6J10K20j5J88k30k20N01J36j15J25m5k29K24J25J45J2k7k32k28K49M67K4
4256A211j89k04J90j27N21j40r1j33M02l72L05Q6j21j50Q2J52J60k35K37l08J00
4277A376q3n7L40k42J68K1k17L15j1o7O2k73J68J9j12K15P9l93L04q2l0K09n9
4300A650l51M8l33N03j9J47j42K14m72q9J38J33j41l1k38q1K26L0j56j25K05j99
4322I17K9K42J8l53k64J81n03K30M16j94j50l54J3M36l03K0j87j86K08p5P6k67
$$ plain form
4344 -50 103 -263 26 -254 186 -6 -90 -300 -582 -552 -555 -108 -501 -672 -996 -962 -1043 -756 -693 -801 -937 -956 -1084
4367 -1084 -798 -909 -1222 -924 -1333 -1146 -1148 -906 -1142 -1168 -1365 -1505 -1450 -1527 -1243 -1185 -1545 -1626 -1608 -1490 -1568 -1238 -1551
4390 -1551 -1524 -1630 -1518 -1337 -1289 -1453 -1643 -1523 -1709 -1514 -1668 -1378 -1586 -1477 -1458 -1577 -1336 -1722 -1347 -1480 -1651
4411 -1651 -1332 -1180 -960 -1087 -1378 -1325 -1366 -931 -1237 -1134 -1277 -1197 -1403 -1227 -946 -897 -878 -1104 -1174 -1026 -736 -789
4433 -789 -504 -1034 -974 -759 -666 -402 -514 -491 -250 -535 -252 -240 -499 -310 -467 -211 2 118 339 -97 -314
4454 -314 115 148 -97 378 147 -179 -132 304 600 462 216 443 71 217 537 501 350 529 47 381 979
4475 979 763 876 765 534 617 817 958 892 1006 971 674 631 602 935 1032 789 787 1003 963 1015 1148 1018 923 1170
4499 1170 996 1401 1513 1337 1080 1026 1366 1351 1118 1298 1086 740 1294 1102 1590 1488 1216 1031 1196 1258 1206
$$ packed form
4344e0J53l66K89k80M40j92q4k10k82L0lM47l93j71l24L4q1K87O3j08j36j9j28
4367a084K86j11l13K98m09J87kK42k36k6j97j40N5p7K84N8l60q1J8J18p8L30l13
4390a551K7j06J12J81M8j64j90J20j86J95j54K90k08J09J9j19K41l86L75j33j71
4411a651L19J52K20j27k91N3m1M35l06J03j43Q0k06J76K81M9J9k26p0J48K90n3
4433g89K85n30O0K15R3K64j12K3K41k85K83J2k59J89j57K56K13J16K21m36k17
4454c14M29L3k45M75k31l26M7M36K96j38k46K27l72J46L20l6j51J79m82L34N98
4475I79k16J13j11k31Q3K00J41o6J14l5k97m3k9L33R7k43kK16m0N2J33j30r5K47
4499A170j74M05J12j76k57n4L40j5k33J80k12l46N54j92M88j02k72j85J65O2n2
$$ plain form
4520 1206 1202 1121 1236 934 1107 1405 1134 1282 1008 970 734 952 1212 1343 1180 1204 712 728 1321 1023 1032 1249
4542 1249 641 892 977 962 1154 679 812 401 665 880 1031 439 520 526 819 749 769 827 436 617 127 592
4564 592 480 722 130 423 67 538 184 72 200 -151 98 -45 -86 12 -140 -121 -220 -310 -260 -225 -5 -386
4586 -386 -451 -591 -610 -701 -379 -413 -735 -838 -951 -633 -494 -951 -793 -785 -1196 -453 -849 -798 -725 -1078 -1250 -976 -1003
4609 -1003 -988 -488 -1001 -1015 -1243 -1091 -1171 -840 -1370 -1330 -1278 -1097 -1214 -1169 -1324 -1029 -1345 -1195 -1249 -978 -1112 -1549
4631 -1549 -1352 -1338 -1073 -1232 -1242 -1296 -1231 -1436 -1552 -878 -1333 -1278 -1080 -1407 -1231 -819 -695 -1159 -1102 -1082 -1062 -1076 -754
4654 -754 -808 -1041 -893 -905 -838 -705 -855 -661 -664 -699 -623 -649 -722 -683 -514 -887 -576 -517 -316 -247 -250 -202 -412 -409 -130 -341
4680 -341 -198 -513 85 -40 -63 87 273 38 -11 50 352 268 -128 212 620 356 536 517 520 435 597 408 485
$$ packed form
4520A206mq1J15l02J73K98k71J48k74l8k36K18K60J31j63K4m92J6N93k98RK17
4542A249o08K51Q5j5J92m75J33m11K64K15J51n92Q1OK93p0K0N8l91J81m90M65
4564E92j12K42n92K93l56M71l54j12J28l51K49j43m1R8j52J9r9r0N0L5K20l81
4586c86o5j40j9r1L22l4l22j03j13L18J39m57J58Qm11P43l96N1P3l53j72K74k7
4609a003J5N00n13j4k28J52q0L31n30M0N2J81j17M5j55K95l16J50n4K71j34m37
4631a549J97J4K65j59j0n4O5k05j16O74m55N5J98l27J76M12J24m64N7K0K0j4L22
4654g54n4k33J48j2O7J33j50J94ll5P6k6p3L9J69l73L11N9K01O9lM8k10LK79k11
4680c41J43l15N98j25k3J50J86k35m9O1L02q4l96L40M08k64J80j9Lq5J62j89P7
$$ plain form
4703 485 630 681 588 740 618 280 780 589 934 723 512 867 961 918 553 860 813 717 949 1002 1107 888
4725 888 725 1061 901 706 1193 898 1167 782 1021 957 1492 867 1347 1067 830 993 861 1176 843 1117
4745 1117 1101 1090 1087 896 1171 818 663 954 1038 1164 821 815 827 851 1149 1217 1131 1017 838 580 881 876 1007 744
4769 744 644 930 540 472 550 744 792 568 287 620 148 584 470 357 614 646 604 720 285 262 320 114
4791 114 129 473 588 203 45 58 75 100 -77 69 155 22 -172 -148 53 136 -234 -256 18 20 -93 -280 -297 -802
4815 -802 -351 -378 -17 -389 -512 -343 -553 -375 -417 -377 -651 -711 -679 -680 -554 -434 -573 -524 -778 -585 -789 -514 -797
4838 -797 -619 -840 -954 -1173 -877 -903 -828 -850 -1006 -1020 -993 -935 -1005 -963 -1137 -1095 -918 -889 -785 -781 -1044 -1199 -1164 -872
4862 -872 -932 -909 -869 -1033 -1190 -832 -811 -894 -739 -1046 -865 -1048 -974 -763 -905 -713 -1013 -953 -736 -651 -573 -748 -986
$$ packed form
4703D85J45N1r3J52j22l38N00j91L45k11k11L55R4m3l65L07m7r6K32N3J05k19
4725H88j63L36j60j95M87k95K69l85K39o4N35o25M80k80k37J63j32L15l33K74
4745A117j6j1lj91K75l53j55K91Q4J26l43oJ2K4K98O8q6j14j79k58L01nJ31k63
4769G44j00K86l90o8P8J94M8k24k81L33m72M36j14j13K57L2m2J16m35k3N8k06
4791A14J5L44J15l85j58J3J7K5j77J46Q6j33j94K4K01Q3l70k2K74Kj13j87j7n05
4815h02M51k7L61l72j23J69k10J78m2M0k74o0L2jJ26J20j39M9k54J93k04K75k83
4838g97J78k21j14k19K96k6P5k2j56j4K7N8p0M2j74M2J77K9J04Mk63j55L5K92
4862h72o0K3M0j64j57L58K1q3J55l07J81j83P4K11j42J92l00O0K17Q5P8j75k38
$$ plain form
4885 -986 -721 -779 -770 -847 -755 -673 -712 -701 -475 -292 -516 -492 -287 -319 -357 -237 -447 -685 -409 -549 -81 -311 72 -100
4909 -100 -373 -132 -183 -110 93 68 -5 -230 241 321 125 117 -25 185 138 156 500 328 357 99 475 263 410
4932 410 758 497 530 461 425 589 416 431 452 415 606 778 919 770 467 577 677 865 756 477 837 772
4954 772 573 944 958 761 657 742 592 806 1160 887 889 907 574 774 967 806 782 886 646 446 765 827
4976 827 798 1057 795 618 987 558 796 672 718 905 583 874 1038 970 758 595 418 406 813 518 427 516
4998 516 325 418 670 485 771 172 223 242 314 604 640 402 76 237 38 526 312 257 461 185 215 310 490
5021 490 393 43 95 -110 260 -83 20 92 216 -10 -72 109 -49 -101 -1 -43 -272 -329 153 12 -100 -348
5043 -348 -459 -93 -80 -172 -332 -379 -557 -626 -389 -436 -264 -325 -322 -347 -509 -420 -383 -670 -603 -492 -603 -848 -580 -516
$$ packed form
4885i86K65n8Rp7R2Q2l9J1K26J83k24K4K05l2l8J20k10k38K76j40M68k30L83j72
4909a00k73K41n1P3K03k5p3k25M71Q0j96qj42K10m7J8L44j72K9k58L76k12J47
4932D10L48k61L3o9l6J64j73J5K1l7J91J72J41j49l03J10J00J88j09k79L60o5
4954G72j99L71J4j97j04Q5j50K14L54k73KJ8l33K00J93j61k4J04k40k00L19O2
4976H27k9K59k62j77L69m29K38j24M6J87l22K91J64o8k12j63j77j2M07k95r1Q9
4998E16j91R3K52j85K86n99N1J9P2K90L6k38l26J61j99M88k14n5K04k76L0R5J80
5021D90r7l50N2k05L70l43J03P2J24k26o2J81j58n2J00m2k29n7M82j41j12k48
5043c48j11L66J3r2j60m7j78o9K37m7J72o1Lk5j62Q9L7k87O7J11j11k45K68O4
$$ plain form
5067 -516 -330 -600 -381 -467 -728 -905 -592 -697 -883 -621 -571 -502 -613 -725 -879 -779 -852 -651 -898 -618 -764
5088 -764 -688 -626 -578 -886 -677 -599 -408 -668 -739 -440 -520 -898 -482 -821 -568 -503 -581 -626 -731 -337 -616 -653 -669 -652
5112 -652 -854 -451 -85 -942 -404 -591 -658 -476 -360 -205 -561 -475 -497 -145 -282 -296 -133 -482 -193 -401 -291
5133 -291 -136 -20 -228 91 -157 -247 -44 -406 -79 -66 -38 -88 -18 184 112 161 -33 -111 120 71 488 289 281 200
5157 200 321 322 197 421 479 225 294 627 324 207 229 496 701 430 496 632 585 583 526 486 624 867 1014 501
5181 501 318 385 505 969 916 741 803 405 541 380 817 953 564 662 776 909 639 947 423 644 910
5202 910 554 719 716 728 522 608 504 793 679 605 399 616 526 452 743 485 658 608 532 474 662 972 473
5225 473 535 514 786 656 468 542 518 409 249 298 405 380 232 269 346 323 189 270 179 320 -149 67 169 128
$$ packed form
5067e16J86k70K19q6k61j77L13j05j86K62N0O9j11j12j54J00p3K01k47K80j46
5088g64P6O2M8l08K09P8J91k60p1K99q0l78M16l39K53O5p8m5j05L94k79l7j6J7
5112f52k02M03L66q57N38j87o7J82J16J55l56Q6k2L52j37j4J63l49K89k08J10
5133b91J55J16k08L19k48r0K03l62L27J3K8n0P0K02p2M9j94p8K31m9M17j99qq1
5157B00J21Jj25K24N8k54O9L33l03j17K2K67K05k71O6J36m7kn7m0J38K43J47n13
5181E01j83O7J20M64n3j75O2l98J36j61M37J36l89R8J14J33k70L08n24K21K66
5202I10l56J65lJ2k06Q6j04K89j14p4k06K17r0p4K91k58J73n0p6n8J88L10m99
5225D73O2k1K72j30j88P4k4j09j60M9J07k5j48L7P7k3j34Q1r1J41m69K16J02m1
$$ plain form
5249 128 -112 32 -1 258 4 89 293 160 -38 -339 -186 -10 7 -32 -213 -41 -21 -57 -288 -259 -147 -476
5271 -476 -12 -415 -233 -496 -276 -200 -383 -267 -446 -219 -159 -260 -390 -669 -338 -433 -433 -270 -552 -531 -677 -397
5293 -397 -239 -655 -343 -680 -350 -540 -305 -452 -484 -568 -284 -738 -474 -389 -404 -720 -421 -513 -455 -361 -590 -739
5315 -739 -648 -753 -423 -436 -626 -604 -506 -149 -507 -275 -485 -374 -454 -671 -487 -540 -587 -392 -551 -242 -231 -636 -383
5338 -383 -436 -443 -552 -452 -292 -98 -425 -353 -414 -565 -193 -49 -458 -387 -534 -323 -421 -244 -379 -56 -307 -147
5360 -147 -123 -88 -122 -99 -186 -92 -248 -26 -75 59 -189 116 1 -289 28 125 36 -1 122 1 216 123 -35 273
5384 273 80 -58 54 56 312 165 259 278 134 257 532 380 143 331 90 260 558 407 214 682 325
5405 325 521 848 607 588 556 502 626 588 739 612 323 550 519 537 606 472 598 584 665 495 372 756 551
$$ packed form
5249A28k40J44l3K59k54Q5K04j33j98l01J53J76J7l9j81J72K0l6k31K9J12l29
5271d76M64m03J82k63K20P6j83J16j79K27O0j01j30k79L31r5%J63k82K1j46K80
5293c97J58m16L12l37L30j90K35j47l2q4K84m54K64Q5j5l16K99r2N8R4k29j49
5315g39R1j05L30j3j90K2R8L57l58K32k10J11q0k17J84n3m7J95j59L09J1m05K53
5338c83n3pj09J00J60J94l27P2o1j51L72J44m09P1j47K11r8J77j35L23k51J60
5360a47K4L5l4K3q7R4j56K22m9J34k48L05j15k90L17R7q9l7J23j21K15r3j58L08
5384B73j93j38J12KK56j47R4J9j44J23K75j52k37J88k41J70K98j51j93M68l57
5405C25J96L27k41j9l2n4J24l8J51j27k89K27l1J8O9j34J26j4Q1j70j23L84k05
$$ plain form
5428 551 539 643 771 673 498 524 446 391 884 364 561 672 718 385 445 593 525 487 323 493 153 559 788
5451 788 442 664 395 266 543 381 355 411 306 234 448 187 441 317 219 44 146 269 172 338 159 86
5473 86 372 98 343 187 -116 197 -102 -7 35 98 140 -86 19 -174 -219 87 146 -15 -327 -205 -339 65
5495 65 -353 -172 -324 -320 -466 -383 -127 -137 -309 -204 -253 -213 -139 -225 -67 -512 -405 -74 -404 11 -192 -321 -496
5518 -496 -452 -437 -383 -690 -797 -375 -365 -476 -606 -482 -351 -605 -451 -650 -441 -280 -569 -225 -643 -354 -446 -385
5540 -385 -490 -512 -554 -525 -553 -318 -611 -477 -354 -220 -262 -462 -311 -258 -186 -444 -497 -533 -412 -306 -405 -478 -539 -271
5564 -271 -454 -222 -246 -495 -505 -160 -370 -222 -173 -358 -124 -406 -496 -139 -12 -238 -284 -97 -197 -156 3 73
5586 73 -157 132 72 -71 -73 -1 -109 -185 -429 -88 86 36 93 338 -16 15 120 -208 289 115 -56 230 111
$$ packed form
5428E51j2J04J28r8j75K6p8n5M93n20J97J11M6l33O0J48o8l8j64J70l40M06K29
5451G88l46K22k69j29K77j62k6N6j05p2K14k61K54j24r8j75J02J23r7J66j79p3
5473H6K86k74K45j56l03L13k99R5M2O3M2k26J05j93m5L06N9j61l12J22j34M04
5495F5m18J81j52Mj46Q3K56j0j72J05m9M0P4q6J58m45J07L31l30M15k03j29j75
5518d96M4J5N4l07j07M22J0j11j30J24J31k54J54j99K09J61k89L44m18K89r2O1
5540c85j05k2m2K9k8K35k93J34J23J34m2k00J51N3P2k58n3l6J21J06r9p3o1K68
5564b71j83K32k4k49j0L45k10J48M9j85K34k82r0L57J27k26m6J87j00M1J59P0
5586G3k30K89o0j43kP2j08p6k44L41J74n0N7K45l54L1J05l28M97j74j71K86j19
$$ plain form
5609 111 11 53 8 153 -62 33 255 162 91 381 84 9 119 553 418 459 178 344 535 217 307 485 15
5632 15 365 531 299 245 441 420 46 484 103 189 491 249 546 349 419 588 494 554 333 468 261 713
5654 713 377 497 476 350 211 420 428 809 440 439 149 371 472 280 340 746 421 331 344 646 440 235 628
5677 628 240 102 404 368 319 365 200 94 580 358 118 309 277 -31 283 43 211 457 3 52 -149 286
5699 286 296 13 28 -10 206 301 271 164 -12 -136 -72 -135 112 -87 5 -419 -123 -134 149 -41 37 17 -149 16
5723 16 -66 112 -338 -383 -164 -149 -459 -90 -243 -299 -487 -384 -175 -467 -126 -223 -469 -250 -315 -318 -636 -413 -274
5746 -274 -410 -514 -269 -330 -427 -367 -289 -286 -223 -545 -376 -310 -243 -249 -514 -376 -415 -656 -410 -351 -337 -388 -238 -410 -307
5771 -307 -362 -292 -272 -220 -432 -252 -589 -179 -424 -146 -476 -374 -323 -302 -230 -371 -49 -234 -138 -124 -110 -275 -302 -192
$$ packed form
5609A11j00M2m5J45k15R5K22r3p1K90k97p5J10M34j35M1k81J66J91l18R0J78m70
5632A5L50J66k32n4J96k1l74M38l81Q6L02k42K97j97P0J69r4O0k21J35k07M52
5654G13l36J20k1j26j39K09QL81l69jk90K22J01j92O0M06l25r0J3L02k06k05L93
5677F28l88j38L02l6m9M6j65j06M86k22k40J91l2l08L14k40J68K46m54M9k01M35
5699B86J0k83J5l8K16R5l0j07j76j24O4o3K47j99R2m24K96j1K83j90P8k0j66J65
5723A6q2J78m50m5K19J5l10L69j53n6j88J03K09k92L41r7k46K19o5ll18K23J39
5746b74j36j04K45o1r7O0P8LO3l22J69O6O7ok65J38l9k41K46N9J4n1J50j72J03
5771c07n5P0K0N2k12J80l37M10k45K78l30J02N1K1P2j41L22j85R6J4J4j65k7J10
$$ plain form
5795 -192 -311 -497 -196 -344 -243 -272 -105 -230 112 -227 -168 -112 -102 -256 -76 -9 76 -153 -71 -137 -219 -159 106
5818 106 -23 486 306 -188 100 -123 228 -119 43 30 112 234 158 227 49 145 294 218 451 275 168 167 -69
5841 -69 126 241 -36 128 209 252 129 265 16 -120 423 88 241 144 317 454 352 82 406 290 348 626
5863 626 46 515 112 194 453 186 56 334 294 236 546 366 331 532 258 336 349 319 262 168 80 266 352 426
5887 426 437 297 368 363 480 252 448 298 169 144 194 314 284 481 340 214 1 117 201 189 385 303 390 286
5911 286 298 395 476 217 66 -61 -254 119 6 64 103 65 99 217 54 192 54 -175 -80 -64 -132 -228 321 -22
5935 -22 -91 -74 -48 -66 -143 -151 -16 -126 155 104 63 143 7 -536 -39 -16 -66 23 26 -83 -57 -32 -176 -431 -355 -100
5961 -100 -218 -86 -93 -10 -224 -174 -352 -205 -325 -158 -180 -116 -258 -271 -249 -247 -255 -340 -397 -518 -294 -298 -202 -490 -339 -505
$$ packed form
5795a92j19j86L01j48J01k9J67j25L42l39N9N6J0j54J80O7Q5k29Q2o6q2O0K65
5818A06j29N09j80m94K88k23L51l47J62j3Q2J22p6O9j78R6J49p6K33j76j07jk36
5841f9J95J15k77J64Q1M3j23J36k49j36N43l35J53r7J73J37j02k70L24j16N8K78
5863F26n80M69m03Q2K59k67j30K78m0n8L10j80l5K01k74P8J3l0n7r4q8J86Q6P4
5887D26J1j40P1nJ17k28J96j50j29k5N0J20l0J97j41j26k13J16Q4j2J96q2Q7j04
5911B86J2R7Q1k59j51j27j93L73j13N8L9l8L4J18j63J38j38k29R5J6o8r6N49l43
5935b2o9J7K6j8p7qJ35j10K81n1m1Q0j36n43M97K3n0Q9Lj09K6K5j44k55P6K55
5961a00j18J32pQ3k14N0j78J47j20J67k2O4j42j3K2Kqq5n7j21K24mR6k88J51j66
$$ plain form
5987 -505 -579 -446 -252 84 -256 -403 -421 -154 -239 -419 -333 -195 -273 -559 -643 -184 -295 -156 -281 -217 -590 -204
6009 -204 -503 -309 -162 -360 -200 -119 50 -82 74 -413 -129 82 -361 -121 76 -93 -248 -144 1 53 32
6030 32 -292 77 37 125 97 -28 -120 12 72 50 119 272 -48 175 -47 105 -50 -109 -93 268 130 49 227 1
6054 1 -66 28 51 336 176 167 224 261 -10 87 233 253 163 460 14 249 139 436 218 245 225 392 207 185 350
6079 350 361 73 140 346 130 487 325 247 421 258 300 242 206 179 -124 108 59 469 471 133 360 343 159 213
6103 213 79 360 441 270 58 111 346 60 -67 220 102 -137 -44 115 301 169 161 119 185 200 71 218 245
6126 245 50 449 501 192 6 457 197 213 122 206 316 121 235 -75 399 -144 -22 -109 134 225 -176 135
6148 135 155 -21 -213 -221 -32 84 230 211 93 -251 -423 -71 -3 -25 46 141 -106 30 -169 136 -142 128 -175
$$ packed form
5987e05p4J33J94L36l40j47j8K67q5j80Q6J38p8k86q4M59j11J39j25O4l73L86
6009b04k99J94J47j98J60Q1J69j32J56m87K84K11m43K40J97j69j55J04J45N2k1
6030C2l24L69m0Q8k8j25r2J32O0k2O9J53l20K23k22J52j55n9J6L61j38q1J78k26
6054Ao7R4K3K85j60rN7L7k71R7J46K0r0K97m46K35j10K97k18K7k0J67j85k2J65
6079C50J1k88O7K06k16L57j62p8J74j63M2n8l6k7l03K32m9M10Kl38K27j7j84N4
6103B13j34K81Q1j71k12N3K35k86j27K87j18k39R3J59J86j32qm2O6J5j29J47K7
6126B45j95L99N2l09j86M51k60J6r1Q4J10j95J14l10M74n43J22q7K43R1m01L11
6148A35K0j76j92qJ89J16J46j9j18l44j72L52O8k2P1R5k47J36j99L05k78K70l03
$$ plain form
6171 -175 -566 -234 -199 -357 -95 -123 -40 -240 -373 -364 234 -131 -73 -116 -327 43 -237 -248 -491 48 -301 -369 -44
6194 -44 -30 -235 -158 -4 -405 -256 -163 -228 -478 -6 -70 -417 -426 -236 -306 -168 -159 -379 -229 -178 -13 -167 -215 -205 -250
6219 -250 -395 -279 -494 -73 -623 -147 -342 -339 -198 38 -419 -164 -223 -124 -272 -84 43 -105 -230 -308 -454 -61
6241 -61 -23 -181 -112 -307 70 -270 -71 17 -197 -240 121 -70 -200 -211 181 234 14 -73 71 -9 65 43 -49 -125
6265 -125 -97 162 -62 179 101 -193 392 219 70 -71 -93 11 38 62 67 202 -110 115 144 78 256 253 152 37
6289 37 195 -136 71 422 285 89 251 338 327 13 196 285 224 241 268 222 152 -77 333 317 265 139 272 101
6313 101 273 83 -91 234 359 1 363 159 334 359 455 114 245 284 101 324 -27 172 163 298 103 263
6335 263 186 261 319 67 -52 242 214 207 136 39 151 -111 140 26 105 122 416 -240 -214 281 -17 60 113 345
$$ packed form
6171a75l91L32L5j58K62k8Q3k00j33RN98l65N8m3k11L70k80j1k43N39l49o8L25
6194d4J4k05P7J54m01J49R3o5k50M72o4l47rJ90p0J38Rk20J50N1J65j54m8J0m5
6219b50j45J16k15M21n50M76j95LJ41K36m57K55n9R9j48J88J27j48j25p8j46L93
6241f1L8j58O9j95L77l40J99Q8k14m3L61j91j30j1L92N3k20q7J44q0P4k2r2p6
6265a25K8K59k24K41p8k94N85j73j49j41k2J04K7K4NJ35l12K25K9o6J78lj01j15
6289C7J58l31K07L51j37j96J62Q7j1l14J83Q9o1J7K7m6p0k29M10j6n2j26J33j71
6313A01J72j90j74L25J25l58L62k04J75K5R6l41J31L9j83K23l51J99rJ35j95J60
6335B63p7P5N8k52j19K94k8pp1r7J12k62K51j14P9J7K94o56K6M95k98P7N3K32
$$ plain form
6359 345 -8 153 164 -40 125 -37 86 -24 -105 125 105 -107 -38 -14 76 -127 3 -19 -250 114 -13 211
6381 211 243 -65 -135 -116 59 -315 -238 166 -241 -280 -172 -1 -184 25 -76 -66 -157 -216 -104 -372 -303 -106 -355
6404 -355 -111 -298 -52 69 -226 -110 -112 -103 -365 8 -337 -65 -299 -469 127 -318 -459 5 -264 -279 -266 -354
6426 -354 -131 -177 -157 -108 -185 -19 3 -264 -50 -114 -22 -185 -236 -254 -226 -348 -405 -263 -397 -404 -65 -35 -256 -424 -179
6451 -179 -115 -102 -529 -213 -375 -317 -250 -90 1 -110 -374 -23 -139 -152 221 -93 -10 -273 43 74 -67 -39 67
6474 67 133 -189 -322 -78 165 241 -95 84 107 69 -46 78 294 209 -84 -24 3 165 -93 -43 208 168 154 10
6498 10 47 97 280 -88 7 139 -60 353 67 200 67 311 260 264 412 50 570 146 182 192 -19 297 345
6521 345 231 -24 25 312 -10 285 478 362 48 137 22 254 250 492 335 435 248 141 351 305 247 288
$$ packed form
6359C45l53J61J1k04J65j62J23j10q1K30k0k12O9K4R0k03J30k2k31L64j27K24
6381B11L2l08p0J9J75l74P7M04m07l9J08J71j83K09j01J0r1n9J12k68O9J97k49
6404c55K44j87K46J21k95J16kRk62L73l45K72k34j70N96m45j41M64k69j5J3q8
6426c54K23m6K0M9p7J66K2k67K14o4R2j63n1j8K8j22n7J42j34pL39L0k21j68K45
6451a79O4J3m27L16j62N8O7J60R1j11k64L51j16j3L73l14Q3k63L16L1j41K8J06
6474F7O6l22j33K44K43P6l36J79K3l8j15J24K16q5k93O0K7J62k58N0K51m0j4j44
6498A0L7N0J83l68R5J32j99M13k86J33j33K44n1MJ48l62N20m24L6J0k11L16M8
6521C45j14k55M9K87l22K95J93j16l14Q9j15K32mK42j57J00j87j07K10m6n8M1
$$ plain form
6543 288 90 224 132 -157 317 236 256 225 195 168 409 317 195 478 387 431 346 106 176 58 289 372 281 159
6567 159 172 148 168 141 18 -80 -30 308 104 107 105 -35 -16 -23 -82 261 -28 17 305 211 408 97 103 39 303 192
6593 192 -7 -150 274 -355 62 43 219 -157 -292 -194 23 -72 -96 -125 145 -375 -202 230 -4 -227 -368 -228
6615 -228 -69 -344 -332 -410 -221 -51 63 -258 -226 -222 -189 95 -158 -378 -346 -297 -274 -45 -300 -353 -62 169 -522
6638 -522 -61 -292 -240 -90 -373 -348 -386 -27 -107 -169 -10 -270 -188 -27 -260 -110 -297 -299 -72 -262 -226 -22 -204
6661 -204 -347 -578 -4 -303 -142 -170 -62 -58 -215 -7 -50 -247 -202 -237 -416 123 51 -56 -46 61 -217 70 -42
6684 -42 -189 -7 60 -292 -152 -278 -257 104 -204 49 -139 -263 -235 -169 251 166 172 97 164 -84 -87 -35 120 -22
6708 -22 47 -112 190 -228 305 119 -186 151 -97 -22 -213 42 17 11 155 220 -102 37 233 135 110 151 142 75
$$ packed form
6543B88j98J34r2k89M74q1K0l1l0k7K41r2j22K83r1M4q5k40P0j18K31Q3r1j22
6567A59J3k4K0k7j23r8N0L38k04Lkj40J9pn9L43k89M5K88r4J97l11Oo4K64j11
6593A92j99j43M24o29M17j9J76l76j35R8K17r5k4k9K70n20J73M32k34k23j41J40
6615b28J59k75J2p8J89J70J14l21L2ML3K84k53k20L2M9K3K29k55n3K91K31o91
6638e22M61k31N2J50k83K5l8L59q0o2J59k60Q2J61k33J50j87kK27j90L6K04j82
6661b04j43k31N74k99J61k8J08Mj57K08m3j97M5l5j79N39p2j07J0J07k78K87j12
6684d2j47J82O7l52J40j26K1L61l08K53j88j24K8O6M20q5Op5O7k48lN2J55j42
6708b2O9j59L02m18N33j86l05L37k48P5j91K55k5oJ44O5l22J39J96r8k5M1ro7
$$ plain form
6732 75 -13 150 159 -77 330 306 302 122 409 216 113 241 84 346 62 300 610 172 250 217 192 277 47 485
6756 485 187 88 149 140 280 346 226 378 487 407 86 95 134 245 514 275 210 47 -130 79 357 234 47
6779 47 112 -61 108 201 229 160 181 128 364 182 138 319 66 320 225 237 224 74 -39 6 -49 85 33 89 174
6804 174 289 138 -23 166 112 267 -16 209 -192 176 -60 35 52 -64 70 -197 -14 329 -228 129 -157
6825 -157 6 -156 -157 -84 -238 -111 -150 -149 -239 -192 -305 -195 -169 -243 -348 -594 2 -196 210 -202 -241 -137 -455 -127
6849 -127 -297 -308 -80 -213 -341 -319 -169 170 -232 -272 -139 -346 -174 -52 -147 -356 223 -397 -234 -30 -290
6870 -290 -207 -227 17 -260 -271 -380 -179 -134 -518 -169 -145 -290 -292 -487 -197 -371 4 -117 -45 -328 -165 -336 120
6893 120 -309 -214 -51 -61 18 -161 -119 -121 13 -273 106 -167 -283 -17 -3 -139 -257 -92 153 -203 -54 9 -46
$$ packed form
6732G5q8J63Rk36M07k4mj80K87j93j03J28j57K62k84K38L10m38P8l3k5Q5k30M38
6756D85k98r9O1rJ40O6j20J52J09q0l21RL9J11K69k39o5j63j77K09K78j23j87
6779D7O5j73J69R3K8o9K1n3K36j82m4J81k53K54r5J2j3j50j13M5n5J34n2N6Q5
6804A74J15j51j61J89n4J55k83K25m01L68k36R5J7j16J34k67J83L43n57L57k86
6825a57J63j62jP3j54J27l9Jr0M7j13J10K6p4j05k46N96j98M06m12l9J04l18L28
6849a27j70j1K28j33j28K2J50L39m02m0J33k07J72J22r5k09N79o20J63K04k60
6870b90Q3k0K44k77j1j09K01M5l84L49K4j45kj95K90j74L75j21P2k83J63j71M56
6893A20m29R5J63j0P9j79M2kJ34k86L79k73j16K66J4j36j18J65K45l56J49O3n5
$$ plain form
6916 -46 -172 -21 -72 -274 67 -222 -120 3 92 -258 -15 140 -113 103 -258 83 -32 262 123 -140 264
6937 264 -23 77 165 342 -67 -86 -114 -87 -205 220 -72 182 17 209 208 -51 329 -309 -5 409 290 172
6959 172 357 214 207 -26 260 174 179 171 420 71 172 172 53 168 302 356 300 307 268 315 126 226 211 170 197 35
6985 35 465 314 147 117 -8 262 269 239 103 143 243 296 173 184 137 370 368 315 63 -90 85 169 217 290 207
7010 207 355 243 188 186 141 370 393 330 210 -74 -9 295 43 40 172 197 353 122 381 16 302 -6 -8 205
7034 205 138 5 -37 -47 -53 -94 118 19 14 -228 -124 24 -1 -9 -147 29 -32 -391 -273 216 -182 -209 132 -316 -32
7059 -32 33 -76 -114 69 -213 -29 -64 -37 -234 -227 -296 -64 -322 -242 -140 3 -310 -328 -155 -42 -472 -89 -401
7082 -401 -479 -152 100 -304 -223 -162 -300 -254 -375 -473 -327 -161 -317 -163 30 -259 -99 -228 -274 -56 -506 -580
$$ packed form
6916d6j26J51n1k02L41k89J02J23Q9l50K43J55k53K16l61L41j15K94j39k63M04
6937B64k87J00Q8J77m09j9k8K7j18M25k92K54j65J92jk59L80o38L04M14j19j18
6959A72J85j43pk33K86q6NqK49l49J01%j19J15J34N4n6Pl9M7j89J00j5m1K7j62
6985C5M30j51j67l0j25K70Pl0j36M0J00N3j23J1m7K33kn3k52j53J75Q4M8P3q3
7010B07J48j12n5km5K29K3o3j20k84O5L04k52lJ32K5J56k31K59l65K86l08kK13
7034B05o7j33m2j0om1K12r9nk42J04J48k5qj38J76o1l59J18M89l98k7L41m48K84
7059c2O5j09l8J83k82J84l5K7j97Po9K32k58Q0J02J43l13j8J73J13m30L83l12
7082d01p8L27K52m04Q1O1j38M6j21r8J46J66j56J54J93k89J60j29m6K18m50p4
$$ plain form
7104 -580 -370 -331 -314 -254 -479 -257 -61 -80 -359 -48 -64 -136 -189 -411 -136 19 -147 -177 -249 -327 -174 -23 -78 -89
7128 -89 6 -494 -104 -16 -359 -208 -42 -156 -121 29 -98 -86 73 5 -335 -136 9 174 -10 260 -74 71
7150 71 -262 87 403 -226 -84 58 212 100 -123 14 -180 180 142 275 79 100 73 37 -68 200 -76 -168
7172 -168 250 142 246 -8 87 293 142 285 243 191 -74 238 127 151 444 215 17 118 334 501 283
7193 283 212 227 -30 260 191 234 103 228 221 195 238 121 277 399 122 43 328 470 376 389 144 392 77 329
7217 329 316 278 104 460 377 48 320 79 190 198 342 466 307 255 165 458 308 90 138 328 177 238 242 189
7241 189 339 383 214 139 176 284 -74 115 210 35 238 319 349 345 54 -51 -2 119 92 88 81 108 -114 140 252
7266 252 -90 91 -64 -52 198 38 -62 -27 27 -50 206 -94 -33 -99 -269 -221 -66 145 -269 -260 159 -144 73
$$ packed form
7104e80K10L9J7O0k25K22J96j9k79L11j6p2n3k22K75J55j66l0p2p8J53J51n5j1
7128h9R5n00L90Q8l43J51J66j14L5J50j27J2J59o8l40J99J45J65j84K70l34J45
7150G1l33L49L16o29J42J42J54j12k23J37j94L60l8J33j96K1k7l6j05K68k76r2
7172a68M18j08J04k54R5K06j51J43m2n2k65L12j11K4K93k29j98J01K16J67k18
7193B83p1J5k57K90o9M3j31J25pk6M3j17J56J22k77p9K85J42r4J3k45K48l15K52
7217C29j3l8j74L56q3l29K72k41J11QJ44J24j59n2r0K93j50k18M8J90j51O1Mn3
7241A89J50M4j69p5L7J08l58J89R5j75K03Q1L0mk91j05M9J21k7mpK7k22K54J12
7266B52l42J81j55J2K50j60j00L5N4p7K56l00O1o6j70M8J55K11m14RM19l03K17
$$ plain form
7289 73 -162 -311 -517 -207 150 -325 -430 -146 -231 -465 -120 174 -181 -425 -159 -209 -225 23 -238 -308 -453 -209
7311 -209 -283 -296 -227 -291 -239 -364 -193 -83 -284 -58 -317 -332 -715 -368 -206 -200 -285 -170 -279 -157 -66 -284 -354 -128
7335 -128 -185 -240 -202 -79 -222 -383 -577 -300 -336 -41 -75 -233 -487 -216 -81 -44 -606 -431 -65 3 -61 -495 52
7358 52 -145 -199 -238 -24 -206 -154 47 -125 -268 -22 -70 -24 -47 -311 -113 109 -28 -229 -63 -23 191 10 -105
7381 -105 47 189 -71 93 -95 163 171 -114 -112 -24 268 197 422 20 91 345 217 -5 162 138 303 101 276
7404 276 242 223 425 126 -88 81 69 182 390 245 147 18 418 167 441 408 96 354 129 311 198 449
7426 449 245 537 325 207 348 207 410 317 226 111 389 406 268 -5 442 464 353 373 264 468 5 281
7448 281 207 313 407 328 622 405 176 244 200 307 102 407 370 303 503 274 178 182 290 400 203 318 194
$$ packed form
7289G3k35j49k06L10L57m75j05K84q5k34L45K94l55k44K66n0j6K48k61p0j45K44
7311b09p4j3O9o4N2j25J71J10k01K26k59j5l83L47J62Oq5J15j09J22R1k18p0K26
7335a28n7n5L8J23j43j61j94K77l6K95l4j58k54K71J35L7n62J75L66O8o4m34N47
7358E2j97n4l9K14j82N2K01j72j43K46m8M6k3k64J98K22j37k01J66M0K14j81j15
7381a05J52J42k60J64j88K58Qk85KQ8K92p1K25m02P1K54j28k22J67k4J65k02J75
7404B76l4j9K02k99k14J69j2J13K08j45r8j29M00k51K74l3l12K58k25J82j13K51
7426D49k04K92k12j18J41j41K03r3r1j15K78J7j38k73M47K2j11K0j09K04m63K76
7448B81p4J06R4p9K94k17k29O8m4J07k05L05l7o7K00k29r6MJ08J10j97J15j24
$$ plain form
7471 194 124 243 55 33 398 428 8 270 -55 -148 171 195 211 147 197 -106 186 30 40 96 203 -71 257
7494 257 -86 -3 94 68 28 -109 -16 -332 -41 51 192 -50 -126 -14 -83 11 -22 39 -50 64 -303 -102 -339 39
7518 39 -238 225 -93 -111 25 -129 -17 -219 -243 -289 -56 -183 -309 -228 -165 -84 135 -128 -62 -574 -411 -316 -160
7541 -160 -388 -367 -240 -316 -390 -215 -489 -221 -191 -463 -233 -579 -452 -370 -225 -311 -508 -392 -66 -447 -316 -477
7563 -477 -360 -486 -330 -337 -488 -285 -567 -409 -29 -353 -558 -87 -218 -345 -281 -198 -157 -163 -501 -462 -273 -60 -170
7586 -170 -136 -325 49 -244 -320 -346 -327 -129 -61 -241 -196 -125 -242 -328 -268 -310 -212 -207 -116 198 41 278 64 124 136
7611 136 3 -167 -208 14 -11 375 -156 -52 234 308 -167 99 221 304 78 263 354 -21 314 233 203 166 110
7634 110 160 241 228 178 82 262 340 336 178 366 169 256 315 216 313 267 464 463 214 189 219 213 339 379 181 262 323
$$ packed form
7471A94p0J19j88k2L65L0m20K62l25r3L19K4J6o4N0l03K92j56J0N6J07k74L28
7494B57l43Q3R7k6m0j37R3l16K91R2J41k42p6J12o9R4l3O1q9J14l67K01k37L78
7518C9k77M63l18j8J36j54J12k02k4m6K33j27j26Q1O3Q1K19k63O6n12J63R5J56
7541a60k28K1J27p6p4J75k74K68L0k72K30l46J27Q2J45q6j97J16L26l81J31j61
7563d77J17j26J56pj51K03k82J58L80l24k05M71j31j27O4Q3M1ol38L9J89K13j10
7586a70L4j89L74k93p6k6J9J98O8j80M5P1j17q6O0m2R8NR1L14j57K37k14O0J2
7611A36j33j70m1K22k5L86n31J04K86P4m75K66J22Q3k26J85R1l75L35q1l0l7n6
7634A10N0Q1j3n0r6J80P8mj58J88j97Q7N9r9R7m6J97jk49k5L0oJ26M0j98Q1O1
$$ plain form
7661 323 491 318 241 144 346 324 135 228 396 511 373 321 565 630 441 231 159 146 136 337 230 495 342
7684 342 367 320 294 456 138 499 167 170 256 253 367 455 197 184 373 187 -29 93 45 93 -54 127 37 148
7708 148 339 -158 102 -37 135 440 -165 217 247 -83 -97 -365 -191 -149 76 64 -68 258 20 -156 182
7729 182 -18 282 254 106 130 -142 25 37 189 -42 -289 -528 -15 -99 -145 -240 -54 -639 -312 -185 -348 37
7751 37 -4 -176 -414 -223 -142 -167 -146 -506 -4 -257 -367 -194 -176 -498 -321 -338 -346 -439 -416 -204 -262 -352 -171 -262 -296
7776 -296 -467 -230 -446 -268 -145 -346 -164 -456 -141 -560 -217 -338 -183 -408 -546 -319 -342 -113 -348 -581
7796 -581 -314 20 -9 -246 -266 -348 -350 -421 -134 -581 -147 -160 -387 -500 -254 -274 -208 -234 -254 -200 -136 -5 -102 -17 -193
7821 -193 -541 -431 -245 -133 -251 -50 -407 37 -41 78 34 42 71 -207 -416 -197 259 -169 -357 363 -90 -132
$$ packed form
7661C23J68j73p7r7K02k2j89R3J68J15j38n2K44O5j89k10p2j3j0K01j07K65j53
7684C42K5m7k6J62l18L61l32LQ6lJ14Q8k58j3J89j86k16J22m8M8j47J81r0J11
7708A48J91m97K60j39J72L05o05L82L0l30j4k68J74M2K25j2j32L26k38j76L38
7729A82k00L00k8j48K4k72J67J2J52k31k47k39N13q4m6r5J86n85L27J27j63L85
7751C7m1j72k38J91Q1k5K1l60N02k53j10J73J8l22J77j7qr3K3K12n8r0J81r1l4
7776b96j71K37k16J78J23k01J82k92L15m19L43j21J55k25j38K27k3K29k35k33
7796e81K67L34k9k37k0q2kp1K87m47M34j3k27j13K46k0O6k6k0N4O4J31r7Q5j76
7821a93l48J10J86J12j18K01l57M44p8J19m4QK9k78k09K19M56m28j88P20m53m2
$$ plain form
7843 -132 -8 -64 57 206 144 14 141 99 373 435 39 194 282 -83 65 242 322 318 402 45 58 358 14
7866 14 163 176 573 428 221 301 198 403 191 550 226 258 474 317 470 380 169 455 248 287 397 443
7888 443 220 265 422 269 425 479 495 261 200 16 306 241 625 430 395 519 495 512 304 366 67 308 133
7911 133 368 381 166 467 251 177 172 187 399 185 -27 135 314 366 470 266 199 155 156 184 281 258 271 105 205
7936 205 127 -9 230 93 213 204 4 132 99 -86 -10 -186 -199 76 84 -29 25 -337 369 -203 -20 -206 -88
7959 -88 -124 51 -70 -235 -73 -121 -121 -105 -109 -235 -14 -319 102 -178 -458 -167 -520 -371 -361 -182 -287 -641 -302
7982 -302 -307 -223 -13 -165 -486 -177 -428 -181 -290 -264 -248 -470 -539 -277 -171 -145 -351 -38 -581 -199 -362 -430 -439
8005 -439 -403 47 -375 -266 -542 -812 -653 -326 -511 -42 -401 -476 -367 -483 -276 -321 -127 -696 -253 -232 -439
$$ packed form
7843a32J24n6J21J49o2j30J27m2K74O2l96J55Q8l65J48J77Q0mQ4l57J3L00l44
7866A4J49J3L97j45k07Q0j03K05k12L59l24L2K16j57J53r0k11K86k07L9J10M6
7888D43k23M5J57j53J56N4J6k34o1j84K90o5L84j95l5J24k4J7k08O2k99K41j75
7911A33K35J3k15L01k16p4nJ5K12k14k12J62J79N2J04k04o7m4JK8R7k3J3j66J00
7936B05p8j36K39j37J20rk00J28l3j85P6j76j3K75Qj13N4l62P06n72J83j86J18
7959h8l6J75j21j65J62m8%J6mj26K21l05M21k80k80K91l53J49J0J79j05l54L39
7982c02nQ4K10j52l21L09k51K47j09K6J6k22o9K62J06K6k06L13n43L82j63o8r
8005d39L6M50m22J09k76k70J59L27j85M69l59p5J09j16K07m5J94n69M43K1k07
$$ plain form
8026 -439 -540 -106 -145 -395 -93 -28 -354 -44 -288 -188 -149 -374 -330 -340 -114 -248 -120 -187 -308 -264 -39 -169
8048 -169 -378 -302 -146 -264 -231 -18 26 -46 -144 -228 -133 -80 -302 -216 54 -209 -345 -301 -221 82 -73 215 -149 -69
8072 -69 33 -152 120 220 290 -135 -39 42 222 233 208 267 56 -20 -12 225 312 171 80 279 263 132 92 200 108
8097 108 165 351 698 180 175 159 468 221 401 193 378 303 391 206 367 405 285 272 96 469 462 272 196 140
8121 140 83 333 387 349 553 692 387 432 197 555 517 513 294 327 408 455 353 472 458 536 345 63 477 187
8145 187 216 270 -46 214 34 191 670 113 329 181 396 324 282 411 385 189 227 292 273 510 -2 137 4
8168 4 205 152 126 227 59 80 98 207 -2 -20 -61 -87 -132 -212 -124 23 216 28 287 38 -212 19 -112
$$ packed form
8026d39j01M34l9k50L02O5l26L10k44J00L9k25M4j0K26j34J28o7j21M4K25j30
8048a69k09P6J56j18L3K13M4p2r8q4R5N3k22Q6K70k63j36M4Q0L03j55K88l64Q0
8072f9J02j85K72J00P0m25R6Q1J80J1k5N9k11p6QK37Q7j41r1J99j6j31m0J08r2
8097A08N7J86L47n18nj6L09k47J80k08J85p5Q8j85J61L8j20j3j76L73pj90p6n6
8121A40n7K50N4l8K04J39l05M5k35L58l8mk19L3Q1M7j02J19j4P8j91k82M14k90
8145A87K9N4l16K60j80J57M79n57K16j48K15p2m2J29k6j96L8O5j9K37n12J39j33
8168DK01n3k6J01j68K1J8J09k09j8m1k6m5q0Q8J47J93j88K59k49k50K31j31
8191a12
$$ Imaginary data points
##PAGE= N=2
##DATA TABLE= (X++(I..I)), XYDATA
$$ plain form
0 0 0 0 0 -8 8 -8 8 -16 24 -32 40 -48 64 -72 88 -106 130 -152 181 -216 251 -292 338 -388 451 -515 586
27 586 -667 757 -854 960 -1079 1210 -1353 1509 -1683 1873 -2079 2306 -2558 2832 -3134 3468
43 3468 -3841 4258 -4724 5249 -5846 6537 -7335 8279 -9414 10808 -12567 14866 -18021
56 -18021 22634 -30035 43867 -78545 343169 400947 -479823 -209372 349364 255557 -193733
67 -193733 57008 374384 62715 -331874 19578 410692 151700 -221719 -4023 235657
77 235657 10858 -165811 151851 336457 13367 -234093 21997 233953 56980 -61568
87 -61568 146867 201184 -74297 -167504 135917 292097 42095 -153309 1054 145706 51748
98 51748 -6192 100799 91275 -84778 -102832 85055 138936 -2492 -43280 56821 38827
$$ packed form
0@%%%qJ6j6J6k4M0n6P2q8J12j36J60j94K36k82L33l97M67n43O30p26Q39r66J101
27E86j253J424j611J814k039K289k563K862l192L556l952M385m864N390n966O602
43C468p309Q099q982R973j1095J2383j3872J5614j7693K0222k3375K7433l2887
56a8021M0655n2669P3902j22412M21714N7778q80770K70451N58736r3807m49290
67a93733K50741L17376l11669l94589L51452L91114k58992l73419K17696K39680
77B35657k24799j76669L17662J84606l23090k47460K56090K11956j76973j18548
87f1568K08435N4317k75481r3207L03421J56180k50002j95404J54363J44652r3958
98E1748n7940J06991r524j76053j8054J87887N3881j41428m0788J00101j7994
$$ plain form
109 38827 -79320 -38864 108296 88724 -52984 -62231 32631 37080 -1730 40797 57859 -43840
121 -43840 -94664 9819 84415 19062 -25303 18072 -7741 -101518 -58665 87989 71136 -97413
133 -97413 -124401 22853 63312 -59545 -99340 1919 28216 -67364 -90692 -2303 25443
144 25443 -38045 -51133 -12226 -41465 -91775 -28959 59388 -2310 -119277 -79880 38488 12827
156 12827 -98868 -79787 13701 -18949 -106865 -54495 44813 -18067 -142775 -100610 26523
167 26523 7985 -98051 -90425 -10853 -21782 -77402 -55754 -17962 -50499 -76126 -31596 -14355
179 -14355 -65063 -69663 -2361 236 -82693 -100625 -22173 9679 -43751 -65218 -30081 -33235 -72300
192 -72300 -54093 -3116 -21752 -79294 -69529 -17447 -19846 -52287 -37055 -15782 -55782 -88911
$$ packed form
109C8827j18147M0456J47160j9572j41708r247R4862M449l8810M2527J7062j01699
121d3840n0824J04483P4596o5353m4365M3375k5813r3777M2853J46654j6853j68549
133i7413k6988J47254M0459j22857l9795J01259K6297r5580k3328Q8389K7746
144B5443o3488j3088L8907k9239n0310O2816Q8347o1698j16967L9397J18368k5661
156A2827j11695J9081R3488l2650q7916N2370R9308o2880j24708M2165J27133
167B6523j8538j06036P626P9572j0929n5620K1648L7792l2537k5627M4530J7241
179a4355n0708m600O7302K597q2929j7932P8452L1852n3430k1467L5137l154l9065
192g2300J8207N0977j8636n7542R765N2082k399l2441J5232K1273m0000l3129
$$ plain form
204 -88911 -34538 26079 -9331 -72187 -55216 -9365 -23152 -48085 -14848 10680 -34268 -70708
216 -70708 -27801 16936 -3956 -29958 -17263 -26758 -61823 -33466 42610 36467 -52330 -78357
228 -78357 -14326 17201 -12560 -12520 17195 -10436 -62706 -33613 40203 41266 -15266 -30569 -8643
241 -8643 -7662 -4994 31302 44572 2264 -28830 -6280 15594 12113 27535 51806 18154 -41105
254 -41105 -26106 49510 72787 24188 -12225 -4487 7181 17634 44963 57466 24543 -9729
266 -9729 83 27540 38124 45574 53378 31916 -4783 1978 52321 74585 47932 23247 23620
279 23620 23936 26451 53886 78417 54845 9288 3622 37134 60313 59046 52037 38450 15231
292 15231 11193 41994 70610 61973 33706 19805 23046 32707 51711 69015 59226 27517 11449
$$ packed form
204h8911N4373O0617l5410o2856J6971M5851j3787k4933L3237K5528m4948l6440
216g0708M2907M4737k0892k6002J2695r495l5065K8357P6076o143q8797k6027
228g8357O4031L1527k9761M0K9715k7631n2270K9093P3816J063n6532j5303K1926
241h643R81K668L6296J3270m2308l1094K2550K1874l481J5422K4271l3652n9259
254d1105J4999P5616K3277m8599l6413P738J1668J0453K7329J2503l2923l4272
266i729R812K7457J0584P450P804k1462l6699O761N0343K2264k6653k4685L73
279B3620L16K515K7435K4531k3572m5557n666L3512K3179j267p009j3587k3219
292A5231m038L0801K8616q637k8267j3901L241R661J9004J7304r789l1709j6068
$$ plain form
305 11449 29221 53435 62223 57563 44490 24394 15068 33075 61460 64071 40691 19529 15769
318 15769 23016 36820 53054 53077 26932 -481 3791 32345 49923 41363 21751 8881 7780
331 7780 17348 32863 40253 28974 9880 2208 10531 23386 31183 30928 18697 -2230 -11722 5080
345 5080 29988 31684 7063 -13647 -11879 19 7782 11871 7290 -12083 -28553 -16533 11073
358 11073 14574 -8504 -23829 -19406 -14494 -13540 -3016 5880 -8866 -31373 -27916 -7654 -5002 -15443
372 -15443 -16835 -17265 -30190 -32733 -10348 166 -24195 -46894 -34994 -18457 -25736 -30751 -17234
385 -17234 -18753 -45633 -53167 -25305 -9873 -28795 -42951 -32028 -28834 -40344 -33039 -11223 -17916
398 -17916 -48385 -54200 -28827 -15038 -22104 -25914 -28954 -46704 -53987 -28545 -4709 -19808 -47433
$$ packed form
305A1449J7772K4214Q788m660j3073k0096r326J8007K8385K611k3380k1162l760
318A5769P247J3804J6234K3k6145k7413M272K8554J7578q560j9612j2870j101
331G780R568J5515P390j1279j9094p672Q323J2855P797k55j2231k0927r492J6802
345E080K4908J696k4621k0710J768J1898P763M089m581j9373j6470J2020K7606
358A1073L501k3078j5325M423M912R54J0524Q896j4746k2507L457K0262K652j0441
372a5443j392m30j2925k543K2385J0514k4361k2699J1900J6537p279n015J3517
385a7234j519k6880p534K7862J5432j8922j4156J0923L194j1510P305K1816o693
398a7916l0469n815K5373J3789p066l810l040j7750p283K5442K3836j5099k7625
$$ plain form
411 -47433 -47294 -33905 -34152 -31108 -14861 -18451 -51332 -65037 -32436 -1734 -12118 -35397 -39755
424 -39755 -38546 -41773 -28101 -1200 -3374 -36070 -51849 -32413 -12612 -11810 -12958 -14318 -32384
437 -32384 -47982 -30165 2261 4774 -20092 -33373 -31147 -31617 -23957 2425 13928 -16205 -50635
450 -50635 -39538 -2518 9995 -2388 -11746 -18651 -29428 -23740 4685 22799 5644 -21505 -26828
463 -26828 -13297 201 12471 18737 4792 -20949 -26132 -1902 20371 19073 4549 -5977 -12120
476 -12120 -11327 4213 26681 28178 2305 -19700 -12186 12023 25587 25340 19627 5951 -12170
489 -12170 -8123 23761 47813 31592 424 -6081 7801 20716 32264 41647 28918 -3068 -13338
502 -13338 17687 48219 44051 22286 10025 4444 6482 26501 48945 41162 12669 2721 16874
$$ packed form
411d7433J39J3389k47L044J6247l590l2881j3705L2601L0702j0384k3279m358
424c9755J209l227J3672K6901k174l2696j5779J9436J9801Q02j148j360j8066
437c2384j5598J7817L2426K513k4866j3281K226m70P660K6382J1503l0133l4430
450e0635J1097L7020J2513j2383r358o905j0777N688K8425J8114j7155k7149n323
463b6828J3531J3498J2270O266j3945k5741n183K4230K2273j298j4524j0526o143
476a2120P93J5540K2468J497k5873k2005P514K4209J3564k47n713j3676j8121
489a2170M047L1884K4052j6221l1168o505J3882J2915J1548R383j2729l1986j0270
502a3338L1025L0532m168k1765j2261n581K038K0019K2444p783k8493r948J4153
$$ plain form
515 16874 27714 31838 41572 40143 13804 -4355 19258 52797 50757 25289 17499 23163 20502
528 20502 21412 39300 51071 34703 12103 11440 26062 36551 40996 37719 20602 5150 15114
541 15114 40000 44892 28244 18113 19724 15999 15116 31675 48050 34316 6448 3835 24550
554 24550 36187 30531 24909 20700 12018 10124 23961 34543 25902 13174 10172 9804 9433 18913
568 18913 30427 21913 710 -4252 9038 16977 14290 11916 8384 -35 -2395 7821 15004 7851
582 7851 -205 647 -230 -3226 3364 12922 6484 -11198 -13970 -1357 5672 -507 -7862 -10223 -10225 -7778
598 -7778 -4633 -8144 -15608 -15728 -11719 -13033 -17029 -12490 -7735 -15832 -28247 -24682 -10298 -6875 -17619
613 -17619 -27249 -24019 -16915 -15179 -18779 -21072 -20594 -21276 -25676 -27245 -20612 -12387 -16363 -31830 -39364
$$ packed form
515A6874J0840M124R734j429k6339j8159K3613L3539k040k5468p790N664k661
528B0502R10J7888J1771j6368k2600o63J4622J0489M445l277j7117j5452R964
541A5114K4886M892j6648j0131J611l725q83J6559J6375j3734k7868k613K0715
554B4550J1637n656n622m209q682j894J3837J0582q641j2728l002l68l71R480
568A8913J1514q514k1203m962J3290P939k687k374l532q419k360J0216P183p153
582G851q056Q52q77k996O590R558o438j7682k772J2613P029o179p355k361kK447
598g778L145l511p464j20M009j314l996M539M755q097j2415L565J4384L423j0744
613a7619r630L230P104J736l600k293M78o82m400j569O633Q225l976j5467p534
$$ plain form
628 -39364 -27776 -13712 -15611 -28486 -33752 -29171 -26211 -27818 -25269 -19203 -22284 -33770 -38853 -28043
642 -28043 -14645 -13202 -24239 -36073 -37816 -26977 -12581 -10312 -22987 -33164 -31590 -24694 -21511
655 -21511 -17453 -11082 -17261 -35406 -40611 -22112 -2514 -6426 -23669 -34178 -32087 -23322 -11329
668 -11329 -3620 -9675 -24605 -31857 -24861 -12612 -3675 -926 -8680 -24343 -31496 -17796 3532 10331
682 10331 -3288 -22255 -27108 -14898 1932 7269 1196 -8133 -15938 -20015 -12340 7144 18139
695 18139 4712 -19187 -24626 -7468 12352 17998 8672 -7185 -17027 -8913 9876 19448 14022
708 14022 5018 -2832 -10148 -4601 19336 35358 17911 -12465 -15866 7862 24965 23534 15572
721 15572 6832 -2916 -3614 11945 27530 27130 15428 2306 -4991 2652 26416 40692 23992 -2647
$$ packed form
628c9364J1588J4064j899j2875n266M581K960j607K549O066l081j1486n083J0810
642b8043J3398J443j1037j1834j743J0839J4396K269j2675j0177J574O896L183
655b1511M058O371o179j8145n205J8499J9598l912j7243j0509K091Q765J1993
668a1329P709o055j4930p252O996J2249Q937K749p754j5663p153J3700K1328O799
682A0331j3619j8967m853J2210J6830N337o073r329p805m077P675J9484J0995
695A8139j3427k3899n439J7158J9820N646r326j5857r842Q114J8789R572n426
708A4022r004p850p316N547K3937J6022j7447l0376l401K3728J7103j431p962
721A5572q740r748o98J5559J5585m00j1702j3122p297P643K3764J4276j6700k6639
$$ plain form
735 -2647 -3949 14804 26310 25640 26652 23245 6875 -2541 13325 36418 37816 20975 8088 4740
749 4740 9949 25494 39998 32884 9038 -843 13278 28402 29293 27060 24513 13269 2002 11527
763 11527 34097 40534 24539 8860 7542 14826 25019 34272 31667 15631 4555 12073 26124
776 26124 29947 25380 21160 14359 5872 9445 26536 35551 24132 6517 1938 11323 23912 27968
790 27968 20460 9428 5382 10385 15881 19650 21140 16443 4490 -2014 8807 24457 24432 9660
804 9660 -760 30 7680 15727 17174 9204 -100 -86 5044 5390 5968 10672 6930 -6472 -11372 2433
820 2433 14457 6735 -6707 -8356 -4539 -4167 -1724 3835 1464 -8805 -13279 -7908 -3533 -3192 -2727
835 -2727 -6496 -15984 -19072 -7732 2210 -3990 -16976 -20857 -16556 -12878 -9111 -5553 -9810 -22278
$$ packed form
735b647j302J8753J1506o70J012l407j6370r416J5866K3093J398j6841j2887l348
749D740N209J5545J4504p114k3846r881J4121J5124Q91k233k547j1244j1267R525
763A1527K2570O437j5995j5679j318P284J0193R253k605j6036j1076P518J4051
776B6124L823m567m220o801q487L573J7091R015j1419j7615m579R385J2589M056
790B7968p508j1032m046N003N496L769J490m697j1953o504J0821J5650k5j4772
804I660j0420P90P650Q047J447p970r304J4N130L46N78M704l742j3402m900J3805
820B433J2024p722j3442j649L817L72K443N559k371j0269m474N371M375L41M65
835b727l769r488l088J1340R942o200j2986l881M301L678L767L558m257j2468
$$ plain form
849 -22278 -27717 -18794 -7477 -7891 -16535 -22602 -25401 -23282 -15647 -6848 -10242 -25522 -34596 -25896 -13400
864 -13400 -10537 -14740 -19490 -26930 -31978 -25401 -11654 -7951 -18913 -28945 -30186 -26167 -18707 -9605
878 -9605 -11080 -26268 -37051 -27627 -13652 -11915 -16482 -18402 -24082 -33626 -28567 -10042 -2709 -15781
892 -15781 -29178 -28632 -21419 -14811 -7614 -7416 -20017 -30779 -23967 -9938 -5055 -8773 -12822 -19479
906 -19479 -26494 -19816 -3220 3625 -8252 -20934 -20669 -14044 -7288 -1121 585 -7935 -18957 -18107
920 -18107 -6343 4593 5286 -2831 -12337 -16466 -8565 4180 10188 4696 -5180 -10857 -9541 103
934 103 11961 13343 2372 -8962 -8136 2303 12024 13891 9159 -455 -6666 -802 12740 19500
948 19500 13424 3721 -943 1051 8278 18107 20383 10984 1003 2413 11677 17144 16863 16061 11891
$$ packed form
849b2278n439Q923J1317m14q644o067k799K119P635Q799l394j5280r074Q700J2496
864a3400K863m203m750p440n048O577J3747L703j0962j0032j241M019P460R102
878i605j475j5188j0783R424J3975J737m567j920n680r544N059J8525P333j3072
892a5781j3397N46P213O608P197J98j2601j0762O812J4029M883l718m049o657
906a9479p015O678J6596O845j1877j2682K65O625O756O167J706q520j1022Q50
920a8107J1764J0936O93q117r506m129P901J2745O008n492r876n677J316R644
934A03J1858J382j0971j1334Q26J0439R721J867m732r614o211N864J3542O760
948A9500o076r703m664J994P227R829K276r399r981J410R264N467k81q02m170
$$ plain form
963 11891 3782 4575 17235 25992 19496 8613 7138 11092 14077 18486 23308 19432 8573 6408
977 6408 14742 21122 20693 19617 15962 9737 8443 18734 26720 21524 12457 11017 14160 15667 19390
992 19390 24258 20886 10948 7829 15502 22554 21244 17445 14373 12248 12095 17379 22036 19934 14019
1007 14019 10685 11841 15109 19014 20329 15742 9055 8619 14189 18372 17038 13640 10811 9042 10084
1022 10084 14143 17186 14762 8884 5747 8007 13014 15362 12668 7376 4428 6088 9645 11808 11213
1037 11213 8378 3611 417 4033 11006 12298 5468 -1228 -1216 3651 6654 6910 4668 307 -4127
1052 -4127 -3432 2792 6297 3776 -1310 -6347 -7395 -4017 3483 4974 -2809 -10934 -10330 -4780 -2011
1067 -2011 -1680 -2130 -6569 -15102 -15193 -4790 1726 -4112 -12889 -15160 -13666 -12204 -7151 -2749 -7691 -18600
$$ packed form
963A1891q109P93J2660Q757o496j0883j475L954K985M409M822l876j0859k165
977F408Q334O380m29j076l655o225j294J0291P986n196r067j440L143J507L723
992A9390M868l372r938l119P673P052j310l799l072k125j53N284M657k102n915
1007A4019l334J156L268L905J315m587o687m36N570M183j334l398k829j769J042
1022A0084M059L043k424n878l137K260N007K348k694n292k948J660L557K163n95
1037A1213k835m767l194L616O973J292o830o696J2M867L003K56k242m361m434
1052d127O95O224L505k521n086n037j048L378P500J491p783q125O04N550K769
1067b011L31m50m439q533r1J0403O516n838q777k271J494J462N053M402m942j0909
$$ plain form
1083 -18600 -21878 -14687 -7647 -7094 -9588 -14869 -22280 -23646 -13090 -3983 -8269 -18939 -22853 -20750
1097 -20750 -18101 -13123 -7548 -10554 -23229 -29258 -21024 -10273 -9240 -13973 -19389 -24285 -26382 -19557
1111 -19557 -8578 -7799 -17805 -26255 -25516 -19836 -13446 -8663 -11306 -21551 -28281 -22876 -12622 -7898
1125 -7898 -11034 -16644 -22165 -25005 -18574 -7925 -3700 -12062 -22124 -23621 -16666 -9020 -4534 -6439
1139 -6439 -13865 -21041 -19527 -10442 -1961 -1845 -9020 -17199 -18178 -10775 -1732 1079 -3532 -10913 -14732
1154 -14732 -12062 -3547 4432 3959 -5263 -12814 -10506 -1731 6214 6333 269 -6821 -7708 -1539 5156
1169 5156 8202 6659 1437 -4231 -4897 3907 13914 13462 3568 -2898 441 6869 10270 12307 12557
1184 12557 6551 172 2464 12401 18073 14460 7968 4667 5363 10717 17718 19036 12188 5550 7730
$$ packed form
1083a8600l278P191P040N53k494n281p411j366J0556R107m286j0670l914K103
1097b0750K649M978N575l006j2675o029Q234J0751J033m733n416m896k097O825
1111a9557J0979P79j0006q450P39N680O390M783k643j0245o730N405J0254M724
1125g898l136n610n521k840O431J0649M225q362j0062j497O955P646M486j905
1139f439p426p176J514R085Q481J16p175q179r79P403R043K811m611p381l819
1154a4732K670Q515P979m73r222p551K308Q775P945J19o064p090q87O169O695
1169E156L046j543n222n668o66Q804J0007m52r894o466L339O428L401K037K50
1184A2557o006o379K292R937N672l613o492l301O96N354P001J318o848o638K180
$$ plain form
1199 7730 13046 15135 16152 18028 14573 7034 6515 16682 22889 17246 10502 10632 13084 13819 16540
1214 16540 20146 17304 10656 9330 14906 18374 17778 17595 16088 11439 9440 15970 21612 18413 11730
1229 11730 10994 13359 14673 16362 18037 15269 10034 9379 13971 16748 15441 13313 12328 10542 9676 12499
1245 12499 16056 14376 9125 6857 10605 14342 12978 10101 8243 8984 9306 9014 10292 11310 9481
1260 9481 5713 5084 7730 10141 9343 6158 3057 3406 5948 8114 6473 3402 1971 3105 2696 2399
1276 2399 4670 6441 3113 -2896 -3494 2654 6798 4013 -2013 -4398 -2159 422 1480 850 -1106
1291 -1106 -4291 -6694 -5808 -966 1605 -859 -6574 -10626 -9308 -3742 -12 -1934 -8379 -12488 -10249
1306 -10249 -5860 -4238 -5127 -6831 -10694 -14264 -12577 -5835 -2604 -6971 -13538 -16064 -14258 -10077 -5599
$$ packed form
1199G730N316K089J017J876l455p539n19J0167O207n643o744J30K452P35K721
1214A6540L606k842o648j326N576L468n96j83j507m649j999O530N642l199o683
1229A1730p36K365J314J689J675k768n235o55M592K777j307k128r85j786q66K823
1245A2499L557j680n251k268L748L737j364k877j858P41L22k92J278J018j829
1260I481l768o29K646K411p98l185l101L49K542K166j641l071j431J134m09k97
1276B399K271J771l328o009n98O148M144k785o026k385K239K581J058o30j956
1291a106l185k403Q86M842K571k464n715m052J318N566L730j922o445m109K239
1306a0249M389J622q89j704l863l570J687O742L231m367o567k526J806M181M478
$$ plain form
1321 -5599 -5721 -11768 -17604 -17084 -12277 -8799 -8869 -10397 -14814 -19325 -18420 -11074 -5980 -9539 -17042 -20664
1337 -20664 -18490 -13537 -8480 -8767 -13973 -19422 -19259 -15734 -11662 -9823 -10721 -14954 -19798 -20274 -13220 -6784
1353 -6784 -8323 -16399 -21446 -18446 -11796 -8893 -9779 -12115 -15240 -18015 -17058 -11791 -5671 -6325 -12721 -18850
1369 -18850 -17617 -10148 -3910 -4920 -11088 -15089 -14453 -9883 -5656 -3594 -4591 -9687 -13969 -12561 -5851
1384 -5851 593 329 -6514 -12393 -10533 -3722 1521 -25 -3510 -4887 -5810 -5215 -596 4855 3849 -2796
1400 -2796 -6179 -2286 2444 5351 6024 3397 -1729 -2760 3443 8784 7509 4491 4143 3465 2508 6043
1416 6043 11784 11801 4600 1462 6181 10482 11524 12393 10846 5527 3454 9423 15724 14521 9652 9453
1432 9453 10209 9089 10426 16215 17757 11543 6642 9714 15228 17121 15295 13009 10853 9751 12793
$$ packed form
1321e599j22o047n836N20M807L478p0j528m417m511R05P346N094l559p503l622
1337b0664K174M953N057k87n206n449J63L525M072J839q98m233m844m76P054O436
1353f784j539q076n047L000O650K903q86k336l125k775R57N267O120o54o396o129
1369a8850J233P469O238j010o168m001O36M570M227K062r97n096m282J408O710
1384e851O444k64o843n879J860O811N243j546l485j377r23N95M619N451j006o645
1400b796l383L893M730K907O73k627n126j031O203N341j275l018l48o78r57L535
1416F043N741J7p201l138M719M301J042Q69j547n319k073N969O301j203m869j99
1432I453P56j120J337N789J542o214m901L072N514J893j826k286k156j102L042
$$ plain form
1447 12793 16762 16709 13988 12298 11853 11806 13210 16651 17454 12843 8451 10714 16098 17196 13677 11340
1463 11340 11723 11917 12159 13637 15550 13555 10188 8367 10756 14506 14729 12070 8522 7502 9519 12574
1479 12574 13582 10693 7483 6308 7433 9338 11118 11246 8745 4478 3179 6369 10341 10458 6156
1494 6156 2156 2360 4532 6788 7995 6640 2844 -935 245 5080 7267 5145 1366 -1067 -1360
1509 -1360 587 3829 4962 1908 -3832 -4821 -1315 2427 2552 17 -3605 -6473 -5399 -784 2125
1524 2125 76 -5057 -7871 -7146 -5105 -1542 321 -2871 -9280 -11599 -6616 -1194 -1537 -5672 -8712
1539 -8712 -10329 -10561 -7303 -2604 -1842 -8300 -14258 -13926 -8359 -4493 -4376 -7405 -12430 -15353 -12373 -6741
1555 -6741 -4995 -7702 -11889 -14573 -14523 -11104 -5976 -4713 -9987 -16578 -16302 -10941 -6812 -6837 -8858 -12924
$$ packed form
1447A2793L969n3k721j690m45m7J404L441Q03m611m392K263N384J098l519k337
1463A1340L83J94K42J478J913j995l367j821K389L750K23k659l548j020K017L055
1479A2574J008k889l210j175J125J905J780J28k501m267j299L190L972J17m302
1494F156m000K04K172K256J207j355l796l779J180M835K187k122l779k433k93
1509a360J947L242J133l054n740r89L506L742J25k535l622k868J074M615K909
1524B125k049n133k814P25K041L563J863l192o409k319M983N422l43m135l040
1539h712j617k32L258M699P62o458n958L32N567L866J17l029n025k923K980N632
1555f741J746k707m187k684N0L419N128J263n274o591K76N361M129k5k021m066
$$ plain form
1571 -12924 -15748 -15125 -10073 -5570 -7119 -12838 -16559 -15342 -11268 -7337 -7014 -10356 -15134 -16120 -12889
1586 -12889 -8490 -6261 -8007 -12422 -15729 -14478 -8843 -4862 -5979 -10961 -14339 -13090 -9262 -5741 -5080
1601 -5080 -7580 -11276 -13134 -10985 -6294 -2837 -4720 -9617 -12065 -9516 -5426 -3319 -3526 -5256 -7936
1616 -7936 -9537 -7008 -1563 738 -3089 -6899 -7036 -4589 -1399 1063 1217 -2185 -5303 -3839 404
1631 404 2436 1845 614 -712 -2244 -1242 4371 6782 2655 -1428 373 3298 4307 5039 6754 5264
1647 5264 1171 1429 6852 9482 7122 5402 5758 5835 6006 8945 11069 8912 5204 5988 9339 10520
1663 10520 10377 10831 9625 6933 7078 11545 14085 10906 8324 9336 10823 10532 12128 13429 12087 8646
1679 8646 8599 12220 14926 13424 11345 10383 10157 10798 12966 14501 12831 10271 9318 11145 13130 13374 12550
$$ packed form
1571a2924k824O23N052M503j549n719l721J217M074L931L23l342m778r86L231
1586a2889M399K229j746m415l307J251N635L981j117m982l378J249L828L521O61
1601e080k500l696j858K149M691L457j883m897k448K549M090K107k07j730k680
1616g936j601K529N445K301l827l810j37K447L190K462J54l402l118J464M243
1631D04K032n91j231j326j532J002N613K411m127m083J801K925J009P32J715j490
1647E264m093K58N423K630k360j720L56P7J71K939K124k157l708P84L351J181
1663A0520j43M54j206k692J45M467K540l179k582J012J487k91J596J301j342l441
1679H646m7L621K706j502k079r62k26O41K168J535j670k560r53J827J985K44q24
$$ plain form
1696 12550 10335 8195 9048 12186 14053 12181 8761 7655 8911 10047 11319 12102 10767 7258 5744
1711 5744 7535 10790 11434 9186 5926 4614 5740 8608 10069 8587 5821 3276 2840 4949 8129
$$ packed form
1696A2550k215k140Q53L138J867j872l420j106J256J136J272P83j335l509j514
1711E744J791L255O44k248l260j312J126K868J461j482k766k545m36K109L180
$$ [...]
8191c54
##END NTUPLES=NMR FID
##END=
