##TITLE=1H_LacDMe-B2-A
 CDCl3, 8 sc, 
 14.11.2019
##JCAMPDX= 6.0         $$ Bruker NMR JCAMP-DX V2.0
##DATA TYPE= NMR FID
##DATA CLASS= NTUPLES
##ORIGIN= UXNMR, Bruker Analytische Messtechnik GmbH
##OWNER= root
$$ XWIN-NMR		Version 3.5
$$ Thu Nov 14 16:43:08 2019 Russian Standard Time (UT+4h)  she@DPX200
##.OBSERVE FREQUENCY= 200.1315
##.OBSERVE NUCLEUS= ^1H
##.DELAY= (6, 6)
##.ACQUISITION MODE= SIMULTANEOUS
##.ACQUISITION SCHEME= undefined
##.AVERAGES= 8
##.DIGITISER RES= 18
##SPECTROMETER/DATA SYSTEM= spect
##.PULSE SEQUENCE= zg30
##.SOLVENT NAME= CDCl3
##.SHIFT REFERENCE= (INTERNAL, CDCl3, 0, 15.7039)
##AUDIT TRAIL= $$ (NUMBER, WHEN, WHO, WHERE, WHAT)
$$ ##TITLE= Audit trail, XWIN-NMR		Version 3.5
$$ ##JCAMPDX= 5.01
$$ ##ORIGIN= Bruker BioSpin GmbH
$$ ##OWNER= she
$$ F:/spectra/data/she/nmr/H-F/1/audita.txt
$$ ##AUDIT TRAIL=  $$ (NUMBER, WHEN, WHO, WHERE, WHAT)
(   1,<2019-11-14 16:42:21.42 +0400>,<she>,<DPX200>,
      <created by zg, POWCHK disabled, PULCHK disabled
       configuration hash MD5:
       00 E9 B6 7A A2 85 ED C7 34 08 36 98 17 FE 4E 26
       data hash MD5: 16K
       CF DA 5B 38 D1 23 DA 73 53 35 27 FC 1E 8F BB B2>)
$$ ##END=
$$ 
$$ hash MD5
$$ 02 6D 9C A0 82 AE 4D DF 4A 01 86 CD A0 6A D8 A4
##$RELAX= 
##$RELAX= 
##$RELAX= 
##$RELAX= 
##$RELAX= 
##$RELAX= 
$$ Bruker specific parameters
$$ --------------------------
##$DU= <F:/spectra>
##$EXPNO= 1
##$NAME= <H-F>
##$PROCNO= 1
##$TYPE= <nmr>
##$USER= <she>
##$AMP= (0..31)
100 100 100 100 100 100 100 100 100 100 100 100 100 100 100 100 100 100 
100 100 100 100 100 100 100 100 100 100 100 100 100 100 
##$AQSEQ= 0
##$AQ_mod= 1
##$AUNM= <au_zg>
##$AUTOPOS= <>
##$BF1= 200.13
##$BF2= 200.13
##$BF3= 200.13
##$BF4= 200.13
##$BF5= 200.13
##$BF6= 200.13
##$BF7= 200.13
##$BF8= 200.13
##$BYTORDA= 1
##$CFDGTYP= 0
##$CFRGTYP= 5
##$CHEMSTR= <none>
##$CNST= (0..31)
1 1 145 1 1 1 1 1 1 1 1 1 1 1 1 1 1 1 1 1 1 1 1 1 1 1 1 1 1 1 1 1 
##$CPDPRG= <>
##$CPDPRG1= <>
##$CPDPRG2= <>
##$CPDPRG3= <>
##$CPDPRG4= <mlev>
##$CPDPRG5= <mlev>
##$CPDPRG6= <mlev>
##$CPDPRG7= <mlev>
##$CPDPRG8= <mlev>
##$CPDPRGB= <>
##$CPDPRGT= <>
##$D= (0..31)
0 1.2 0 0 0 0 0 0 0 0.06 0 0.03 0 0 0 0 0.0002 0 0 0 0 0 0 0 0 0 0 0 0 
0 0 0 
##$DATE= 1573735340
##$DBL= (0..7)
120 120 120 120 120 120 120 120 
##$DBP= (0..7)
150 150 150 150 150 150 150 150 
##$DBP07= 0
##$DBPNAM0= <>
##$DBPNAM1= <>
##$DBPNAM2= <>
##$DBPNAM3= <>
##$DBPNAM4= <>
##$DBPNAM5= <>
##$DBPNAM6= <>
##$DBPNAM7= <>
##$DBPOAL= (0..7)
0.5 0.5 0.5 0.5 0.5 0.5 0.5 0.5 
##$DBPOFFS= (0..7)
0 0 0 0 0 0 0 0 
##$DE= 6
##$DECBNUC= <off>
##$DECIM= 24
##$DECNUC= <off>
##$DECSTAT= 4
##$DIGMOD= 1
##$DIGTYP= 9
##$DL= (0..7)
0 120 120 120 120 120 120 120 
##$DP= (0..7)
150 150 150 150 150 150 150 150 
##$DP07= 0
##$DPNAME0= <>
##$DPNAME1= <>
##$DPNAME2= <>
##$DPNAME3= <>
##$DPNAME4= <>
##$DPNAME5= <>
##$DPNAME6= <>
##$DPNAME7= <>
##$DPOAL= (0..7)
0.5 0.5 0.5 0.5 0.5 0.5 0.5 0.5 
##$DPOFFS= (0..7)
0 0 0 0 0 0 0 0 
##$DQDMODE= 0
##$DR= 18
##$DS= 0
##$DSLIST= <SSSSSSSSSSSSSSS>
$$ [...]
##$SUBNAM2= <"">
##$SUBNAM3= <"">
##$SUBNAM4= <"">
##$SUBNAM5= <"">
##$SUBNAM6= <"">
##$SUBNAM7= <"">
##$SUBNAM8= <"">
##$SUBNAM9= <"">
##$SW= 24.0689530833862
##$SWIBOX= (0..15)
0 0 2 0 0 0 0 0 0 0 0 0 0 0 0 0 
##$SW_h= 4816.95568400771
##$TD= 16384
##$TD0= 1
##$TE= 0
##$TE2= 300
##$TE3= 300
##$TEG= 300
##$TL= (0..7)
0 120 120 120 120 120 120 120 
##$TP= (0..7)
150 150 150 150 150 150 150 150 
##$TP07= 0
##$TPNAME0= <>
##$TPNAME1= <>
##$TPNAME2= <>
##$TPNAME3= <>
##$TPNAME4= <>
##$TPNAME5= <>
##$TPNAME6= <>
##$TPNAME7= <>
##$TPOAL= (0..7)
0.5 0.5 0.5 0.5 0.5 0.5 0.5 0.5 
##$TPOFFS= (0..7)
0 0 0 0 0 0 0 0 
##$TUNHIN= 0
##$TUNHOUT= 0
##$TUNXOUT= 0
##$USERA1= <user>
##$USERA2= <user>
##$USERA3= <user>
##$USERA4= <user>
##$USERA5= <user>
##$V9= 5
##$VALIST= <valist>
##$VCLIST= <CCCCCCCCCCCCCCC>
##$VD= 0
##$VDLIST= <DDDDDDDDDDDDDDD>
##$VPLIST= <PPPPPPPPPPPPPPP>
##$VTLIST= <TTTTTTTTTTTTTTT>
##$WBST= 1024
##$WBSW= 4
##$XGAIN= (0..3)
0 0 0 0 
##$XL= 0
##$YL= 0
##$YMAX_a= 389127
##$YMIN_a= -333876
##$ZGOPTNS= <>
##$ZL1= 120
##$ZL2= 120
##$ZL3= 120
##$ZL4= 120
##$ABSF1= 10
##$ABSF2= 0
##$ABSG= 5
##$ABSL= 3
##$ALPHA= 0
##$AQORDER= 0
##$ASSFAC= 0
##$ASSFACI= 0
##$ASSFACX= 0
##$ASSWID= 0
##$AUNMP= <proc_1d>
##$AZFE= 0.1
##$AZFW= 0.1
##$BCFW= 1
##$BC_mod= 2
##$BYTORDP= 1
##$COROFFS= 0
##$CY= 11.3945322036743
##$DATMOD= 1
##$DC= 2
##$DFILT= <>
##$DTYPP= 0
##$F1P= 16.9975609425685
##$F2P= -3.02152046262296
##$FCOR= 0.5
##$FTSIZE= 0
##$FT_mod= 4
##$GAMMA= 1
##$GB= 0.15
##$INTBC= 1
##$INTSCL= 1
##$ISEN= 128
##$LB= 0.24
##$LEV0= 0
##$LPBIN= 0
##$MAXI= 10000
##$MC2= 0
##$MEAN= 0
##$ME_mod= 0
##$MI= 1.114404
##$NCOEF= 0
##$NC_proc= 0
##$NLEV= 6
##$NOISF1= 3.799351
##$NOISF2= 2.8
##$NSP= 1
##$NTH_PI= 0
##$NZP= 0
##$OFFSET= 15.70392
##$PC= 1
##$PHC0= -9456.922
##$PHC1= 19.60088
##$PH_mod= 1
##$PKNL= yes
##$PPARMOD= 0
##$PSCAL= 0
##$PSIGN= 0
##$REVERSE= no
##$SF= 200.130013532006
##$SI= 16384
##$SIGF1= 3
##$SIGF2= 2
##$SINO= 400
##$SIOLD= 16384
##$SREGLST= <1H.CDCl3>
##$SSB= 0
##$STSI= 0
##$STSR= 0
##$SW_p= 3612.71676300578
##$SYMM= 0
##$S_DEV= 0
##$TDeff= 0
##$TDoff= 0
##$TI= <>
##$TILT= no
##$TM1= 0
##$TM2= 0
##$TOPLEV= 0
##$USERP1= <user>
##$USERP2= <user>
##$USERP3= <user>
##$USERP4= <user>
##$USERP5= <user>
##$WDW= 1
##$XDIM= 8192
##$YMAX_p= 0
##$YMIN_p= 0
$$ End of Bruker specific parameters
$$ ---------------------------------
##NTUPLES= NMR FID
##VAR_NAME=  TIME,          FID/REAL,        FID/IMAG
##SYMBOL=    X,             R,               I
##VAR_TYPE=  INDEPENDENT,   DEPENDENT,       DEPENDENT
##VAR_FORM=  AFFN,          ASDF,            ASDF
##VAR_DIM=   8192,          8192,            8192
##UNITS=     SECONDS,       ARBITRARY UNITS, ARBITRARY UNITS
##FACTOR=    0.0002076,     1,               1
##FIRST=     0,             0,               0
##LAST=      1.7004516,     0,               0
##MIN=       0,             -333876,         0
##MAX=       1.7004516,     389127,          0
$$ Real data points
##PAGE= N=1
##DATA TABLE= (X++(R..R)), XYDATA
$$ [...]
2218A198p48o29P11J734N59j829j110M18K13pQ62K55p82j265R82J374j50j289
$$ 1198 450 -179 532 2266 2825 996 -114 304 517 510 1372 1627 845 -420 562 1936 1786 497
2236D97n03Q31N35p3Q43k19j305p68M74J310k36p81l60l77m27J245J080j148j985
$$ 497 -6 825 1360 1287 2130 1911 606 -162 312 1622 1386 605 245 -132 -559 686 1766 618 -1367
2255a367K96R56K20J12O83l74k103n15J705J613k56j775j99J30j54R57J356n07
$$ -1367 -1071 -115 105 217 900 526 -1577 -2092 -387 1226 970 -805 -1004 -874 -1028 -71 1285 778
2273G78k379q17J108J564P31N2j245k373p20K394K332n03k019j169m64L28J667
$$ 778 -1601 -2418 -1310 254 985 1037 -208 -2581 -3301 -907 1425 922 -1097 -2266 -2730 -2402 -735
2290g35J893M6l609j581J480K906N37l01p52k143j677K042L351J084k108k714
$$ -735 1158 1204 -2405 -3986 -2506 400 937 636 -116 -2259 -3936 -1894 1457 2541 433 -2281
2306b281p06M38J864K556N6l067l101J222K244J892K05p67k712k370J486M073
$$ -2281 -2987 -2549 -685 1871 1927 -1140 -4241 -3019 -775 1117 1322 555 -2157 -4527 -3041 1032
2322A032J988k051l293r36O50J634K568J072k108l865o35L022K696N29j306k529
$$ 1032 3020 969 -2324 -3260 -2610 -976 1592 2664 556 -3309 -3944 -922 1774 2303 997 -1532
2338a532k159O79L761K403j232k836j925j01J321L194J778j827m218j716K544
$$ -1532 -3691 -3012 749 3152 1920 -916 -2841 -2942 -1621 1573 3351 1524 -2694 -4410 -1866
2353a866L503Q55j238j863j937l14K774K947J14k942k645k30J591K779J920j414
$$ -1866 1637 2492 1254 -609 -2546 -2860 -86 2861 2975 33 -2612 -2842 -1251 1528 3448 2034
2369B034l428j864J318K635J544j35j694k763j082K524L533J52k475k704m47J348
$$ 2034 -1394 -3258 -1940 695 2239 2104 410 -2353 -3435 -911 2622 2774 299 -2405 -2852 -1504
2385a504K609J648m50k670k332M63K588J863N17j709k519r73J914K638M78j566
$$ -1504 1105 2753 2303 -367 -2699 -2236 352 2215 2732 1023 -1496 -2469 -555 2083 2561 995
2401I95j986j68k81J760J960L43k725k126L73K090J451j29o97j609j352J368J852
$$ 995 -991 -1159 -1440 320 2280 2623 -102 -2228 -1855 235 1686 1557 860 -749 -2101 -733 1119
2418A119J072p96j475o99r4J535J639r3j880j380L85J870N02jl82q79j626O11
$$ 1119 2191 1395 -80 -779 -873 662 2301 2208 328 -1052 -667 1203 1705 1704 1322 443 -1183 -572
2436e72K136P83j323j326O8Q17L69O40n7j063j111L57K008J22o62k11n27m17O36
$$ -572 1564 2347 1024 -302 -234 583 952 1592 1535 472 -639 -282 1726 1848 1186 975 448 31 667
2455F67J347L2j133j179Q98R43k7m97P9j69j262K46J664Q84j553j475L06N65N27
$$ 667 2014 2046 913 -266 632 1575 1548 1051 1130 961 -301 -55 1609 2493 940 -535 -229 336 863
2474H63O50J81j139j308N33J311O22n83m72r12r68J152K494M49k299k182P31J175
$$ 863 1513 1694 555 -753 -220 1091 1713 1130 658 -254 -1222 -70 2424 2873 574 -1608 -877 298
2492B98O38K64J1j218j876K0K293J332m33j725j497k05J911J495L67j399k106
$$ 298 936 1200 1211 -7 -1883 -1863 430 1762 1329 -396 -1893 -2098 -187 1308 1675 276 -1830
2509a830o55P32J755J689q6k419k516M86K728K165p87k024j418n72J152J951J533
$$ -1830 -2485 -1753 2 1691 1605 -814 -3330 -2844 -116 2049 1262 -762 -2180 -2752 -1600 351 1884
2526A884j508k572j592J165K180K270q04k624j874J36K194K296Q2j435k163j259
$$ 1884 376 -2196 -3788 -2623 -443 1827 1023 -1601 -3475 -3339 -1145 1151 1233 -202 -2365 -3624
2542c624P19L138K012j358l036j724J536K093J492L72j697k724r77K011K766J200
$$ -3624 -2905 233 2245 887 -2149 -3873 -2337 -244 1248 1620 -77 -2801 -3778 -1767 999 2199
2558B199j526k005k285O36K461K763q93k491j530K06J049K005J801j101l331k170
$$ 2199 673 -1332 -3617 -2981 -520 2243 1350 -1141 -2671 -2465 -1416 589 2390 1289 -2042 -4212
2574d212K397L400O06j046j687j921R5J718K577N99k174k414n89J536K278J519
$$ -4212 -1815 1585 2191 1145 -542 -2463 -2368 -650 1927 2526 352 -2062 -2651 -1115 1163 2682
2590B682q98l483j015J288K309J201p22q83k132q56J246L446Q05k003k728l60
$$ 2682 1784 -1699 -2714 -1426 883 2084 1362 479 -1653 -2509 -1263 2183 2988 985 -1743 -2103
2606b103J257J574R43K02j537k070L1K101J754J08j803j089j204J162K495N92
$$ -2103 -846 728 1671 1873 336 -1734 -1703 398 2152 2260 457 -632 -1836 -674 1821 2413
2622B413j361j703o30M43R08J155N28r54j862n30J943J025K6j057o38m64K53J041
$$ 2413 1052 -651 -1281 -838 70 1225 1753 799 -1063 -1593 350 1375 1401 344 -294 -758 -505 536
2640E36J333m83j638q24P62J149O00J12j249j346L78J376L11m51j57k79n34l58
$$ 536 1869 1386 -252 -1076 -314 835 1435 1547 298 -1048 -670 706 1017 566 409 130 -404 -762
2658g62J378R26m74j637k39Q07J288j53o63j13m34j46P37N83k82m23l80j48K60
$$ -762 616 1542 1068 -569 -808 -1 1287 1134 471 358 -76 -222 515 1098 816 393 13 -135 125
2677A25R85M55p29j700N38J575pp25M4L69q91q3J036R00j267j070J90Q14O58k31
$$ 125 1110 1565 836 -864 -326 1249 1242 517 561 930 39 -44 992 1892 625 -445 -255 559 1217 986
2697I86R4r76n22K85J462Q31r82p59l92n44L03J634J248j639j913k72J858N39
$$ 986 1080 104 -418 -133 1329 2160 1178 419 27 -517 -214 1420 2668 1029 -884 -1156 702 1241
2715A241k60K3m49j753N7J918J773n96k130p78K12P01J188O65j072j621q17J637
$$ 1241 981 1004 555 -1198 -1141 777 2550 1954 -176 -954 -742 -41 1147 1812 740 -881 -1698 -61
2733f1J153J59l69r16j586k21K139K071p90k217j229O25P33Q53J246k63k816j232
$$ -61 1092 1251 882 -34 -1620 -1841 298 2369 1579 -638 -1867 -1242 -509 344 1590 1327 -1489 -2721
2751b721J101K384Q92n59j682j360m95J613J930N66j803j883o91O44K114J400
$$ -2721 -1620 764 1656 1097 -585 -1945 -2440 -827 1103 1669 -134 -2017 -2708 -2064 50 1450
2767A450l87k071k233M94K142J725l64j110j445j187R69K557J120j508k108j463
$$ 1450 1063 -1008 -3241 -2747 -605 1120 756 -354 -1799 -2986 -2017 540 1660 152 -1956 -3419
2783c419J275J800J333j95j698j761o8J658J669N33r45k161j093R07K486J084
$$ -3419 -2144 -344 989 794 -904 -2665 -2733 -1075 594 1127 182 -1979 -3072 -2165 321 1405
2799A405q61j997n05Q5J319J487N39j406k192l85J301K084M93j008j672j052N50
$$ 1405 544 -1453 -1958 -1873 -554 933 1472 66 -2126 -2511 -1210 874 1367 359 -1313 -2365 -1815
2816a815J772J388j38j292j482n09J177J997O91j331j786m57R95J418N51l97j148
$$ -1815 -43 1345 1207 -85 -1567 -2076 -899 1098 1789 458 -1328 -1785 -790 628 1179 782 -366
2833c66q84m83J493J690L00j294j449J62O04R11Q41m75j021j201P67Q33Q74K06
$$ -366 -1250 -1733 -240 1450 1750 456 -993 -831 -227 684 1525 1050 29 -1172 -405 428 1302 1508
2851A508q55j047m81J207J008J71j161p92K75K12L61R65r2j112r24N09J401L49
$$ 1508 653 -394 -875 332 1340 1511 350 -442 -167 45 406 1371 1279 167 -757 -248 1153 1502
2869A502m08m46p03k47Q72M12O8m93m12l19K4P73L70q4r50m8J88Q27k64l53K5
$$ 1502 1094 648 -55 -302 570 982 1050 557 145 -174 -150 623 993 909 -41 -89 99 926 662 309 334
2890C34q3l80M82M77j14n19l59L27L11M71m11o6p85N24J42M01j30k28l71L4J11
$$ 334 251 -129 353 830 716 197 -162 165 476 947 536 470 -315 209 351 752 622 394 23 57 168
2911A68N73M05n59n71n30M25J013j3l51n54m48L95N86M29r0q24p19J61M76J025
$$ 168 741 1146 587 16 -514 -89 924 911 560 6 -442 -47 539 968 878 54 -665 -504 -28 997
2931I97N84j526q88O3J004N32K56k74n19q35k0J297Q67m09j018j166M77J043O79
$$ 997 1581 55 -833 -770 234 766 1022 748 229 -606 -626 671 1538 1129 111 -1055 -578 465 1144
2950A144J98p39j065m20O28J032M29l16p73j256jJ401J402l11j544q64M6P81R47
$$ 1144 1342 603 -462 -882 -254 778 1207 891 118 -1138 -1139 262 1664 1353 -191 -1055 -1009 -228 719
2969G19M40K62j746j596O25J715J346q81j159r62l77R74J749M61j199j487o27
$$ 719 1159 1421 -325 -1921 -1296 419 1765 884 -275 -1237 -1614 -640 1109 1570 371 -1116 -1743
2986a743P95J304J092l43j811j303K89J664J199l91r76r04q41P01J535J360j115
$$ -1743 -948 356 1448 1105 -706 -2009 -1720 -56 1143 752 -224 -1128 -1969 -1268 267 1627 512
3003E12k034p35R24J187R99j17j298j313l48J158J298N79o76j418j250P60J711
$$ 512 -1522 -2257 -1333 -146 853 736 -562 -1875 -2223 -1065 233 812 136 -1282 -2532 -1772 -61
3020f1J166o57j569j204J062L24J097P82j037j400p62R07J495Q60j064j501k53
$$ -61 1105 448 -1121 -2325 -1263 -939 158 940 -97 -1497 -2259 -1352 143 1003 -61 -1562 -1815
3037a815J50J168Q43K47j208j122j45O04J586M40n14j803n11J191J120K32n36
$$ -1815 -1665 -497 346 593 -615 -1737 -1882 -1278 308 748 234 -1569 -2080 -889 231 463 -73
3054g3j44j053j79P14J647P4p00j270k19P23J087M27p64p96m36M50L52Q20O34
$$ -73 -217 -1270 -1449 -735 912 986 286 -984 -1203 -480 607 1034 270 -526 -962 -512 -160 660 1294
3073A294p22j077m20P88J117K64j149k52O0J56K7N33M36o37p45L46M85O88j74
$$ 1294 572 -505 -925 -137 980 1244 95 -157 -97 59 86 619 1055 418 -327 19 504 1192 1018
3092A018q11j68K5J12O99l7l51k73J5M4m7M78L28n46n86J77J048o8o43MO1J52
$$ 1018 207 39 64 176 875 838 487 214 229 273 226 704 1032 486 -100 77 1125 1057 414 418 479 631
3114F31p5l6Q33n67n41O2M61L82m95m13R8j07M77L15m57n83L47n1K23J99Pn3n70
$$ 631 556 520 1353 786 245 307 768 1150 655 242 340 233 710 1025 568 -15 332 281 504 703 710 657 87
3137H7n84O07Q45J85p06o08N4L69J30M45n2q44j51r1R74K41k7p84m45j93O51P40
$$ 87 -497 110 955 1140 434 -174 -120 249 379 824 772 -72 -223 -314 660 901 874 90 -355 -548 103 843
3159H43K31q72m64l05K46L23J125l23q77p81Q7Q05P97l31l13q45k45L41R22P74
$$ 843 1074 202 -262 -567 -321 2 1127 804 -73 -854 -767 38 835 504 191 -654 -899 -558 364 1138
3179A138n12r62q10L19Q77J188Jj485q31J28N11Q19O70o71q18p04K02Q26J410
$$ 1138 626 -336 -1146 -827 50 1238 1239 -246 -1077 -949 -438 381 1051 380 -438 -1142 -940 -114 1296
3198A296m94j385m71j1R17R43K86j152r18l2M80J091O84l71j368r47O27Q93P88
$$ 1296 802 -583 -1054 -1065 -148 795 1081 -71 -989 -1021 -541 550 1234 863 -505 -1452 -825 68 856
3217H56j04m76j225q2R9J345O55k83j683p34P98R31O57k08j105p07J36M75J117
$$ 856 752 276 -949 -1031 -932 413 1068 785 -898 -1632 -834 97 754 546 -559 -1266 -1130 -655 462
3236D62M33m68j125m72Q4J332Q73o48j337n98K26J140J35O92p04q01p22K41J180
$$ 462 895 427 -698 -1170 -1086 246 1119 471 -866 -1464 -1238 -98 37 729 25 -776 -1498 -1257 -77
3255g7Q66n72j056l53m1P13P16l19j51p90k54K97J209J51o26n97p27N59R93O09
$$ -77 789 217 -839 -1192 -1233 -520 196 -123 -274 -1064 -1318 -1021 188 339 -287 -884 -1611 -1052 -59 550
3275E50o49m49j46m13L8R51N12l62r72m13N46O36M08j43n47m04l1L18P42K30n08
$$ 550 -99 -548 -694 -1107 -1069 -118 394 32 -940 -1353 -807 -171 237 94 -453 -857 -888 -570 172 402 -106
3296a06j56o59L04P98l07J79m87K03j99M15L33K2j06n73j04M44O82j53m18j50
$$ -106 -262 -921 -617 181 -126 53 -434 -231 -430 -15 318 340 234 -339 -443 1 683 530 112 -38
3316c8%k4j9K83k0J42n5j94k4N75N2m35k1o4L62m0K06k68K30r6k44K32N64n19
$$ -38 -38 -62 -81 202 182 324 269 75 51 626 678 243 222 158 520 480 686 418 648 552 308 540 1104 585
3340E85j92J88K48J17o26J14K57l26J80P1L0m20r8N88O0Ql30K62k42l40M70M72
$$ 585 393 581 829 946 320 434 691 365 545 616 646 226 128 716 776 784 454 716 474 134 604 1076
3362A076n1p94l3L54PK36J13j44m60m50J93M32L65R2n86j42m02N60M74k08l59
$$ 1076 1025 231 198 552 559 795 908 764 304 -146 47 479 844 936 350 208 -194 366 840 632 273
3383B73o39K48K92J00K37N49r36j055K90J239K59n15l57K94l97m22R31K80j12
$$ 273 -366 -118 174 274 511 1060 124 -931 -641 598 857 342 -15 279 -118 -540 391 671 559
3402E59q42j75J22M36M59j18l65j040K03O87M77l07K80r48o06O02P84O14o13q95
$$ 559 -283 -458 -336 100 559 441 76 -964 -761 -74 403 96 376 -572 -1178 -576 208 822 209 -686
3422f86p5K73K78L78K58j14j042k59J70J264K08q6r89j91l32Q17P04o1p29n26
$$ -686 -761 -488 -210 168 426 312 -730 -989 -819 445 653 567 -422 -613 -945 -128 576 515 -214 -740
3442g40M10k19L41O94j50r03p86N61J472k81k49m05m78j58R3J291L18p16q34j48
$$ -740 -330 -549 -208 486 336 -567 -1353 -792 680 399 150 -255 -733 -891 -798 493 811 95 -739 -887
3462h87L78O87R9O2l24j063J72R11K81j36k23m35o88L54R10O29p11q33K20K43
$$ -887 -509 178 277 339 15 -1048 -876 35 316 180 -43 -478 -1166 -812 98 727 16 -817 -597 -354
3482c54L60o7K19j00p02j70L54P16J73m00n01l72P6O58L24j49l46m94j25K69M07
$$ -354 6 -61 158 58 -644 -814 -460 256 429 29 -472 -844 -768 -110 214 65 -281 -775 -900 -631 -224
3503b24L57m4p68l17P1P44K21j17j21k27p3j70L97P10l36p12J63Q6J35O35k75
$$ -224 133 89 -679 -996 -925 -181 40 -77 -198 -425 -498 -668 -271 439 103 -609 -446 -360 -225 410 135
3524A35m66j70K8J41m00Q90m8j09q23K13O36J40m50m8L04Jj24pK47O2k12l78N14
$$ 135 -331 -501 -473 -332 -732 158 110 1 -822 -609 27 167 -283 -331 -27 -26 -150 -157 90 152 -60 -438 76
3547G6j03J66O8J9k67J80j17K89q2K84l67K40l16k34P32k09l03j46K30N01o00
$$ 76 -27 139 207 226 -41 139 22 311 229 513 146 386 70 -164 568 359 56 -90 140 641 41
3568D1K32K79K32n09m95M83K11j23J63k39J34J20j88Q9L28K63l17k34m23N94P7
$$ 41 273 552 784 275 -220 263 474 351 514 275 409 529 341 430 758 1021 704 470 47 641 718
3589G18m2p5n02J54K48j43K83J62l96j14l15N93J90k24p1l57o4J50m9K86J94R1
$$ 718 676 601 99 253 501 358 641 803 407 293 -22 571 761 537 466 109 45 195 146 432 626 717
3611G17n55k33N00J17K23l28j06l60K83l6k24M29l9n47j90K65K62M56l65k69k55
$$ 717 162 -71 429 546 769 441 335 -25 258 222 -2 427 388 -159 -349 -84 178 634 269 0 -255
3632b55j41M78K72k4p26J26q3j63N86N24j9j069l45L96P07j3o7j81k01k93L1L28
$$ -255 -396 82 354 330 -396 -270 -353 -516 70 594 575 -494 -839 -443 264 251 184 3 -198 -491 -460 -132
3654a32M02J65n79o50M7M56L59K16m97m41k03J24O88L93j60o31m81j71J143J42
$$ -132 270 435 -144 -794 -747 -291 68 284 -213 -654 -857 -733 -45 348 188 -443 -924 -1095 48 190
3674A90O0n53m68M7L35Q2P69l20q97j71K7N85J61K64k13n60J19J36L45K23P0n98
$$ 190 250 -303 -771 -724 -389 -307 462 142 -755 -926 -899 -314 -153 111 -102 -662 -543 -407 -62 161 231 -367
3696c67l48j39P43N15k34m14l99J17L08K51M6n3k17p53M81L64M50Lm66n73L85
$$ -367 -715 -854 -111 404 170 -244 -643 -526 -218 33 79 26 -191 -944 -463 -99 351 354 -112 -685 -300
3717c00J13P7P4k78l7j20L32J88J89q8m02m42kO28J61J19l86j84O7j70L67M93
$$ -300 -187 -110 -36 -314 -351 -471 -139 49 238 150 -252 -694 -696 -68 93 212 -174 -358 -291 -461 -94 399
3739C99m7n21j39k61L95P7K84o1m74r2J7J36N64L2k22p06J42O44R8k59j70j04
$$ 399 352 -169 -308 -569 -174 -97 187 126 -348 -440 -423 -287 277 309 87 -619 -477 167 265 6 -164 -268
3761b68m4j56M70K83J60m94k78K41J35J77L22m90q6k48n4O30j22j94L30m74o1
$$ -268 -312 -468 2 285 445 -49 -327 -86 49 226 548 58 -28 -276 -330 300 178 -16 314 -160 -221
3782b21J96K34M5j71j40RJ79p7QK99kl61k81L00K05r2j68J0J94l09K75K76j28
$$ -221 -25 209 254 83 -57 -48 131 54 62 361 359 -2 -283 17 222 130 -38 -28 166 -143 132 408 280
3805B80j08J1j69J8K35J55k45k77J91J72K37m02J88J95j65m9k44K89L03k85l0
$$ 280 172 183 14 32 267 422 177 -100 91 263 500 98 286 481 316 267 23 312 615 330 300
3826C00L19m89J47J71K45n69L40m38Q7J56J17j5n4k19n7L29k6L68J0n09P3l63
$$ 300 619 130 277 448 693 124 464 26 113 269 386 371 317 98 41 370 344 712 722 213 286 -77
3848g7K8O76j95O4n74K47q0L43j93L33k35j77n65J72M10K93J7n09l28M36J59j10
$$ -77 -49 627 432 496 -78 169 89 432 239 572 337 160 -405 -233 177 470 487 -22 -350 86 245 135
3870A35N1k37R6j50j01M26K50j4n12m98M60r2K57j00j15l28n9K46O2L14Mm22j99
$$ 135 186 -51 45 -105 -206 220 470 456 -56 -554 -94 -186 71 -29 -144 -472 -531 -285 -223 91 95 -327 -526
3893e26R7r6O53Qk09j6l53k45M95K86r6m78J69k61L39M08j19k29l06j30K0L88
$$ -526 -429 -525 128 136 -73 -89 -442 -687 -192 94 -2 -480 -311 -572 -233 175 56 -173 -479 -609 -589 -201
3915b01M21k77l30o92L20M51L55j22j06m80n0L96Q8J53J53k84m86J20K51N61K
$$ -201 220 -57 -387 -1079 -759 -308 47 -75 -181 -661 -711 -315 -227 -74 79 -205 -691 -571 -320 241 243
3936B43o66pk25J47K41O05k34m56k73J99L08M98j61l46m85j36J53M98J59N8r5
$$ 243 -423 -430 -655 -508 -267 338 104 -352 -625 -426 -118 380 219 -127 -612 -748 -595 -97 62 120 25
3957B5m43N0j06N38L65k55q94J55N70K20l9J52k52n46J3J96O43q4k54o04J05J64
$$ 25 -418 -368 -474 64 429 174 -720 -565 5 225 186 338 86 -460 -447 -251 392 308 54 -550 -445 -281
3979b81K37J22kj2l11M32k44L16j83k03j46q9L74K92K69k74l73k34K4K50J08M70
$$ -281 -44 78 76 64 -247 185 -59 257 74 -129 -275 -364 10 302 571 297 -76 -310 -286 -36 72 542
4001E42o50J49l14j7L72L20k41l76L9q2L09o9K48j03m12J10K48Q0j0o8j94L7k75
$$ 542 -108 41 -273 -290 82 402 161 -215 -176 -258 51 -18 230 127 -285 -175 73 153 143 75 -119 -82 -357
4024c57L01L34j12l2j90l19J74N81O5O8o11L2K9K37J58j10L8j84k00M56P3lK39
$$ -357 -56 278 166 134 -56 -375 -201 380 445 513 -98 -66 -37 200 358 248 286 102 -98 358 431 428 667
4047F67p31JK14J8K13m7J64p2j05l00K4K06K30l43m2M01Oj28k08J12J9n9j89K42
$$ 667 -64 -63 151 169 382 335 499 427 322 22 46 252 482 139 97 498 504 376 168 280 299 240 51 293
4071B93j54J83r8k30M31k03p2K87j95l5k2p4J66m9K68k44k5l49L24J24j1k51L4
$$ 293 139 322 224 -6 425 222 150 437 242 207 185 111 277 228 496 252 227 -122 202 326 315 64 98
4094I8R0k76J9J62K62k06j53J65l94L90q0JJ39j16k35J30m9K1O08l96n66J89J28
$$ 98 188 -88 -69 93 355 149 -4 161 -233 157 77 78 217 101 -134 -4 -53 -32 576 180 -386 -197 -69
4117f9K54j40J00l1j32m45M53L01k15n04k24J39L50j45J04K44l38k20n0N81j65
$$ -69 185 45 145 114 -18 -463 -10 291 76 -428 -652 -513 -163 -308 -204 40 -298 -518 -568 13 -152
4138a52J55j62K8o95K92L15L87j59l94k10J88L01rK4n37J36n20O09L97M6j66l51
$$ -152 3 -159 -131 -826 -534 -219 168 9 -385 -595 -407 -106 -115 -91 -628 -492 -1012 -403 -6 40 -126 -477
4160d77j4k10O44J76j93j73n20K13M60L9J08o8n73j06M51j12L80j20k46k16o3
$$ -477 -491 -701 -57 119 -74 -247 -767 -554 -94 -55 53 -15 -588 -694 -243 -355 25 -95 -341 -557 -620
4181f20RO05L31l63n39J36K00L77p0K3j23n79L05L17q3J13k80k5l32M17L71J10
$$ -620 -611 -6 325 -38 -577 -441 -241 136 66 89 -34 -613 -308 9 -74 39 -241 -266 -598 -181 190 300
4203C00k26k66M9j28K33J70O67n69o06L01j45M64K68o56n5L1K6K10K26J72k56
$$ 300 74 -192 -143 -271 -38 132 799 230 -376 -75 -220 244 512 -144 -199 -168 -142 68 294 466 210
4224B10m39J72m3L64K79r2l45o00M77L08j21n1J30k33m08M99L02L7j99l26k62
$$ 210 -229 -57 -100 264 543 451 106 -494 -17 291 170 119 249 16 -392 107 409 446 247 -79 -341
4245c41L53K10m4nn2l26jN73n7Rj58l04l7K20L78k6m40j78K12o4j22M94k22L07
$$ -341 12 222 178 173 121 -205 -206 367 310 319 161 -143 -180 40 418 392 -48 -226 -14 -78 -200 294 72 379
4269C79j96j10J48l05K26m32L50j64p2K40M0j45L07l67J61K76l9k47l5J13J56
$$ 379 183 73 221 -84 142 -290 60 -104 -176 64 104 -41 266 -101 60 336 297 50 15 128 284
4290B84k07k5k4M5J49p6j50MM2K84j44J06n7K12o72l3M11Q3p3j4m0m5j48L17N2
$$ 284 77 52 28 73 222 146 -4 0 42 326 182 288 231 443 -229 -262 149 232 159 145 105 60 -88 229 281
4315B81k34n4k50K53k4K59R3k47k76K68J91j31L45j17l78k94O9L86J00J18j11
$$ 281 47 -7 -257 -4 -28 231 324 77 -199 69 260 129 474 357 -21 -315 -246 140 240 358 247
4336B47o18p7M99j28K97k71K04n18J36L82k13K77l9m47P3J7J44L13j97j99l55
$$ 247 -371 -448 51 -77 220 -51 153 -365 -229 153 -60 217 178 -269 -196 -179 -35 278 81 -118 -473
4357d73K10O9J02J23O9o15Q7J22L91L2p8l24j10Q2N5L15J18l29n64L76p5L62L75
$$ -473 -263 -194 -92 31 100 -515 -428 -306 85 117 39 -285 -395 -313 -258 57 175 -154 -718 -342 -417 -55 320
4380C20n65j55k81j14N53L23J8p8o08K1K39M06K61p29m8j25J28K97L36l64O4n00
$$ 320 -245 -400 -681 -795 -242 81 99 21 -587 -566 -327 79 340 -389 -437 -562 -434 -137 199 -165 -101 -601
4402f01mO41N6j01j53k03k30K79J88L06j13l21j93K2m2N63m2k54j12M5K3r2O20
$$ -601 -605 36 92 -9 -162 -365 -595 -316 -128 178 65 -256 -449 -427 -469 94 52 -202 -314 -269 -246 -338 282
4425B82j34o91J6K79lQ8L54l77o6l9o6N17k48P8l66k05L71L06J70R2k95j97Q4
$$ 282 148 -543 -527 -248 -251 -163 191 -186 -252 -291 -357 160 -88 -10 -376 -581 -210 96 266 358 63 -134 -50
4448e0J53K28rk67j40K9j11N20Q5j44l77J79k71J51M76m6Qn76L23j13L00K99j94
$$ -50 103 331 322 55 -85 -56 -167 353 438 294 -83 96 -175 -24 452 406 414 -162 161 48 348 647 453
4471D53l82k16J83K02J74k33j51l04L37L5J27R0j96n3O9j60J6J04J14j00l0N6
$$ 453 71 -145 38 240 414 181 30 -274 63 98 225 315 119 66 135 -25 -9 95 209 109 79 135
4493A35K10p0j6k0K9k02J22NK87m40r3J24k93O26m8l02J30k46K78k69j23R4K91
$$ 135 345 275 259 239 268 66 188 193 480 40 -53 71 -222 404 356 54 184 -62 216 -53 -176 -82 209
4516B09k66L80j42m89M43k78J37j04L9O8q1J18K40j13J73k14j7j24O8R7k3J58
$$ 209 -57 323 181 -308 135 -143 -6 -110 -71 -3 -84 34 274 161 334 120 103 -21 47 144 121 279
4538B79n5k00r2P7J75J60k57q4K85j43j71J59Pj59l4j78J60K53L05j61l41k09
$$ 279 224 24 -68 9 184 344 87 3 288 145 -26 133 140 -19 -53 -231 -71 182 487 326 -15 -224
4560b24J07L93j82J0k68R2jj61K74O55m98l69M7k95M51L8N1r8l0l34K80L74j61
$$ -224 -117 276 94 104 -164 -72 -73 -234 40 695 197 -172 -125 -420 31 69 120 22 -8 -342 -62 312 151
4583A51k84j8o6K37j7L21k52l93m3O1L47L15m49J33m17j54J93M11J61k88l51l05
$$ 151 -133 -151 -217 20 3 324 72 -321 -364 -303 44 359 -90 43 -374 -528 -335 76 237 -51 -402 -707
4605g07O48K40m9j53j12k56k89M35N18K7l65k50J48n8m6J92J42k57l07P1M7N61
$$ -707 -59 181 132 -21 -133 -389 -678 -243 275 302 -63 -313 -165 -223 -269 -77 65 -192 -499 -428 -381 180
4627A80q5j12l37o4J28L87n6k10R6k52l33L66L40J95l80m20K15K92M3K35j23m27
$$ 180 95 -17 -354 -418 -290 97 41 -169 -73 -325 -658 -292 48 243 -137 -557 -342 -50 -7 228 105 -322
4649c22j05p1N55P2J25j55m06j04L41L81j67l08l39j10M69L29j55j80O1l64q0
$$ -322 -427 -498 57 129 254 99 -307 -411 -70 311 144 -164 -503 -613 -144 185 30 -150 -89 -453 -533
4670e33M89M59l64j25k89J43k3K96n7J91n67j09K14L96L22p3l99k55K66j51O11
$$ -533 -44 415 51 -74 -363 -220 -243 53 -4 187 -380 -489 -275 121 443 370 -29 -284 -18 -169 442
4691D42k1l09j83J55o0J3K83j19j15j64m5M12j19R8l30o6K88n2q0L94k76J75k27
$$ 442 421 112 -71 84 24 37 320 201 86 -78 -123 289 170 268 -62 -128 160 108 28 422 146 321 94
4714I4J33L56l62N7j39k09L47q4q3L9j8J48m26J92J59J65q9l32K48K30l36K89
$$ 94 227 583 221 278 139 -70 277 193 110 149 131 279 -147 45 204 369 280 -52 196 426 90 379
4736C79j34j25L3M9k42M28l52K41j7j5j79LJ95n6j49J63k74q9K67J41j69r8R9
$$ 379 245 120 153 202 -40 388 36 277 260 245 66 69 264 208 59 222 -52 -141 126 267 98 0 99
4759I9J39j06l48J76N5N1L55k64m01K87l49M08mO6j38j63j2k1L47j83LK46k88
$$ 99 238 132 -216 -40 15 66 421 157 -244 43 -306 102 98 164 26 -137 -149 -170 177 -6 -3 243 -45
4782d5j62L46Mj04K3P4l65jR0O67n02l49J60J05J60O3l43L13l48J64l6K53l1m29
$$ -45 -207 139 143 39 62 136 -229 -230 -140 527 25 -324 -164 -59 101 164 -179 134 -214 -50 -86 167 136 -293
4806b93l5j45O4K82L14m6n63K69k07K91M72o38M25m41k12L96P3N83o73k00j91
$$ -293 -328 -473 -409 -127 187 141 -422 -153 -360 -69 403 -235 190 -251 -463 -67 6 589 -84 -284 -475
4827d75N12r1L12q1P7q49o8N73J21j1M7l82q8L08Q7k3L62n08K5K48k21L41L88
$$ -475 37 -54 258 177 254 -595 -663 -90 31 20 67 -315 -403 -95 -8 -31 331 -177 -152 96 -125 216 604
4850F04n19o01K03J74K18m9N7j63q1m0M21k87K54k85l23P7p8M47K88l59k76N6
$$ 604 85 -516 -313 -139 79 30 87 -76 -157 -197 224 -63 191 -94 -417 -340 -418 29 317 -42 -318 -262
4872b62Q2K06k80J40O2n35J33N48K07L7n81l22M34K14koK5l94m7j3K15M72m75
$$ -262 -180 26 -254 -114 -52 -587 -454 94 301 338 -243 -565 -131 83 81 75 100 -294 -341 -354 -139 333 -142
4895a42qM6k14L7M19j35L0l65q2L83L15r2J40j57m93J79J12K7k22Q4J70j23K9
$$ -142 -150 -104 -318 -281 138 3 33 -332 -414 -31 284 192 332 175 -318 -139 -27 0 -222 -138 32 -91 -62
4918f2K19j10o6P5k13K59M7K56k78l49NN24j64P1n0J88l43O8J37j18J12Q8m40
$$ -62 157 47 -19 56 -157 102 149 405 127 -222 -217 307 143 214 164 352 9 77 214 96 208 296 -144
4941a44L84j45Q3K5O8J35n07J91J39K9k42k9L3L34m48J46L8N6k74J24MK14M2K5
$$ -144 240 95 178 203 271 406 -101 90 229 258 16 -13 20 354 -94 52 90 146 -128 -4 0 214 256 281
4965B81j75pj75M38j00j4p4k27J8J28Q3j59O2Q0L5n9J20k22j84K4J39L24l22p4
$$ 281 106 99 -76 362 262 248 174 -53 -35 93 176 17 79 159 194 135 255 33 -151 -127 12 336 14 -60
4989f0J06O9j70L8J44p2N1J2m34K73M6OJ13j66JR2O2j32k4j0n5j10K98k47K55
$$ -60 46 115 -55 -17 127 55 106 118 -316 -43 3 9 122 -44 -43 49 111 -21 -45 -55 -110 -220 78 -169 86
5014H6j19k95J65p6K80k88o9K83j80j88K54L90j24j09j04j24%n0M20o8m38q3O3
$$ 86 -33 -328 -163 -239 41 -247 -316 -33 -213 -401 -147 243 119 10 -94 -218 -218 -268 152 84 -354 -437 -374
5037c74R9L61J01k46j01j59K19L21K0k96p9k84k7L33J86J22l76j92K8L28J9M22
$$ -374 -275 86 187 -59 -160 -319 -100 221 241 -55 -134 -418 -445 -112 74 196 -180 -372 -344 -16 3 425
5059D25o36Q6j36J1N48j75k0k16n26N77J60J02j89o6l95R9K78J18L82m50j52k39
$$ 425 -211 -125 -261 -250 298 123 103 -113 -639 -62 98 200 11 -55 -450 -351 -73 45 427 -23 -175 -414
5081d14J32L23K91m88O1l09n3L45M81m01O7j81q4L12J84k26J0l83K39j31K28J85
$$ -414 -282 41 332 -156 -95 -404 -457 -112 369 -32 35 -146 -230 82 266 40 50 -333 -94 -225 3 188
5103A88l3Rk77m9K48p8L8L9l52O5j26J42K02J21K8n71K88k5K24J64o37K38j7P4
$$ 188 155 164 -113 -162 86 8 46 85 -267 -202 -328 -186 16 137 165 -406 -118 -143 81 245 -392 -154 -171 -97
5127i7K6R2J18k05N2J86j21K36m67L48k35O5K8N8k1m7N2m9j73J16o1R5Jo7n6K13
$$ -97 -71 21 139 -66 -14 172 51 287 -180 168 -67 -2 26 84 63 16 68 19 -154 -38 -99 -4 -3 -70 -126 87
5153H7K42m2k87J62l51M4L10K3l6J7j70J06P8L7o2K5j85J57k32L78j34L14m69
$$ 87 329 287 0 162 -189 -145 165 188 152 169 -1 105 183 220 158 183 -2 155 -77 301 167 481 12
5176A2M2R9K19l03K70k79K2Nk89L21l6K0k46L70l9j84O5J03o7j34L59l8l49pr
$$ 12 54 153 372 69 339 60 82 87 -202 119 83 103 -143 227 188 4 69 172 105 -29 330 292 -57 -64 -73
5201g3L51l83K12n0k38M36j48J5K58k85k03L96j99J8L3k5r9R9k68M84L6M3o01
$$ -73 278 -105 107 57 -181 255 107 122 380 95 -108 288 89 107 140 115 16 115 -153 331 367 410 -191
5224a91J65M9J29J15k12j8k79J63J77k25L38J2k75m5N3j49L85k0j22l56M7J79
$$ -191 -26 23 152 267 55 37 -242 -79 98 -127 211 223 -52 -97 -44 -193 192 172 50 -306 -259 -80
5246h0K00K28k58L6j51l38J27K97j43r1K11j69K74M9l75K11J86n74K57o4J57n6
$$ -80 120 348 90 126 -25 -363 -236 61 -82 -173 38 -131 143 192 -183 28 214 -360 -103 -167 -10 -66
5268f6j0l42J2K27p3L24j69k1rk77K84M06m16K94l36R9M2J09o2q4j46k74L95J7
$$ -66 -76 -418 -406 -179 -252 72 -97 -118 -127 -404 -120 286 -130 164 -172 -73 -31 78 16 -68 -214 -488 -93 -76
5292g6R5P8j76k69lL00p2K26l2l87l9L44O9J53l04L28j21j82m4K00K12j89l23
$$ -76 19 97 -79 -348 -351 -51 -123 103 71 -316 -355 -11 58 211 -93 235 114 -68 -112 88 300 111 -212
5315b12k26K37J27j11K5J07l01J83j09M48j56J64l43j26M15R2l9k03p1R0r4L29
$$ -212 -438 -201 -74 -185 -160 -53 -354 -171 -280 168 12 176 -167 -293 122 214 175 -28 -99 -9 -103 226
5337B26j65L3J10k53j89L77N5m8k43k13K28J27J08J2%m79M59j01J89L9k6k98J9
$$ 226 61 94 204 -49 -238 139 194 146 -97 -310 -82 45 153 165 165 -314 145 44 233 272 246 -52 -33
5360c3j21J49K55k25q6K41k03j9K48j54m3M5k19j40J74M75J7m3l54J69j08k29
$$ -33 -154 -5 250 25 -61 180 -23 -42 206 52 9 54 -165 -305 -131 344 361 318 -36 133 25 -204
5382b04N43l01R8o7j44K02k58J29J36mm17K43l4K72l98L32K2m68N77r6J27m21
$$ -204 339 38 136 69 -75 127 -131 -2 134 130 -287 -44 -78 194 -204 128 150 -318 259 163 290 -131
5404a31j46L85l21N18Rp6l93N0L58j55r4R2R9R7l23J27k27j16L83k5J5N1J0n3
$$ -131 -277 108 -213 305 314 238 -155 -105 253 98 4 96 195 292 -31 96 -131 -247 136 111 126 177 187 134
5428A34k42j55M89m40J57q6K73L7m9j89L39j31m24J15K75lJ3M7m51M27k02L31
$$ 134 -108 -263 226 -214 -57 -143 130 167 118 -71 268 137 -287 -172 103 100 113 160 -291 136 -66 265
5450B65j57j56J4L2l41N70K0l31K46o31M82j13J55K26j5n63L56j73M21k30K9j54
$$ 265 108 -48 -34 -2 -343 227 247 -84 162 -469 13 -100 55 281 266 -297 59 -114 307 77 106 -48
5472d8l03K54L46l09j00L58l05L5j54K61Kj44j78J99k11L76J02j84k30Rj6M55
$$ -48 -351 -97 249 -60 -160 198 -107 -72 -226 35 37 -107 -285 -86 -297 79 181 -3 -233 -224 -240 215
5494B15m27Q3J96k20j57j27M99k51q9p1L58n12L76K62m9k99M0K20l19L63o8J09
$$ 215 -212 -129 67 -153 -310 -437 62 -189 -278 -349 9 -503 -127 135 86 -213 -173 47 -272 91 23 132
5516A32m84r1K61K34m7m0L8l70L5J80J16j7j75j22K99j10m3K12k09K96r5r2j60
$$ 132 -352 -443 -182 52 5 -35 3 -367 -332 -152 -36 -53 -228 -350 -51 -161 -204 8 -201 95 0 -92 -252
5539b52QJ77m7j89P7q9L68k6J83j88k83M22j08j29J17q7j5O7M3k54k69N13o9k5
$$ -252 -244 -67 -114 -303 -226 -315 53 27 210 22 -261 161 53 -76 41 -46 -61 6 49 -205 -474 39 -30 -55
5563e5J51r0J34L37l10M3l68L73l36K96j64m14L82n5K52k32J74J18n4j74o1k0
$$ -55 96 6 140 477 167 210 -158 215 -121 175 11 -403 -21 -76 176 -56 118 236 182 8 -53 -73
5585g3K38l75K38m5N22l00j07j55J27j20pL28k56J84l06L9K13J2m98M85P9l06
$$ -73 165 -210 28 -17 505 205 98 -57 70 -50 -57 271 15 199 -107 -68 145 157 -341 144 223 -83
5607h3k9L50m71L33q1K39k18k82N31j97k82L43n1j9N1m9J86l99L17l7O0j24j56
$$ -83 -112 238 -233 100 19 258 40 -242 289 92 -190 153 102 83 134 85 271 -128 189 152 212 88 -68
5630f8j44M79l01q5P4j07M77l16O9j2J58l13l7r3K38r9JJ21p0j20K94k2K27o6
$$ -68 -212 267 -34 -119 -45 -152 325 9 78 66 224 -89 -126 -219 19 -80 -79 42 -28 -148 146 124 351 285
5654B85k37k13K14k02l1L61k45J53J45r8l1K00j60N2l20j97J21K92L40m10j13
$$ 285 48 -165 49 -153 -184 177 -68 85 230 132 101 301 141 193 -127 -324 -203 89 429 19 -94
5675i4J34k5J06Qj23L04j98p1K01k99J96J25k57k75K09K64k00J15l49l1M96j43
$$ -94 40 15 121 129 6 310 112 41 242 -57 139 264 7 -268 -59 205 5 120 -229 -260 236 93
5697I3j33p9N6lM3o4J41Q0j8k51j05K57j12M39l11J60k60k9M3K90r3k46R9k66
$$ 93 -40 -119 -63 -66 -23 -87 54 134 116 -135 -240 17 -95 344 33 193 -67 -96 -53 237 144 -102 -3 -269
5721b69RL31K39k55k64L8q6OL92J01m19j84j02L78J70O4l42j04M91k70K47k48
$$ -269 -260 71 310 55 -209 -171 -257 -251 141 242 -177 -361 -463 -85 85 149 -193 -297 194 -76 171 -77
5743g7q1J56n4l83M30L01l12J16l71o1L38K6q2J74j78L1l6R1L89l84o7m14L46
$$ -77 -158 -2 -56 -439 -9 292 -20 96 -275 -336 2 28 -54 120 -58 -27 -63 28 417 33 -34 -448 -102
5766a02j55J59K91j15m7j44p9L32j20J5l18K07%J57q1J39k09j33qL56o9j1o1l9
$$ -102 -257 -98 193 78 31 -113 -192 140 20 35 -283 -76 -76 81 0 139 -70 -203 -211 145 76 65 4 -35
5790c5J59k7j34J27K4j27J45k97L41j31O9j52pL07j67n9j99J82P6k38M81n86M45
$$ -35 124 97 -37 90 114 -13 132 -165 176 45 114 -38 -45 262 95 36 -163 19 95 -143 338 -248 197
5813A97j18LN5n1K00J70j54n6k37pJ68m16J83O0L3K8l0m6J01j5k8J58q9q4J17
$$ 197 79 82 137 86 286 456 302 246 9 2 170 -246 -63 -3 30 58 28 -18 83 68 40 198 109 25 142
5838A42j24K53p4N2Nk34O7m1K31l80RL28j91o5L6M03o90L01J05k08N6J51l45K19
$$ 142 18 271 197 249 254 20 87 46 277 -103 -94 234 43 -22 14 417 -273 28 133 -75 -19 132 -213 6
5862Fl4q3J29r2J99M3k41M4n5k28L19K23o25M96l11Q5K30j81K12M7o1l68K06j56
$$ 6 -28 -111 18 -74 125 168 -73 -29 -84 -312 7 230 -395 101 -210 -125 105 -76 136 183 122 -246 -40 -196
5886a96K29j22n4R3q0K46J57k03j01R7l33M16k36L6K39k4l56K51l58M10J80k61
$$ -196 33 -89 -143 -50 -130 116 273 70 -31 66 -267 149 -87 -51 188 164 -192 59 -299 111 291 30
5908C0L3j4m11K36K47o1q9j1j27L27P1Lk79J85j58r3j07K28Lj10J92k13K5q8K78
$$ 30 63 49 -362 -126 121 60 -29 -40 -167 160 231 234 -45 140 -18 -111 -218 10 13 -97 95 -118 -93 -181 97
5933I7J46k26J84l38J96L1j03k79K77k63L30R8k3K01o31n8M03j90rp3n6L37j98
$$ 97 243 17 201 -137 59 90 -13 -292 -15 -278 52 150 127 328 -303 -361 42 -148 -157 -230 -286 51 -147
5956a47M9q4L17k86l4J25J31J19j81k00N00o35J44j10J38P9j03J87j65k13L90
$$ -147 -98 -182 135 -151 -185 -60 71 190 9 -191 309 -326 -182 -292 -154 -75 -178 9 -156 -369 21
5977B1J59l32K68%q1j81P7J62o2j16j15r9J26P4K29j42k98J21M5K56n0p6k47N44
$$ 21 180 -152 116 116 35 -146 -69 93 31 -85 -200 -299 -173 -99 130 -12 -310 -189 -144 112 62 -14 -261 283
6001B83l05j19L14k90J51k96K96o3J01L7l5j8Mj75k65L30J68K44l57J3k14J03
$$ 283 -22 -141 173 -117 34 -262 34 -29 72 109 74 56 60 -115 -380 -50 118 362 5 18 -196 -93
6023i3J27K01k02j38P8K33k45j75J42J04k32L37j96J96j70J63qn8r4J14K20m07
$$ -93 34 235 33 -105 -27 206 -39 -214 -72 32 -200 137 -59 137 -33 130 122 64 -30 84 304 -103
6045a03K31j71O6j21K29j27J62p1q6J7J86q6l1l18MM17l77O19k32R8l55j72N52
$$ -103 128 -43 23 -98 131 4 166 95 9 26 212 126 95 -223 -219 198 -179 440 208 306 -49 -221 331
6068C31k13J09J48m83J90K17j26j44J05j89j84J59K64J67Ok37L03k09k75L10k10
$$ 331 118 227 375 -108 82 299 173 29 134 -55 -239 -80 184 351 357 120 423 214 -61 249 39
6089C9J90m42L52l4M2k53K03J3n0j30q4L41j36Jm9J48j45k7Q9J07K15n04J10O2
$$ 39 229 -213 139 105 147 -106 97 110 60 -70 -154 187 51 52 3 151 6 -21 68 175 390 -114 -4 58
6113E8j41J75K6k56K1J28q5J9k14J12K58r0j8N1j98J41k21N4J65p1J17j81k9J51
$$ 58 -83 92 118 -138 -117 11 -74 -55 -269 -157 101 11 -7 44 -154 -13 -234 -180 -15 -86 31 -150 -179 -28
6137b8l6k44n5K96J61k00K43m85R9L54q9o3j5j77K0L58j19n3N2L9o4K25r5K6J09
$$ -28 -64 -308 -363 -67 94 -106 137 -348 -249 105 16 -47 -62 -239 -219 139 20 -33 19 58 -6 219 124 150 259
6162B59m17o5J40N7j80J49n4j99J16J55j6K65J17j81j27k28K14j52N5J30k05M31
$$ 259 -158 -223 -83 -26 -206 -57 -111 -310 -194 -39 -55 210 327 146 19 -209 5 -147 -92 38 -167 264
6184B64m93J90N0R7o7K4M9l5k40P7J52k93kL80l65J96k68M4L39m01L23r2K62l56
$$ 264 -229 -39 11 108 41 65 114 79 -161 -84 68 -225 -227 153 -212 -16 -284 -240 99 -302 21 -71 191 -165
6208a65J82k33L01M8J58k08M3J10R9k83L50m39K27l13J56k25J95L14k62m8k86
$$ -165 17 -216 85 133 291 83 126 236 335 52 402 -37 190 -123 33 -192 3 317 55 7 -279
6229b79K88k92K59j79K63J73n41K07J34K0j90L10j72J8jO7k20P1K3k7J49l6j48
$$ -279 9 -283 -24 -203 60 233 -308 -101 33 53 -137 173 1 19 18 85 -135 -64 -41 -68 81 45 -103
6252a03J35J13m11L71J48l12r8j0M67k49J83j92M4j3j68N2k9oj03J01K28j50L4
$$ -103 32 145 -266 105 253 -59 -157 -167 300 51 234 42 86 73 -95 -43 -72 -78 -181 -80 148 -2 32
6275C2J52j70k2L41l33j73J45K16k02J31K54j91k0k28Q4p0K93j89K8Q9K3j64L71
$$ 32 184 14 -8 333 0 -173 -28 188 -14 117 371 180 160 -68 16 -54 239 50 78 167 190 26 397
6298C97m56J69J10k31R5j51K79j69Q8k45M47j17k16L7k39J94j74O6L41m3p1l3
$$ 397 -59 110 220 -11 84 -67 212 43 131 -114 333 216 0 37 -202 -8 -182 -116 225 182 111 78
6320G8R4K3k34q1K87J41m77K56q1L4k1J37j30l08L01j5k3L53k88j21j89J04M0
$$ 78 172 195 -39 -120 167 308 -169 87 6 40 19 156 26 -282 19 4 -19 334 46 -75 -264 -160 -120
6343a20J3J41j97L86k27J7o5J45P5J34l86L25l38R4J06O9n2k80J03o0Q6J72k3
$$ -120 -107 34 -163 223 -4 13 -52 93 168 302 -84 241 -97 -3 103 172 120 -160 -57 -117 -31 141 118
6366A18r4M0M3q9j63J86o4J2P0N6j16j04r8L02J33j36J6nr4J74j45j0j78R8PJ84
$$ 118 24 64 107 18 -145 41 -23 -11 59 115 -1 -105 -203 99 232 96 112 107 13 187 42 32 -146 -48 -41 143
6392A43j03l81M59J12k01J32j73k79N4L38p9J32j77k41P6M9L56k91qN5k06K4M15
$$ 143 40 -341 118 230 29 161 -12 -291 -237 101 22 154 -23 -264 -188 -139 217 -74 -82 -27 -233 -209 206
6415B06k86n1K30l45K60k35M42k22o7p2k0K83m21M24j24n9k45J43L13k36kr1J61
$$ 206 -80 -131 99 -246 14 -221 221 -1 -68 -140 -160 123 -298 126 2 -57 -302 -159 154 -82 -84 -175 -14
6438a4q2L4p9Q4L11m07J82j26j10L45O9n77N15j59Q3K19k76K94k07r9P7O0K03
$$ -14 -96 -62 -141 -57 254 -153 29 -97 -207 138 207 -370 145 -14 69 288 12 306 99 0 77 137 340
6461C40m21K72k80j60L76K3k60M37k09k66J40j29K66O4l47l3K03q3L1L04k51J67
$$ 340 -81 191 -89 -249 127 150 -110 327 118 -148 -8 -137 129 193 -154 -187 16 -67 -36 268 17 184
6483A84k00o4K52j21J1j35j66N56j11l9Q4j37j09m93O00l4L98l52k35M4q1J07
$$ 184 -16 -80 172 51 62 -73 -239 317 206 167 251 114 5 -488 112 78 476 124 -111 -67 -148 -41
6505d1R6R3k77O5j38K58j92J56K14R1k00j67p7J17L05l07J22l00J47J39k89K23
$$ -41 55 148 -129 -64 -202 56 -136 20 234 325 125 -42 -119 -2 303 -4 118 -182 -35 104 -185 38
6527C8J66q5j53J81k34J44K16m74K35j07j00L20k67L76p8Q7j32Q2j8j19p9kJ68
$$ 38 204 119 -34 147 -87 57 273 -201 34 -73 -173 147 -120 256 178 265 133 215 197 78 -1 -3 165
6550A65l63M64l13n6RL08k91K56j39j5r0k03L10j57Q9OlL7j05o6K46k26M3K86
$$ 165 -198 266 -47 -103 -94 214 -77 179 40 25 -65 -268 42 -115 -26 -20 -23 14 -91 -157 89 -137 -94 192
6574A92j16J26j38mj8Q3j22N7k08L54R0l45K01l96L2N4MJ02O7K60m93J12r6P6
$$ 192 76 202 64 60 42 125 3 60 -148 206 296 -49 152 -244 -212 -158 -154 -52 15 275 -218 -106 -202 -126
6598a26P6R0J5l18J16j45K54J1O1o7k76p5L35K11j90k3j5k88N53l1l94J75M3m36
$$ -126 -50 40 55 -263 -147 -292 -38 -27 34 -33 -309 -384 -49 162 -28 -51 -66 -354 199 168 -226 -51 -8 -444
6622d44L83J13r4j85K91p3m0k61M36k25m2P1Q4k0J05p8j49P3j10k51R5M93j83
$$ -444 -61 52 -42 -227 64 -9 -49 -310 126 -99 -141 -70 14 -6 99 21 -128 -55 -165 -416 -321 172 -11
6645a1J5L3k38k71M89j68J26R9l53K32J10k8j46M23l64j22m8P8J10P7o7m4P0j09
$$ -11 4 37 -201 -472 17 -151 -25 74 -279 -47 63 35 -111 312 -52 -174 -222 -144 -34 43 -24 -68 2 -107
6669a07J07M6J2j40J56k60N42N1n06K74k51q9J86j79M24k64j64Q2L5K12j01O9
$$ -107 0 46 58 -82 74 -186 356 407 -99 175 -76 -165 21 -158 266 2 -162 -80 -45 167 66 135
6691A35l96J99Nn0K60l02l5J44Qj26J56K03O7k74j66J81N8J49j5m94L09r9K49
$$ 135 -261 -62 -57 -107 153 -149 -184 -40 -32 -158 -2 201 268 -6 -172 9 67 216 201 -293 16 -83 166
6714A66K9j43k88K07l5nP3J55N7p7j63l1j66K43J33M8r5l17J26L38m94m5k6K18
$$ 166 195 52 -236 -29 -64 -69 4 159 216 139 -24 -55 -221 22 155 203 108 -209 -83 255 -239 -284 -310 -92
6738i2J05K0o7R4o2l60M99l06L31k57K69l32N3R4Rp7J02O0k79J39O5Q3J4Kj25
$$ -92 13 33 -34 60 -2 -362 137 -169 162 -95 174 -158 -105 -11 -2 -79 23 83 -196 -57 8 91 105 107 -18
6763a8J96L81p92M19j52M2J53k90K39q4j43qJ25J54K28k86j03K0R6k72O3K06K3
$$ -18 178 559 -233 186 34 76 229 -61 178 94 -49 -57 68 222 450 164 61 81 177 -95 -32 174 197
6786A97k33K59k6m9k30N0J34J03j30k8L8L3j32J0N20n32N4j20R5J13j46J63r7
$$ 197 -36 223 197 148 -82 -32 102 205 75 47 85 118 -14 -4 516 -16 38 -82 13 126 -20 143 46
6809D6J78n14K22K1Q2J02l94K84J53m09L53j22j68M1J2J42j25r9qQ2K75m95J97
$$ 46 224 -290 -68 -47 35 137 -257 27 180 -229 124 2 -166 -125 -113 29 -96 -195 -203 -121 154 -341 -144
6832a44Q0m5J9m4p0J75R1K8j19J8O7Q5o26J90M40K10m01j16k60N45o6j12q1o4
$$ -144 -64 -109 -90 -134 -204 -29 62 90 -29 -11 56 141 -485 -295 145 355 -46 -162 -422 123 57 -55 -136 -200
6856b00Q1Q1J53j49p0L9k89K86K0K7M0k53K48m8j59R2J63l30J63o0K88j45j54
$$ -200 -119 -38 115 -34 -104 -65 -354 -68 -48 -21 19 -234 14 -34 -193 -101 62 -268 -105 -165 123 -22 -176
6879a76R4J53j43J30m75M48m6mj70P7J19j64J12J33l09j57O5N08l80K95o20K95
$$ -176 -82 71 -72 58 -417 31 -15 -19 -189 -112 7 -157 -45 88 -221 -378 -313 195 -185 110 -510 -215
6901b15J66J63j82J62j2j75N1p0K88j63j40o5K84l43K05K1J81R1q9J14m42J75
$$ -215 -49 114 -68 94 82 -93 -42 -112 176 13 -127 -192 92 -251 -46 -25 156 247 158 272 -170 5
6923EK53M0l42j19L09J77r4j86j77K58k13k2Q5oj9j15L48n8l22M27r4j05M0l1
$$ 5 258 298 -44 -163 146 323 229 43 -134 124 -89 -111 -26 -32 -51 -166 182 124 -198 229 135 30 70 39
6947C9k31M9J36q0q1L50m8k08K14M8j94q6L2O3JK90k90m0n4K09j60J74k66J47
$$ 39 -192 -143 -7 -87 -168 182 134 -74 140 188 -6 -92 -60 3 4 294 4 -36 -90 119 -41 133 -133 14
6971A4M6m0k78K97j62J58J29q8j09jm1J71l05K94K38l18L8j46J56k78N1J80L21
$$ 14 60 20 -258 39 -123 35 164 76 -33 -34 -75 96 -209 85 323 5 43 -103 53 -225 -174 6 327
6994C27k92p3q5K51m5l9j17J0j54J77O2P4K99m42J19q9k12K82J84l8k02n8M1L40
$$ 327 35 -38 -123 128 83 44 -73 -63 -217 -40 22 96 395 -47 72 -17 -229 53 237 199 -3 -61 -20 320
7018C20k11mj85r2K04M5k4N4j07m5o9J56K62l2m00J50q8K19r7j56J13o8Pk49M32
$$ 320 109 105 -80 -172 32 77 53 107 0 -45 -114 42 304 272 -128 22 -66 153 56 -100 13 -55 -48 -297 135
7043A35K2l62j46L11n6L81o57M71m32J85J42J11P5l8r4L87l50j18K05k29l7j42
$$ 135 157 -205 -351 -40 -96 285 -372 99 -333 -148 -6 105 180 142 48 435 85 -33 172 -57 -94 -236
7065b36K62k3K54m66K89j45k86K58J03k45K87j44j5J17L8k81J89N8J54R9n13J59
$$ -236 26 3 257 -209 80 -65 -351 -93 10 -235 52 -92 -107 10 48 -233 -44 14 168 267 -246 -87
7087h7j13M9J31j93m4J65J35Lq8J8k01m8m6M40Krn28M19Pl9k74K57k07K60K2k03
$$ -87 -200 -151 -20 -213 -257 -92 43 46 -42 -24 -225 -273 -319 121 123 114 -414 5 12 -27 -301 -44 -251 9 31 -172
7113a72L83l62j24O5p2J71L02k41R9k29q3J90O2K67Kk26j19l16L94j46J30O0q1
$$ -172 211 -151 -275 -210 -282 -111 191 -50 49 -180 -263 -73 -11 256 258 32 -87 -403 -9 -155 -25 35 -46
7136d6n3o7L70j97q9O6j43P1J08r6K69j41l4J01Q3k27O5k97J76L65k23j41K04
$$ -46 -99 -166 204 7 -82 -16 -159 -88 20 -76 193 52 18 119 202 -25 40 -257 -81 284 61 -80 124
7159A24N6k62j64K13k6O5Q9j08L45k61k56L93j13l7M76n37J9j25L08pnj59P5l98
$$ 124 180 -82 -246 -33 -59 6 95 -13 332 71 -185 208 95 58 534 -3 16 -109 199 192 187 28 103 -295
7183b95O22m19P9m6L41l08J30J92k53l2Knp1J22J26o9l7J14k50O6J19j64J12k29
$$ -295 327 -92 -13 -59 282 -26 104 296 43 11 13 8 -63 59 185 116 79 193 -57 9 128 -36 76 -153
7207a53J31J48J04L9k71n1N9l87L43J9j74K22j07J6lP9n6P3K41l16l04L78Q2k30
$$ -153 -22 126 230 269 -2 -53 6 -381 -38 -19 -193 29 -78 -62 -65 14 -42 31 272 -44 -348 30 112 -118
7231a18J03l2j51L95j0j80K98l58j23k70M81N0J97o99L40o1J09K21P2j66k6K0
$$ -118 -15 -47 -198 197 187 7 305 -53 -176 -446 35 85 282 -417 -77 -138 -29 192 264 98 72 92
7253I2KO8l97J88K33k8k02J86k49J1K60l11L2J61rk03N26q1l45J47J83l21qJ55
$$ 92 94 162 -235 -47 186 158 -44 142 -107 -96 164 -147 -115 46 37 -166 360 279 -66 81 264 -57 -65 90
7277I0j30k2k56J29K43k5J51pl77L06k5m5l31J76L31l4k73n2Q4J04oK5j93M3Q0
$$ 90 -40 -62 -318 -189 54 29 180 173 -204 102 77 32 -299 -123 208 174 -99 -151 -67 37 31 56 -137 -94 -14
7302a4K74j49l97M73j79k01M06k50jn1N7j13J08K68k70j8o4mp9M6K81j20J32j55
$$ -14 260 111 -286 187 8 -193 213 -37 -38 -89 -32 -145 -37 231 -39 -57 -121 -125 -204 -158 123 3 135 -20
7326b0RR7j10k73L41k52pK5Q8K57J31n71J10J66K60j62k99R5p9Q0J25L2j42j5
$$ -20 -11 86 -24 -297 44 -208 -215 -190 -102 155 286 -285 -175 -9 251 89 -210 -115 -194 -114 11 43 -99 -114
7350a14K20k2k43K81q7N3K26m00Q4n5J3J42j72J18k48K54p1q1j76L46o06L42K76
$$ -114 106 84 -159 122 35 88 314 -86 -2 -57 -44 98 -74 44 -204 50 -21 -102 -278 68 -538 -196 80
7373H0j31j24K03L8m7P0N6k1j15k21J95j44L83l40J10Q1o2j43O7M11l35J03n7
$$ 80 -51 -175 28 66 19 89 145 124 9 -212 -17 -161 222 -118 -8 73 11 -132 -65 346 11 114 57
7396E7k2N6K8K15l60L39l18J75q3K37o7k98J00k59L02K66k43q3J67l14N1J30j56
$$ 57 35 91 119 334 -26 313 -5 170 87 324 257 -41 59 -200 102 368 125 42 209 -105 -54 76 -80
7419h0J03J66j09j32j53L89n9Q7LJ7n59O7J30K63k24Lk50M00Q8k25J70K3K2j67
$$ -80 23 189 80 -52 -205 184 125 212 215 232 -327 -260 -130 133 -91 -88 -338 62 150 -75 95 118 140 -27
7443b7j14R1J07j55L42m02K65k19K73R3l41J67j4N8k04J73j41M38k62K1J38j47
$$ -27 -141 -50 57 -98 244 -158 107 -112 161 254 -87 80 66 124 -80 93 -48 390 128 149 287 140
7465A40k63L58o1J4j92L1QJ92j13l15L81m26M26q8Jj73N1M1l36L73n8J28J14N6
$$ 140 -123 235 174 188 -4 27 35 227 114 -201 180 -246 180 92 93 -80 -29 12 -324 49 -9 119 233 289
7489B89k29k74L2L90l00R5k14K99J11k61J0K90j78N9k50K16j17j06m4K53m5k24
$$ 289 60 -214 -182 208 -92 3 -211 88 199 -62 -52 238 60 119 -131 85 -32 -138 -182 71 26 -198
7511a98K42Q0l03J75r1m3J65p1k03K86k49J45j96QL60J60m68o2Q3K14Mj16K03
$$ -198 44 124 -179 -4 -95 -138 27 -44 -247 39 -210 -65 -261 -253 107 267 -201 -263 -180 34 38 -78 125
7534A25r6M3k48K70J47m00M1J24l6N8L35n57J31J5q0j63L91k22L9K12m39K08J3
$$ 125 29 72 -176 94 241 -159 -118 6 -30 28 363 -194 -63 -48 -128 -291 100 -122 -83 129 -310 -102 -89
7557h9M68k87k71n3L56j1j82n2j7P3Nj38J09OJ62r9k34N21o5j05k62n6K54m4l59
$$ -89 379 92 -179 -232 124 113 -69 -121 -138 -65 -60 -198 -89 -83 79 -20 -254 267 202 97 -165 -221 33 -11 -370
7582c70L84j06K68j66k68L68k02P8M2lq3k56J61k3L23P8m01M67l84J60J86k20
$$ -370 14 -92 176 10 -258 110 -92 -14 28 25 -58 -314 -153 -176 147 225 -176 291 -93 67 253 33
7604C3O1m94M69P7j16k03L79J01j49L31m50k8q8N2pK06m19K72O3j5J31k58M1K95
$$ 33 94 -400 69 146 30 -173 206 307 158 489 39 11 -77 -25 -32 174 -245 27 90 75 206 -52 -11 284
7628B84j31j13j28N9J01J00L5k6r7K57k49Jj06K64j25l3J0m5J57n3k54J15pl2
$$ 284 153 40 -88 -29 72 172 207 181 84 341 92 93 -13 251 126 93 103 58 215 162 -92 23 16 -16
7652a6K0N5J43P3M9j30l8K9j70p5J00N7N6k18K89l45p9K83m0l5J04k8k1m9J98
$$ -16 4 59 202 275 324 194 156 185 15 -60 40 97 153 -65 224 -121 -200 83 43 8 112 84 63 14 212
7677B12k02K36o3j89R7J7l2j11J7K21m0m3J84k65J47k81J22K46o36L04J33Nl4
$$ 212 10 246 183 -6 91 108 76 -35 -18 203 163 120 304 39 186 -95 27 273 -363 -59 74 79 45
7700D5J17j01K28n57J82j05K18J61l15K36q4p6K17k22j22K16j14j82J65r3K28
$$ 45 162 61 289 -268 -86 -191 27 188 -127 109 25 -51 166 -56 -178 38 -76 -258 -93 -186 42
7721D2k21R9j0N9k7M7K21j57j80J26J3k14K54k58K0K35M6k07j13J60r6R1R9l32
$$ 42 -179 -80 -90 -31 -58 -11 210 53 -127 -1 12 -202 52 -206 -186 49 95 -112 -225 -65 -161 -70 29 -303
7745c03K52j98J13J25Pk51K52q3O0K2J49m52j86L30J03J61L9l24J18m1q6J23K56
$$ -303 -51 -249 -136 -11 -4 -255 -3 -86 -26 -4 145 -307 -493 -163 -60 101 140 -184 -66 -107 -193 -70 186
7768A86j54l55L58J55l18J95j61K39l89L94R3m69M98m45P2k55K07R6J8q8Q2j2
$$ 186 32 -323 35 190 -128 67 -94 145 -244 150 243 -226 272 -173 -101 -356 -149 -53 -35 -123 -41 -53
7790e3L09n19L01K55j37l55N8K56K77n46K27K27k32j6K23j09m96N70j07p34N95
$$ -53 256 -263 38 293 156 -199 -141 115 392 -154 73 300 68 52 275 166 -330 240 133 -601 -6
7811fJ59R3k47k09J0J21K17o9j73j5K38k98J20j22K12K87o07k8R7M16k10PK0j37
$$ -6 153 246 -1 -210 -200 -79 138 69 -104 -119 119 -179 -59 -181 31 318 -289 -317 -220 196 -14 -7 13 -124
7835a24O5M4J49k19q6j11L61O2n9r0J44l08N7q7J04R5J79n3k91o2K48p6K70j41
$$ -124 -59 -15 134 -85 -171 -282 79 141 82 -8 136 -172 -115 -202 -98 -3 176 123 -168 -230 18 -58 212 71
7859G1J09k22o1L5o6N4J16J8O4j17J48J5j88J70j29j55J20Q0N2j41J82l75K45
$$ 71 180 -42 -103 -68 -134 -80 36 54 118 1 149 164 -24 146 17 -138 -18 62 114 -27 155 -220 25
7882B5J60j48J85q9o1k2j68J28K92l99M04Q1m50J6L6J53L5j49l8J59n7J27M2J37
$$ 25 185 37 222 133 72 50 -118 10 302 -97 307 388 -62 -46 -10 143 178 29 -9 150 93 220 262 399
7906C99m62J99j3J09K3l10Q3m4J57MK8k84J57j0n0K12Lj88K98l12J6K39l71K23
$$ 399 -63 136 123 232 255 -55 28 -16 141 145 173 -111 46 36 -14 198 201 13 311 -1 15 254 -117 106
7930A06j78J70N2m4n9R5k5K2n5l16Q7K05J56p8j73J90l95J99j56K98K5j67q0n7
$$ 106 -72 98 150 106 47 142 117 139 84 -232 -145 60 216 138 -35 155 -240 -41 -197 101 126 -41 -121 -178
7954a78K1L54K8m83L13q6Kp1J16Q6k81J84P4p5J02r2L0lj76M6J95J45J29n2m4
$$ -178 -157 197 225 -258 55 -31 -29 -100 16 102 -179 5 79 4 106 14 44 41 -135 -89 106 251 380 328 284
7979B84k65l68M65r4o0K04L1l86M3M67k12k36Q8l78N73l5k12L00l21j72J93j24
$$ 284 19 -349 116 22 -38 166 197 -189 -146 321 109 -127 -39 -417 156 121 -91 209 -112 -284 -91 -215
8001b15J82k71L13p8Q6j9J36M3o5j4l29K44K3o9l4j22P2L11k74K38p7k11k20K66
$$ -215 -33 -304 9 -69 17 -2 134 177 112 98 -231 13 36 -33 -67 -189 -117 194 -80 158 81 -130 -350 -84
8025h4K47j50J42l41J41j45L29j04N4O7k79R7l70L75M8K82l77q2O0J3n8Q3L44
$$ -84 163 13 155 -186 -45 -190 139 35 89 156 -123 -26 -396 -21 27 309 -68 -150 -90 -77 -135 -52 292
8048B92k30m70M77J15r0l38K12J8J4oJ73q8l10K35o3J81k94K37j14J13L5k92L68
$$ 292 62 -408 69 184 94 -244 -32 -14 0 -6 167 79 -231 4 -59 122 -172 65 -49 64 99 -193 175
8071A75k77K52l33J56j48K39n4J37M4l17n0L04j47J4J68L5n07M08J25j92r5o0
$$ 175 -102 150 -183 -27 -175 64 10 147 191 -126 -176 128 -19 -5 163 198 -309 99 224 32 -63 -123
8093a23p0L03k35k5K69M3k08L6K48j58l83K38j7K58m12J94l5J64j17K42l89J19
$$ -123 -193 110 -125 -150 119 162 -46 -10 238 80 -303 -65 -82 176 -236 -42 -77 87 -30 212 -177 -58
8115e8j61K04K57m1J73k16l9j09K14j65J51Q5j5m09J61K74n54L64j62K29j60Q7
$$ -58 -219 -15 242 201 374 158 119 10 224 59 210 295 280 -129 32 306 -248 116 -46 183 23 110
8137A10O7j2j64m8j68K02J75k43K67k49J29p8J16j8j18J05J85j31j61J25n3k3
$$ 110 177 165 1 -47 -215 -13 162 -81 186 -63 66 -12 104 86 -32 73 258 127 -34 91 38 15
8159A5r8j53L46j34j19M78n13L67j68j6J53l98kM21K35m19n11N11l3n4Q6J23q3
$$ 15 -83 -236 110 -24 -143 335 -178 189 21 5 158 -240 -242 179 414 -5 -516 -5 -38 -92 -6 117 34
8182C4j4K7j59J55l2j84j87K79J68
$$ 34 20 47 -112 43 11 -173 -360 -81 87
8191H7
$$ Imaginary data points
##PAGE= N=2
##DATA TABLE= (X++(I..I)), XYDATA
0@%%%jRj6J6j9K7l2M0n6P2q8J04j25J50j77K09k49K96l45M00m63N33o10O96p93
$$ 0 0 0 0 -1 8 -8 8 -11 16 -16 24 -32 40 -48 56 -69 81 -96 113 -136 160 -185 215 -248 285 -325 371 -422
28d22R00j018J149j293J452j626J814k021K251k503K777l079L414l783M188m634
$$ -422 478 -540 609 -684 768 -858 956 -1065 1186 -1317 1460 -1619 1795 -1988 2200 -2434
44b434N134n692O317p031P849q791R896j1213J2814j4814J7387k0845K5769l3382
$$ -2434 2700 -2992 3325 -3706 4143 -4648 5248 -5965 6849 -7965 9422 -11423 14346 -19036
58a9036M6844p7601K67577K8364n80024J42817L59952j5843k70517J19275J75922
$$ -19036 27808 -49793 217784 246148 -333876 -191059 168893 153050 -117467 1808 177730
69A77730j66141k24495J90591K16364j33319j93000J19658J03518j43579p6171
$$ 177730 11589 -212906 -22315 194049 60730 -132270 -12612 90906 -52673 -128844
79a28844K12168J06345k00712j55948J31531J20968n9254k6766Q7112m0485j54298
$$ -128844 83324 189669 -11043 -166991 -35460 85508 26254 -512 86600 46115 -108183
90a08183K5798J98663K1425j81551n5649J36657M0862j09167j5142J14715O192
$$ -108183 -82385 116278 137703 -43848 -99497 37160 78022 -31145 -46287 68428 74620
101G4620j30623m2579R2605N3668k5639j232O52p4569m7094R3088J06668m4635
$$ 74620 -56003 -98582 -5977 47691 22052 20820 21472 -53097 -100191 -7103 99565 54930
113E4930j08621q752N9390K4238N584J2494l3377n7638K0316O9478q976n4068
$$ 54930 -53691 -62443 -3053 21185 26769 39263 5886 -51752 -31436 38042 29066 -25002
125b5002L0087N9778n9699j07931L8249J35637J4153j14770n0351O1631L8886
$$ -25002 5085 64863 5164 -102767 -64518 71119 85272 -29498 -79849 -18218 20668
136B0668k7597q055K4246j5070m0417J5436N5751O385m3799j5847K3960L867j9114
$$ 20668 -6929 -14984 9262 -5808 -46225 -30789 24962 31347 -12452 -28299 -4339 -472 -19586
149a9586J1809L5622k048l9554j2304K5490R897j3399K000J0352k0000k0211L2735
$$ -19586 -7777 27845 25797 -13757 -26061 -571 9326 -4073 -2073 8279 -11721 -31932 803
162H03M0054l3048o7200Q095P1059K0714n2613l2208K8126K8812p844j6113l936
$$ 803 40857 7809 -59391 -51296 19763 40477 -12136 -44344 -16218 12594 4750 -11363 -15299
175a5299J410R234J7308j294k3781l627K8502J1449l2506k5336K4189L6757k094
$$ -15299 -13889 -4655 12653 11359 -12422 -16049 12453 23902 -8604 -33940 -9751 27006 24912
188B4912k6869j4807J592O696J1604P549j3789k1199N678K5911N234j9416q630
$$ 24912 -1957 -16764 -15172 -8476 3128 10677 -3112 -24311 -18633 7278 12512 -6904 -15534
201a5534P167m278r435J5722K6296k622k4048p861K604m245J1382L5720M573n2449
$$ -15534 -8367 -12645 -22080 -6358 19938 17316 -6732 -14593 -11989 -16234 -4852 30868 35441 -17008
215a7008l2587M1985N0143j5673m0422o017N889o436J8042M0310q921o0906j9565
$$ -17008 -49595 -7610 42533 26860 -13562 -19579 -13690 -20126 -2084 38226 29305 -31601 -51166
228e1166M2874K2652k3301O27L2504j1840n2976l118N3958K5788k6093k3395l403
$$ -51166 -8292 14360 -8941 -8314 24190 12350 -40626 -43744 10214 36002 9909 -13486 -16889
241a6889m412J3533M2839J1678n1769m1912K5694L8008k636n336J8121j1373n1452
$$ -16889 -21301 -7768 35071 46749 -5020 -46932 -21238 16770 14134 8798 26919 15546 -35906
254c5906j0044N3465L4453k7978k8718M017k036j1873K5201M1787j4269n8869
$$ -35906 -45950 7515 41968 13990 -14728 -10711 -12747 -24620 581 42368 28099 -30770
266c0770j7325L8114L3887O334k484k0304l8777n743M8968L6508k2732l0128M563
$$ -30770 -48095 -9981 23906 30240 27756 7452 -31325 -37068 11900 48408 25676 -4452 111
279A11L283j7446R967M2665K373n1488k7133L0961K8907l307j060P39l0802l1918
$$ 111 3394 -14052 -4085 38580 40953 -10535 -37668 -6707 22200 18893 17833 18572 -12230 -44148
293d4148K6887N6088N658m0046k0897Q644K339N566K5936J1707k9533k7527J2033
$$ -44148 -17261 38827 44485 4439 -16458 -7814 -5475 91 26027 37734 8201 -19326 -7293
306g293K4265L990J404M567k0576l3691P508M6728K0490k6621k8515o069m54O680
$$ -7293 16972 20962 22366 26933 6357 -27334 -19826 26902 47392 20771 -7744 -13813 -14267 -7587
320g587K6797J7728k5656l5859L462K8668R219p092j068n113j6770r96K5771J7554
$$ -7587 19210 36938 11282 -24577 -21115 7553 16772 9680 8612 3499 -13271 -14267 11504 29058
334B9058j0769j5701n438p914j793K5163K6176j6360l9578n650K6208J0975q835
$$ 29058 18289 2588 -2850 -10764 -12557 12606 38782 22422 -17156 -22806 3402 14377 5542
347E542k415j094j4663o171K1803J6940j6906k1431M636J1015l570J038J5815
$$ 5542 3127 2033 -12630 -18801 3002 19942 3036 -18395 -13759 -2744 -6314 -5276 10539
360A0539J015k0974r177J3789R659l839K73M027q601q238J2622J2994j3496j9282
$$ 10539 11554 -9420 -18597 -4808 4851 1012 1285 5312 -3289 -11527 1095 14089 593 -18689
374a8689O897J6864j322j0945J306M584n717n132L620J422k930M644O421o009
$$ -18689 -11792 5072 3750 -7195 -5889 -1305 -7022 -12154 -8534 -7112 -10042 -5398 1023 -4986
388d986r374M846J0621k734r306L91O160K582N443N673j0347j9582J714K5093
$$ -4986 -14360 -9514 1107 -1627 -10933 -10542 -4382 -1800 3643 9316 -1031 -20613 -18899 6194
402F194J1920j5491j6104J342P557L062M198L55j0842j0859M321J2170P190J489
$$ 6194 18114 2623 -13481 -12139 -4582 -1520 2678 3033 -7809 -18668 -14347 -2177 5013 6502
416F502m958j7330j4025J4017L0321N989k1866j4608L192N108N881J5355N155
$$ 6502 1544 -15786 -29811 -15794 14527 20516 -1350 -15958 -12766 -7658 -1777 13578 18733
429A8733k3705k2275J5110K8657J992j5681n418k911j0880J772K4176J2569j5952
$$ 18733 -4972 -27247 -12137 16520 18512 2831 -2587 -5498 -16378 -14606 9570 22139 6187
442F187j7663j435j926Q52K2453K0428k2269l9552L873L8034J2494j6967n983
$$ 6187 -11476 -12911 -14837 -13985 8468 28896 6627 -32925 -29052 8982 21476 4509 -1474
455a474K461j5434r917K8602L1739j4580l5413n488J4806L475M644J9245m06l4308
$$ -1474 987 -14447 -24364 4238 35977 21397 -14016 -19504 -4698 -1223 3421 22666 22260 -12048
469a2048k0689K2769K8323j826j2372o304j3536j0924K0700L4338k895l5613j5338
$$ -12048 -32737 -9968 18355 16529 4157 -2147 -15683 -26607 -5907 28431 25536 -10077 -25415
482b5415J4478P962L01J7730J4958k4455l8441N261L9937J8731j4539j6752j0322
$$ -25415 -10937 -2975 -2674 15056 30014 5559 -32882 -27621 12316 31047 16508 -244 -10566
495a0566r005Q695L2307J6791k7925l7599j436K5994J9193N078o246k0654k0328
$$ -10566 -19571 -10876 21431 38222 10297 -27302 -28738 -2744 16449 21527 15281 -5373 -25701
508b5701O911K6505J0678j0973o589p94r710o437J9180K5620o767l1628j2037
$$ -25701 -18790 7715 18393 7420 831 37 -9673 -16110 3070 28690 21923 -9705 -21742
521b1742J6301J8857O313j642r161j6675p854J1392J7496P381l988j3367j6957
$$ -21742 -5441 13416 19729 18087 8926 -7749 -15603 -4211 13285 20666 16678 3311 -13646
534a3646l023J8746J8968m087j7820q729K050M075R415J4856j264k4542j8773
$$ -13646 -16669 2077 21045 16958 -862 -9591 -7541 -3466 5949 20805 19541 -5001 -23774
547b3774J3147K7766J1209j2012j7671r221L769J4151J1447l427j1743n734R02
$$ -23774 -10627 17139 28348 16336 -1335 -10556 -6787 7364 18811 15384 3641 -2093 -1191
560a191J661N852Q198j824j6401r323R683J3611m45m907p10n705j0724L084J8239
$$ -1191 470 6322 14520 12696 -3705 -13028 -3345 10266 9821 4914 4204 -1501 -12225 -9141 9098
575I098Q513j1949j1796K366M841L00L310N322n265r583K00Q596L259j769j351
$$ 9098 17611 5662 -6134 -3768 1073 1373 4683 10005 4740 -4843 -4643 3953 7212 5443 4092
590D092n885p866M218J3040K6j3086k026J0643j192j3494k8J5152J852j2559k087
$$ 4092 -1793 -9659 -5441 7599 7625 -5461 -7487 3156 1964 -11530 -11558 3594 5446 -7113 -9200
605i200J0189J324r353j864P765K322l317j33N14j873R18L218k967n142M840O562
$$ -9200 989 2313 -7040 -8904 -1139 1183 -2134 -2267 -1753 -3626 -2708 510 -2457 -7599 -2759 3803
621C803p353j0071Q407J4668p286j8952j282J6302O308p979m364K585r01m254
$$ 3803 -3550 -13621 -5214 9454 2168 -16784 -18066 -1764 4544 -3435 -7799 -5214 -6115 -10369
635a0369K809O299J893l031m653l237K309R867O409p885j2742p86R555O940J334
$$ -10369 -7560 -1261 632 -2399 -7052 -10289 -7980 1887 8296 411 -12331 -13117 -3562 3378 4712
650D712l23n768j1705l438J2870J3889j726j3715q778R56P715J0136L906q738
$$ 4712 4389 -1379 -13084 -16522 -3652 10237 8511 -5204 -13982 -13026 -5311 4825 8731 -7
664gj2617k053Q693P979M352J755o336j4090n373J3202J5921K228q208q711q101
$$ -7 -12624 -14677 -5984 1995 6347 8102 1766 -12324 -17697 -4495 11426 13654 5446 -3265 -11366
679a1366k106J3939J8353j979k2422j2984R344J3891M036L58k600j2249j3215
$$ -11366 -13472 467 18820 16841 -5581 -18565 -9221 4670 8706 9064 6464 -5785 -19000
692a9000O354K0946J0724q933j4038r226j539J1788J9438M068j8835j6941M605
$$ -19000 -12646 8300 19024 10091 -3947 -13173 -14712 -2924 16514 20582 1747 -15194 -10589
705a0589J3152N950L436J535j2781j9358L262K7126J5206j5522k0098l675N258
$$ -10589 2563 8513 11949 13484 703 -18655 -15393 11733 26939 11417 -8681 -12356 -7098
718g098N647J0242Q135r326j7139m684Q777R096P347L977j1722k0853j025K4581
$$ -7098 -1451 8791 16926 7600 -9539 -14223 -5446 3650 10997 14974 3252 -17601 -18626 5955
732E955J5983j0173j4523k092j073l434J1229J9250j585k3341j3683R108J3224
$$ 5955 21938 11765 -2758 -4850 -5923 -9357 1872 21122 19537 -3804 -17487 -8379 4845
745D845O329K769o491j6878q405J5164J8149j645j2595o493l091j043J0489J6905
$$ 4845 11174 13943 7452 -9426 -17831 -2667 15482 13837 1242 -5251 -8342 -9385 1104 18009
759A8009k114k0868j0650J0585J1260J086J799K33j1132j0974Q544J7493Q44j2107
$$ 18009 15895 -4973 -15623 -5038 6222 7308 9107 9340 -1792 -12766 -4222 13271 14115 2008
773B008n086J900j523J268J1355O034j2809j4382L456J1211L696m0M13p046r532
$$ 2008 -3078 -1178 -2701 -1433 9922 15956 3147 -11235 -7779 3432 7128 7088 7501 455 -9077
788i077M030J3000J664q151q12L840n509m929J0587J1171r501j4950L612J2470
$$ -9077 -5047 7953 9617 1466 654 4494 -1015 -5944 4643 15814 6313 -8637 -5025 7445
802G445L14n967J145K079n353k509O388K135n091j36M183l507n615N289O577o174
$$ 7445 7759 1792 2937 5016 -337 -2846 3542 5677 586 450 4633 1126 -4489 800 7377 1203
818A203p865O223P618n373o020N555M318p554m273Q577N185p473n251M770L497
$$ 1203 -6662 -439 7179 1806 -4214 1341 5659 -1895 -6168 2409 7594 121 -5130 -360 3137
833C137k936R4K060m459m776N210P958l164p565m16L159j946L03O756P38j0761
$$ 3137 201 295 2355 -2104 -6880 -1670 6288 3124 -4441 -4857 -1698 -3644 -3341 3415 4153 -6608
849f608o023Q516R244k557n825k063j862j274P665R785m466j4792m282R929P782
$$ -6608 -12631 -4115 5129 2572 -3253 -5316 -7178 -8452 -787 8998 4532 -10260 -14542 -4613 3169
864C169j533j706j000o083m731O396R698j568p044j580r88k924M354J0529O98
$$ 3169 1636 -70 -1070 -7153 -11884 -5488 4210 2642 -4402 -5982 -6970 -9894 -5540 4989 5687
879E687j2549o937N987N515j79L840M071q855j3146L907J5866M823p734m846j186
$$ 5687 -6862 -13799 -7812 -2297 -2476 1364 5435 -3420 -16566 -12659 3207 8030 296 -4550 -5736
894e736m288J171J2540P305j0045j2719M74O967M172M425L350q689j4287J782
$$ -5736 -10024 -8853 3687 10992 947 -11772 -11298 -4331 -159 4266 7616 -1073 -15360 -13578
908a3578J6015P745o952o189j663l077k48R754R630n779j2862k936O634N470L602
$$ -13578 2437 10182 3230 -2959 -4622 -7699 -7947 1807 11437 5658 -7204 -10140 -3506 1964 5566
923E566K841m647j1777l887J0884J0837n68o493n138m589J25R293R985l173j1694
$$ 5566 8407 3760 -8017 -11904 -1020 9817 9249 2756 -2382 -6971 -6846 2447 12432 9259 -2435
938b435n538L814N543M112L584k569j0480m938O828R657J364l973l175m469l228
$$ -2435 -7973 -4159 1384 5496 9080 6511 -3969 -8907 -2079 7578 8942 4969 1794 -2675 -5903
953e903N788R763K7q219m092K050M5O32O677L921p935r235J748P934L306m04l79
$$ -5903 -115 9648 9675 1456 -2636 -586 -541 91 6768 10689 2754 -6481 -4733 3201 6507 6103 5724
970E724n054p362K181J0506M478n591n661j140j353J991Q294L901q197r614L396
$$ 5724 670 -6692 -4511 5995 10473 4882 -779 -1919 -3272 -1281 7013 10914 2717 -6897 -3501
985c501P211M30j248K079j336p987j516R514N587n763o007J539K060j294J189
$$ -3501 3710 4140 2892 4971 3635 -4352 -5868 3646 9233 3470 -2537 -998 1062 -232 957
1000I57M006j069m403m40J995j164j93M469J925o368m690M175N210k204j766K986
$$ 957 4963 3894 -509 -949 1046 -118 -311 4158 6083 -285 -4975 -800 4410 2206 440 3426
1016C426p88o399l72Q464L533p082m870M561K588l426l56M977O54n513k350K407
$$ 3426 2638 -3761 -4133 4331 7864 782 -4088 473 3061 -365 -721 4256 4910 -603 -2953 -546
1032e46K387Q18J208j063m086j837M758K766l089j264K929j287n236P91P447J266
$$ -546 1841 2659 3867 2804 -1282 -3119 1639 4405 1316 52 2981 1694 -3542 -2751 4696 5962
1048E962o194k394L403L78l206K601N441j451p382k220M416L806P21m26l426m320
$$ 5962 -232 -2626 777 1155 -2051 550 5991 4540 -2842 -5062 -646 3160 3881 3455 29 -4291
1064d291P61N105J959j681q83n10l481k648O177O623l407q349j186M212J224J65
$$ -4291 -3530 1575 3534 1853 970 460 -3021 -5669 508 7131 3724 -4625 -5811 -1599 -375 -210
1080b10L257J8o499m811M041O293R67j926k028l951l077M913P494Q9p157l343
$$ -210 3047 3065 -3434 -8245 -4204 2089 3056 1130 -898 -4849 -7926 -3013 4481 4570 -2587 -5930
1096e930J473k5J597O378J798q937q593M758R137J171m029j61j262o019j086Q860
$$ -5930 -4457 -4482 -2885 3493 5291 -3646 -12239 -7481 1656 2827 -1202 -1363 -2625 -8644 -9730 -870
1112h70O620m595o880k156J072K102O252M103n832r971n28Q292M452q06m50k197
$$ -870 5750 1155 -5725 -7881 -6809 -4707 1545 5648 -184 -10155 -10683 -2391 2061 1255 805 -1392
1128a392p072k427Q552Q728l231q101j296J200r29L219P126L23r372o863M180
$$ -1392 -8464 -10891 -2339 6389 3158 -4943 -6239 -5039 -5968 -2749 4377 4700 -4672 -11535 -7355
1143g355P875L318m44l757o665k067O496Q173m67n530k427p60j386L007P302J820
$$ -7355 520 3838 3394 -363 -7028 -9095 -2599 5574 5107 -423 -2850 -3610 -4996 -1989 5313 7133
1159G133p786o252K986M826Q83R57J507l119p182n41Q141N873j560n358m633j649
$$ 7133 -653 -6905 -3919 907 1790 2747 4254 1135 -6047 -6588 1553 7426 5866 508 -4125 -5774
1175e774M026P276K401m871m981k50O82J974N259M177n451j0601KJ0327N697l931
$$ -5774 -1748 5528 7929 3058 -1923 -2173 -1491 483 5742 9919 4468 -6133 -6131 4196 9893 5962
1191E962m562j212j044r93M562N613j816n677l022J055J727L273K629k300n215
$$ 5962 1400 188 -856 -1849 2713 8326 6510 833 -2189 -1134 593 3866 6495 4195 -1020
1206a020p93L935J372j087J839J451m599n200L265P995Q78n159k663n3o35K64
$$ -1020 -1813 2122 3494 2407 4246 5697 1098 -4102 -837 7158 8036 2877 214 161 -474 -210
1222b10M768L122l764o206l22L049K242J290N44l278n348O32O208L370l140l560
$$ -210 4558 7680 3916 -2290 -2612 437 2679 3969 4513 1235 -4113 -3481 2727 6097 2957 -603
1238f03m54k09J61L418L943k866n505J80K972j54m74L613J886o081n727M018O765
$$ -603 -1057 -1266 -1105 2313 6256 3390 -2115 -1935 1037 883 409 4022 5908 -173 -5900 -1882 4883
1255D883j92m868j018M51j548O43M454J288l671l367N88M46P48L960K055m411
$$ 4883 4691 -177 -1195 -744 -2292 -1649 2805 4093 422 -2945 -2357 -1911 -1163 2797 4852 441
1271D41n273K406M652p41k071K815J213n157l085N169M253j752l732m84k92q02
$$ 441 -4832 -2426 2226 1485 -586 2229 3442 -1715 -4800 369 4622 2870 -862 -1346 -1638 -2440
1287b440K535L952j063n164j924J619Q22K081L082M2o754l977M845O374m11m557
$$ -2440 95 4047 2984 -2180 -4104 -2485 -1663 418 3500 3542 -3212 -7189 -2344 4030 3619 -938
1303i38j782Q92P50J707K165l59l541j708J426Q97N59J776J184l529m516J339
$$ -938 -2720 -1828 -1078 629 2794 2435 -1106 -2814 -1388 -491 68 1844 3028 -501 -5017 -3678
1319c678M018P69k102kN40k447j558K859L591j066l310j068M89K29K470L224j278
$$ -3678 340 1109 -993 -995 -455 -2902 -4460 -1601 1990 924 -2386 -3454 -2965 -2736 -266 2958 1680
1336A680m877k309K280K916J678O21j128m522k809L400M478K06l006j869r54k10
$$ 1680 -3197 -5506 -3226 -310 1368 1989 861 -3661 -6470 -3070 1408 1614 -1392 -3261 -4215 -4425
1352d425K617L093q49m844o56K382J96r72K875L016l262n253J28M928J974j080
$$ -4425 -1808 1285 436 -4408 -5064 -2682 -2486 -3458 -583 2433 -829 -6082 -5954 -1026 948 -132
1368a32j073j034r87P09K230O11j152o75n21j878M71M390K583m559n499J143M845
$$ -132 -1205 -2239 -3226 -2517 -287 324 -828 -1503 -2024 -3902 -3431 959 3542 -1017 -6516 -5373 -528
1385e28J179j241k89L94j631l090K022M704J245k249k762o30R93K228K763l77
$$ -528 651 -590 -879 -485 -2116 -5206 -3184 1520 2765 516 -2246 -2876 -1883 345 3108 2731
1401B731k827k297M54J819K537K250l90n035m799K873N640J967k144k471j006
$$ 2731 -96 -2393 -1939 -120 2417 4667 4277 -758 -5557 -2684 2956 4923 2779 308 -698
1416f98j103K1L679K900k280l514m34J574J463J550J745j638l977j107L318L553
$$ -698 -1801 -1780 1899 4799 2519 -995 -1429 145 1608 3158 4903 3265 -712 -1819 1499 5052
1432E052K66j274j915k017n36K882K573j207j333l30j394j480K164M032m19m689
$$ 5052 5318 4044 2129 112 -424 2458 5031 3824 2491 2161 767 -713 1451 5483 5064 375
1448C75l665L328L886O89p43j317k580j840J664M097K410j728k855k482L9L107
$$ 375 -3290 38 3924 4613 3870 2553 -27 -1867 -203 3894 6304 4576 1721 -761 -722 2385
1464B385L870r17m137k184J703J415l22J793J526l839n304M70N799K699j423k463
$$ 2385 6255 5338 1201 -983 720 2135 1813 3606 5132 1293 -4011 -3541 2258 4957 3534 1071
1480A071k018k356O71M667K775k338l068m09n36J02L862L523k636o420j489N270
$$ 1071 -947 -3303 -2632 2035 4810 2472 -596 -1005 -1541 -1439 2423 5946 3310 -3110 -4599 671
1496F71K984j315n19m70l940k743M183N705r53m650j508L80j073J290M538Rn410
$$ 671 3655 2340 1821 1351 -2589 -5332 -1149 4556 3603 -1047 -2555 -2175 -3248 -1958 2580 2589 -2821
1513b821k441L405L078p72l43J278l042l748K759O511J11m795j465J727j286j112
$$ -2821 -5262 -1857 1221 449 106 1384 -1658 -5406 -2647 3864 3975 -820 -2285 -558 -1844 -2956
1529b956L643L752l026n905J77M096J345j192j02o60l606k35M276L212j821k398
$$ -2956 687 4439 1413 -4492 -4315 -219 1126 -66 -168 -828 -4434 -4669 -393 2819 998 -1400
1545a400j329j270K42L914M221k200n258p05L307L17p83K085J706l745m198L099
$$ -1400 -2729 -3999 -3757 157 4378 2178 -3080 -3785 -478 -161 -944 1141 2847 -898 -5096 -1997
1561a997M857o77l802q65O03k21L04K137J207k530j781J24l79M32K989J485k842
$$ -1997 2860 2183 -1619 -2484 -1881 -2102 -1798 339 1546 -984 -2765 -2641 -3020 -2588 401 1886 -956
1578i56k674J431K332q88o70J517O43k700j407M006K285l004k534Q35P32n38K87
$$ -956 -3630 -2199 133 -755 -1425 92 735 -1965 -3372 634 2919 -85 -2619 -1784 -1052 -1590 -1303
1595a303J935j24j938j311J49o70J263K611M44l343j693K567P02j039Q0K207j444
$$ -1303 632 508 -1430 -2741 -2592 -3262 -1999 612 1056 -2287 -3980 -1413 -711 -1750 -1670 537 -907
1612i07l077N81N123J561l832k542J562J77n53K204K705j022m579q78K166J076
$$ -907 -3984 -3403 1720 3281 -551 -3093 -1531 -1354 -1907 297 3002 1980 -2599 -3477 -1311 -235
1628b35K84O09m49l439m96L479K102j833j362J019j097k486K826N310j60n072
$$ -235 49 658 209 -3230 -3726 -247 1855 22 -1340 -321 -1418 -3904 -1078 4232 4072 -1000
1644a000j944J695R79Q47L259J571m510n012J746N250R03j549n86k394k870K689
$$ -1000 -2944 -1249 -270 577 3836 5407 897 -4115 -2369 2881 3784 2235 1649 -745 -3615 -926
1660i26N764J202m757m608O06K163J561L685J384m589n651J631N291K418j546
$$ -926 4838 6040 1283 -3325 -2719 -556 1005 4690 6074 1485 -4166 -2535 2756 5174 3628
1675C628q62j013k683j40N025L290k977m031n28O11J455K757K601k804o562j535
$$ 3628 2766 1753 -930 -1070 3955 7245 4268 237 -291 320 1775 4532 7133 4329 -2233 -3768
1691c768M089L815M79r80j915l594j456M088N314o88m598k781Q18J842K762K942
$$ -3768 321 4136 4615 3635 1720 -1874 -3330 758 6072 5384 786 -1995 -1177 665 3427 6369
1707F369j291n465k805K352M030K024j14k248m553j989L514M700J10l805k080
$$ 6369 5078 -387 -3192 -840 3190 5214 5100 2852 -1701 -3690 -176 4524 4634 829 -1251
1722a251k06o82K149L754L10m958m217J909L923K064L91j312l602l371K732M797
$$ -1251 -1457 -2139 10 3764 4074 -884 -5101 -3192 731 2795 3186 1874 -1728 -5099 -2367 2430
1738B430J325j734j943j816j301J860M048O99m746l188K001K899j0j97L88j962
$$ 2430 3755 2021 78 -1738 -3039 -1179 2869 3568 -1178 -4366 -2365 534 524 327 715 -1247
1754a247l881M31M859J765j804j848l43q28k92K309K199j398k354N03J262m67
$$ -1247 -5128 -4697 162 1927 123 -1725 -2068 -2896 -3188 -879 1320 -78 -2432 -1929 -667 -1134
1770a134O49J803q39l428p57L870J672j956j066O04q77k408J298L824k36l640
$$ -1134 -485 1318 479 -2949 -3706 164 1836 -120 -1186 -582 -1459 -3867 -2569 1255 1019 -2621
1786b621q41K623L46j438K63J347j252j264K095J870j935j407J519R17j519n1
$$ -2621 -3462 -839 -493 -1931 -1668 -321 -1573 -2837 -742 1128 -807 -2214 -695 222 -1297 -1348
1802a348J928L15j812j41K474o35l293K37K913m9j770J98J345j451k450J697K586
$$ -1348 580 895 -917 -1058 1416 781 -2512 -2275 638 589 -1181 -983 362 -1089 -3539 -1842 744
1819G44m90k510L45J121k56M51J389n31k253k72J529J428m1J186m81l185k103
$$ 744 254 -2256 -1911 -790 -1046 -595 794 263 -1990 -2262 -733 695 654 1840 1359 -1826 -3929
1836c929L216L567p56k895k06L69j071M96K542Q33l169k798R17K500J624L59j094
$$ -3929 -713 2854 2098 -797 -1003 -634 -1705 -1209 1333 2166 -1003 -3801 -2884 -384 1240 1599 505
1853E05l030k265K532L813J431j669j964j354r91J527M784J362m197l723R42K298
$$ 505 -2525 -4790 -2258 1555 2986 1317 -647 -2001 -2992 -1465 3319 4681 484 -3239 -2297 1
1869AJ509R25j52l072l851J013M692K654j300k755k038j798J442M554K765k288
$$ 1 1510 2435 2283 -789 -4640 -3627 1065 3719 2419 -336 -2374 -4172 -2730 1824 4589 2301
1885B301m664q60J708J958K736J465l200n674P52N938K593j595j765j408k698
$$ 2301 -2363 -3223 -1515 443 3179 4644 1444 -4230 -3478 2460 5053 3458 1693 285 -2413
1900b413k91M633M878j729o002k564K291K121J673J557j624m348j920L449L879
$$ -2413 -2704 1929 6807 5078 -924 -3488 -1197 924 2597 4154 2530 -1818 -3738 -289 3590
1915C590R02j691k385k830n19M592O021j120o026k797J780J910J307K370N01m288
$$ 3590 4492 2801 416 -2414 -2933 1659 7680 6560 534 -2263 -483 1427 2734 5104 5605 1317
1931A317m617J698N126K061k237k852j885q05K124M543J216m444l555J12J851
$$ 1317 -3300 -1602 3524 5585 3348 496 -1389 -2194 -70 4473 5689 1245 -2310 -2198 -347
1946c47J489L166P17l363n326J122N326J954j741j792p45j309J20L693J876k553
$$ -347 1142 4308 5025 1662 -3664 -2542 2784 4738 2997 1205 460 -849 -729 2964 4840 2287
1962B287l611n49J723R81J089N16j145m034p33K944K030k56j102j005j466Q9K451
$$ 2287 -1324 -1873 -150 831 1920 2436 1291 -2743 -3476 -532 1498 1242 140 -865 -2331 -2242 209
1979B09K178j286l053q37J637Q94J318J020r03l715r77K435K559o38j536m29n21
$$ 209 2387 1101 -1952 -2789 -1152 -258 1060 2080 1177 -2538 -3515 -1080 1479 841 -695 -1124 -1645
1996a645p02J211J869r06k425j61J079O04P9P20j34k490r09K965J716j677j644
$$ -1645 -2347 -1136 733 -173 -2598 -2759 -1680 -1076 -997 -277 -411 -2901 -3810 -845 871 -806 -2450
2013b450R30J173q69n56J094M3r99lJ586L59j722j77J41o53k66K543P94k792j720
$$ -2450 -1520 -347 -1216 -1772 -678 -635 -1634 -1637 -51 308 -1414 -1591 -1450 -2103 -2369 174 968 -1824 -3544
2032c544J462J797q78o11J334q0k148n72L335K030k007k371N6M26J089J703O85
$$ -3544 -2082 -285 -1163 -1774 -440 -520 -2668 -3240 95 2125 118 -2253 -2197 -1771 -682 1021 1706
2049A706j639k239J89J629P83L17K74j285k536J27M166J371k638k728j68J394
$$ 1706 67 -2172 -1983 -354 429 746 1020 -265 -2801 -2674 1492 2863 225 -2503 -2671 -1277
2065a277M40J478J744j428l518j099K799L110K94j867j438j494Q10K257K531n16
$$ -1277 -837 641 2385 957 -2561 -3660 -861 2249 2543 676 -762 -2256 -1446 811 3342 2826
2081B826l285k153L30K143L118J494k986m223j758K976L506J367j514j810l209
$$ 2826 -459 -2612 -2282 -139 2979 4473 1487 -2736 -4494 -1518 1988 3355 1841 31 -3178
2096c178p95L015M758M38m431l459M39K996K849P90j551k913k145J180L224K559
$$ -3178 -3973 -958 3800 4238 -193 -3652 -3213 -217 2632 3422 1871 -1042 -3187 -2007 1217 3776
2112C776J01k824l878p28L402L887O2k693k474j022O92K300K632k00l285l593
$$ 3776 3877 1053 -2825 -3553 -151 3736 3798 1105 -1369 -2391 -1699 601 3233 3033 -252 -3845
2128c845M32L872L244R4k692l540r78K780L099J637j153k495k997j23L613L731
$$ -3845 -3413 459 3703 3797 1105 -2435 -3413 -633 2466 4103 2950 455 -2542 -2665 948 4679
2144D679K36m360l411Q03L072K158N31j106l232l007J907L768K473j412l371j673
$$ 4679 4915 555 -2856 -2053 1019 3177 3708 2602 -630 -3637 -1730 2038 4511 3099 -272 -1945
2160a945m26K285L088J164k388l034l96K036J672J531j26k691k520m8M043K273
$$ -1945 -2371 -86 3002 4166 1778 -1256 -1652 384 2056 3587 3461 770 -1750 -1798 2245 4518
2176D518j129k507j125p96L96K474K549j678l830j154J874J974O51k99j182k324
$$ 4518 3389 882 -243 -1039 -643 1831 4380 2702 -1128 -2282 -408 1566 2217 1918 736 -1588
2192a588l13K621K137n50j789q41n89Q5J827K434r73l093r16J472J272r4mK0j926
$$ -1588 -1901 720 2857 2307 518 -323 -912 -827 1000 3434 2461 -632 -1548 -76 1196 1102 1098 1118 -808
2211h08j214J534J919J83j981j351M20j55J010J308l56k140o10J296N08K60J27
$$ -808 -2022 -488 1431 1614 -367 -1718 -1298 -1453 -443 865 509 -1631 -2241 -945 -437 -177 -50
2228e0L2p27j131Q48J429j49j813m66J482Ro3K59m60p11p60Q48J277m73q72n70
$$ -50 -18 -745 -1876 -1028 401 252 -1561 -2027 -545 -536 -599 -340 -800 -1511 -2271 -1423 -146 -619 -1491 -2061
2248b061J09K57R42L54j276j178O05J563K78n01m1l98j357J04K112J623j481j720
$$ -2061 -1952 -1695 -753 -399 -1675 -2853 -2248 -685 -407 -908 -949 -1347 -2704 -2600 -488 1135 -346 -2066
2266b066o4R23N54M35N25j056j837N0J658J317j29p25j589j144O54K523J733j322
$$ -2066 -2130 -1207 -653 -218 307 -749 -2586 -2536 -878 439 310 -415 -2004 -3148 -2494 29 1762 440
2284D40k702k80O99P80J997Q40j425k930p63K919K872j32k193j318r07K9K581
$$ 440 -2262 -2542 -1843 -1063 934 1774 349 -2581 -3344 -425 2447 2315 122 -1196 -2103 -2074 507
2301E07K560k44l515k348P50J959J954R38j281l221j568K291L202M47j084j717
$$ 507 3067 2823 -692 -3040 -2290 -331 1623 2561 1280 -1941 -3509 -1218 1984 2431 1347 -370
2317c70k083k80K382L882N55l621l031L43K358J627J687m39l146k794P18M215
$$ -370 -2453 -2733 -351 3531 4086 465 -2566 -2223 135 1762 3449 3010 -136 -2930 -2212 2003
2333B003J689j122k509k205j38J743L615J012l023l590l55K066K343J953m8l159
$$ 2003 3692 2570 61 -2144 -2282 -539 3076 4088 1065 -2525 -2880 -814 1529 3482 3434 275
2349B75l604L73M121K817j000k204j899n80R94L083J874j812l593j867J566K838
$$ 275 -3329 -2956 1165 3982 2982 778 -1121 -1701 -707 2376 4250 2438 -1155 -3022 -1456 1382
2365A382K016r1k709l278m11L078K590N20j873j981j559N50L095K348r44l384
$$ 1382 3398 3307 598 -2680 -3091 -13 2577 3097 1224 -757 -2316 -1766 1329 3677 2733 -651
2381f51j660Q89K146K252J21j730k396j346J973K958R04j471k080j644n0K799
$$ -651 -2311 -1422 724 2976 3097 1367 -1029 -2375 -402 2556 3460 1989 -91 -1735 -1785 1014
2397A014J961o85k501j335L85J465J120J057r81k572j325J837K523N42q36j543
$$ 1014 2975 2290 -211 -1546 -1161 304 1424 2481 1500 -1072 -2397 -560 1963 2505 1669 126
2413A26j103J13J174K030L16k181j208O0J119Q89O95m97k169j193J449K206J77
$$ 126 -977 -864 310 2340 2656 475 -733 -673 446 1335 2030 1533 -636 -1829 -380 1826 2003
2430B003j138q94n06m23O60J935L80k126j311O31Q59R00J09p54n94r09J151J444
$$ 2003 865 -29 -535 -958 -298 1637 2017 -109 -1420 -789 70 970 1079 325 -269 -1178 -27 1417
2448A417l37r04o17q8J81P03P42j34j623j060J174J410r61r00M63K99j112L98
$$ 1417 1080 176 -441 -529 -348 355 1097 963 -660 -1720 -546 864 -97 -997 -534 -235 -1347 -949
2466i49J436K66j714j539P14J656M82j60j73j569j79N98J406K67r77r17n02L7
$$ -949 487 753 -961 -2500 -1786 -130 352 192 19 -1550 -1729 -1131 275 542 -435 -1352 -1854 -1817
2484a817J306J534j98k761j914J856J928M25n68p06j126q15P28K505P97j707j955
$$ -1817 -511 1023 825 -1936 -3850 -1994 -66 359 -209 -915 -2041 -2856 -2128 377 1174 -533 -2488
2501b488n94R93J971J413p77k272j404O19J888J397L23q45k581j121J410K990
$$ -2488 -3082 -2089 -118 1295 518 -1754 -3158 -2539 -651 746 1069 224 -2357 -3478 -2068 922
2517I22J047j882k151r27J024J357J801J00j885k190l29J894K583O88j628k823
$$ 922 1969 87 -2064 -2991 -1967 -610 1191 1291 -594 -2784 -3113 -1219 1364 2052 424 -2399
2533b399j005J819L074R59j155k109j482NJ552L303M65k801k544l11K474K139
$$ -2399 -3404 -1585 1489 2448 1293 -816 -2298 -2293 -741 2562 3027 226 -2318 -2629 -155 1984
2549A984M52j113j903j803M23K963K344o00k722j897l46J851K879Q61k188k714
$$ 1984 2436 1323 -580 -2383 -1960 1003 3347 2747 25 -1872 -2218 -367 2512 3373 1185 -1529
2565a529l84J568J747J341J29j865l198R6K971K819k20l179j364j92R57K026J475
$$ -1529 -1913 -345 1402 2743 2872 1007 -2191 -2095 876 3695 3475 296 -1068 -1260 -303 1723 3198
2582C198l60k995k159J002K691J436J67k185k380k59K553K036p4j709j406p46
$$ 3198 2838 -157 -2316 -1314 1377 2813 2980 795 -1585 -1844 709 2745 2671 962 -444 -1190
2598a190Q0K071K378l08k825k218O62K644J032j37j233j182j501R41K341J117
$$ -1190 -1110 961 3339 3031 206 -2012 -1350 1294 2326 2189 956 -226 -1727 -786 1555 2672
2614B672j445j665j269N59J498J710J45j905j808J95J334J024P38p47j203j153
$$ 2672 1227 -438 -1707 -1148 350 2060 2205 300 -1508 -1313 21 1045 1783 1036 -167 -1320
2630a320J32K490R23j340j545p7L04O08J030M22j255j493m9J349R69Q9n42j038
$$ -1320 -1188 1302 2225 885 -660 -737 -433 175 1205 1627 372 -1121 -1170 179 1148 1237 695 -343
2648c43j067R84J374M36q30j200M59k40k2J238O03j060j536K21J393P01o80k06
$$ -343 -1410 -426 948 1384 554 -646 -187 -427 -449 789 1392 332 -1204 -983 410 1111 431 225
2666B25j82m83j77J130N16q71k09m00M34P3O20K31j247q83P81J296J1r34l40K24
$$ 225 43 -440 -617 513 1029 158 -51 -451 -17 56 676 907 -340 -1223 -442 854 865 -69 -409 -185
2686a85j35n7P26N86j084j164L57J454K93m92o21n34L7N05J295L90j521q89j97
$$ -185 -320 -377 349 935 -149 -1313 -956 498 791 299 -322 -856 -819 -314 981 1371 -150 -1039 -1236
2705a236L54O60R56L92j728j810O13K201K73o48o61l49q81R8K030J131j313k115
$$ -1236 -882 -222 734 1126 -602 -2412 -1799 402 675 27 -634 -983 -1864 -1766 264 1395 82 -2033
2723b033m3J015J007O84q7j151j882K54J867J223m75j084j198l14O01J692J680
$$ -2033 -2076 -1061 -54 630 543 -608 -2490 -2236 -369 854 379 -705 -1903 -2217 -1616 76 1756
2740A756j892k369m77J263J502N13L43q92k505m73J961K656j80j718j633l99R87
$$ 1756 -136 -2505 -2982 -1719 -217 296 639 -253 -2758 -3231 -1270 1386 1206 -512 -2145 -2544 -1557
2757a557J717J305p7k688j385K92K009J276N40j106k561q42J682K875L10j544
$$ -1557 160 1465 1388 -1300 -2685 -2393 -384 892 1432 326 -2235 -3077 -1395 1480 1790 246
2773B46j350q11n2J544K218J08j979k304N8K085J908Q1q67j918q10Q55J947J250
$$ 246 -1104 -1915 -1967 -423 1795 1903 -76 -2380 -2322 -237 1671 1752 885 -1033 -1843 -988 959 2209
2791B209n08j759j471o1J748K052q1j620j759J5J198J399P51n05j667j477M12
$$ 2209 1701 -58 -1529 -1590 158 2210 2129 509 -1250 -1235 -37 1362 2113 1608 -59 -1536 -1124
2808a124K153J508l17j800j367k71J571J760L95j120j412j227O31J991J381k79
$$ -1124 1029 2537 2220 420 -947 -1218 353 2113 2508 1388 -24 -1251 -620 1371 2752 2473
2824B473k010j606M58J583J282j06r87j158p59O20J214J386l10k103q99P44J278
$$ 2473 463 -1143 -685 898 2180 2074 1087 -71 -830 -210 1004 2390 2080 -23 -922 -178 1100
2841A100P18k48q11j156j25Q73Q09M78m11r75j073K22J746O46m73j118j076N47
$$ 1100 1818 1570 759 -397 -522 351 1160 1638 1227 252 -821 -599 1147 1793 1320 202 -874 -327
2859c27J039m0L03k55q19o22P09J146K92j075q19k15L31R50J19k80n07m72J96
$$ -327 712 672 975 720 -99 -721 -12 1134 1426 351 -468 -683 -352 598 717 437 -70 -542 -346
2878c46L97N18r0k01p44j33N74P26n06l91k34K39K35l44O50k86j95n91O88N54
$$ -346 51 569 479 278 -466 -599 -25 701 195 -196 -430 -191 44 -300 350 64 -131 -722 -34 520
2898E20l69J52p24n1K08N93j02k53k31k07mL89K84L00p55p15L87Q89N06n07p88
$$ 520 151 303 -421 -472 -264 329 227 -26 -257 -464 -468 -79 205 505 -250 -965 -578 311 817 310 -478
2919d78m79L41M69M46R6k43q98l25L90J110M60l08j124p41M01J059P50q71l92
$$ -478 -957 -616 -147 299 395 152 -746 -1071 -681 429 889 581 -543 -1284 -883 176 926 55 -337
2938c37m48k54R8J317P25r57r28q56O62R75R17n24j185q23Q0J477Q24l39o13j204
$$ -337 -785 -1039 -941 376 1101 144 -784 -1640 -978 -3 914 390 -795 -1618 -1538 -61 763 424 -189 -1393
2958a393k93N06J754M25q10j473n56P05J123M76j29n81j428n07J354J794J85j494
$$ -1393 -1686 -1180 574 999 189 -1284 -1840 -1135 -12 464 335 -246 -1674 -2181 -827 967 1152 -342
2976c42j050p59O56J747J035p34j211j555M44J350R25M67j021j632m74J160J818
$$ -342 -1392 -2151 -1495 252 1287 553 -658 -2213 -1769 -419 506 973 -48 -1680 -2154 -994 824
2993H24L78j398j142l45L42Q15J335M40j672j632K46J543J170q0q87j182l90M05
$$ 824 1202 -196 -1338 -1683 -1341 -526 809 1249 -423 -2055 -1809 -266 904 824 -63 -1245 -1635 -1230
3011a230J406J257l92j553q54k30J054K240j67j384j680o0J404R90K33q1j057
$$ -1230 176 1433 1041 -512 -1366 -1596 -542 1698 1531 147 -1533 -1593 -189 801 1034 953 -104
3028a04j160k21J717J791l84j338j432J74P41J462K43o77q73o44K41J292Q86q2
$$ -104 -1264 -1485 232 2023 1639 301 -1131 -957 -216 1246 1489 812 -61 -705 -464 828 1714 1632
3046A632j048j525K42J444J210l52j033l64n25L79Q13R19j85j047j080K77J269
$$ 1632 584 -941 -699 745 1955 1603 570 206 -319 60 873 1792 1607 560 -520 -243 1026
3063A026M18o8o03j102n5P49P29K26O6r04p49M4J120J231p61p31o90M55L03pJ68
$$ 1026 1444 1376 773 -329 -384 365 1094 1320 1386 482 -267 -223 897 2128 1367 636 -54 401 704 697 865
3084H65L03p69l92L4R01K85o41n37l65K35J056O2q29j20q6K15J59M1%K72o39n58
$$ 865 1168 399 7 41 942 1227 586 49 -316 -81 975 1037 208 88 2 217 376 417 417 689 50 -508
3106e08M09N41K78o57j95K06J83n34K78M00l25m21M3M33L65n03l39J06j8L63l
$$ -508 -99 442 720 63 -132 74 257 -277 1 401 76 -345 -302 131 496 -7 -346 -240 -258 105 102
3127A02q8q73L36O59J28n69J7R5n42P0M54P24m53p90j18P5O62j8L02k59p16k55
$$ 102 14 -859 -523 136 264 -305 -288 -193 -735 -665 -211 513 60 -730 -848 -773 -111 -129 173 -86 -802 -1057
3149a057O26Q74J28o16r34nQ6J033O81o15p07k64K17L52M04M64n68q98m32L95
$$ -1057 -431 443 571 -45 -979 -984 -898 135 816 201 -506 -770 -553 -201 203 667 99 -799 -1231 -836
3169h36J410K96q59q52l92L72M66J046K2r65r14r2N98J287K76o60j139o91R72
$$ -836 574 870 11 -841 -1233 -861 -395 651 673 -292 -1206 -1298 -700 587 863 203 -936 -1627 -655
3188f55R71K12Jj271n82j0Q35J033N72j061j350j15Q68Q95P51n66q33j142J73
$$ -655 316 528 529 -742 -1324 -1334 -499 534 1106 45 -1305 -1420 -552 343 1094 528 -305 -1447 -1274
3207a274R15J177J05r47j096l17R86R04N23j031p61o42L89J003O10M00j137j101
$$ -1274 -359 818 923 -24 -1120 -1437 -451 453 976 -55 -816 -1458 -1069 -66 544 944 -193 -1294
3225a294o08J439J042R9p84o59l51K98P97Q65j95r31j107L7R78J184K76j149j188
$$ -1294 -1902 -463 579 678 -106 -765 -1116 -818 -21 844 649 -282 -1389 -1352 -374 810 1086 -63 -1251
3244a251j0O88Q41K19n69J8j127J51R87J174k59r17j097J15R42Q41R5m49r00k50
$$ -1251 -1261 -573 268 487 -82 -64 -1191 -1040 -53 1121 862 -55 -1152 -1037 -95 746 841 392 -508 -758
3264g58J06R86Q17L5j168p66J45N90R19L10p23n70k61L74L92O52Rj061k2l83Q41
$$ -758 -652 334 1151 1186 18 -748 -603 -13 906 1216 493 -77 -338 36 428 1080 1089 28 6 -377 464
3285D64O56P0q43k67j15J69M60N27j51n28n08J03L70R84j01p46j58j51M58j34
$$ 464 1120 1190 347 80 -35 134 594 1121 970 442 -66 37 407 1391 1290 544 386 235 693 559
3305E59L18K11m76m42q7R28j3m13l39m85O42J32M22k33J4o81K37k47L21N81l99
$$ 559 877 1088 612 170 83 1011 998 585 246 -239 403 535 957 724 738 57 294 47 368 949 550
3326E50j68j89J67K41J18j78j07J98j6m78K19L32l08K37q35N86q5m08J52J97p5
$$ 550 382 193 360 601 719 541 434 632 616 138 357 689 381 618 -217 369 284 -124 28 225 150
3347A50j21L95m58k01Q7N45j21j60r3m2l56R2N00K20j44q03j34O20l55L13p1r7
$$ 150 29 424 -34 -235 -148 397 276 116 23 -19 -375 -283 217 437 293 -510 -644 -24 -379 -66 -137 -234
3369b34l45m3J96J138m91n35n41l1M08K58L19K64j398l6K54O31k2M14l37n60m67
$$ -234 -579 -622 -426 712 221 -314 -855 -886 -478 -220 99 363 -1035 -1071 -817 -186 -208 206 -131 -691 -1158
3390a158N14Q74K16r43l71M38m07J71J053k64m66j034M25O02N64j93k14n17m78
$$ -1158 -644 230 446 -497 -868 -430 -837 -666 387 123 -343 -1377 -952 -350 214 21 -193 -710 -1188
3409a188N03Q78j05j31o09j3k86N03R68J66r74r44K75Q23N95k46Q2n15o11L80
$$ -1188 -685 193 88 -43 -652 -665 -951 -448 520 686 -288 -1232 -957 -134 461 215 297 -218 -829 -449
3429d49JJ140K1j233k94l94P40J101O1n89o24m58M20N03M19L22n07q02k89N57
$$ -449 -448 692 713 -520 -814 -1208 -468 633 694 105 -519 -977 -557 -54 365 687 180 -622 -911 -354
3449c54J329l19q11o15L61M2L53R6L70n76o49p3Q77M15J04l27p55j55L87P70m0
$$ -354 975 656 -155 -770 -409 -367 -14 82 452 -124 -773 -846 31 446 550 223 -532 -687 -300 470 430
3470D30j95k35o38p3L07J078j91n31n96J24M76J83K62m9l18n05N4O05O33m63n07
$$ 430 235 0 -638 -711 -404 674 483 -48 -644 -520 -44 139 401 352 34 -471 -417 188 821 358 -149
3491a49l97j13K92R45k0m56k39m16N30K33j20P42o85p12m0Q18M55R9m52k11J00
$$ -149 -546 -659 -367 578 558 102 -137 -553 -23 210 90 832 147 -565 -605 213 668 767 315 104 204
3512B04l57L88N18j24l30n42L50O4M13L53k28m97l36L12J03K26L1j57k31k10K01
$$ 204 -153 235 753 629 299 -243 107 171 584 937 709 212 -124 188 291 517 548 391 160 -50 151
3533A51N09K34k94q96M67M05k90O3N27j12n44j31M7L97Q1j61j96n7m90P03N1K64
$$ 151 660 894 600 -296 171 576 286 349 876 764 220 89 136 533 614 453 257 200 -290 413 464 728
3555G28j76l7q1l06q4P09j67l33j06j37L96j57J82k0J31n33K45J11L0L63n20J27
$$ 728 552 515 434 128 44 753 586 253 147 10 406 249 431 411 542 9 254 365 395 758 238 365
3577C65j17k07M19k81J43l7k74k3m12M88K18j08J31o04J08J7J93J99j20l12m24
$$ 365 248 41 460 179 322 285 11 -12 -424 64 282 174 305 -299 -191 -174 19 218 98 -214 -638
3598f38j43M21N97O0l13n63K20l4L20Q8q1q7l83jK47M95K17n62r53N93J14K69
$$ -638 -781 -360 237 297 -16 -579 -359 -393 -73 15 -66 -153 -536 -537 -290 205 422 -140 -1093 -500 -386 -117
3620a17m07J13L31o78K1L62N95l30j29n33L4K26P17p2j85l84k22M0p5O55N66r61
$$ -117 -524 -411 -80 -758 -737 -375 220 -110 -239 -772 -738 -512 205 133 -52 -436 -658 -618 -693 -38 528 -433
3642d33m49J34L05L36L40l99k20l53K8L34N19o7qj190L22N84M61J60m19n50Q6
$$ -433 -882 -748 -443 -107 233 -166 -386 -739 -711 -377 142 75 67 -1123 -801 -217 244 404 -15 -565 -479
3663d79k94O32M58j63k00k94j92O1R79L1o13n23j43J23N60L67K7m22m61p9L37
$$ -479 -773 -141 317 154 -46 -340 -532 -471 508 539 -74 -597 -740 -617 -57 310 337 -85 -546 -625 -288
3684b88Q73k39j60o28N5L5O25K71j77o39j47J90j7K47N95j43n40m25L83P82L8
$$ -288 585 346 186 -442 -387 -352 273 544 367 -272 -419 -229 -246 1 596 453 -87 -512 -129 653 691
3705F91l31k29m58j24K89P76J90o55p98M22K98L37q1n3j31l35O6K85j49N60O1
$$ 691 360 131 -327 -451 -162 614 804 149 -649 -227 71 408 327 274 143 -192 -126 159 10 570 631
3726F31n82k10K53O81j90l32k34k67J35R6M91J69n28k53l18N09L95J36m4l64n07
$$ 631 49 -161 92 773 583 251 17 -250 -115 -19 472 641 113 -140 -458 51 446 582 538 174 -333
3747c33K18L36M27j32q5n47J4K34K74K10l84j31J14k97K7M65m40M58k01k38K0
$$ -333 -115 221 648 516 431 -116 -102 132 406 616 232 101 215 -82 -55 410 -30 428 227 -11 9
3768IM66j88J09k36m92M20R0m4L2K07j98k06O2L58K56k6o54J33n7L46k3j32K66
$$ 9 475 287 396 160 -332 88 178 134 166 373 175 -31 31 389 645 619 -35 98 41 387 364 232 498
3791D98k61k02J55K96l2J66m59L3j28J65N6P6j14J9j64r6Q4K23q5K60l06l86M54
$$ 498 237 35 190 486 454 620 161 194 66 231 287 363 249 268 104 8 92 315 230 490 184 -202 252
3814B52j97J07o9K85m44m1L45k10J03O4k29j11Q5K29j01j25Q6q5l4k86M38K5J0
$$ 252 55 162 93 378 -66 -107 238 28 131 195 -34 -145 -60 169 68 -57 29 -56 -90 -376 62 87 97
3837I7m8l67L6K09q4J85J22j44m25O8R9N9K6j1j9j32J67J87k97O6j32j86J1M5
$$ 97 49 -318 -282 -73 -157 28 150 6 -419 -351 -252 -193 -167 -178 -197 -329 -162 25 -272 -206 -338 -524 -513 -468
3861d68N51p1m41k17p8K18J53J12j03j05l6k39k8N94K52n61k35l4L18L5K33J3
$$ -468 83 12 -429 -646 -724 -506 -353 -241 -344 -449 -485 -724 -752 -158 94 -467 -702 -736 -418 -383 -150 -137
3883a37o7j97l15K25K70L20m5q81K07J12L76L83m71j86m8J32J75N4L40N8n37m73
$$ -137 -204 -401 -716 -491 -221 99 54 -827 -620 -508 -132 251 -220 -406 -454 -322 -147 -93 247 305 -232 -705
3905g05K14N45J40Q2n54N4J06K71j30L2r5k84k21P50J3Q4p4l12l16J92L30M03
$$ -705 -491 54 194 276 -278 -224 -118 153 23 55 -40 -324 -545 205 218 302 228 -84 -400 -208 122 525
3927E25j19m22J43l48L4N48J66r6n21o2J71q5M49K14p32Q9l52J41P78n9R9k46
$$ 525 406 -16 127 -221 -187 361 527 431 -90 -152 19 -66 383 597 -135 -46 -398 -257 521 462 561 315
3949C15l36J02J4N48l21J7l04j33J35J38P03m37j76o55K21J65M71m42m8p2k63
$$ 315 -21 81 95 643 322 339 35 -98 37 175 878 441 265 -390 -169 -4 467 25 -23 -95 -358
3970c58M30K05L20r2o43k67K68L03K37j66j34l42O2K89K40K11k14l13k11J86M81
$$ -358 72 277 597 505 -138 -405 -137 166 403 237 103 -239 -177 112 352 563 349 36 -175 11 492
3991D92m7Ml63l16L30J40R9j05J55l18j78k46M47M73j10k83l14L5R9M43K8m88
$$ 492 445 449 86 -230 100 240 339 234 389 71 -107 -353 94 567 457 174 -140 -105 -6 437 465 -23
4013b3L9k74K36M09N9K2l29j17n04N31L18Nk20l01K03j16K41NJ7J01k25k08J68
$$ -23 16 -258 -22 387 446 468 139 22 -482 49 367 372 152 -149 54 -62 179 184 201 302 77 -131 37
4036C7L45J12n13K19j30J3k87K73K12n3l22K5j2M70K9m24j6j31K2q5K54p6L30
$$ 37 382 494 -19 200 70 83 -204 69 281 228 -94 -69 -81 389 418 -6 -22 -153 -131 -216 38 -38 292
4059B92l18l01L87p8J38k39J3Q3k32L7K36K51j75k22m9J67L30n11J03k07J08j31
$$ 292 -26 -327 60 -18 120 -119 -106 -23 -255 -218 18 269 94 -128 -177 -10 320 -191 -88 -295 -187 -318
4081c18NJ74J05K30k56j73j36Q7K65j60M5j79M9k8j94M61Rm6m23l4L51K14j48
$$ -318 -313 -139 -34 196 -60 -233 -369 -282 -17 -177 -132 -311 -262 -290 -484 -23 -14 -60 -483 -517 -166 48 -100
4104a00l9l01MK00p5R4O1J16n73j06J38L31R0L1k00m9j93L52J04O9N6k19l11J09
$$ -100 -139 -440 -436 -236 -311 -217 -156 -40 -613 -719 -581 -250 -160 -129 -329 -378 -571 -219 -115 -46 10 -209 -520 -411
4128d11L90J11l17K1j48o1J68N22j41J29l38k42n5K62O6K10m71q1J79j8J54P1
$$ -411 -21 90 -227 -206 -354 -415 -247 275 134 263 -75 -317 -372 -110 -44 166 -305 -386 -207 -225 -71 0
4150@r0k06k39J41O89J88j90m03r2J32J03J46L48m00k16q7J10K88J56j28k95k08
$$ 0 -90 -296 -535 -394 295 483 293 -110 -202 -70 33 179 527 127 -89 -176 -66 222 378 250 -45 -253
4172b53k3M72M08m8n20J69l35J64K74J39K19n76k73K45M11j02K80l17j44l01K35
$$ -253 -276 196 604 556 36 205 -130 34 308 447 666 90 -183 62 473 371 651 334 190 -111 124
4193A24J61L30j74m32l42L96N4M52J47n95k86k20P80q7L52j0p53j10r2L69N67
$$ 124 285 615 441 9 -333 63 117 569 716 121 -165 -385 395 308 660 650 -103 -213 -305 64 631
4214F31J16p05l2j33J13L10J60m1l21k95L17J37k9J69n35R1k48L96M02j52ql11
$$ 631 747 42 10 -123 -10 300 460 419 98 -197 120 257 228 397 -138 -47 -295 101 503 351 343 32
4236C2k59k7M51L25l43k5m82J67O02m7j10m70M5n8n9K90N97l02k73k99J42L46
$$ 32 -227 -254 197 522 179 154 -328 -161 441 394 284 -186 -141 -199 -258 32 629 327 54 -245 -103 243
4258B43J40l50p0J70j69M6p8J67o3M1j60j23L19j9J19j19k87Q9K11J08j19j05
$$ 243 383 33 -37 133 -36 10 -68 99 36 77 -83 -206 113 94 213 94 -193 -104 107 215 96 -9
4280ij65J82o0p4J92j41R7k50L75q7p2n7p4J82j85J14J5O6j3j13J31L0N9j81j47
$$ -9 -174 8 -52 -126 66 -75 22 -228 147 60 -12 -69 -143 39 -146 -32 -17 49 36 -77 54 84 143 -38 -185
4305a85j3J39p8L2K72m22J3J64j53J48J57m57K49n9J22O5nk32k83N18l4K7M7k48
$$ -185 -198 -59 -137 -105 167 -255 -242 -78 -231 -83 74 -383 -134 -193 -71 -6 -11 -243 -526 -8 -42 -15 32 -216
4329b16l44J71J68K28J5j70k99K09J23K3J8k42Q5k47K25j5L59l67n0L1j42L48
$$ -216 -560 -389 -221 7 22 -148 -447 -238 -115 -92 -74 -316 -231 -478 -253 -268 91 -276 -326 -295 -437 -89
4351h9j3R4j35k43J00j61J55M83l22O8k74l56N47N51l49L02p05j8k70Q84j91J10
$$ -89 -102 -8 -143 -386 -286 -447 -292 191 -131 -63 -337 -693 -146 405 56 358 -347 -365 -635 249 58 168
4373A68m16k05R9N33K05k47p7m12l76O65J53L14m47k08k54J55L54L57l08l23j09
$$ 168 -248 -453 -354 179 384 137 60 -352 -728 -63 90 404 -43 -251 -505 -350 4 361 53 -270 -379
4394c79M36j43K05N88p63o6k28K19L88K36j85l63k15Q9L78L80j00l32m66K09K26
$$ -379 57 -86 119 707 -56 -122 -350 -131 257 493 308 -55 -270 -181 197 577 477 145 -321 -112 114
4415A14N0L36n7l21n92M19N14j01M8k88k19L25K9K2K42O4o68Q3j0J36L07J4j82
$$ 114 164 500 443 122 -470 -51 463 362 410 122 -97 228 257 279 521 585 -83 0 -10 126 433 447 265
4438B65j69J58RK24q9Jl56P2j03N32l37L36k75m83K47J36L93q8m08n6j87K46N71
$$ 265 96 254 263 487 398 399 43 115 12 544 207 543 268 -215 32 168 561 473 65 9 -178 68 639
4461F39k0m22k82J34J30K3K98j27j36l43p2K21Q3J88k89J28j61R1j4J92k5l0l97
$$ 639 619 197 -85 49 179 202 500 373 237 -106 -178 43 126 314 25 153 -8 83 69 261 236 206 -191
4484a91K48K10K5k10k50p7Lm8N65r9N9n41J66j11J47L25j86j39rJ47l75M26j97
$$ -191 57 267 292 82 -168 -245 -242 -290 275 176 235 -306 -140 -251 -104 221 35 -104 -113 34 -341 85 -112
4507a12J03j3m6j60r9R3J6K88m09M4m9J29O6l9J55O1Nl22M51J2l51J53J22j39
$$ -112 -9 -22 -68 -228 -327 -234 -218 70 -339 -295 -344 -215 -149 -188 -33 28 33 -289 162 174 -177 -24 98 -41
4531d1j37J66j54K84o0k76J61%j30j87L23P9k53M0q9K80q2J45l31K60K6Nk27R2
$$ -41 -178 -12 -166 118 58 -218 -57 -57 -187 -374 -51 28 -225 -185 -274 6 -76 69 -262 -2 24 29 -198 -106
4555a06J71k53j54Q1K75K41k52j08Q8p9K6q4K96J24k32j83m31L39K43o0r4Oj55
$$ -106 65 -188 -342 -261 14 255 3 -105 -17 -96 -70 -154 142 266 34 -149 -580 -241 2 -58 -152 -146 -301
4578c01j4K86MJ5J10o24L20J29J93k7l15j81J24L2J63J81PK7l96j42M36J51m01
$$ -301 -315 -29 -25 -10 100 -524 -204 -75 118 91 -224 -405 -281 -249 -86 95 102 129 -267 -409 27 178 -223
4601b23j64N0J19J15N01l97l4k97j83L63K66Q0k52j73k36K65L71k4O6l67l2j79
$$ -223 -387 -337 -218 -103 398 1 -33 -330 -513 -150 116 196 -56 -229 -465 -200 171 147 213 -154 -186 -365
4623c65K26K23J16Q0n46%O2J74L81r7l43j92j7K45J91K91k17l28j9j7L19J66j84
$$ -365 -139 84 200 280 -266 -266 -204 -30 351 254 -89 -281 -298 -53 138 429 212 -116 -135 -152 167 333 149
4646A49j91j53P4J86L07J10j56k15L4p7J50L59l25Qk82j80M09M21q7m51k71l7
$$ 149 -42 -195 -121 65 372 482 326 111 145 68 218 577 252 260 -22 -202 207 628 541 90 -181 -218
4668b18J40L8P78l99k31l39J25J82K46L4k13J0j89N55k56Q2k95J45j59J15R3O5
$$ -218 -78 -40 738 339 108 -231 -106 76 322 356 143 153 -36 519 263 345 50 195 36 151 244 309
4690C09O7l65pO8J42J32Q3j95l14l30M97J59q6K69m82J9K24r6J60n3k35P1J04
$$ 309 376 11 4 72 214 346 429 234 -80 -410 87 246 160 429 -53 -34 190 94 254 201 -34 37 141
4713A41k32L16m2m2q3m17L86J49M4k07J23r5j67Q7J78m4j05k33K8J68L0k21Pj45
$$ 141 -91 225 183 141 58 -359 27 176 220 13 136 41 -126 -39 139 95 -10 -243 -215 -47 -17 -238 -231 -376
4737c76J44K99l33K65Q7O9l30J80j07Q7q6N7M5j00L4M4m74L48J58k48j01L71l19
$$ -376 -232 67 -266 -1 86 155 -175 5 -102 -15 -101 -44 1 -99 -65 -21 -495 -147 11 -237 -338 33 -286
4760b86M07m23N8K85j9j34j11Q9Q9J26l61L67m77K27L9R3J56j32j51j75J91j49
$$ -286 121 -302 -244 41 22 -112 -223 -134 -45 81 -280 87 -390 -163 -124 -31 125 -7 -158 -333 -142 -291
4782b91N76p4l85J77k82O0K41k63K82j15j21q8j67N91j43j25J70l98M15j32N58
$$ -291 285 211 -174 3 -279 -219 22 -241 41 -74 -195 -283 -450 141 -2 -127 43 -355 60 -72 486
4803D86m77R2k79j90J47L76j23J08l94M6K00j81L79J32l57m68N25r8N28l16m2
$$ 486 9 101 -178 -368 -221 155 32 140 -254 -208 -8 -189 190 322 -35 -503 22 -76 452 136 94
4824I4m72M20m7N2J76N5o49J87m8L35K72n50l37M50k88L84L70k25l25N0k17M60
$$ 94 -378 42 -5 47 223 278 -371 -184 -232 103 375 -175 -512 -62 -350 34 404 179 -146 -96 -313 147
4846A47j9l7L30n46J07j40L07L71l10l24j45m1K27K01j14K17k72r4OL49j33j06
$$ 147 128 91 421 -125 -18 -158 149 520 210 -114 -259 -300 -73 128 14 231 -41 -135 -129 220 87 -19
4868a9J11p2j83p0N01k7j55Pk09O3L51o8J36m89l8O0N58k06k9j18j46m06K33N87
$$ -19 92 20 -163 -233 268 241 86 93 -116 -53 298 230 366 -123 -161 -101 457 251 222 104 -42 -448 -215 372
4892C72q9J41k74l70P7J20L05J56l52k15J67J40J81j0r0k5j10p3L54j27j55O3
$$ 372 283 424 150 -220 -143 -23 282 438 86 -129 38 178 359 349 259 234 124 51 405 278 123 186
4914A86r9L0j3J03Q8j90Nk16M11n4l0l64%J93R3p8K16j16Mq5k36J70R0L27r1m20
$$ 186 87 117 104 207 295 105 110 -106 305 251 221 -143 -143 50 143 65 281 165 169 84 -152 18 108 435 344 -76
4940g6N3oK81O7n57M34m83M35k49P3J09o5k29N1p1J86K0l12J14J9L00j74j91L52
$$ -76 -23 -29 252 319 -238 196 -287 148 -101 -28 81 16 -213 -162 -233 -47 -27 -339 -225 -206 94 -80 -271 81
4964H1j27j17j81N36j9q64P66l2k34J24K2Q4o74O15j51J70L1q7pl08M24j15K01
$$ 81 -46 -163 -344 192 173 -691 75 43 -191 -67 -45 39 -635 -20 -171 -1 30 -57 -64 -372 52 -63 138
4987A38k73Pp7K78k91N7J1J5j03j36M15j68J16l4m50K03L91J01k17P1l62J87j10
$$ 138 -135 -128 -205 73 -218 -161 -150 -135 -238 -374 41 -127 -11 -45 -495 -292 99 200 -17 54 -308 -121 -231
5010b31L41m6k54j9L4l4K63R8k91l1n00M24J53K58j15O4m08J17m8K19J21p4r8
$$ -231 110 64 -190 -209 -175 -209 54 152 -139 -170 -670 -246 -93 165 50 114 -294 -177 -225 -6 115 41 -57
5033e7j87j46K52J33M0M7k43j53K17P3R4L14m89k92K66L08j54K09m60j23P0J28
$$ -57 -244 -390 -138 -5 35 82 -161 -314 -97 -24 70 384 -105 -397 -131 177 23 232 -228 -351 -281 -153
5055a53K84q5M10n57j60K34R6J63J21l57k78p9L63K47K7k88k09j33L73J03L78
$$ -153 131 46 456 -101 -261 -27 69 232 353 -4 -282 -361 2 249 276 -12 -221 -354 19 122 500
5076E00m74j05j09Q5K41rOj08j04q9QJ00M86l31j26j27J8L09Lq6l42J37p4J60
$$ 500 26 -79 -188 -103 138 129 135 27 -77 -166 -158 -58 428 97 -29 -156 -138 171 174 88 -254 -117 -191 -31
$$ [...]
8191A05
##END NTUPLES=NMR FID
##END=
