##TITLE=1H_LacDMe-A3-p3
 CDCl3, 8 sc, 
 14.11.2019
##JCAMPDX= 6.0         $$ Bruker NMR JCAMP-DX V2.0
##DATA TYPE= NMR FID
##DATA CLASS= NTUPLES
##ORIGIN= UXNMR, Bruker Analytische Messtechnik GmbH
##OWNER= root
$$ XWIN-NMR		Version 3.5
$$ Thu Nov 14 16:35:25 2019 Russian Standard Time (UT+4h)  she@DPX200
##.OBSERVE FREQUENCY= 200.1315
##.OBSERVE NUCLEUS= ^1H
##.DELAY= (6, 6)
##.ACQUISITION MODE= SIMULTANEOUS
##.ACQUISITION SCHEME= undefined
##.AVERAGES= 8
##.DIGITISER RES= 18
##SPECTROMETER/DATA SYSTEM= spect
##.PULSE SEQUENCE= zg30
##.SOLVENT NAME= CDCl3
##.SHIFT REFERENCE= (INTERNAL, CDCl3, 0, 15.7039)
##AUDIT TRAIL= $$ (NUMBER, WHEN, WHO, WHERE, WHAT)
$$ ##TITLE= Audit trail, XWIN-NMR		Version 3.5
$$ ##JCAMPDX= 5.01
$$ ##ORIGIN= Bruker BioSpin GmbH
$$ ##OWNER= she
$$ F:/spectra/data/she/nmr/H-F/1/audita.txt
$$ ##AUDIT TRAIL=  $$ (NUMBER, WHEN, WHO, WHERE, WHAT)
(   1,<2019-11-14 16:34:30.01 +0400>,<she>,<DPX200>,
      <created by zg, POWCHK disabled, PULCHK disabled
       configuration hash MD5:
       00 E9 B6 7A A2 85 ED C7 34 08 36 98 17 FE 4E 26
       data hash MD5: 16K
       C1 31 5E F3 28 94 50 C8 EC 7E BB 59 52 EE A9 28>)
$$ ##END=
$$ 
$$ hash MD5
$$ 69 A6 F8 79 90 C4 6C 9A F1 25 80 6F 45 D4 46 C5
##$RELAX= 
##$RELAX= 
##$RELAX= 
##$RELAX= 
##$RELAX= 
##$RELAX= 
$$ Bruker specific parameters
$$ --------------------------
##$DU= <F:/spectra>
##$EXPNO= 1
##$NAME= <H-F>
##$PROCNO= 1
##$TYPE= <nmr>
##$USER= <she>
##$AMP= (0..31)
100 100 100 100 100 100 100 100 100 100 100 100 100 100 100 100 100 100 
100 100 100 100 100 100 100 100 100 100 100 100 100 100 
##$AQSEQ= 0
##$AQ_mod= 1
##$AUNM= <au_zg>
##$AUTOPOS= <>
##$BF1= 200.13
##$BF2= 200.13
##$BF3= 200.13
##$BF4= 200.13
##$BF5= 200.13
##$BF6= 200.13
##$BF7= 200.13
##$BF8= 200.13
##$BYTORDA= 1
##$CFDGTYP= 0
##$CFRGTYP= 5
##$CHEMSTR= <none>
##$CNST= (0..31)
1 1 145 1 1 1 1 1 1 1 1 1 1 1 1 1 1 1 1 1 1 1 1 1 1 1 1 1 1 1 1 1 
##$CPDPRG= <>
##$CPDPRG1= <>
##$CPDPRG2= <>
##$CPDPRG3= <>
##$CPDPRG4= <mlev>
##$CPDPRG5= <mlev>
##$CPDPRG6= <mlev>
##$CPDPRG7= <mlev>
##$CPDPRG8= <mlev>
##$CPDPRGB= <>
##$CPDPRGT= <>
##$D= (0..31)
0 1.2 0 0 0 0 0 0 0 0.06 0 0.03 0 0 0 0 0.0002 0 0 0 0 0 0 0 0 0 0 0 0 
0 0 0 
##$DATE= 1573734869
##$DBL= (0..7)
120 120 120 120 120 120 120 120 
##$DBP= (0..7)
150 150 150 150 150 150 150 150 
##$DBP07= 0
##$DBPNAM0= <>
##$DBPNAM1= <>
##$DBPNAM2= <>
##$DBPNAM3= <>
##$DBPNAM4= <>
##$DBPNAM5= <>
##$DBPNAM6= <>
##$DBPNAM7= <>
##$DBPOAL= (0..7)
0.5 0.5 0.5 0.5 0.5 0.5 0.5 0.5 
##$DBPOFFS= (0..7)
0 0 0 0 0 0 0 0 
##$DE= 6
##$DECBNUC= <off>
##$DECIM= 24
##$DECNUC= <off>
##$DECSTAT= 4
##$DIGMOD= 1
##$DIGTYP= 9
##$DL= (0..7)
0 120 120 120 120 120 120 120 
##$DP= (0..7)
150 150 150 150 150 150 150 150 
##$DP07= 0
##$DPNAME0= <>
##$DPNAME1= <>
##$DPNAME2= <>
##$DPNAME3= <>
##$DPNAME4= <>
##$DPNAME5= <>
##$DPNAME6= <>
##$DPNAME7= <>
##$DPOAL= (0..7)
0.5 0.5 0.5 0.5 0.5 0.5 0.5 0.5 
##$DPOFFS= (0..7)
0 0 0 0 0 0 0 0 
##$DQDMODE= 0
##$DR= 18
##$DS= 0
##$DSLIST= <SSSSSSSSSSSSSSS>
$$ [...]
##$SUBNAM2= <"">
##$SUBNAM3= <"">
##$SUBNAM4= <"">
##$SUBNAM5= <"">
##$SUBNAM6= <"">
##$SUBNAM7= <"">
##$SUBNAM8= <"">
##$SUBNAM9= <"">
##$SW= 24.0689530833862
##$SWIBOX= (0..15)
0 0 2 0 0 0 0 0 0 0 0 0 0 0 0 0 
##$SW_h= 4816.95568400771
##$TD= 16384
##$TD0= 1
##$TE= 0
##$TE2= 300
##$TE3= 300
##$TEG= 300
##$TL= (0..7)
0 120 120 120 120 120 120 120 
##$TP= (0..7)
150 150 150 150 150 150 150 150 
##$TP07= 0
##$TPNAME0= <>
##$TPNAME1= <>
##$TPNAME2= <>
##$TPNAME3= <>
##$TPNAME4= <>
##$TPNAME5= <>
##$TPNAME6= <>
##$TPNAME7= <>
##$TPOAL= (0..7)
0.5 0.5 0.5 0.5 0.5 0.5 0.5 0.5 
##$TPOFFS= (0..7)
0 0 0 0 0 0 0 0 
##$TUNHIN= 0
##$TUNHOUT= 0
##$TUNXOUT= 0
##$USERA1= <user>
##$USERA2= <user>
##$USERA3= <user>
##$USERA4= <user>
##$USERA5= <user>
##$V9= 5
##$VALIST= <valist>
##$VCLIST= <CCCCCCCCCCCCCCC>
##$VD= 0
##$VDLIST= <DDDDDDDDDDDDDDD>
##$VPLIST= <PPPPPPPPPPPPPPP>
##$VTLIST= <TTTTTTTTTTTTTTT>
##$WBST= 1024
##$WBSW= 4
##$XGAIN= (0..3)
0 0 0 0 
##$XL= 0
##$YL= 0
##$YMAX_a= 179758
##$YMIN_a= -129225
##$ZGOPTNS= <>
##$ZL1= 120
##$ZL2= 120
##$ZL3= 120
##$ZL4= 120
##$ABSF1= 10
##$ABSF2= 0
##$ABSG= 5
##$ABSL= 3
##$ALPHA= 0
##$AQORDER= 0
##$ASSFAC= 0
##$ASSFACI= 0
##$ASSFACX= 0
##$ASSWID= 0
##$AUNMP= <proc_1d>
##$AZFE= 0.1
##$AZFW= 0.1
##$BCFW= 1
##$BC_mod= 2
##$BYTORDP= 1
##$COROFFS= 0
##$CY= 11.3945322036743
##$DATMOD= 1
##$DC= 2
##$DFILT= <>
##$DTYPP= 0
##$F1P= 16.9975609425685
##$F2P= -3.02152046262296
##$FCOR= 0.5
##$FTSIZE= 0
##$FT_mod= 4
##$GAMMA= 1
##$GB= 0.15
##$INTBC= 1
##$INTSCL= 1
##$ISEN= 128
##$LB= 0.24
##$LEV0= 0
##$LPBIN= 0
##$MAXI= 10000
##$MC2= 0
##$MEAN= 0
##$ME_mod= 0
##$MI= 1.114404
##$NCOEF= 0
##$NC_proc= 0
##$NLEV= 6
##$NOISF1= 3.799351
##$NOISF2= 2.8
##$NSP= 1
##$NTH_PI= 0
##$NZP= 0
##$OFFSET= 15.70392
##$PC= 1
##$PHC0= -9456.674
##$PHC1= 19.20088
##$PH_mod= 1
##$PKNL= yes
##$PPARMOD= 0
##$PSCAL= 0
##$PSIGN= 0
##$REVERSE= no
##$SF= 200.130013532006
##$SI= 16384
##$SIGF1= 3
##$SIGF2= 2
##$SINO= 400
##$SIOLD= 16384
##$SREGLST= <1H.CDCl3>
##$SSB= 0
##$STSI= 0
##$STSR= 0
##$SW_p= 3612.71676300578
##$SYMM= 0
##$S_DEV= 0
##$TDeff= 0
##$TDoff= 0
##$TI= <>
##$TILT= no
##$TM1= 0
##$TM2= 0
##$TOPLEV= 0
##$USERP1= <user>
##$USERP2= <user>
##$USERP3= <user>
##$USERP4= <user>
##$USERP5= <user>
##$WDW= 1
##$XDIM= 8192
##$YMAX_p= 0
##$YMIN_p= 0
$$ End of Bruker specific parameters
$$ ---------------------------------
##NTUPLES= NMR FID
##VAR_NAME=  TIME,          FID/REAL,        FID/IMAG
##SYMBOL=    X,             R,               I
##VAR_TYPE=  INDEPENDENT,   DEPENDENT,       DEPENDENT
##VAR_FORM=  AFFN,          ASDF,            ASDF
##VAR_DIM=   8192,          8192,            8192
##UNITS=     SECONDS,       ARBITRARY UNITS, ARBITRARY UNITS
##FACTOR=    0.0002076,     1,               1
##FIRST=     0,             0,               0
##LAST=      1.7004516,     0,               0
##MIN=       0,             -129225,         0
##MAX=       1.7004516,     179758,          0
$$ Real data points
##PAGE= N=1
##DATA TABLE= (X++(R..R)), XYDATA
$$ [...]
$$ plain form
2007 -1988 -848 1402 2008 119 -1627 -1505 -1046 191 1586 1722 -95 -2148 -1638 163 1251 1257 568
2024 568 -623 -1926 -1638 656 2168 676 -1016 -1906 -1287 -387 507 1732 667 -1611 -1969 -468 788
2041 788 1437 1363 264 -1517 -1784 -108 2139 1782 33 -927 -1114 -988 240 1789 1420 -593 -2155
2058 -2155 -973 199 975 1329 383 -841 -2047 -949 1043 1924 766 -580 -778 -995 -580 1110 1973
2075 1973 697 -639 -962 -4 646 1153 1450 243 -1290 -1481 315 1304 625 199 -554 -1283 -1070 187
2093 187 1808 1187 -605 -997 -498 50 619 1583 1208 -847 -1336 -363 1022 1011 832 67 -745 -1290 -52
2112 -52 1306 1030 -27 -1036 -968 -757 -38 822 1381 -174 -1354 -901 197 795 467 39 -78 -818 -788
2131 -788 477 1395 745 -347 -888 -522 -393 352 1090 260 -610 -1286 -358 -34 412 518 -431 -1258 -1052
$$ packed form
2007a988J140K250O06j889j746J22M59J237J395J36j817k053N10J801J088Oo89
2024E68j191j303K88K294J512j492j692q90O19R00Q94J225j065k278l58J501J256
2041G88O49p4j099j781k67J676K247l57j749r60j87J26J228J549l69k013j562
2058b155J182J172P76L54r46j224j206J098J992Q81j158j346j98k17M15J690Q63
2075A973j276j336l23R58O50N07K97j207j533j91J796R89o79m26p53p29K13J257
2093A87J621o21j792l92M99N48N69R64l75k055m89R73J385j1j79p65q12n45J238
2112e2J358k76j057j009O8K11P19Q60N59j555j180M53J098N98l28m28j17p40L0
2131g88J265R18o50j092n41L66J29P45P38q30q70o76R28L24M46J06r49q27K06
$$ plain form
2150 -1052 -21 1382 652 -608 -310 -778 -360 -164 1416 872 -386 -990 -493 259 254 351 363 -499 -1057
2169 -1057 -752 528 557 -175 -87 -375 -388 -482 320 1138 -86 -634 -476 -112 16 303 768 716 -859 -774 571
2190 571 1026 331 24 32 -217 -469 210 815 396 -452 -435 -390 -58 -105 483 387 -547 -508 74 604 234 354
2212 354 358 95 -389 -160 789 510 -304 -103 162 -123 -101 322 741 -104 -726 -165 354 127 -274 250 -174
2233 -174 -227 -194 237 683 -182 -226 243 223 -182 148 532 91 -112 -96 178 -24 -383 6 250 -106 -193 -49
2255 -49 138 -33 -545 -201 -8 -511 -614 71 269 -303 -538 68 10 -265 90 250 1 17 75 235 63
2276 63 -380 -136 282 -98 -84 -372 -175 -434 -322 197 300 -354 -355 -138 53 -484 -132 98 -78 -529 -572 573
2298 573 314 231 -35 117 -226 -129 212 357 59 -342 -249 107 -57 252 500 -10 -550 -562 264 311 356 308
$$ packed form
2150a052J031J403p30j260K98m68M18J96J580n44j258o04M97P52nR7J2q62n58
2169a057L05J280K9p32Q8k88j3r4Q02Q18j224n48J58L64J28K87M65n2j575Q5J345
2190E71M55o95l07Qk49k52O79O05m19q48J7M5L32m7N88r6r34L9N82N30l70J20
2212C54Mk63m84K29R49k79q14K01K65k85K2M23M19q45o22N61N19k27m01N24m24
2233a74n3L3M31M46q65m4M69k0m05L30L84m41k03J6K74k02l59L89K44l56q7J44
2255d9J87j71n12L44J93n03j03O85J98n72k35O06n8k75L55J60k49J6N8J60j72
2276F3m43K44M18l80J4k88J97k59J12N19J03o54jK17J91n37L52K30j76m51m3J145
2298E73k59q3k66J52l43R7L41J45k98m01R3L56j64L09K48n10n40j2Q26M7M5m8
$$ plain form
2320 308 330 -436 -200 374 797 303 -268 -405 3 380 55 672 386 -364 -468 149 627 695 370 29 -332
2341 -332 -590 58 476 458 -196 -339 -320 -146 115 811 592 132 -715 -540 398 438 170 326 -48 -344 -272
2362 -272 310 808 48 -409 -508 -310 -184 403 823 -113 -699 -666 -67 -15 491 347 -173 -893 -447 236 818
2383 818 504 -63 -719 -812 -453 139 684 289 -736 -1049 -652 451 353 183 97 -727 -995 -329 497 339
2403 339 216 -219 -721 -683 73 582 542 -137 -786 -361 -120 429 719 936 -528 -1084 -341 543 946 372
2423 372 -255 -699 -737 -765 529 1113 292 -703 -919 -487 228 1015 847 294 -632 -896 -425 665 554 794
2443 794 117 -636 -621 628 874 878 -369 -656 -499 -201 386 1166 735 -365 -1287 -427 277 1130 530 -17
2463 -17 -576 -556 -212 709 977 443 -310 -645 -601 221 1089 933 10 -975 -971 111 710 600 503 -658 -1005
$$ packed form
2320C08K2p66K36N74M23m94n71j37M08L77l25O17k86p50j04O17M78O8l25l41l61
2341c32k58O48M18j8o54j43J9J74K61O96k19m60q47J75R38M0k68J56l74k96P2
2362b72N82M98p60m57r9J98J26N87M20r36n86L3N99N2N06j44n20p20M46O83N82
2383H18l14n67o56r3L59N92N45l95j025l13L97J103r8j70q6q24k68O66Q26j58
2403C39j23m35n02L8P56N09m0o79o49M25K41N49K90K17j464n56P43Q84M03n74
2423C72o27m44l8k8J294N84q21r95k16M32P15P87j68n53r26k64M71J090j11K40
2443G94o77p53J5J249K46Mj247k87J57K98N87P80m31j100r22Q60P04Q53o00n47
2463a7n59K0L44R21K68n34p53l35M4Q22Q68j56r23r85MJ082N99j10r7j161l47
$$ plain form
2484 -1005 -842 379 1112 662 -144 -780 -933 -365 378 1165 638 -725 -1262 -393 366 1005 695 31 -962
2503 -962 -997 -326 485 1147 285 -413 -842 -812 -78 1056 795 92 -1022 -850 -101 158 1008 315 -687 -1445
2523 -1445 -810 369 933 430 48 -906 -1170 -584 501 1064 308 -866 -1131 -620 125 738 1116 84
2541 84 -957 -1177 173 747 988 434 -204 -1090 -982 423 1105 906 -81 -1069 -781 -313 468 1243 523
2560 523 -435 -1164 -705 410 1033 699 388 -500 -1001 -197 894 891 601 -240 -567 -554 138 1265 1191 24
2580 24 -959 -433 -120 599 810 596 -362 -797 -815 553 1262 876 -61 -830 -578 -215 502 1095 501 -643
2600 -643 -1056 -434 205 871 893 72 -949 -996 -345 475 974 495 -334 -948 -762 72 708 567 -327 -934
2620 -934 -577 -222 466 627 257 -489 -1013 -627 393 783 653 -364 -419 -752 -359 342 967 350 -274 -972
$$ packed form
2484a005J63J221P33m50q06o36j53N68P43P87n27j363n37Q69P59O39l10o64r93
2503i62l5O71Q11O62q62o98m29L0P34J134k61p03j114J72P49K59Q50o93j002p58
2523a445O35J179N64n03l82r54k64N86J085N63p56j174k65N11P45O13L78j032
2541H4j041k20J350N74K41n54o38q86J08J405O82j99r87r88K88M68P81P75p20
2560E23r58p29M59J115O23l34l11q88n01Q04J091lk90q41l27J3O92J127p4j167
2580B4r83N26L13P19K11k14r58m35j8J368P09l86r37p69K52L63P17N93n94j144
2600f43m13O22O39O66K2q21j021m7O51Q20M99m79q29o14J86Q34O36j41q94o07
2620i34L57L55O88J61l70p46n24L86J020L90j30j017n5l33L93P01O25o17o24o98
$$ plain form
2640 -972 -374 388 639 908 7 -1212 -1001 -364 604 603 203 -343 -963 -754 185 1000 487 -42 -659 -730 -464
2661 -464 213 833 251 -431 -656 -609 155 565 609 -11 -866 -902 -235 677 393 317 -495 -829 -395 245 913
2682 913 861 332 -500 -634 142 489 1104 464 -140 -412 -545 511 830 869 -259 -298 -935 -444 553 1174
2702 1174 552 -248 -516 -448 537 505 736 281 -484 -212 -121 643 760 171 -132 -600 -515 194 685 567 -126
2723 -126 -411 -382 -142 323 698 410 -262 -722 -153 410 566 254 -313 -635 -592 -449 274 717 188 -737 -275
2744 -275 -155 124 702 488 -21 -810 -287 145 396 252 109 -393 -822 -604 174 599 277 -488 -215 -461
2764 -461 -6 120 333 520 -538 -671 -466 77 358 342 3 -542 -598 -162 531 369 -163 -12 -326 -350 -44
2785 -44 254 191 -67 -548 -436 170 -120 69 157 -149 -448 -431 -18 402 223 -75 -107 -367 -227 303 464 68
$$ packed form
2640i72N98P62K51K69r01j219K11O37R68jm00n46o20K09R39Q15n13n29o17p1K66
2661d64O77O20n82o82k25M7P64M10M4o20q55l6O67R12k84p6q12l34M34O40O68
2682I13n2n29q32j34P76L47O15o40o04k72j33J056L19L9j128l9o37M91R97O21
2702A174o22q00k68O8R85l2K31m55p65K72R1P64J17n89l03m68Q5P09M91j18o93
2723a26k85K9K40M65L75k88o72m60N69N63J56l12n67l22M3J43P23M43n29r25M62
2744b75J20K79N78k14n09p89N23M32K51j44j43n02m29K18P78M25l22p65K73k46
2764d61M55J26K13J87j058j33K05N43K81j6l39n45n6M36O93j62n32J51l14k4L06
2785d4K98o3k58m81J12O06k90J89Q8l06k99J7M13M20j79k98l2k60J40N30J61l96
$$ plain form
2807 68 -277 -271 -110 47 315 233 405 -598 -38 55 455 459 165 19 -252 -72 171 326 236 -193 -275 112 107
2830 107 53 255 101 -183 -513 -218 490 198 219 73 -48 -232 324 330 524 151 -269 91 19 217 140 178
2852 178 205 -179 196 386 101 -188 -374 -155 -348 36 -134 210 129 -79 -244 -129 -28 -236 492 298 25
2873 25 -313 113 -34 170 61 184 -111 -297 -326 230 -104 -164 116 -44 133 -108 13 36 -60 -287 -157 141
2895 141 -117 71 -81 282 -328 -314 -103 -178 -356 -301 20 -14 12 244 11 -173 9 135 70 -151 -42 89
2917 89 -233 77 109 98 -34 49 -31 272 159 -31 25 412 99 32 90 216 -30 -400 39 53 167 139 65 288
2941 288 -254 -311 229 380 38 69 225 63 25 157 420 147 -71 -296 -247 267 216 442 162 162 -160 18
2963 18 500 230 -8 132 -351 -344 -53 239 466 -138 -229 -109 -3 -90 -96 445 39 -286 -212 -151 -38 334 290
$$ packed form
2807F8l45OJ61J57K68q2J72j003N60R3M00Mk94j46k71J80K43J55r0m29q2L87n
2830A07n4K02j54k84l30K95P08k92K1j46j21j84N56OJ94l73m20L60p2J98p7L8
2852A78K7l84L75J90k85k89j86K19j93L84j70L44q1k08j65J15J01k08P28j94k73
2873B5l38M26j47K04j09J23k95j86k9N56l34o0K80j60J77k41J21K3r6k27J30K98
2895A41k58J88j52L63o10J4K11p5j78N5L21l4K6K32k33j84J82J26o5k21J09J31
2917H9l22L10L2j1j32Q3q0L03j13j90N6L87l13o7N8J26k46l70M39J4J14k8p4K23
2941B88n42n7N40J51l42L1J56j62l8J32K63k73k18k25M9N14n1K26k80%l22J78
2963A8M82k70k38J40m83PK91K92K27o04r1J20J06q7oN41m06l25P4O1J13L72m4
$$ plain form
2986 290 -91 -554 -170 489 217 235 -70 -150 -139 143 62 337 32 -208 -326 -217 210 196 182 -87 -168 -470
3008 -470 133 196 333 -132 -264 -182 -158 -63 316 513 -135 -411 -344 -32 323 250 -104 -486 -570 -77 44 149
3030 149 -38 -177 -404 -222 227 -40 419 134 -403 -463 -93 263 444 243 64 -318 -69 129 701 303
3050 303 -217 -403 -384 -97 505 727 149 -463 -686 -313 9 66 390 99 -441 -413 -23 379 434 435 -124 -215
3072 -215 -270 -8 808 568 137 -451 -489 -71 398 642 300 -278 -574 -277 173 520 616 240 -450 -590 -44
3093 -44 348 451 -2 -325 -126 -93 119 369 963 276 -392 -657 -193 331 748 175 -182 -587 -595 -105 550
3114 550 120 180 -490 -573 -202 275 549 329 -146 -794 -313 103 400 423 302 -380 -625 -179 272 200 -96
3135 -96 -146 -572 -462 -205 610 660 -4 -358 -540 -369 247 126 286 -124 -328 26 -59 480 391 19 -406 -519
$$ packed form
2986B90l81m63L84O59k72J8l05q0J1K82q1K75l05k40j18J09M27j4j4k69q1l02
3008d70O03O3J37m65j32Q2K4R5L79J97o48k76O7L12L55p3l54l82q4M93J21J05
3030A49j87j39k27J82M49k67M59k85n37o0L70L56J81k01j79l82K49J98N72l98
3050C03n20j86J9K87O02K22n78o12k23L73L22N7L24k91n40K8L90M02N5Jn59r1
3072b15n5K62Q16k40m31n88l8M18M69K44l42n78k96K97M50L47R6l76o90j40N46
3093d4L92J03m53l23J99L3K12K50N94o87o68k65M64N24M17n73l57m05qM90O55
3114E50m30O0o70q3L71M77K74k20m75o48M81M16K97K3j21o82k45M46M51p2k96
3135i6n0m26J10K57Q15N0o64l54j82J71O16j21J60m10k04L54q5N39q9l72m25j13
$$ plain form
3157 -519 -269 307 758 224 -297 -400 -273 -82 111 396 -103 -452 -426 -163 325 772 250 -217 -795 -395
3177 -395 82 673 667 -424 -396 -479 -61 57 661 508 -174 -612 -235 179 240 473 180 -481 -619 -260 594
3198 594 501 288 -258 -277 -215 71 656 229 276 -496 -609 -147 264 468 418 -52 -539 -468 203 450 572 -59
3220 -59 -279 -633 -123 159 646 539 -193 -431 -181 -120 268 491 -78 -343 -536 -118 421 500 41 57 -401
3241 -401 -437 72 624 393 158 -419 -703 -154 7 652 328 -59 -671 -483 -24 366 121 35 -381 -329 -152
3262 -152 19 255 82 -125 -613 -257 -93 152 516 -38 -299 -661 16 99 452 52 -8 -424 -678 -189 531
3283 531 386 97 -297 -572 -217 313 677 408 -330 -565 -259 -64 461 540 -3 -19 -408 -284 386 453 269
3304 269 26 -414 -417 -5 449 684 195 -197 -447 12 330 607 407 13 -400 -366 -61 529 482 103 -297
$$ packed form
3157e19K50N76M51n34n21j03J27J91J93K85m99l49K6K63M88M47n22m67n78M00
3177c95M77N91oj091K8q3M18J18O04j53o82m38L77M14O1K33k93o61j38L59Q54
3198E94r3k13n46j9O2K86N85m27M7p72j13M62M11K04n0m70m87P1O71K47J22o31
3220e9k20l54N10K82M87j07p32k38K50O1L88K23n69k65j93M18N39P9m59J6m58
3241d01l6N09N52k31k35n77k84N49J61O45l24l87o12J88M59L90k45q6m16N2J77
3262a52J71K36j73k07m88L56J64K45L64n54k61l62O77Q3L53m00o0m16k54M89P20
3283E31j45k89l94k75L55N30L64k69p38k35L06J95N25P9n43j6l89J24O70O7j84
3304B69k43m40lM12M54K35m89l92k50M59L18K77k00l94m13L4L05N90m7l79m00
$$ plain form
3325 -297 -198 -134 -89 301 357 10 -118 -251 47 267 395 115 -232 -194 -317 453 322 -96 -287 -338 -371 86
3347 86 536 490 107 -531 -420 14 107 432 263 -151 -487 -330 -83 390 311 60 -399 -303 -108 100 463 83
3369 83 -236 -417 -379 -228 355 509 266 -191 -526 -208 30 272 94 -244 -346 -199 131 333 313 -242 -179
3390 -179 -230 119 58 212 59 -58 -237 -218 -55 131 27 163 -299 -434 -144 409 47 112 -142 -257 -23
3411 -23 -12 132 437 121 -116 -399 9 24 179 191 247 15 -627 133 123 213 -23 -36 -50 -136 33 319 -51
3434 -51 34 -41 -216 108 104 201 73 -131 -111 -72 122 437 72 191 -105 -29 125 128 108 79 -114 -189 -193 386 -11
3459 -11 219 -34 -102 -34 151 123 126 -36 -156 102 -227 375 85 -88 166 4 -88 -2 63 94 64 -254 -99 154
3483 154 -90 106 1 -58 42 -16 -49 354 -12 -21 -65 126 -9 266 35 -117 69 43 -156 249 31 199
$$ packed form
3325b97R9O4M5L90N6l47j28j33K98K20J28k80l47L8j23P70j31m18j91n1l3M57
3347H6M50m6l83o38J11M34R3L25j69m14l36J57K47M73p9k51m59R6J95K08L63l80
3369H3l19j81L8J51N83J54k43m57l35L18K38K42j78l38j02J47L30K02k0n55O3
3390a79n1L49o1J54j53j17j79J9J63J86j04J36m62j35K90N53l62O5k54j15K34
3411b3J1J44L05l16k37k83M08J5J55J2N6k32o42P60j0R0k36j3j4q6J69K86l70
3434e1Q5p5j75L24mR7j28k04K0L9J94L15l65J19k96P6J54Lk0k9j93p5mN79l97
3459a1K30k53o8O8J85k8Lj62j20K58l29O02k90j73K54j62r2Q6O5L1l0l18J55K53
3483A54k44J96j05n9J00n8l3M03l66rm4J91j35K75k31j52J86k6j99M05k18J68
$$ plain form
3505 199 -132 -228 -307 -300 207 -34 31 -103 72 40 -47 -13 -11 -38 -96 -62 181 -102 53 -198 60 39 97 -21 173
3530 173 155 -211 7 -123 187 -217 223 220 -11 23 96 1 -324 -30 -132 21 -94 -163 -7 -207 -338 -2
3552 -2 343 -130 234 128 -318 253 127 361 162 -182 -4 -59 104 -88 65 -124 -57 -199 82 8 134 309
3574 309 -47 202 -79 -136 96 -29 142 -29 128 258 -97 493 -10 -52 -66 -74 -72 66 5 -86 87 -49 -212
3597 -212 144 160 106 -87 25 -129 -20 99 120 126 -185 -397 -66 136 202 177 -31 90 -233 72 329 30
3619 30 -234 -222 102 -144 92 184 -41 -144 -272 187 245 260 439 25 -21 51 111 165 -220 -229 145 -169 -163 56
3643 56 69 205 106 -77 -176 -109 79 160 151 123 -423 -278 234 111 -65 56 -232 -207 -282 198 406 -26 -152 -335
3667 -335 90 150 271 186 -51 -453 -243 -45 24 245 65 28 -107 -188 80 -85 230 -537 -188 -45 -78 100
$$ packed form
3505A99l31r6p9PN07k41O5j34J75l2q7L4Kk7n8L4K43k83J55k51K58k1N8j18J94
3530A73j8l66K18j30L10m04M40lk31L4P3r5l25K94j02J53j15o9J56k00j31L36
3552bL45m73L64j06m46N71j26K34j99l44J78n5J63j92J53j89O7j42K81p4J26J75
3574C09l56K49k81n7K32j25J71j71J57J30l55N90n03m2j4qKJ38o1r1J73j36j63
3597b12L56J6n4j93J12j54J09J19K1Ol11k12L31K02O6k5k08J21l23L05K57k99
3619C0k64J2L24k46K36R2k25j03j28M59N8J5J79m14m6P2O0N4l85rL74l14OK19
3643E6J3J36r9j83r9O7J88Q1rk8n46J45N12j23j76J21k88K5p5M80K08m32j26j83
3667c35M25O0J21q5k37m02K10J98O9K21j80l7j35q1K68j65L15p67L49J43l3J78
$$ plain form
3689 100 177 244 -73 -43 -216 283 337 106 216 -83 -203 -194 107 127 -27 93 -419 -240 127 288 230 80 -231
3712 -231 -46 139 371 356 481 -46 -479 -509 120 467 11 -161 -156 -229 106 277 266 152 -163 -127 -218 156 6
3735 6 337 -170 -416 -369 -59 148 296 -148 8 -2 -1 40 370 162 -130 -96 -52 -105 541 389 168 -228 -164 9
3759 9 107 281 148 -130 31 -380 -1 2 525 119 -245 -455 -433 -112 -122 393 -62 -635 -263 -77 224 93
3781 93 228 -307 -301 -148 203 201 411 -36 -367 -401 -108 116 82 272 -172 -337 -205 67 427 363 -15 -151 -66
3804 -66 -47 310 419 270 63 -279 -162 49 242 63 206 -112 -127 7 347 444 58 -220 -537 -52 193
3825 193 146 198 -61 -297 -104 273 285 310 316 -27 -291 -388 246 272 125 -76 -395 63 5 290 414 270 -271
3848 -271 -96 -347 240 401 424 210 -198 -246 -17 319 243 28 -162 -258 -82 172 304 585 -21 -276 -246 -188
$$ packed form
3689A00P7O7l17L0j73M99N4k31J10k99j20RL01K0j54J20n12J79L67J61n8j50l11
3712b31J85J85K32j5J25n27m33l0O29L47m56j72Np3L35J71j1j14l15L6r1L74j50
3735FL31n07k46M7L10K07J48m44J56j0JM1L30k08k92L4M4n3O46j52k21l96O4J73
3759IR8J74j33k78J61m11L79LN23m06l64k10K2L21j0N15m55n73L72J86L01j31
3781I3J35n35OJ53L51kK10m47l31l4K93K24l4J90m44j65J32K72L60o4l78j36Q5
3804f6J9L57J09j49k07l42J17K11J93j79J43l18j5J34L40R7l86k78l17M85K45
3825A93m7N2k59k36J93L77J2K5Ol43k64r7O34K6j47k01l19M58n8K85J24j44n41
3848b71J75k51N87J61K3k14m08m8K29L36p6k15j90r6J76K54J32K81o06k55L0N8
$$ plain form
3870 -188 17 205 184 -79 -552 -297 -196 339 -163 -38 -430 -272 -34 380 190 199 -8 -316 76 -46 216
3891 216 150 -125 -299 21 -160 153 147 53 -319 -486 -279 100 60 263 -71 -184 -417 1 50 91 172 -72 -373
3914 -373 -58 273 255 284 98 -182 -215 -93 302 152 -16 -129 -237 -90 331 754 565 106 -80 -39 -162
3935 -162 277 498 -218 -239 56 -210 261 155 210 -225 41 21 -111 7 262 -118 -137 -20 -305 -105 629
3956 629 175 -50 -249 28 -28 374 277 -133 -289 -289 -119 68 254 420 -247 -378 -122 -88 174 139 -115 -394
3978 -394 -194 -82 155 146 282 37 -522 -43 203 191 272 222 -346 -131 -321 44 314 -133 -30 -183 -275 151
4000 151 -101 144 -1 -32 -31 -81 18 191 104 -62 -71 -432 276 183 43 -47 -125 -327 -138 -93 -47 -183 15 -184
4024 -184 -415 -89 67 110 68 -214 -295 -37 -12 158 401 -68 -301 -198 -22 4 233 -70 66 325 70 -77
$$ packed form
3870a88K05J88k1k63m73K55J01N35n02J25l92J58K38M14j90Rk07l08L92j22K62
3891B16o6k75j74L20j81L13or4l72j67K07L79m0K03l34j13k33M18M9M1Q1k44l01
3914c73L15L31j8K9j86k80l3J22L95j50j68j13j08J47M21M23j89m59j86M1j23
3935a62M39K21p16k1K95k66M71j06N5m35K66k0j32J18K55l80j9J17k85K00P34
3956F29m54k25j99K77n6M02r7m10j56%J70J87J86J66o67j31K56L4K62l5k54k79
3978c94K00J12K37rJ36k45n59M79K46j2Q1n0n68K15j90L65K70m47J03j53r2M26
4000A51k52K45j45l1Jn0R9J73q7j66rl61P08r3j40r0p8k02J89M5M6j36J98j99
4024a84k31L26J56M3m2k82q1K58K5J70K43m69k33J03J76K6K29l03J36K59k55j47
$$ plain form
4046 -77 0 138 265 -135 -1 153 202 41 148 -20 -23 -37 215 134 219 -87 111 31 -203 255 293 358 -98 -250
4070 -250 -239 44 234 -10 161 3 -127 -175 5 235 1 283 116 69 -61 289 76 76 2 -29 101 275
4092 275 -227 -9 243 -211 -200 -7 31 -3 14 -50 23 -55 123 -133 -35 -107 -132 -288 230 -53 271 -60 43
4115 43 -105 -278 39 -186 -173 -225 -173 -84 -126 41 182 116 -14 152 -113 13 187 -56 64 87 -24 -135 201
4138 201 62 -247 -256 -74 105 -160 -104 41 -140 -91 110 280 -89 -157 55 14 -23 -105 41 296 119 65 -68
4161 -68 -41 -157 -69 335 40 256 -186 195 2 -85 134 85 -149 57 75 204 71 107 -243 -25 445 -224
4183 -224 204 -304 -79 116 81 165 -117 -171 -80 -178 -290 -84 -202 46 -152 -54 -52 36 -132 -87 90 -106 13
4206 13 292 -61 137 -48 -106 219 58 197 120 -134 -13 232 328 130 67 -16 -31 -48 28 -141 191 -12 -197
$$ packed form
4046g7P7J38J27m00J34J54M9j61J07j68lj4K52q1Q5l06J98q0k34M58L8O5m56j52
4070b50J1K83J90k44J71j58j30m8J80K30k34K82j67m7j30L50k13%p4l1J30J74
4092B75n02K18K52m54J1J93L8l4J7o4P3p8J78k56R8p2k5j56N18k83L24l31J03
4115D3j48j73L17k25J3n2N2Q9m2J67J41o6j30J66k65J26J74k43J20K3j11j11L36
4138B01j39l09rJ82J79k65N6J45j81M9K01J70l69o8K12m1l7q2J46K55j77n4j33
4161f8K7j16Q8M04k95K16m42L81j93q7K19m9k34K06J8J29j33L6l50K18M70o69
4183b24M28n08K25J95l5Q4k82n4R1r8j12K06j18K48j98R8KQ8j68M5J77j96J19
4206A3K79l53J98j85n8L25j61J39p7k54J21K45R6j98o3q3j5j7P6j69L32k03j85
$$ plain form
4229 -197 -121 -210 231 -204 181 54 -161 53 245 -1 132 179 -336 -26 -50 -109 305 -19 -216 -245 -269 107
4251 107 -12 29 -106 -69 -38 -285 -7 87 -19 155 0 -182 -15 265 16 21 23 -153 -448 -222 120 -52 165
4274 165 -202 172 264 285 70 -147 -14 -276 274 391 104 303 -161 -120 43 98 -105 184 -92 335 233
4295 233 -26 111 273 135 137 -255 153 359 431 27 -238 -225 131 -123 103 130 125 -68 -271 -69 131 104 -3
4318 -3 -330 35 -244 222 266 295 44 -321 -200 -267 113 262 164 -168 -50 73 344 -110 23 206 -2 -109
4340 -109 12 -126 81 -42 26 -207 -6 56 254 234 252 -123 -108 -125 100 45 244 -182 -335 -211 -38 -185
4362 -185 89 -11 -55 -51 -129 126 180 430 -37 -284 71 -44 165 94 -59 -248 17 37 350 -142 35 241
4384 241 -348 -58 -115 171 -105 348 -268 -29 -12 65 131 233 62 -151 -98 63 425 338 29 -135 -229 -147 311
$$ packed form
4229a97P6q9M41m35L85j27k15K14J92k46J33M7n15L10k4n9M14l24j97k9k4L76
4251A07j19M1j35L7L1k47K78R4j06J74j55j82J67K80k49NKj76k95K26L42j72K17
4274A65l67L74R2K1k15k17J33k62N50J17k87J99m64M1J63N5k03K89k76M27j02
4295B33k59J37J62j38Kl92M08K06P2m04k65J3L56k54K26K7nj93k03K02K00k7j07
4318cl27L65k79M66M4K9k51l65J21o7L80J49r8l32J18J23K71m54J33J83k08j07
4340a09J21j38K07j23O8k33K01O2J98k0J8l75J5j7K25n5J99m26j53J24J73j47
4362a85K74j00m4Mp8K55N4K50m67k47L55j15K09p1j53j89K65K0L13m92J77K06
4384B41n89K90n7K86k76M53o16K39J7P7O6J02j71k13N3J61L62q7l09j64r4Q2M58
$$ plain form
4407 311 151 239 -275 -248 75 140 140 208 75 79 -17 -205 286 146 215 126 -95 -238 -236 32 121 -33 74 101 61
4432 61 149 248 183 -145 -122 191 473 135 50 92 -186 -279 -303 265 407 -189 -236 -113 -55 112 81 104 177 -310 -390
4457 -390 160 399 150 15 205 -186 -2 165 142 291 -109 -344 -195 -24 91 224 332 128 -392 -51
4477 -51 -41 522 35 -77 -29 41 -102 235 92 34 67 314 -227 -147 198 167 -75 -140 -155 -192 235 131 178 195
4501 195 22 -331 5 143 112 80 -19 -59 -69 45 168 398 68 -86 -197 -175 -141 79 -268 -105 -343 117
4523 117 177 208 297 -191 -162 -303 -115 15 195 -80 -135 -107 63 143 141 -131 -326 -393 8 37 176 98 167 -223
4547 -223 -162 -92 173 38 78 -28 -55 -181 32 293 202 22 -94 -320 -260 456 17 110 91 -382 11 -29 403
4570 403 78 -70 -56 -123 -40 98 332 -11 58 -271 -335 78 104 228 -291 137 -72 -100 -162 9 343 82 -140
$$ packed form
4407C11j60Q8n14K7L23O5%O8j33Mr6j88M91j40O9q9k21j43KK68Q9j54J07K7m0
4432F1Q8R9o5l28K3L13K82l38q5M2k78r3k4N68J42n96m7J23N8J67l1K3P3m87q0
4457c90N50K39k49j35J90l91J84J67k3J49m00k35J49J71J15J33J08k04n20L41
4477e1J0N63m87j12M8P0j43L37j43n8L3K47n41Q0L45l1k42o5j5l7M27j04M7J7
4501A95j73l53L36J38l1l2r9m0j0J14J23K30l30j54j11K2L4K20l47J63k38M60
4523A17O0L1Q9m88K9j41J88J30J80k75n5K8J70Q0kk72j95o7M01K9J39p8O9l90
4547b23O1P0K65j35M0j06k7j26K13K61r1j80j16k26O0P16m39R3j9m73L93m0M32
4570D03l25j48J4o7Q3J38K34l43O9l29o4M13K6J24n19M28k09k8o2J71L34k61k22
$$ plain form
4593 -140 -53 -31 260 153 159 16 -166 -224 120 -4 216 -114 -119 -179 -133 54 -154 277 79 -16 162 34 72 69
4617 69 -174 -161 -98 183 -292 62 -102 9 -102 49 263 271 122 -159 -207 35 -356 -4 186 158 -130 -251
4639 -251 -10 146 -42 304 -259 -64 -15 -130 215 43 432 -45 46 -157 145 178 -67 4 -214 -165 107 -219
4661 -219 -67 -249 166 208 94 429 -118 163 5 -130 -175 161 253 206 -26 152 -16 -25 328 -11 -176 -106
4683 -106 81 -212 -189 155 167 -63 36 -89 -67 -114 72 106 -206 14 -144 88 312 54 327 -55 47 -279
4705 -279 75 -311 2 388 149 -87 76 107 2 -217 -73 -48 69 92 85 132 -20 34 -98 85 19 69 -44
4728 -44 -102 -76 -196 -209 59 112 -146 -174 169 -30 19 -105 -296 -18 230 -99 -196 -6 120 -58 93 -39 -294
4751 -294 -109 -7 10 226 -129 2 -1 -248 318 -272 115 37 -81 -233 -130 -140 86 -14 83 -149 116 47
$$ packed form
4593a40Q7K2K91j07Oj43j82n8L44j24K20l30no0M6J87k08M31j98r5J78j28L8l
4617F9k43J3O3K81m75L54j64J11j11J51K14Qj49k81m8K42l91L52J90k8k88j21
4639b51K41J56j88L46n63J95M9j15L45j72L89m77R1k03L02L3k45P1k18M9K72l26
4661b19J52j82M15M2j14L35n47K81j58j35m5L36R2m7k32J78j68rL53l39j65P0
4683a06J87k93K3L44J2k30R9j25K2m7J86L4l12K20j58K32K24k58K73l82J02l26
4705b79L54l86L13L86k39k36J63L1j05k19J44K5J17K3pM7j52N4j32J83o6N0j13
4728d4n8K6j20j3K68N3k58k8L43j99M9j24j91K78K48l29r7J90J26j78J51j32k55
4751b94J85J02J7K16l55J31lk47N66n90L87p8j18j52J03j0K26j00R7k32K65o9
$$ plain form
4773 47 -63 -23 -368 -185 13 -84 60 376 45 -193 182 129 -209 -117 53 119 139 119 -8 -139 -119 -66 -8 282
4797 282 62 57 -141 52 167 168 44 2 29 72 85 210 -16 137 -132 34 84 -14 45 -140 164 116 190 105 -93
4822 -93 109 -129 -125 -404 101 70 -115 58 -121 -56 -194 -12 147 -121 -112 109 42 182 -127 -254 -9 131 -143
4845 -143 151 -38 338 -111 78 -250 -59 -81 -108 -38 -115 227 28 147 293 50 162 -126 -56 -25 156 -190
4867 -190 208 231 -82 -22 35 -69 -192 88 156 -110 -36 -149 52 -335 -277 -175 116 117 -191 260 114 173 -67
4890 -67 5 120 16 -10 182 -195 187 101 178 -53 -22 -14 -281 9 -11 180 91 -41 -138 66 176 90 -120 300
4914 300 -276 35 -69 38 159 74 -42 -161 160 -220 238 -227 -67 88 -34 243 37 98 -87 -190 -346
4935 -346 -76 -34 -24 -24 -97 -144 -50 93 87 35 7 66 -162 138 121 54 81 -297 -158 -179 -82 97 137 253 96 3
$$ packed form
4773D7j10M0l45J83J98r7J44L16l31k38L75n3l38R2J70O6K0k0j27j31K0N3N8K90
4797B82k20nj98J93J15Jj24m2K7M3J3J25k26J53k69J66N0r8N9j85L04m8P4q5j98
4822i3K02k38Mk79N05l1j85J73j79O5j38J82J59k68RK21o7J40l09j27K45J40k74
4845a43K94j89L76m49J89l28J91k2k7P0p7L42j99J19J46k43J12k88P0L1J81l46
4867a90L98K3l13O0N7j04j23K80O8k66P4j13K01l87N8J02K91Jl08M51j46N9k40
4890f7P2J15j04k6J92l77L82q6P7k31L1Qk67K90k0J91q9j32r7K04J10q6k10M20
4914C00n76L11j04J07J21q5j16j19L21l80M58m65J60J55j22K77k06O1j85j03j56
4935c46K70M2J0%p3m7R4J43on2k8N9k28L00j7o7K7l78J39k1R7J79M0J16j57r3
$$ plain form
4961 3 -111 333 44 32 6 23 -282 140 481 -40 -32 -401 -189 -1 332 112 253 -152 -162 -124 199 250 13
4984 13 157 -2 -20 -159 -97 -89 -188 192 -45 -156 134 -40 48 175 -41 38 154 200 198 -210 344 10 65 77
5008 77 230 23 22 -86 -311 -74 -15 -50 254 7 -237 -115 -1 85 -12 -133 -162 25 2 123 191 -18 -66 -11
5032 -11 -108 136 191 -58 -219 -120 -117 216 135 -6 187 44 -150 -247 -140 189 209 -232 -138 -51 -423 84 230 -343
5056 -343 152 -344 -314 99 295 -154 -76 76 -194 238 81 186 123 -153 -182 -30 134 218 29 -169 97 152
5078 152 114 50 110 121 94 -241 -468 59 219 146 -57 -304 -117 -290 360 220 189 20 78 -32 -144 188 119
5101 119 153 -73 -190 11 147 161 -147 -94 -191 -76 405 191 107 -147 -81 -13 -158 207 368 -81 147 24
5123 24 14 -210 460 69 -58 -135 -165 37 -39 307 36 -26 118 -8 39 215 53 45 -27 -190 -188 -290 179 68
$$ packed form
4961Cj14M44k89j2k6J7l05M22L41n21Ql69K12J88L33k20J41m05j0L8L23N1k37
4984A3J44j59j8j39O2Qr9L80k37j11K90j74Q8J27k16P9J16M6km08N54l34N5J2
5008G7J53k07jj08k25K37N9l5L04k47k44J22J14Q6r7j21k9J87k3J21O8k09m8N5
5032a1r7K44N5k49j61R9LL33q1j41J93j43j94r7J07L29K0m41R4Q7l72N07J46n73
5056c43M95m96L0M13J96m49P8J52k70M32j57J05o3k76k9J52J64Q4j89j98K66N5
5078A52l8o4O0J1k7l35k27N27J60p3k03k47J87j73O50j40l1j69N8j10j12L32o9
5101A19L4k26j17K01J36J4l08N3r7J15M81k14q4k54O6O8j45L65J61m49K28j23
5123B4j0k24O70l91j27p7l0K02p6L46k71o2J44j26M7J76j62qp2j63Kj02M69j11
$$ plain form
5147 68 195 -57 -92 530 -25 45 -97 -93 -259 92 210 242 219 -117 13 2 145 -277 46 -84 46 -53 197
5170 197 269 196 64 -24 -194 -140 -14 21 352 59 -104 -230 -48 242 32 282 111 -354 -303 -87 270 94
5192 94 13 24 215 210 197 -83 244 -74 -14 16 120 -14 171 -186 56 -97 -67 112 19 -32 -139 90 -24 248
5216 248 77 166 -57 -154 -390 -181 96 -50 58 187 -185 -32 232 352 87 11 -55 124 2 73 36 164
5238 164 12 -40 -196 -119 -20 104 123 -95 66 16 -16 -4 -6 -65 -209 266 47 157 61 251 -115 -46 129 30
5262 30 236 30 -222 -189 -65 111 -27 392 -243 -75 -299 92 -200 203 12 -73 101 101 70 267 29 -22
5284 -22 -72 126 -266 -128 191 -177 -278 -212 278 -132 -123 114 127 -283 24 -57 -123 -65 165 -89 117 -46 -90
5307 -90 392 140 247 -122 -295 -49 69 -28 146 48 55 110 241 428 65 0 -241 -91 48 -64 179 6
$$ packed form
5147F8J27k52l5O22n55P0j42Mj66L51J18L2k3l36J30j1J43m22L23j30J30r9K50
5170A97P2p3j32q8j70N4J26L5L31k93j63j26J82K90k10K50j71m65N1K16L57j76
5192I4q1J1J91nj3k80L27l18O0L0J04j34J85l57K42j53L0J79r3n1j07K29j14K72
5216B48j71Q9k23r7k36K09K77j46J08J29l72J53K64J20k65p6o6J79j22P1l7J28
5238A64j52n2j56P7R9J24J9k18J61n0l2J2kn9j44M75k19J10r6J90l66O9J75r9
5262C0K06k06k52L3J24J76j38M19o35J68k24L91k92M03j91q5J74%l1J97k38n1
5284b2n0J98l92J38L19l68j01O6M90m10RK37J3m10L07q1o6N8K30k54K06j63m4
5307i0M82k52J07l69j73K46J18r7J74r8PN5J31J87l63o5k41J50J39j12K43j73
$$ plain form
5329 6 -83 106 -151 315 181 78 149 -172 8 187 164 116 207 -63 121 27 170 237 30 41 -135 22 170
5352 170 0 171 351 -321 -29 451 134 172 139 -242 -57 -41 21 132 41 -24 25 36 -313 -107 91 -1 63
5375 63 -86 30 91 226 44 -99 268 185 -246 -6 72 -17 63 -85 128 -52 122 260 -25 18 -69 117 -7
5398 -7 -237 50 230 -31 30 252 204 -110 -73 -100 217 -126 101 -47 -16 29 -110 -88 -31 76 -189 12 -17 -159
5422 -159 302 168 2 -47 -233 -110 -72 87 -47 36 152 219 62 -307 -116 -7 73 7 -34 -49 -27 203 47
5445 47 -48 -10 285 -78 -418 16 -55 54 -74 184 98 -218 60 -32 102 -2 174 -76 -21 109 -53 -118 33
5468 33 105 -118 221 -168 177 243 46 -124 42 -45 74 -131 155 -147 36 107 73 -7 -351 -255 51 -55 41
5491 41 21 -27 22 -228 81 80 -163 -190 -134 -22 33 -163 -109 -64 230 -86 -10 39 202 115 -134 -178 -10 -100 24
$$ packed form
5329Fq9J89k57M66j34j03P1l21J80J79k3m8R1k70J84r4J43O7k07J1j76J57J48
5352A70j70J71J80o72K92M80l17L8l3l81J85J6O2J11r1o5M9J1l49K06J98r2O4
5375F3j49J16O1J35j82j43L67q3m31K40P8q9Q0j48K13j80J74J38k85M3q7J86j24
5398gk30K87J80k61O1K22m8l14L7k7L17l43K27j48L1M5j39K2N7J07k65K01k9j42
5422a59M61j34j66m9j86J23L8J59j34Q3J16O7j57l69J91J09Q0o6m1j5K2K30j56
5445D7r5L8K95l63l40M34p1J09j28K58q6l16K78r2J34j04J76k50N5J30j62o5J51
5468C3P2k23L39l89L45O6j97j70J66q7J19k05K86l02J83P1l4q0l44R6L06j06R6
5491D1k0m8M9k50L09jk43k7N6J12N5j96N4M5K94l16P6M9J63q7k49m4J68r0J24
$$ plain form
5516 24 -256 -22 34 50 -114 61 37 -267 -167 22 -87 -21 -156 -107 -60 -128 33 -274 74 133 -55 -297 -1
5539 -1 -164 -16 -126 87 -118 -36 159 40 168 56 63 178 30 93 -69 25 -99 -123 -150 -108 172 148 186 -122
5563 -122 -257 262 156 108 -263 165 -83 144 179 13 -25 -135 -264 48 54 205 -53 -69 -73 -9 109 206 -74
5586 -74 -273 -13 -404 -98 9 -106 263 -184 32 23 -21 92 146 -224 -213 -252 -165 187 290 146 30 50 -140
5609 -140 66 64 -24 -153 -116 -258 35 49 242 -273 140 -38 -153 72 256 174 -95 -191 -130 -159 -13 229 78
5632 78 22 -271 -160 -140 89 -78 -314 -184 6 257 142 251 -26 -213 279 -180 212 105 2 9 -334 -310
5654 -310 -5 86 149 -3 -4 -16 -92 -99 73 50 -391 -255 49 80 369 239 -79 0 -29 -317 -135 49 197 51
5678 51 -60 206 104 45 344 -199 -33 54 41 -90 126 122 38 38 -82 169 32 -69 36 -37 49 42 -39 283 204
$$ packed form
5516B4k80K34N6J6j64J75k4l04J00J89j09O6j35M9M7o8J61l07L48N9j88k42K96
5539aj63J48j10K13k05Q2J95j19J28j12PJ15j48O3j62R4j24k4k7M2K80k4L8l08
5563a22j35N19j06m8l71M28k48K27L5j66l8j10j29L12OJ51k58j6mO4J18R7k80
5586g4j99K60l91L06J07j15L69m47K16rm4J13N4l70J1l9Q7L52J03j44j16K0j90
5609a40K06kq8j29L7j42K93J4J93n15M13j78j15K25J84q2k69r6O1k9J46K42j51
5632G8n6k93J11K0K29j67k36J30J90K51j15J09k77j87M92m59L92j07j03Pl43K4
5654c10L05R1O3j52jj2p6pJ72k3m41J36L04L1K89j30l18P9k9k88J82J84J48j46
5678E1j11K66j02n9K99n43J66Q7j3j31K16mq4%j20K51j37j01J05p3Q6pq1L22p9
$$ plain form
5703 204 -129 -99 -57 32 43 91 32 4 -35 7 150 -33 -10 -87 106 -71 -163 -259 -115 119 -424 -39 167 -114
5727 -114 -201 -206 -409 -54 -11 39 -41 -124 -130 -69 15 177 0 144 -303 -28 -245 19 -97 20 -83 -272 -146 -24
5751 -24 205 14 -44 125 5 -293 103 96 114 -58 -112 -346 143 -87 -89 -24 302 -1 4 -96 153 117 -201 86
5775 86 100 -189 -18 97 -52 40 97 -81 -288 -6 47 -82 -46 -244 -95 15 -21 48 81 -167 58 199 204 165
5799 165 -149 13 -153 28 -66 245 -219 153 -146 -205 203 297 -281 268 -14 80 168 -216 -134 -363 218 188
5821 188 -117 51 266 271 161 -492 122 77 59 -229 -79 -5 -7 58 167 -9 233 144 76 -44 -71 -51 -35 176
5845 176 -160 -59 -247 4 223 -20 -57 308 5 -42 205 119 -10 70 190 -91 -314 63 -110 -219 -55
5866 -55 -34 56 136 46 162 53 -423 -4 38 -119 -214 -32 -102 -215 171 -116 43 60 82 78 -53 116 115 121 35 138
$$ packed form
5703B04l33L0M2Q9J1M8n9k8l9M2J43j83K3p7J93j77r2r6J44K34n43L85K06k81
5727a14q7nk03L55M3N0q0q3oO1Q4J62j77J44m47K75k17K64j16J17j03j89J26J22
5751b4K29j91n8J69j20k98L96pJ8j72n4k34M89k30kO5L26l03Nj00K49l6l18K87
5775H6J4k89J71J15j49R2N7j78k07K82N3j29L6j98J49J10l6O9L3k48K25J41Nl9
5799A65l14J62j66J81r4L11m64L72k99n9M08R4n78N49k82R4Q8l84Q2k29N81l0
5821A88l05J68K15Nj10o53O14m5j8k88J50P4kO5J09j76K42q9o8j20k7K0J6K11
5845A76l36J01j88K51K19k43l7L65l03m7K47q6j29Q0J20k81k23L77j73j09J64
5866e5K1R0Q0r0J16j09m76M19M2j57r5J82p0j13L86k87J59J7K2mj31J69jOq6J03
$$ plain form
5892 138 -277 90 193 -55 149 131 2 -159 196 -5 175 269 156 -135 38 -126 128 23 42 -25 -278
5913 -278 115 73 39 -219 -310 309 -255 -22 -61 -282 -97 296 -160 120 -51 107 158 126 134 -255 91 -230 126
5936 126 184 -82 -251 -169 62 339 48 56 252 74 118 81 140 65 -167 26 -172 261 -164 -38 203 89 -78
5959 -78 42 36 15 50 29 198 339 187 -40 -59 135 69 51 -157 -235 25 181 -114 283 175 242 33 -281 -64
5983 -64 29 65 -152 307 55 129 -30 -120 64 -135 1 26 150 69 -43 -135 -26 -126 119 39 119 141 -150 14
6007 14 -283 103 76 -115 2 -68 3 166 46 41 186 38 191 -206 -154 -165 -127 -396 255 116 -162 206 147
6030 147 -61 -25 43 166 -73 -17 84 -162 57 -57 -24 -199 -25 -154 -41 57 -108 153 98 0 -67 80 152
6053 152 -7 -160 -250 -228 -170 -42 -111 126 119 -340 148 -16 79 23 -42 -194 136 47 -15 118 -170 -58 -159 48
$$ packed form
5892A38m15L67J03k48K04j8j29j61L55k01J80R4j13k91J73j64K54j05J9o7k53
5913b78L93m2l4k58r1O19n64K33l9k21J85L93m56K80j71J58N1l2Ql89L46l21L56
5936A26N8k66j69Q2K31K77k91QJ96j78M4l7N9p5k32J93j98M33m25J26K41j14j67
5959g8J20ok1L5k1J69J41j52k27j9J94o6j8k08p8K60J56k95L97j08O7k09l14K17
5983f4R3L6k17M59k52P4j59r0J84j99J36K5J24q1j12r2J09j00K45q0Q0K2k91J64
6007A4k97L86k7j91J17p0P1J63j20nJ45j48J53l97N2j1L8k69O51j39k78L68n9
6030A47k08L6O8J23k39N6J01k46K19j14L3j75J74j29J13R8j65K61n5r8o7J47P2
6053A52j59j53r0K2N8J28o9K37pm59M88j64R5n6o5j52L30q9o2J33k88J12j01K07
$$ plain form
6077 48 -18 33 -144 145 158 -40 -64 -283 253 7 -254 -4 -13 73 -81 -41 103 100 -42 -165 50 69 -7 -253
6101 -253 242 3 -65 6 -17 371 136 195 174 -151 -201 191 -73 152 16 -199 189 93 -252 -20 37 -276 47
6124 47 -263 -153 19 19 51 -148 -129 -193 -44 0 178 -168 155 304 -69 -94 -126 110 -133 -126 92 -52 -6 -1 -41
6149 -41 -114 261 -236 -88 420 -135 400 227 -81 54 -60 227 -144 -269 98 130 -8 37 280 175 -150
6170 -150 83 107 -15 -19 -50 -159 8 111 29 157 -21 -222 -5 98 -165 343 203 -199 -1 40 -154 25
6192 25 -27 12 50 18 360 -41 176 112 53 87 151 -41 99 -183 -43 143 215 294 -47 18 120 -105 -16 165
6216 165 -167 -37 241 59 -248 -296 269 92 149 203 85 317 -160 415 -74 468 -102 -64 -58 -353 62 180
6238 180 -105 -72 -2 39 83 -119 170 -23 -172 77 -42 104 -141 -133 -105 -140 -128 -109 -40 153 -181 -64 88 -96
$$ packed form
6077D8o6N1j77K89J3j98k4k19N36k46k61K50rQ6j54M0J44lj42j23K15J9p6k46
6101b53M95k39o8P1k3L88k35N9k1l25n0L92k64K25j36k15L88r6l45K32N7l13L23
6124D7l10J10J72%L2j99J9o4J49M4J78l46L23J49l73k5l2K36k43PK18j44M6Nm0
6149d1p3L75m97J48N08n55N35j73l08J35j14K87l71j25L67L2j38M5K43j05l25
6170a50K33K4j22ml1j09J67J03q2J28j78k01K17J03k63N08j40m02J98M1j94J79
6192B5n2L9L8l2L42m01K17o4n9L4O4j92J40k82J40J86P2P9l41O5J02k25Q9J81
6216A65l32J30K78j82l07m8N65j77N7N4j18K32m77N75m89N42n70L8Ok95M15J18
6238A80k85L3P0M1M4k02K89j93j49K49j19J46k45QK8l5J2J9O9J93l34J17J52j84
$$ plain form
6262 -96 93 -58 -148 279 265 -231 -51 174 -50 -158 -47 10 -273 -32 356 57 -86 51 5 -99 -169 5
6284 5 72 205 -90 30 -233 -173 -137 -98 259 264 54 221 -73 59 130 92 141 245 75 62 92 92 154 -110 306
6309 306 29 258 -325 66 256 32 174 -33 -254 159 -39 76 110 4 210 -24 -158 81 -37 32 117
6330 117 -98 159 -153 179 -105 -89 -130 65 216 -73 231 -41 -14 -148 -298 108 -12 94 77 -230 -56
6351 -56 69 -176 3 109 113 52 70 -50 -31 -132 -7 74 -264 -71 61 73 296 -153 -88 -102 -234 -48 95
6374 95 -8 -231 24 -89 -130 86 -133 -183 424 -58 52 -288 183 396 63 133 -455 -65 11 -9 140 209
6396 209 273 -9 50 40 39 140 39 111 31 148 5 -172 -25 -3 18 57 121 162 27 -270 103 -73 59 345
6420 345 148 47 150 -198 -54 34 96 192 -162 229 106 -206 -170 -40 -92 67 -155 -288 -150 308 -29 -325
$$ packed form
6262i6J89j51r0M27j4m96J80K25k24j08J11N7k83K41L88k99j43J37m6j04p0J74
6284EO7J33k95J20k63O0L6L9L57Nk10J67k94J32P1l8M9J04j70j3L0%O2k64M16
6309C06k77K29n83L91J90k24J42k07k21M13j98J15L4j06K06k34j34K39j18O9Q5
6330A17k15K57l12L32k84J6m1J95J51k89L04k72K7j34j50M06j20J06j7l07J74
6351e6J25k45J79J06Mo1J8j20J9j01J25Q1l38J93J32J2K23m49O5j4j32J86J43
6374I5j03k23K55j13m1K16k19n0O07m82J10l40M71K13l33P0n88L90P6k0J49O9
6396B09O4k82N9j0jJ01j01P2q0J17j43j77J47K2K1L9O4M1j35k97L73j76J32K86
6420C45j97j01J03l48J44Q8O2R6l54L91j23l12L6J30n2J59k22j33J38M58l37k96
$$ plain form
6442 -325 302 -215 187 -74 -27 137 -18 -20 22 95 143 14 118 -364 -126 -110 -133 -43 -219 -7 -119 287 46
6465 46 -31 -250 -19 -42 -47 -145 -307 178 -100 184 122 116 75 -318 201 116 -154 252 127 102 148 -14 151 -31
6489 -31 151 -20 -81 312 281 125 -108 -36 -137 152 -144 -1 274 0 232 11 -52 90 15 -46 -14 0 -107
6512 -107 -168 -126 -47 158 148 194 -121 54 210 12 -131 -108 420 -127 356 149 261 -155 -155 58 83 164 -139
6535 -139 127 -30 -55 277 -13 7 175 279 57 -185 208 -1 -94 -181 155 -10 -74 -291 202 393 -159 54
6557 54 361 106 -22 -110 81 -30 -20 21 21 -225 31 -48 20 20 63 -281 -163 -30 -294 15 -312 -300 -13 163
6581 163 14 -68 -114 -98 -184 43 81 158 178 96 271 -51 64 81 72 -58 -57 79 112 -97 -115 94 -18 -202 40
6606 40 255 -84 225 38 5 -204 -14 170 246 32 -81 114 -189 149 101 -28 94 -391 274 -64 -212
$$ packed form
6442c25O27n17M02k61M7J64j55kM2P3M8j29J04m82K38J6k3R0j76K12j12M06k41
6465D6p7k19K31k3nr8j62M85k78K84o2om1l93N19q5k70M06j25k5M6j62J65j82
6489c1J82j71o1L93l1j56k33P2j01K89k96J43K75k74K32k21o3J42p5o1L2J4j07
6512a07o1M2P9K05j0M6l15J75J56j98j43K3N28n47M83k07J12m16%K13K5Q1l03
6535a39K66j57k5L32k90K0J68J04k22k42L93k09r3q7L36j65o4k17M93J91n52K13
6557E4L07k55j28q8J91j11J0M1%k46K56p9O8%M3l44J18J33k64L09l27J2K87J76
6581A63j49q2m6J6q6K27L8P7K0q2J75l22J15J7rj30JJ36L3k09j8K09j12j84K42
6606D0K15l39L09j87l3k09J90J84P6k14j13J95l03L38m8j29J22m85O65l38j48
$$ plain form
6627 -212 -13 110 147 83 -36 -72 116 -71 -26 -9 207 -42 240 89 -234 131 -46 351 -104 58 -74 -118
6649 -118 356 124 -1 0 -88 -94 -50 -39 10 45 -363 187 82 -63 4 184 9 109 47 -6 -137 -21 200 119
6673 119 -158 100 115 -104 213 10 -99 190 73 -68 222 207 307 62 -41 44 15 8 -84 87 6 253 -80
6696 -80 -171 123 -138 -63 -60 105 -98 370 -126 -183 12 7 236 37 182 41 -476 -111 -78 163 76 46 66 -174
6720 -174 -31 140 -123 -10 -299 -25 153 -157 205 9 339 -265 39 -104 -56 77 205 -47 -321 3
6740 3 -159 85 -68 255 68 -29 -73 274 49 146 13 -112 186 133 63 74 169 -271 -102 -4 -246 151 -185
6763 -185 -121 -59 248 101 117 -90 157 259 61 -56 131 144 -152 -76 179 -16 -65 138 119 -14 41 -239 74
6786 74 243 -168 31 27 158 146 270 -311 290 88 -260 -49 -132 -160 155 -116 -115 268 141 -141 16 109 -141
$$ packed form
6627b12J99J23L7o4j19l6J88j87M5J7K16k49K82j51l23L65j77L97m55J62j32m4
6649a18M74k32j25Jq8oM4J1M9L5m08N50j05j45O7J80j75J00o2n3j31J16K21q1
6673A19k77K58J5k19L17k03j09K89j17j41K90j5J00k45j03Q5k9pr2J71q1K47l33
6696h0r1K94k61P5LJ65k03M68m96n7J95nK29j99J45j41n17L65L3K41q7l0K0k40
6720a74J43J71k63J13k89K74J78l10L62j96L30o04L04j43M8J33J28k52k74L24
6740Cj62K44j53L23j87r7m4L47k25R7j33j25K98n3p0J1R5m40J69R8k42L97l36
6763a85O4O2L07j47J6k07K47J02j98j17J87J3k96P6K55j95m9K03j9j33N5k80L13
6786G4J69m11J99mJ31j2J24n81O01k02l48K11q3k8L15k71JL83j27k82J57R3k50
$$ plain form
6809 -141 165 55 -369 -75 -27 -84 -245 44 -98 -54 -5 279 -171 -105 133 -88 -51 258 -18 152 -279 -10
6831 -10 175 2 166 -8 32 39 373 162 38 182 -51 -187 279 93 -9 151 -225 23 24 56 181 -189
6853 -189 119 -90 7 81 47 113 66 96 243 155 114 28 -91 -88 174 192 114 -1 34 67 176 -239 -48 -79 -189
6878 -189 12 221 -369 -274 3 -182 190 110 -23 -66 39 -130 27 -32 -20 -14 18 152 67 102 -199 -231 -77 84
6902 84 58 -82 215 -97 -478 -43 -31 162 44 -229 -160 -75 235 69 -191 -22 -113 -41 -140 -142 -21 124 6
6925 6 39 -11 -115 33 -43 70 182 -390 39 -160 -144 -169 -119 48 166 85 -24 179 -25 -54 140 211 -13 -19
6949 -19 -87 64 -66 -148 -150 -96 25 -106 17 28 -13 34 -318 -148 194 -145 49 80 149 16 -123 -170 -233 -109
6973 -109 -33 30 42 102 -50 -213 -190 -69 265 121 -250 -181 56 -80 -28 -55 -345 -38 242 83 -78 4 -21
$$ packed form
6809a41L06j10m24K94M8n7j61K89j42M4M9K84m50O6K38k21L7L09k76J70m31K69
6831a0J85j73J64j74M0PL34k11j24J44k33j36M66j86j02J60l76K48JL2J25l70
6853a89L08k09R7P4l4O6m7L0J47q8m1q6j19LK62J8p8j15L5L3J09m15J91l1j10
6878a89K01K09n90R5K77j85L72q0j33m3J05j69J57n9J2OL2J34q5L5l01l2J54J61
6902H4k6j40K97l12l81M35J2J93j18k73O9Q5L10j66k60J69r1P2r9kJ21J45j18
6925FL3n0j04J48p6J13J12n72M29j99J6k5N0J67J18q1j09K03k04k9J94P1k24o
6949a9o8J51j30q2kN4J21j31J23J1m1M7l52J70L42l39J94L1O9j33j39m7o3J24
6973a09P6O3J2O0j52j63K3J21L34j44l71O9K37j36N2k7k90L07K80j59j61Q2k5
$$ plain form
6996 -21 -325 -91 13 -89 20 6 2 -208 -2 -201 -87 363 -199 -85 273 180 -9 310 -134 180 38 9
7018 9 183 -20 98 -14 -93 201 -67 -258 -35 -94 416 63 -247 -38 -211 -117 126 -157 25 47 263 -108
7040 -108 -253 -4 41 -84 -359 -156 -31 -55 131 193 -195 111 49 -31 -98 76 8 -38 -31 29 23 29 155 45 -23
7065 -23 -56 119 36 -48 -64 128 50 -56 -151 69 -297 51 -81 -23 5 -23 13 -373 -10 -255 124 16 -293 115
7089 115 103 213 -81 39 -30 70 -323 -57 17 -94 221 144 -229 -142 146 -65 85 88 -128 102 110 121 -1
7112 -1 23 -21 -15 -110 -26 30 -89 -24 137 -281 -250 -38 -93 41 354 -149 -139 -219 -147 108 -42 84 163 35 -125
7137 -125 23 -196 -156 -133 128 -16 -84 60 95 2 -85 -186 -195 -117 279 91 -102 -237 70 -263 -270 44 86 -19
7161 -19 -120 111 18 -290 -296 45 175 -23 -116 -171 -56 200 -13 -45 -84 -68 -54 -161 -25 -58 341 -70 76 -107
$$ packed form
6996b1l04K34J04j02J09j4mk10K06j99J14M50n62J14L58r3j89L19m44L14j42k9
7018IJ74k03J18j12p9K94k68j91K23n9N10l53l10K09j73R4K43k83J82K2K16l71
7040a08j45K49M5j25k75K03J25k4J86O2l88L06o2q0o7J74o8m6PO0oOJ26j10o8
7065b3l3J75q3q4j6J92p8j06r5K20l66L48j32N8K8k8L6l86L63k45L79j08l09M08
7089A15j2J10k94J20o9J00l93K66P4j11L15p7l73Q7K88k11J50Lk16K30QJ1j22
7112aK4m4Or5Q4N6j19O5J61m18L1K12n5J34L13n03J0q0P2K55j50J26P9j28j60
7137a25J48k19M0K3K61j44o8J44L5r3q7j01rP8L96j88j93j35L07l33pL14M2j05
7161a9j01K31r3l08oL41J30j98r3n5J15K56k13l2l9J6J4j07J36l3L99m11J46j83
$$ plain form
7185 -107 -339 -192 -218 -30 113 125 -247 -88 58 60 -80 -196 -305 111 124 -94 -159 -97 -94 65 277 -96 26
7208 26 311 -55 -304 23 44 91 212 10 29 -55 37 314 206 74 68 -42 -45 2 -44 -132 178 -85 -105 -187 185
7233 185 29 158 61 -13 -308 111 227 -214 -87 207 -182 -60 -149 18 -137 169 152 -1 -236 29 40 83
7255 83 102 -19 -7 46 54 -116 -21 -156 272 -6 241 145 37 86 13 -92 191 -230 -206 -124 23 250 -115 -13
7279 -13 159 -27 -11 238 327 59 -45 188 140 -18 172 -8 45 42 144 68 114 -88 115 -6 -128 73 42
7302 42 -77 -70 -77 -43 -36 30 85 251 10 -135 -140 162 -230 192 117 -176 88 -60 -240 -68 134 -17 -208 70
7326 70 30 272 4 -173 2 -183 -60 139 9 -46 -41 98 -315 26 -188 66 -59 15 -73 29 99 111 244
7349 244 31 213 -123 25 -119 -295 224 263 71 -36 2 -140 -71 -296 2 -174 -122 -369 -95 140 -24
$$ packed form
7185a07k32J47k6J88J43J2l72J59J46Kj40j16j09M16J3k18o5O2LJ59K12l73J22
7208B6K85l66k49L27K1M7J21k02J9q4R2K77j08j32oj10lM7m6q8L10k63k0q2L72
7233A85j56J29r7p4k95M19J16m41J27K94l89J22q9J67j55L06j7j53k35K65J1M3
7255H3J9j21J2N3Qj70R5j35M28k78K47r6j08M9p3j05K83m21K4Q2J47K27l65J02
7279a3J72j86J6K49Q9k68j04K33m8j58J90j80N3lJ02p6M6k02K03j21j22K01l1
7302D2j19PpL4PO6N5J66k41j45nL02l92M22p5k93K64j48j80J72K02j51j91K78
7326G0m0K42k68j77J75j85J23J99j30n5NJ39m13L41k14K54j25P4q8J02P0J2J33
7349B44k13J82l36J48j44j76N19L9j92j07L8j42O9k25K98j76N2k47K74K35j64
$$ plain form
7370 -24 22 -39 103 31 124 193 -10 132 -455 -138 141 -124 78 130 168 193 108 10 132 -47 273 68 138 302
7394 302 219 -117 -65 -292 -144 -30 -85 -142 -47 121 -235 -27 146 -51 43 272 338 -87 -218 12 -36 -94 -184
7417 -184 -61 152 172 -144 -125 -64 138 75 -196 159 -171 -251 -102 181 73 -6 -253 71 -228 -83 59 -99
7439 -99 -192 -119 -62 -189 259 235 80 130 132 -185 376 3 301 106 -14 -151 -240 -244 -247 28 258 -194 127 91 69
7464 69 123 -80 45 -112 -157 126 -217 107 49 -59 207 -2 -41 1 120 148 60 -84 207 -124 192 8 36
7487 36 -161 -171 -164 293 172 -128 -204 216 -120 54 74 -116 -48 -42 -105 -71 -110 -43 -265 -312 -215 72 85 8 88 -243
7513 -243 198 94 -121 -274 202 189 124 227 175 -45 213 170 15 -130 -172 27 170 -33 -32 12 -155 -47 175
7536 175 -56 -106 299 -88 14 145 -92 7 -192 88 -155 -125 -22 88 171 308 19 39 256 -179 -274 134
$$ packed form
7370b4M6o1J42p2R3O9k03J42n87L17K79k65K02N2L8K5q5r8J22j79L20k05P0J64
7394C02q3l36N2k27J48J14n5n7R5J68l56K08J73j97R4K29O6m25j31K30m8n8r0
7417a84J23K13K0l16J9O1K02o3k71L55l30q0J49K83j08p9k47L24k99J45J42j58
7439i9r3P3N7j27M48k4j55N0Kl17N61l73K98j95j20j37q9mlK75K30m52L21l6k2
7464F9N4k03J25j57m5K83l43L24n8j08K66k09l9M2J19K8q8j44K91l31L16j84K8
7487C6j97j0PM57j21l00p6M20l36J74K0j90O8Oo3L4l9O7k22m7R7K87J3p7Q0l31
7513b43M41j04k15j53M76j3o5J03n2k20K58m3j55j45m2J99J43k03JM4j67J08K22
7536A75k31n0M05l87J02J31k37R9j99K80k43L0J03J10Q3J37k89K0K17m35r5M08
$$ plain form
7558 134 -48 68 89 78 13 -110 -167 -2 -68 45 -77 78 157 -102 17 181 348 8 -203 187 -11 158
7580 158 187 111 -11 100 -45 -56 -19 26 4 -174 -50 270 169 200 67 86 27 -247 30 4 -44 235 -70 -171
7604 -171 7 27 16 37 -207 -78 288 110 243 -71 -268 124 105 42 80 59 39 11 63 -178 -98 -210 -107 315
7628 315 -58 20 82 178 72 -47 -129 60 160 -12 -279 181 43 -52 -296 116 -3 -123 29 10 -138 36
7650 36 -91 -125 115 330 -89 -139 180 -192 -13 76 -111 -154 31 93 38 -90 -157 -223 -133 -160 146 70 28 181
7674 181 -202 -165 64 -273 141 -161 244 -29 -144 110 -38 158 202 12 61 -146 173 -271 -51 46 3 143
7696 143 16 221 -81 233 -22 -186 -141 166 221 -1 117 138 41 25 1 167 49 -152 -48 -248 -47 -419
7718 -419 -40 -27 -47 -51 -114 238 -115 172 -28 -27 355 -64 -153 251 -162 193 -110 -63 -309 3 7 189 -26 98
$$ packed form
7558A34j82J16K1j1o5j23n7J65o6J13j22J55P9k59J19J64J67l40k11L90j98J69
7580A58K9p6j22J11j45j1L7M5k2j78J24L20j01L1j33J9n9k74K77k6m8K79l05j01
7604a71J78K0j1K1k44J29L66j78J33l14j97L92j9o3L8k1k0k8N2k41Q0j12J03M22
7628C15l73P8O2R6j06j19q2J89J00j72k67M60j38r5k44M12j19j20J52j9j48J74
7650C6j27l4K40K15m19n0L19l72J79Q9j87m3J85O2n5j28o7o6R0k7L06p6m2J53
7674A81l83L7K29l37M14l02M05k73j15K54j48J96M4j90M9k07L19m44K20R7m3J40
7696A43j27K05l02L14k55j64M5L07N5k22J18K1r7j6k4J66j18k01J04k00K01l72
7718d19L79J3k0mo3L52l53K87k00JL82m19q9M04m13L55l03M7k46L12MJ82k15J24
$$ plain form
7742 98 31 95 -116 15 48 -153 217 -23 59 -24 100 -49 -75 -70 437 121 -29 214 312 -178 -195 112 9 -185
7766 -185 -212 310 171 -59 185 -190 -166 46 -455 52 68 -73 -75 -77 -53 16 163 128 54 251 -248 -75 -326 230
7790 230 -77 5 52 86 -270 129 247 -4 -122 308 157 255 -70 -158 -190 -136 209 -58 110 534 102 -88
7812 -88 -163 139 5 -75 321 -136 -267 -141 -94 137 37 157 67 -127 8 -17 -187 16 72 81 146 131 -220 57
7836 57 -36 -167 62 137 -86 -494 -134 -304 -185 49 55 125 87 -67 -25 -195 119 -92 8 133 -40 118 124
7859 124 200 -370 -13 -16 4 -155 125 -61 -161 -283 138 -176 -288 133 173 -157 52 178 -178 -3 -29 -296
7881 -296 177 -40 -195 87 -65 8 -36 -241 -106 -258 -154 193 131 270 -258 -151 -153 303 44 -147 226 55
7903 55 104 -175 85 29 128 -304 -57 -169 -80 46 283 138 206 166 -274 -173 -143 87 -54 -111 -15 60 199 -234
$$ packed form
7742I8o7O4k11J31L3k01L70k40Q2q3J24j49k6NN07l16j50K43R8m90j7L07j03j94
7766a85k7N22j39k30K44l75K4K12n01N07J6j41kkK4O9J47l5p4J97m99J73k51N56
7790B30l07Q2M7L4l56L99J18k51j18M30j51R8l25q8l2N4L45k67J68M24m32j90
7812h8p5L02j34q0L96m57j31J26M7K31j00J20r0j94J35k5j70K03N6RO5j5l51K77
7836E7r3j31K29P5k23m08L60j70J19K34OP0l8j54M2j70L14k11J00J25j73J58O
7859A24P6n70L57lK0j59K80j86j00j22M21l14j12M21M0l30K09J26l56J75k6k67
7881b96M73k17j55K82j52P3m4k05J35j52J04L47o2J39n28J07kM56k59j91L73j71
7903E5M9k79K60n6R9m32K47j12Q9J26K37j45O8m0m40J01L0K30j41n7R6P5J39m33
$$ plain form
7927 -234 -389 91 193 13 265 -220 285 139 75 -16 -201 -110 -8 183 537 -131 79 -32 29 7 -266 -121
7949 -121 -254 100 202 -110 -94 -36 99 156 -210 -309 -9 -46 206 -3 200 91 64 246 235 -227 -16 -242
7971 -242 -123 76 -48 169 20 45 -51 6 156 -113 -138 101 160 23 -182 120 35 -117 -111 -131 133 219 209 -16
7995 -16 135 -159 78 64 208 -195 -55 45 112 -10 -237 -81 79 93 125 -60 -119 -59 3 -67 -117 -149 141 187
8019 187 77 -184 -260 -52 -275 -17 105 312 388 -199 -62 33 -160 41 38 50 290 -235 192 131 189 104 157
8042 157 376 -186 59 203 77 44 213 -217 -2 -173 199 169 -99 155 0 100 -20 -97 309 -357 -249
8063 -249 64 42 -252 2 -65 2 131 -25 214 198 -191 -230 288 121 52 271 84 -90 -67 153 -81 -164 -26
8086 -26 -54 -143 -81 65 -89 -137 -131 186 -140 329 -192 -241 -181 27 -106 15 -88 -6 -136 131 -99 -195 87 -81
$$ packed form
7927b34j55M80J02j80K52m85N05j46o4r1j85R1J02J91L54o68K10j11O1k2k73J45
7949a21j33L54J02l12J6N8J35N7l66r9L00l7K52k09K03j09k7J82j1m62K11k26
7971b42J19J99j24K17j49K5r6N7J50k69k5K39N9j37k05L02q5j52Ok0K64Q6j0k25
7995a6J51k94K37j4J44m03J40J00O7j22k27J56J60J4L2j85n9O0O2p0n0l2K90M6
8019A87j10k61p6K08k23K58J22K07P6n87J37R5j93K01lJ2K40n25M27o1N8q5N3
8042A57K19n62K45J44j26l3J69m30K15j71L72l0k68K54j55J00j20p7M06o66J08
8063b49L13k2k94K54o7O7J29j56K39j6l89l9N18j67o9K19j87j74K3K20k34q3J38
8086b6k8q9O2J46j54m8OL17l26M69n21m9O0K08j33J21j03Q2j30K67k30r6K82j68
$$ plain form
8110 -81 52 -56 -222 -241 -122 -58 -143 -215 -185 16 -13 30 152 -214 52 127 19 9 -239 -183 4 122 -101 -81
8134 -81 56 34 -321 118 -74 -150 -215 -234 -159 -64 -171 198 24 -248 -44 83 -191 -192 -73 -81 -124 232 -170 -20
8158 -20 278 5 6 95 -387 58 140 -169 142 -62 154 57 -177 76 81 60 -207 -60 39 -174 -83 67 -140 269
8182 269 -11 260 47 -286 -48 44 56 -94 148
$$ packed form
8110h1J33j08j66j9J19O4q5p2L0K01k9M3J22l66K66P5j08j0k48N6J87J18k23K0
8134h1J37k2l55M39j92p6o5j9P5R5j07L69j74k72K04J27k74jJ19qm3L56m02J50
8158b0K98k73JQ9m82M45Q2l09L11k04K16r7k34K53Nk1k67J47R9k13R1J50k07M09
8182B69k80K71k13l33K38R2J2j50K42
8191A48
$$ Imaginary data points
##PAGE= N=2
##DATA TABLE= (X++(I..I)), XYDATA
$$ plain form
0 0 0 0 0 0 0 0 0 -8 8 -8 10 -16 16 -24 24 -32 40 -48 56 -65 80 -92 105 -121 143 -161 184 -209 236 -268
30 -268 304 -339 380 -425 475 -528 588 -652 725 -804 890 -984 1090 -1208 1337 -1485 1649
47 1649 -1837 2053 -2305 2600 -2958 3394 -3948 4669 -5659 7109 -9440 13814 -24875 112986
61 112986 146803 -129225 -126671 10458 80128 16656 23959 45215 -7196 -89130 -44211 47347
73 47347 63504 1825 -31631 -41784 -35830 -560 52961 43164 -16902 -48634 -24229 2301 27175
86 27175 57242 48651 -20057 -60786 -18231 37496 36266 21387 26335 2644 -53357 -56048 11385
99 11385 53121 25011 -11899 -29568 -49948 -45083 19867 67981 14255 -65818 -52774 15008
111 15008 31018 10786 18271 16709 -34305 -55294 12264 74824 42788 -19707 -29572 -19705 -26768
$$ packed form
0@%%%%%%%qJ6j6J8k6L2m0M8n6P2q8J04j21J45j72J97k26K64l04L45l93M45n04
30b68N72o43P19q05R00j003J116j240J377j529J694j874K074k298K545k822L134
47A649l486L890m358M905n558O352p342Q617j0328J2768j6549K3254l8689J37861
61A12986L3817k76028K554J37129O9670o3472P303K1256n2411q1934M4919R1558
73D7347J6157o1679l3456j0153N954L5270N3521r797o0066l1732K4405K6530K4874
86B7175L0067q591o8708m0729M2555N5727j230j4879M948k3691n6001k691O7433
99A1385M1736k8110l6910j7669k0380M865O4950M8114n3726q0073J3044O7782
111A5008J6010k0232P485j562n1014k0989O7558O2560l2036o2495r865R867p063
$$ plain form
124 -26768 -6694 46673 50942 -14277 -62972 -50526 -17250 12318 42984 32964 -36912 -79309
136 -79309 -26216 42825 33913 -7057 -5403 561 -27335 -23870 40885 68711 4629 -55576 -33396
149 -33396 15493 28620 29230 25989 -13583 -60381 -40437 23010 39143 5674 -9434 -8530 -33198
162 -33198 -44987 4775 54627 27078 -28811 -28343 5853 11938 3859 16586 24273 3883 -10948
175 -10948 -847 8635 12894 26089 21665 -23317 -50179 -3781 53340 34193 -22618 -33913 -14704
188 -14704 -16560 -10224 31796 46116 -7658 -51664 -22571 20082 17833 10529 28272 20927 -23838
201 -23838 -33784 13264 45759 24539 -5231 -12339 -15295 -7650 23167 33492 -7976 -43733 -19822
214 -19822 14539 4952 -8329 11195 13372 -29525 -47587 -894 39754 22879 -3869 -3402 -9534
$$ packed form
124b6768K0074N3367M269o5219m8695J2446L3276K9568L0666j0020o9876m2397
136g9309N3093O9041q912m0970J654N964k7896L465O4755K7826o4082o0205K2180
149c3396M8889J3127O10l241l9572m6798J9944O3447J6133l3469j5108R04k4668
162c3198j1789M9762M9852k7549n5889M68L4196O085q079J2727P687k0390j4831
175a0948J0101R482M259J3195m424m4982k6862M6398N7121j9147n6811j1295J9209
188a4704j856O336M2020J4320n3774m4006K9093M2653k249p304J7743p345m4765
201b3838r946M7048L2495k1220k9770p108k956P645L0817J0325m1468l5757K3911
214a9822L4361r587j3281J9524K177m2897j8062M6693M0648j6875k6748M67o132
$$ plain form
227 -9534 -26120 -5024 41391 40562 -8032 -29153 -6900 6739 1815 8742 13721 -11241 -31179
240 -31179 -9544 14649 716 -16452 -5107 -1840 -24660 -23375 15569 30717 -2217 -27056
252 -27056 -15442 -3028 -164 19981 36125 5925 -34915 -22994 18031 19691 -2104 3804 14540
265 14540 -10726 -34872 -9734 23067 9628 -17424 -13171 -2889 -12190 -10398 14528 15566 -17445
278 -17445 -28292 862 21743 13277 5892 5477 -9505 -18755 7268 33462 18155 -8399 -2754
291 -2754 7177 -10834 -17824 12958 29999 -285 -27024 -10889 5911 -4575 -6629 12036 9198
304 9198 -17803 -16322 15490 21929 -4101 -10519 8091 10660 -1149 7024 21929 10336 -9110
317 -9110 -4250 6693 893 1550 20002 15917 -18183 -29747 -1097 18206 3737 -6525 1843
$$ packed form
227i534j6586K1096M6415q29m8594k1121K2253J3639m924O927M979k4962j9938
240c1179K1635K4193j3933j7168J1345L267k2820J285L8944J5148l2934k4839
252b7056J1614J2414K864K0145J6144l0200m0840J1921M1025J660k1795N908J0736
265A4540k5266k4146K5138L2801j3439k7052M253J0282r301J792K4926J038l3011
278a7445j0847K9154K0881q466p385m15j4982r250K6023K6194j5307k6554N645
291b754R931j8011o990L0782J7041l0284k6739J6135J6800j0486k054J8665k838
304I198k7001J481L1812O439k6030o418J8610K569j1809Q173J4905j1593j9446
317i110M860J0943n800O57J8452m085l4100j1564K8650J9303j4469j0262Q368
$$ plain form
330 1843 -3173 -18277 -6301 18644 11038 -14500 -8112 16545 12010 -7955 -927 15663 4498
343 4498 -11625 2160 19891 7235 -9056 -2476 2936 -10047 -9872 10227 11462 -12864 -19696
356 -19696 -180 3888 -12228 -11177 6631 6091 -7931 -4741 5454 -2970 -11285 4758 17989
369 17989 3192 -10849 1457 10795 -3359 -10231 4698 9115 -7207 -8934 6365 1524 -19248
382 -19248 -14203 9369 6048 -16716 -12969 9097 5774 -14777 -11380 7182 4297 -5950 3477
395 3477 13633 -425 -13047 525 13506 3371 -5261 6076 10753 -4026 -11675 -1408 3280
408 3280 -3015 -186 6298 -4289 -15891 -5301 8622 -1 -9584 2747 10978 -4953 -12150 8948
422 8948 19550 -1140 -13131 5564 16782 2604 -2182 13704 10251 -15978 -17249 14193 26378
$$ packed form
330A843n016j5104J1976K4945p606k5538O388K4657m535j9965P028J6590j1165
343D498j6123J3785J7731j2656j6291O580N412j2983J75K0099J235k4326o832
356a9696J9516M068j6116J051J7808n40j4022L190J0195q424q315J6043J3231
369A7989j4797j4041J2306R338j4154o872J4929M417j6322j727J5299m841k0772
382a9248N045K3572l321k2764L747K2066l323k0551L397J8562k885j0247R427
395C477J0156j4058j2622J3572J2981j0135q632J1337M677j4779p649J0267M688
408C280o295K829O484j0587j1602J0590J3923q623r583J2331Q231j5931p197K1098
422H948J0602k0690j1991J8695J1218j4178m786J5886l453k6229j271L1442J2185
$$ plain form
435 26378 2671 -15728 -9233 -3253 -4422 4514 14270 2113 -15525 -10256 4621 5816 2366 7209
449 7209 4685 -7906 -6379 12266 16213 182 -4147 5517 1884 -8665 3076 21648 8570
462 8570 -19943 -18067 6561 9416 -4604 -2318 7235 -3629 -19681 -10876 8886 9913 883 -724
476 -724 -3297 -11431 -5201 13492 15329 -1938 -9098 -100 2233 -2662 4972 12904 -532 -18621
490 -18621 -11514 8035 8468 -1708 -2145 -4826 -18200 -16116 8835 19075 -856 -16084 -6986 -1869
504 -1869 -9265 -894 21884 17187 -14747 -24490 -351 16724 9862 3286 1889 -9604 -18286 -608
518 -608 21151 11357 -13430 -15903 -3722 -1937 -2337 9345 12145 -8078 -23297 -10604 9939 13822
532 13822 8848 3115 -8598 -16187 -2427 18377 17071 487 -3828 -443 -4975 -5663 9777 19097
$$ packed form
435B6378k3707j8399O495N980j169Q936R756j2157j7638N269J4877J195l450M843
449G209k524j2591J527J8645L947j6031m329R664l633j0549J1741J8572j3078
462H570k8513J876K4628K855j4020K286R553j0864j6052Q805J9762J027r030j607
476g24k573q134O230J8693J837j7267p160Q998K333m895P634P932j3436j8089
490a8621P107J9549M33j0176m37k681j3374K084K4951J0240j9931j5228R098N117
504a869p396Q371K2778m697l1934r743K4139J7075o862o576j397j1493q682J7678
518f08K1759r794k4787k473J2181J785m00J1682K800k0223j5219J2693K0543L883
532A3822m974n733j1713p589J3760K0804j306j6584m315L385m532o88J5440R320
$$ plain form
546 19097 1935 -14960 -8673 3330 1489 1693 10798 4665 -16430 -18761 5894 20477 8668
559 8668 -4178 -4397 -6515 -8830 6371 25002 15757 -9274 -15210 -1991 5824 8027 14441 11492
573 11492 -8990 -20633 -6077 11546 11432 4996 472 -10758 -20978 -5146 22529 19975 -9516
586 -9516 -20258 -3962 5639 2339 7857 15846 2048 -19154 -15081 8510 18408 11086 2690 -7539
600 -7539 -19079 -12539 12909 22933 3178 -16640 -13677 -4423 -2951 2822 12509 5055 -14932 -18647
614 -18647 -2456 8604 8034 6715 498 -14292 -16798 4074 21179 10360 -7617 -9268 -5462
627 -5462 -7326 -112 15713 15229 -9151 -22563 -10716 3642 5861 7637 7844 -7582 -23844 -13302
641 -13302 12880 18941 2391 -8404 -8079 -8822 -4328 12527 20023 3294 -15401 -12730 667 7223
$$ packed form
546A9097j7162j6895O287J2003j841K04R105o133k1095k331K4655J4583j1809
559H668j2846k19k118k315J5201J8631r245k5031n936J3219P815K203O414k949
573A1492k0482j1643J4556J7623j14o436m524j1230j0220J5832K7675k554k9491
586i516j0742J6296R601l300N518P989j3798k1202M073K3591R898p322q396j0229
600g539j1540O540K5448J0024j9755j9818K963R254J472N773R687p454j9987l715
614a8647J6191J1060n70j319o217j4790k506K0872J7105j0819j7977j651L806
627e462j864P214J5825m84k4380j3412J1847J4358K219J776K07j5426j6262J0542
641a3302K6182O061j6550j0795L25p43M494J6855P496j6729j8695K671J3397O556
$$ plain form
655 7223 11293 12660 -516 -20327 -16849 7690 19069 7266 -3604 -6604 -12080 -12841 5092 22210
669 22210 12070 -11561 -16255 -3974 4056 7805 13857 9417 -9127 -17258 -1553 14716 12904
682 12904 4463 160 -7643 -14102 -1703 18614 17032 -4406 -15175 -7945 -1134 2837 11523 13616
696 13616 -2969 -19228 -11160 7253 12504 8531 5416 -3296 -15217 -10531 12322 21638 6096
709 6096 -9305 -8213 -3868 -2173 6858 16207 6266 -14980 -17540 -844 10071 7872 4662 -1267
723 -1267 -13431 -16101 965 16661 10691 -4100 -8753 -8585 -7354 2773 16559 12442 -7994 -16220
737 -16220 -5556 3681 5186 8143 7337 -7715 -19857 -8445 12325 12890 -1345 -7574 -6592 -9381
751 -9381 -6576 8300 15352 698 -15230 -12026 -494 5163 7767 9086 -445 -15161 -12787 4705
$$ packed form
655G223M070J367j3176j9811L478K4539J1379j1803j0870l000n476p61J7933J7118
669B2210j0140k3631m694J2281Q030L749O052m440j8544q131J5705J6269j812
682A2904q441m303p803o459J2399K0317j582k1438j0769P230O811L971Q686K093
696A3616j6585j6259Q068J8413N251l973l115q712j1921M686K2853R316j5542
709F096j5401J092M345J695R031R349r941k1246k560J6696J0915k199l210n929
723a267j2164k670J7066J5696n970j4791m653J68J231J0127J3786m117k0436q226
737a6220J0664R237J505K957q06j5052j2142J1412K0770N65j4235o229R82k789
751i381K805J4876P052j4654j5928L204J1532N657K604J319r531j4716K374J7492
$$ plain form
765 4705 14259 7256 -810 -4750 -10425 -9288 5244 15657 6066 -9152 -10519 -3893 -1214 3467
779 3467 11876 7170 -11211 -17102 -1584 12878 8967 1393 -612 -5520 -10235 -1354 14508 13878
793 13878 -2385 -10178 -4457 -245 1846 8882 10918 -1480 -13226 -7646 5331 8674 5012 2372
807 2372 -2644 -9943 -5810 7999 12221 2420 -4539 -3083 -2784 -2933 5490 13915 5111 -9488 -9438 2118
823 2118 6402 5029 5907 2725 -8174 -11177 1697 11869 6392 -2593 -2703 -3722 -7729 -1269 12523
838 12523 11286 -5905 -13373 -3405 5250 4143 4089 4290 -3146 -10867 -4751 7892 9077 773 -3621
853 -3621 -4146 -6102 -3561 6016 9531 -204 -8868 -7240 -1835 747 5228 6977 -2188 -12642 -7184
868 -7184 5899 7281 -1222 -2453 689 -3364 -7940 106 10023 4708 -6395 -7306 -1223 554 656
$$ packed form
765D705R554p003q066l940n675J137J4532J0413r591j5218j367O626K679M681
779C467Q409m706j8381n891J5518J4462l911p574k005m908m715Q881J5862o30
793A3878j6263p793N721M212K091P036K036j2398j1746N580J2977L343l662k640
807B372n016p299M133J3809M222r801o959J456K99j49Q423Q425q804j4599N0J1556
823B118M284j373Q78l182j0899l003J2874J0172n477q985j10j019m007O460J3792
838A2523j237j7191p468R968Q655j107n4K01p436p721O116J2643J185q304m394
853c621n25j956K541R577L515r735q664J628N405K582M481J749r165j0454N458
868g184J3083J382q503j231L142m053m576Q046R917n315j1103r11O083J777J02
$$ plain form
883 656 4503 2990 -5382 -8744 -1599 4503 3145 572 -424 -4221 -6481 -89 6428 2950 -3269 -1715
899 -1715 628 -3579 -4807 5306 10339 -249 -10642 -4506 4761 4190 612 2520 686 -6558 -5105
914 -5105 4820 8203 158 -3934 -238 -598 -3242 834 7998 4086 -5474 -6202 1409 4074 2453 3040
930 3040 1998 -3471 -5406 2083 7203 2970 -2164 -1044 28 -1667 580 5636 2971 -3301 -3040
945 -3040 1867 1256 -1092 2396 5034 -967 -6502 -719 6329 3246 -2976 -1016 1810 -1267 -2494
960 -2494 2349 4651 -1019 -4088 344 2202 -1479 -655 3351 1415 -4474 -2462 3013 1861 -2748
975 -2748 -734 3045 -726 -4981 -846 4573 1233 -4178 -1778 1554 -972 -2649 1034 2222 -2024
990 -2024 -3316 718 1259 -1998 -1165 1748 225 -3941 -1215 3315 373 -3872 -929 2916 -974 -4020
$$ packed form
883F56L847j513q372l362P145O102j358k573r96l797k260O392O517l478o219J554
899a715K343m207j228J0113N033j0588j0393O136R267n71l578J908j834p244J453
914e105R925L383q045m092L696l60k644M076P164l912r560p28P611K665j621N87
930C040j042n469j935P489N120m233n134J120J072j695K247N056k665o272K61
945c040M907o11k348L488K638o001n535N783P048l083o222J960K826l077j227
960b494M843K302n670l069M432J858l681Q24M006j936n889K012N475j152m609
975b748K014L779l771m255M135N419l340n411K400L332k526j677L683J188m246
990b024j292M034N41l257Q33K913j523m166K726M530k942m245K943L845l890l046
$$ plain form
1006 -4020 -86 3952 -806 -5316 -579 3465 211 -3918 -1291 1680 173 -1063 496 -1039 -2658
1021 -2658 -251 3150 572 -3307 -439 2740 -361 -3518 1444 4753 223 -4507 -519 3788 1019
1036 1019 -1375 1255 2205 -2499 -3103 2656 4327 -405 -3180 108 903 -786 921 4062 941 -3705
1052 -3705 -1303 3035 2200 -434 1517 3056 -1401 -3661 1662 5113 1873 -1491 -309 258 -1887
1067 -1887 290 5174 3299 -3375 -4043 1685 2469 -236 652 2939 -299 -4431 -979 4553 3571 -1022
1083 -1022 -963 303 -1967 -2224 3232 5903 160 -4986 -3116 1049 1910 2134 2063 -1508 -5101 -2363 2491
1100 2491 2249 -289 -47 -464 -3747 -4356 2486 6274 994 -5238 -3233 32 174 495 3809 2417
1116 2417 -4991 -6677 339 4760 2340 -787 -1388 -3247 -4763 -548 4606 2951 -2893 -3747 -2253
$$ packed form
1006d020L934M038m758m510M737M044l254m129K627K971j507j236J559j535j619
1021b658K407L401k578l879K868L179l101l157M962L309m530m730L988M307k769
1036A019k394K630R50m704o04N759J671m732k775L288P95j689J707L141l121m646
1052c705K402M338q35k634J951J539m457k260N323L451l240l364J182N67k145
1067a887K177M884j875o674o68N728P84k705Q88K287l238m132L452N532r82m593
1083a022N9J266k270k57N456K671n743n146J870M165Q61K24p1l571l593K738M854
1100B491k42k538K42m17l283o09O842L788n280o232K005L265J42L21L314j392
1116B417p408j686P016M421k420l127o01j859j516M215N154j655n844q54J494
$$ plain form
1131 -2253 -1915 -919 3601 4525 -2366 -7169 -3302 3234 3676 1328 442 -2621 -5016 -1902 5281 5317 -575
1148 -575 -3693 -1930 -1426 -1571 2503 6016 920 -6092 -5988 263 3464 3127 2355 -717 -5571 -4496
1164 -4496 2747 7005 3261 -1476 -1920 -2362 -1677 2644 7570 3623 -3951 -4936 240 2529 2062 3623
1180 3623 3152 -2944 -7348 -1878 6110 5833 -6 -2908 -2967 -2849 521 5271 5546 -307 -4594 -2666
1196 -2666 394 2620 4843 4762 -1375 -6232 -3168 3917 4709 1869 203 -1514 -4838 -4171 3223 8082
1212 8082 2321 -5421 -5697 -1528 913 3189 4659 951 -5615 -5964 149 4443 3830 2021 -402 -4519
1228 -4519 -5945 844 7502 4737 -2161 -4853 -3166 -2066 891 5404 4000 -4050 -8946 -3563 3711
1243 3711 4004 888 -709 -3043 -5722 -2748 3730 5985 1732 -3094 -4429 -3731 -52 5570 6419 -472
$$ packed form
1131b253L38R96M520R24o891m803L867O536M42k348q86l063k395L114P183L6n892
1148e75l118J763N04j45M074L513n096p012J04O251L201l37p72l072m854J075
1164d496P243M258l744m737m44m42O85M321M926l947p574r85N176K289m67J561
1180C623m71o096m404N470P988k77n839k902n9J18L370M750K75n853m287J928
1196b666L060K226K223q1o137m857L064P085P92k840j666j717l324O67P394M859
1212H082n761p742k76M169K441K276J470l708o566l49O113M294o13j809k423m117
1228d519j426O789O658k765o898k692J687J100K957M513j404q050m896N383P274
1243C711K93l116j597k334k679K974O478K255m253m826j335O98L679N622Q49o891
$$ plain form
1259 -472 -6427 -4994 450 2447 3445 2614 -1622 -7214 -5384 2278 5464 1506 -2001 -1993 -3293 -4146 924
1276 924 7857 4729 -4702 -7114 -1095 3311 3845 3597 2357 -2863 -6497 -1922 5351 6456 1868 -2569
1292 -2569 -4670 -3953 807 5756 4693 -1446 -4684 -3275 -964 1884 5477 5207 -1494 -7138 -3302
1307 -3302 4624 6383 3019 73 -1825 -3850 -2343 4245 7590 2499 -3878 -4501 -1906 862 3774
1322 3774 5228 938 -5619 -5519 -205 3677 3353 2046 -297 -4262 -5160 943 7114 5046 -1169 -3813
1338 -3813 -2329 -380 2088 5413 3857 -2908 -6401 -2473 2454 3409 2747 524 -3831 -6492 -2622
1353 -2622 3766 4615 321 -2746 -3990 -4533 -1465 4855 6572 -346 -6792 -4473 1691 3478 2717 1895
1369 1895 -745 -4882 -4429 1362 4913 2630 -1283 -3373 -4468 -3495 1433 5766 2124 -4996 -6762
$$ packed form
1259d72n955J433N444J997R98q31m236n592J830P662L186l958l507Qj300q53N070
1276I24O933l128r431k412O019M406N34k48j240n220l634M575P273J105m588m437
1292b569k101P17M760M949j063o139l238J409K311K848L593k70o701n644L836
1307c302P926J759l364k946j898k025J507O588L345n091o377o23K595K768K912
1322C774J454m290o557J00N314L882l24j307k343l965q98O103O171k068o215k644
1338c813J484J949K468L325j556o765l493L928M927R55o62k223m355k661L870
1353b622O388Q49m294l067j244n43L068O320J717o918o446K319O164J787p61q22
1369A895k640m137M53N791L551k283l913k090j095R73M928M333l642p120j766
$$ plain form
1384 -6762 -2165 1575 2977 2668 190 -3504 -4631 -703 3446 3271 1678 -69 -2879 -3848 -51 5457
1400 5457 4517 -1174 -4448 -2498 -331 1186 3487 3354 -2196 -6355 -3252 3020 3846 1244 -152 -1300
1416 -1300 -3279 -2273 2826 5532 2181 -1993 -2665 -1479 377 3583 5064 1446 -4301 -3892 928
1431 928 3269 2313 1263 -172 -3274 -3805 687 4843 3089 -1648 -2989 -1920 -842 1323 4434 3588
1447 3588 -1531 -4257 -1328 2413 3516 2855 1024 -2220 -3715 -480 3316 2942 129 -1092 -1634 -2739
1463 -2739 -1263 2612 3604 -704 -4410 -2805 580 1229 1512 1488 -347 -3514 -2699 1705 3813 1675
1479 1675 -772 -791 -1720 -1939 1325 4103 1515 -3132 -3286 -1152 326 551 836 672 -2606 -3918 -1280
1496 -1280 1875 1469 -340 -411 -1455 -2973 -484 3611 2941 -1014 -2314 -1008 96 824 2271 2341 -1040
$$ packed form
1384f762M597L740J402l09k478l694j127L928M149j75j593j747k810r69L797N508
1400E457r40n691l274J950K167J517K301j33n550m159L103O272Q26k602j396j148
1416a300j979J006N099K706l351m174o72J186J856L206J481l618n747M09M820
1431I28K341r56j050j435l102n31M492M156j754m737j341J069J078K165L111q46
1447C588n119k726K929L741J103o61j831l244j495L235L796l74k813j221n42j105
1463b739J476L875R92m308l706J605L385O49K83k4j835l167Q15M404K108k138
1479A675k447j9r29k19L264K778k588m647j54K134J478K25K85j64l278j312K638
1496a280L155m06j809p1j044j518K489M095o70l955j300J306J104P28J447P0l381
$$ plain form
1513 -1040 -3843 -1516 1588 1314 191 -117 -932 -2830 -2200 1139 2740 103 -1880 -1674 -760 -259 1439
1530 1439 2861 436 -2390 -1526 1766 2050 841 814 856 -1211 -2228 1121 2865 1389 -888 -876 -719
1547 -719 -1157 -155 2060 1743 -1473 -2589 -353 1618 739 662 1023 -280 -1322 115 2252 2296 251
1564 251 399 336 -475 -302 1530 2420 -45 -2374 -639 775 93 68 852 -108 -2098 -2067 590 1490 -28
1583 -28 -407 42 -314 -1053 507 1919 694 -905 -213 843 -17 196 1258 950 -1259 -1950 405 1106
1601 1106 -406 -903 -59 -581 -1721 -1080 967 775 -1310 -1452 104 103 -859 -249 1132 8 -1357 8
1619 8 824 -75 -438 464 427 -736 -756 473 383 -930 -1056 364 129 -1155 -886 226 -482 -1397 -586 814
1639 814 -220 -1037 -166 872 -118 -961 564 1034 135 -649 771 1070 -14 -608 520 659 -431 -233
$$ packed form
1513a040k803K327L104k74j123l08q15j898O30L339J601k637j983K06R14N01J698
1530A439J422k425k826Q64L292K84j209k7M2k067j017L349J744j476k277J2J57
1547g19m38J002K215l17l216j116K236J971q79p7L61j303j042J437K137M4k045
1564B51J48o3q11J73J832Q90k465k329J735J414o82k5P84r60j990L1K657R00j518
1583b8l79M49l56p39J560J412j225j599O92J056q60K13J062l08k209o91K355P01
1601A106j512m97Q44n22j140O41K047j92k085j42J556jr62O10J381j124j365J365
1619HQ16q99l63R02l7j163k0J229r0j313j26J420k35j284K69J112p08r15Q11J400
1639H14j034q17Q71J038r90q43J525M70q99p84J420K99j084n94J128J39j090J98
$$ plain form
1657 -233 877 271 -1224 -894 637 508 -375 -69 275 -696 -941 423 1408 385 -542 513 964 -252
1675 -252 -23 1943 1903 -570 -1071 685 1221 333 -81 408 -92 -1040 -374 654 827 -529 -810 -473 -605
1694 -605 -237 1297 1528 -174 -1183 78 825 556 541 1507 221 -1304 -537 1435 1899 -255 -580 -250
1712 -250 -402 -774 155 1058 4 -1742 -1443 -560 -244 121 613 -307 -1531 -1757 638 1601 1092 -42
1730 -42 79 -565 -1140 96 1971 1238 -1110 -1849 -892 -33 109 830 466 -1331 -2576 -1371 781 768
1748 768 -12 -459 -1438 -2106 -768 1541 1723 -240 -1715 -903 -173 166 1538 2325 -84 -2367 -1633 588
1766 588 1706 903 32 -531 -1746 -1836 260 1909 615 -1173 -1564 -1342 -343 1187 2057 668 -1802
1783 -1802 -1855 -162 1456 1381 1464 571 -862 -1904 -34 2308 1939 15 -1123 -1260 -987 297 2289
$$ packed form
1657b33J110o06j495L30J531j29q83L06L44r71k45J364R85j023r27J055M51j216
1675b52K29J966m0k473n01J756N36q88m14M89n00r48O66J028J73j356k81L37j32
1694f05L68J534K31j702j009J261P47k69j5R66j286j525P67J972M64k154l25L30
1712b50j52l72R29R03j054j746K99Q83L16L65M92r20j224k26K395R63n09j134
1730d2J21o44n75J236J875p33k348p39R57Q59J42P21l64j797j245J205K152j3
1748G68p80m47r79o68J338K309J82j963j475Q12P30L39J372P87k409k283P34K221
1766E88J118q03q71n63j215r0K096J649j294j788l91K22R99J530Q70j389k470
1783a802n3J693J618p5Q3q93j433j042J870K342l69j924j138j37K73J284J992
$$ plain form
1800 2289 1932 -851 -2416 -758 490 1091 1312 1274 -458 -2310 -992 1479 2562 936 -412 -953
1816 -953 -924 135 1998 3153 1014 -1497 -1785 -381 1096 1517 1637 -148 -2261 -2169 48 1862 1524
1833 1524 -179 -932 -1925 -1784 716 2755 1381 -1049 -1905 -1098 85 1213 2165 1483 -1266 -2667 -749
1850 -749 1340 1932 611 -465 -2056 -2389 -1004 1699 1997 -391 -2146 -1958 -883 279 1873 1968 -464
1867 -464 -2883 -1900 388 1713 1304 799 -570 -2256 -1385 986 2372 1137 -846 -2052 -1750 -865 1467
1884 1467 1808 283 -2341 -2766 -568 1027 1393 1230 -187 -2107 -2418 -196 2392 2005 435 -1107
1900 -1107 -1737 -1197 984 2987 2050 -885 -2211 -1237 312 1054 1661 759 -1065 -2922 -1464 1381 1985
1917 1985 965 -559 -1198 -2070 -613 2380 2865 713 -1805 -1722 17 1291 2089 1740 503 -1775 -2092
$$ packed form
1800B289l57k783j565J658J248O01K21l8j732j852J318K471J083j626j348n41
1816i53K9J059J863J155k139k511k88J404J477M21J20j785k113R2K217J814l38
1833A524j703p53r93J41K500K039j374k430q56Q07J183J128R52o82k749j401J918
1850g49K089N92j321j076j591l33J385K703K98k388j755J88J075J162J594R5k432
1867d64k419R83K288J325m09n05j369j686Q71K371J386j235j983j206L02Q85K332
1884A467L41j525k624m25K198J595L66j63j417j920l11K222K588l87j570j542
1900a107o30N40K181K003r37k935j326R74J549P42O07r02j824j857J458K845O04
1917A985j020j524o39q72J457K993M85k152k518Q3J739J274P98l49j237k278l17
$$ plain form
1934 -2092 262 2253 1878 341 -1145 -1843 -1673 583 2246 1553 -984 -2255 -1207 39 1262 2181
1950 2181 952 -1371 -2312 -385 1268 2122 1112 95 -1608 -2058 -298 2410 2436 79 -1352 -1606
1966 -1606 -829 159 1651 1707 -964 -2464 -1687 409 1338 1237 540 -1075 -2151 -1140 1025 2287 1081
1983 1081 -834 -1503 -1345 -465 1319 2430 457 -2019 -2044 -518 627 1092 731 -268 -1906 -2285 -445
2000 -445 1574 1680 213 -1363 -1743 -1224 404 1936 1672 -1083 -1909 -946 280 1368 1625 999 -1148
2017 -1148 -2300 -994 1418 1822 746 -579 -1186 -1770 -421 1762 1813 135 -2028 -1532 -298 901
2033 901 1429 1698 172 -1733 -1567 598 2035 1538 569 -422 -1424 -1036 1023 2430 1042 -1152 -1463
2050 -1463 -646 134 785 1625 652 -1126 -2058 -412 1186 1115 803 -91 -1319 -1510 -35 1990 1821 109
$$ packed form
1934b092K354J991l75j537j486o98J70K256J663o93k537j271J048J246J223R19
1950B181j229k323r41J927J653Q54j010j017j703m50J760K708K6k357j431k54
1966a606P77R88J492N6k671j500P77K096R29j01o97j615j076J011K165J262j206
1983A081j915o69J58Q80J784J111j973k476k5J526J145M65l61r99j638l79J840
2000d45K019J06j467j576l80N19J628J532k64k755q26R63J226J088K57o26k147
2017a148j152J306K412M04j076j325o07n84J349K183N1j678k163M96J234J199
2033I01N28K69j526j905J66K165J437m97r69r91j002L88K059J407j388k194l11
2050a463Q17P80O51Q40r73j778r32J646J598p1l12q94j228j91J475K025j69j712
$$ plain form
2068 109 -498 -657 -430 639 1753 1175 -403 -1605 -858 440 681 659 302 -884 -1748 -1147 686 1415
2086 1415 333 -915 -1110 -798 -375 926 1748 634 -1127 -1080 16 877 1177 1235 10 -1485 -1438 -208
2104 -208 974 731 -457 -1145 -1044 -963 122 1154 459 -767 -1552 -881 -51 531 706 678 -451 -1489
2122 -1489 -484 825 887 -88 -174 -636 -836 -380 704 1122 -166 -1203 -955 -536 193 317 394 -374 -1311
2141 -1311 -904 226 657 152 68 -38 -905 -744 637 1308 570 -779 -482 284 351 428 1026 928 -674 -911
2161 -911 -262 851 455 433 -12 -762 -752 -142 906 754 -132 -248 -73 -53 -91 1017 1141 151 -754 -261
2181 -261 609 487 710 833 1 -883 -648 844 1199 104 -460 -60 -355 -113 250 518 193 -682 -787
2200 -787 118 187 193 520 455 -658 -732 591 1041 298 -295 67 -110 -320 203 504 233 -568 -608 -80 81
$$ packed form
2068A09o07j59K27J069J114n78j578j202P47J298K41k2l57j186q64O01J833P29
2086A415j082j248j95L12M23J301Q22j114j761M7J096Q61L00N8j225j495M7J230
2104b08J182k43j188o88J01Q1J085J032o95j226p85O71Q30N82J75k8j129j038
2122a489J005J309O2r75q6m62k00M56J084M18j288j037K48M19P29J24P7p68r37
2141a311M07J130M31n05q4j06q67J61J381O71p38j349K97P66O7P7N98r8j602k37
2161i11O49J113l96k2m45p50J0O10J048j52q86j16J75K0l8J108J24r90r05M93
2181b61Q70j22K23J23q32q84K35J492L55j095n64M00k95K42L63K68l25q75j05
2200g87R05O9OL27o5j113p4J323M50p43n93L62j77k10N23L01k71q01m0N28J61
$$ plain form
2221 81 -251 199 97 -386 -955 -138 348 250 -102 -304 -28 -519 -361 430 410 -317 -611 88 133 -153 -153 313
2243 313 26 -942 -404 131 -392 -314 116 -39 -488 -537 100 372 -138 -382 -7 296 -272 -354 427 348 38
2264 38 -62 272 179 -349 -113 105 241 -375 -63 378 -270 -485 188 256 101 -463 -269 300 80 -193 340
2285 340 141 -152 -175 296 252 -170 -105 593 -57 -92 93 607 606 -16 -297 203 123 -186 461 544 -412 -575 -175
2308 -175 13 328 3 130 -12 -392 -75 417 432 354 -226 59 5 -118 406 968 483 -299 -241 303 374 218
2330 218 8 75 -678 -567 38 168 170 -514 -500 -439 -337 241 583 157 -332 -539 -170 -80 350 240 307 -682
2352 -682 -621 374 554 731 -74 -274 -286 -802 -211 380 219 -474 -979 -533 -138 396 -16 237 -376 -878 -663
2373 -663 263 724 -56 67 -125 -499 -428 433 766 151 -707 -770 -444 163 227 614 -82 -809 -526 34 507
$$ packed form
2221H1l32M50j02m83n69Q17M86r8l52k02K76m91J58P91k0p27k94O99M5k86%M66
2243C13k87r68N38N35n23P8M30j55m49m9O37K72n10k44L75L03n68q2P81p9l10
2264C8j00L34r3n28K36K18J36o16L12M41o48k15O73O8j55n64J94N69k20k73N33
2285C40j99k93k3M71m4m22O5O98o50l5J85N14jo22k81N00q0l09O47Q3r56j63M00
2308a75J88L15l25J27j42l80L17M92J5p8n80K85n4j23N24N62m85p82N8N44P1j56
2330B18k10O7p53J11O05J30Ko84J4O1J02N78L42m26m89k07L69R0M30j10O7r89
2352f82O1R95J80J77q05k00j2n16N91N91j61o93n05M46L95N34m12K53o13n02K15
2373f63R26M61p80J23j92l74P1Q61L33o15q58o3L26O07O4L87o96p27K83N60M73
$$ plain form
2394 507 502 -43 -223 -442 -445 193 1205 882 -123 -347 -230 125 486 571 545 -263 -844 -57 484 902 724
2415 724 38 -500 -1012 -214 783 614 54 -534 -573 -478 169 981 1060 60 -782 -634 202 808 538 691 -119
2436 -119 -906 -408 368 897 496 23 -758 -856 -51 700 1055 279 -523 -856 -302 277 553 594 270 -549 -895
2457 -895 -346 967 903 240 -706 -730 -543 189 1109 938 -387 -971 -569 -323 583 966 502 -631 -1282 -667
2477 -667 230 511 464 -235 -881 -777 -321 657 1237 280 -867 -957 -910 233 526 564 -70 -1134 -1094 -107 885
2498 885 898 406 -339 -1165 -740 244 1279 527 -628 -1125 -750 -405 554 1233 379 -699 -1078 -477 417
2517 417 638 638 -231 -706 -1303 -174 1055 1077 -204 -612 -945 -579 94 1097 1012 -535 -771 -788 -127 903
2537 903 1085 495 -564 -1018 -585 645 1252 1025 -152 -311 -669 8 914 1118 367 -889 -905 -317 489
$$ packed form
2394E07nn45j80k19lO38J012l23j005k24J17L55L61Q5k6q08n81P87N41M18j78
2415G24o86n38n12P98R97j69n60n88l9R5O47Q12P9j000q42J48Q36O06k70J53q10
2436a19p87M98P76N29m01m73p81r8Q05P51L55p76q02l33N54N79K76M1l24q19l46
2457h95N49J313o4o63r46k4J87P32R20j71j325n84M02K46R06L83m64j133o51O15
2477f67Q97K81m7o99o46J04M56R78N80r57j147r0M7J143K93L8o34j064M0R87R92
2498H85J3m92p45q26M25R84J035p52j155m97L75L45R59O79q54j078l79O01Q94
2517D17K21%q69m75n97J129J229K2j281m08l33L66O73J003q5j547k36j7O61J030
2537I03J82n90j059m54M33J230O07k27j177j59l58O77R06K04p51j256j6N88Q06
$$ plain form
2556 489 830 662 57 -998 -1200 -102 1184 1023 137 -340 -515 -509 545 1276 669 -135 -800 -533 -223
2575 -223 686 942 344 -812 -959 -465 331 1048 446 -1 -625 -1030 -373 566 1112 373 -857 -773 -204 288
2595 288 630 751 -106 -1049 -575 -45 1094 821 225 -340 -1103 -740 326 1127 589 -248 -972 -945 -232 431
2615 431 1162 382 -865 -1059 -631 337 785 709 170 -858 -1228 -74 1143 1128 163 -581 -812 -584 377
2634 377 839 742 147 -835 -757 -95 668 793 674 -428 -1116 -703 635 609 690 -126 -514 -597 -178 667 1080
2655 1080 564 -710 -800 -422 434 669 572 170 -653 -920 357 612 558 537 -874 -747 -651 292 959 470
2675 470 -201 -654 -232 100 507 844 465 -424 -858 -158 639 761 372 -108 -331 -848 -161 819 947 -18
2695 -18 -374 -794 -270 290 380 578 -172 -762 -507 393 620 395 231 -356 -840 -900 178 937 354 -317 -506
$$ packed form
2556D89L41j68o05j055k02J098J286j61q86m77j75OJ054P31o07q04o65K67L10
2575b23R09K56n98j156j47M94P96P17o02m47o24m05O57R39N46p39j230Q4N69M92
2595B88L42J21q57r43M74N30J139k73n96n65p63L63J066Q01n38q37p24K7P13O63
2615D31P31p80j247j94M28R68M48p6n39j028l70J154J217j5r65p44k31K28R61
2634C77M62r7n95r82P8O62P63J25j19j102o88M13J338k6Q1q16l88q3M19Q45M13
2655A080n16j274r0L78Q56K35r7m02q23k67J277K55n4k1j411J27R6R43O67m89
2675D70o71m53M22L32M07L37l79q89m34P00P97J22l89m80k23n17O87R80J28r65
2695a8l56m20N24N60R0J98p50n90K55R00K27k25j64n87m84o0J078P59n83o71j89
$$ plain form
2716 -506 -340 -208 522 768 249 -819 -649 -477 162 408 494 232 -665 -397 -329 706 369 -321 -477 -616
2736 -616 -286 40 420 415 -260 -564 -634 -103 200 703 205 -350 -591 -447 316 759 404 -4 -467 -82 -203
2757 -203 505 417 327 -814 -545 -203 96 295 459 218 -520 -667 -46 203 579 -22 -473 -268 -260 316 555
2778 555 378 -400 -533 -98 -16 86 372 316 -126 -378 -103 192 527 79 -218 -98 -162 118 361 603 314
2799 314 -266 -273 -422 168 450 581 67 -442 -345 59 145 164 331 -283 -160 9 326 610 222 -339 -249 17
2821 17 8 395 342 88 -242 -217 146 182 155 134 -168 -464 -254 -165 396 309 -30 -29 -362 -332 -5 176 255 -588 -366
2846 -366 -201 282 -364 -125 -26 -433 -101 -187 166 225 56 -214 -58 -8 -231 150 75 -211 -92 11 -5 -231
2868 -231 -47 108 -211 -258 -162 174 92 -208 -143 -151 -208 -55 14 185 -128 -142 -286 -317 246 -94 -18 240 125 -64
$$ packed form
2716e06J66J32P30K46n19j068J70J72O39K46Q6k62q97K68O8J035l37o90j56j39
2736f16L30L26L80no75l04p0N31L03N03m98n55k41J44P63M43l55m08m63L85j21
2757b03P08q8r0j141K69L42K99J99J64k41p38j47O21K49L76o01m51K05QN76K39
2778E55j77p78j33M35Q2J02K86n6m42k52K75K95L35m48k97J20o4K80K43K42k89
2799C14n80pj49N90K82J31n14n09R7M04Q6J9J67o14J23J69L17K84l88n61R0K66
2821A7rL87n3k54l30K5L63L6k7k1l02k96K10Q9N61q7l39Jl33L0L27J81P9q43K22
2846c66J65M83o46K39R9m07L32q6L53N9j69k70J56N0k23L81p5k86J19J03j6k26
2868b31J84J55l19m7R6L36q2l00O5qn7J53O9J71l13j4j44l1N63l40P6K58j15j89
$$ plain form
2892 -64 107 274 -13 -50 81 -68 129 117 -17 66 -179 -108 122 124 -114 218 128 144 38 450 346 32 -35
2915 -35 143 12 119 181 167 505 -29 176 -104 321 -8 -79 80 78 86 270 338 103 -123 -142 -324 296 -69
2938 -69 7 -13 46 192 130 128 182 156 -255 87 -186 37 429 349 -198 -155 -66 47 222 242 -247 25 -104 -77 181
2963 181 78 -216 32 -237 -265 -34 404 17 -160 -404 -210 -160 -54 191 145 -162 -661 33 243 233 102
2984 102 -511 -513 -143 -292 303 248 186 -665 -104 -179 -99 240 235 21 -143 -370 240 448 80 70 -343 -396 -135
3007 -135 595 402 123 -353 -593 -221 195 428 711 125 -496 -208 202 215 316 -70 -248 -196 -326 77 536
3028 536 247 52 -283 -285 -92 224 199 412 -58 -354 -256 277 295 -130 134 -323 -472 -95 528 405 343 -330
3050 -330 -462 -330 -43 378 259 -220 -166 -309 26 358 502 415 -302 -421 -329 146 605 437 124 -65 -220
$$ packed form
2892f4J71J67k87l7J31j49J97j2j34Q3k45P1K30Kk38L32r0J6j06M12j04l14o7
2915c5J78j31J07O2j4L38n34K05k80M25l29p1J59kQJ84O8k35k26j9j82O20l65
2938f9P6k0N9J46o2kN4k6m11L42k73K23L92q0n47M3Q9J13J75K0m89K72j29K7K58
2963A81j03k94K48k69k8K31M38l87j77k44J94N0J06K45m6l07m99O94K10j0j31
2984A02o13kL70j49N95n5o2q51N61p5Q0L39nk14j64k27O10K08l68j0m13n3K61
3007a35P30j93k79m76k40L72M16K33K83n86o21K88M10J3J01l86j78N2j30M03M59
3028E36k89j95l35kJ93L16k5K13m70k96R8N33J8m25K64m57j49L77O23j23o2o73
3050c30j32J32K87M21j19m79N4j43L35L32J44q7p17j19R2M75M59j68l13j89j55
$$ plain form
3071 -220 38 535 281 264 -482 -513 -279 52 254 431 343 -418 -540 -21 394 639 261 -310 -501 -629 -378
3092 -378 488 402 61 -668 -207 -443 27 394 137 -118 -654 -558 89 413 189 -57 -527 -662 -238 211 255
3113 255 315 -533 -446 -227 -8 304 475 -179 -560 -466 -156 427 321 0 -197 -481 -432 -97 303 72 8 -306
3135 -306 -573 133 462 478 269 -95 -675 -204 312 699 266 101 -430 -277 -92 427 665 185 -168 -546
3155 -546 -495 178 560 451 86 -209 -643 -125 313 518 50 -139 -338 -422 312 539 587 -170 -123 -358 192
3176 192 454 700 329 -173 -690 -481 88 81 393 -54 -484 -601 -439 502 787 182 -325 -302 -235 244 397
3197 397 536 14 -597 -109 -91 -94 716 644 -501 -632 -148 -86 410 374 -64 -598 -596 -264 262 640 126 -302
3219 -302 -803 -455 -26 431 313 -167 -423 -604 -17 519 525 383 -406 -581 -545 22 490 372 -63 -411 -561
$$ packed form
3071b20K58M97k54j7p46l1K34L31K02J77q8p61j22N19M15K45l78n71j91j28K51
3092c78Q66q6l41p29M61k36M70L67k57k55n36R6O47L24k24k46m70j35M24M49M4
3113B55O0q48Q7K19K19L12J71o54l81R4L10N83j06l21j97k84M9L35M00k31o4l14
3135c06k67P06L29J6k09l64n80M71N16L87m33j65n31J53J85N19K38m80l53l78
3155e46N1O73L82j09l65k95m34N18M38K05m68j89j99q4P34K27M8p57M7k35N50
3176A92K62K46l71n02n17K09N69pL12m47m30j17J62R41K85o05n07K3O7M79J53
3197C97J39n22o11M88J8lQ10p2j145j31M84O2M96l6m38n34KL32N26L78n14m28
3219c02n01L48M29M57j18m80k56j81N87N36Oj42p89j75L6N67M68j18m35l48j50
$$ plain form
3240 -561 -230 272 668 236 -49 -399 -663 128 548 307 63 -291 -387 -398 270 336 96 30 -514 78 427
3261 427 454 394 -69 -566 -319 119 148 317 286 -433 -400 -173 214 404 316 -188 -524 -403 -156 729 586 480
3283 480 -208 -493 -96 -190 481 391 7 -207 -504 19 588 401 14 -270 -414 -140 423 406 572 48 -368
3304 -368 -646 40 406 628 160 -293 -174 -482 278 343 11 -10 -151 -422 -162 290 573 179 -559 -250 -348
3325 -348 -61 166 347 152 -281 -203 5 -42 6 54 -572 -293 -56 43 432 288 12 -442 -283 -111 116 300
3347 300 450 -53 -166 -252 -88 167 89 64 -324 -481 -148 207 463 260 -72 -249 -397 -73 141 170 -95
3368 -95 -272 -303 -97 -20 294 -5 -453 -73 -71 280 150 200 27 -367 -413 131 -24 216 124 -194 -380 -285 -103
3391 -103 183 50 83 -149 -643 203 330 258 342 -263 -542 -13 123 517 256 -25 -161 -323 58 410 291
$$ packed form
3240e61L31N02L96m32k85l50k64P91M20k41k44l54r6j1O68O6k40o6n44N92L49
3261D27K7o0m63m97K47M38K9J69l1p19L3K27L87J90q8n04l36J21K47Q85j43j06
3283D80o88k85L97r4O71r0l84k14k97N23N69j87l87k84j44K74N63j7J66n24m16
3304c68k78O86L66K22m68m53J19l08P60O5l32k1j41k71K60M52K83l94p38L09r8
3325c48K87K27J81j95m33P8K08m7M8M8o26K79K37R9L89j44k76m54J59J72K27J84
3347C00J50n03j13q6J64K55p8k5l88j57L33L55K56k03l32j77j48L24K14K9k65
3368i5j77l1K06P7L14k99m48L80KL51j30N0j73l94m6N44j55K40r2l18j86R5J82
3391a03K86j33L3k32m94Q46J27p2Q4o05k79N29J36L94k61k81j36j62L81L52j19
$$ plain form
3412 291 -216 -222 -250 -130 362 272 163 46 -132 -222 -150 330 266 105 -23 52 -256 179 202 448 166 -101 -267
3435 -267 225 467 396 83 -98 -145 -266 6 372 79 -158 -84 95 -97 116 291 -10 85 -22 190 216 168
3457 168 -85 -92 -57 -349 54 101 51 -85 -304 41 -225 1 20 20 118 -81 -233 -258 -338 -228 157 20 -10 -184
3481 -184 -14 164 75 34 -192 9 -368 -139 -5 -77 -175 -193 -302 -25 12 184 -51 -317 217 -174 117 -122
3503 -122 -160 46 256 104 42 212 13 -136 134 -34 207 -129 -111 183 -263 -134 -122 -88 150 -156 36 119
3525 119 227 -149 162 -45 21 -66 -74 486 -4 -156 437 185 111 -118 92 -1 -207 -173 169 173 173 167 -13 -133
3549 -133 -26 262 302 -103 -94 -48 217 317 122 223 300 14 122 102 46 197 -97 -31 -189 40 -99 119 102
3572 102 -168 -57 -196 146 141 181 212 85 -335 13 150 -134 -46 71 115 -89 -23 241 251 -159 -331 -2 -294
$$ packed form
3412B91n07ok8J20M92r0j09j17j78r0P2M80o4j61j28P5l08M35K3K46k82k67j66
3435b67M92K42p1l13j81m7j21K72L66k93k37P4J79j92K13J75l01R5j07K12K6m8
3457A68k53pL5k92M03M7n0j36k19L45k66K26J9%R8j99j52k5q0J10L85j37l0j74
3481a84J70J78q9m1k26K01l77K29J34p2r8j8j09K77L7J72k35k66N34l91K91k39
3503a22l8K06K10j52o2J70j99j49K70j68K41l36J8K94m46J29J2L4K38l06J92Q3
3525A19J08l76L11k07O6q7qN60m90j52N93k52p4k29K10r3k06L4L42M%oj80j20
3549a33J07K88M0m05RM6K65J00j95J01P7k86J08k0n6J51k94O6j58K29j39K18j7
3572A02k70J11j39L42nM0L1j27m20L48J37k84Q8J17M4k04O6K64J0m10j72L29k92
$$ plain form
3595 -294 -117 154 25 222 -38 -212 -8 78 86 -81 -124 -214 -82 116 190 334 60 164 -220 -214 83 64 -4
3618 -4 -183 -228 -126 -148 15 -241 -184 -133 -334 -35 166 19 170 -126 -306 -257 -65 43 260 -210 -238 -442 -211
3641 -211 74 159 187 -336 -113 92 -78 562 580 -258 -130 26 10 253 227 350 -258 -339 -156 206 221 334
3663 334 -29 -344 -174 -73 279 -174 6 -124 -214 -114 197 320 -16 -157 58 -233 114 236 10 23 -146
3684 -146 97 -61 99 365 165 -154 -201 -283 5 181 20 28 -262 -97 -231 -31 47 152 -105 155 -168 -10
3706 -10 217 151 303 -270 -350 -241 160 518 -39 119 -274 -242 21 129 335 81 -345 -314 -326 155 307 280
3728 280 10 -514 -352 40 127 439 -129 -409 -13 -440 342 388 88 -55 -152 -276 -143 117 367 56 -218
3749 -218 -628 -513 58 462 235 -249 -277 -441 48 440 475 22 -247 -284 -143 -20 252 77 -39 -39 -73 44
$$ packed form
3595b94J77K71j29J97k60j74K04Q6Qj67m3r0J32J98P4J44k74J04l84OK97j9o8
3618dj79m5J02k2J63k56N7N1k01K99K01j47J51k96j80M9J92J08K17m70k8k04K31
3641b11K85Q5K8n23K23K05j70O40J8q38J28J56j6K43k6J23o08q1J83L62J5J13
3663C34l63l15J70J01L52m53J80j30r0J00L11J23l36j41K15k91L47J22k26J3j69
3684a46K43j58J60K66k00l19m7q2K88J76j61Qk90J65j34K00P8J05k57K60l23J58
3706a0K27o6J52n73q0J09M01L58n57J58l93L2K63J08K06k54m26L1j2M81J52k7
3728B80k70n24J62L92Q7L12n68k80L96m27P82M6l00j43r7j24J33K60K50l11k74
3749b18m10J15N71M04k27m84k8j64M89L92L5m53k69l7J41J23K72j75j16%l4J17
$$ plain form
3771 44 379 408 145 -186 -106 -403 199 72 744 11 -301 -197 55 342 157 426 -95 -523 -27 -18 341 295
3793 295 213 -413 -214 190 11 143 120 29 -26 168 223 307 -9 47 -302 -298 128 -39 394 163 -197 -212 -13
3816 -13 309 280 -81 -45 -273 -190 91 261 507 155 59 -494 -187 -175 66 -109 -207 -123 -165 -83 155 387 510
3839 510 -370 -441 -153 183 431 210 8 -74 -216 103 276 -12 33 66 -161 -196 -132 183 -165 5 -273 -324
3861 -324 34 78 228 -186 -193 -444 129 75 178 57 -175 -641 -354 -191 105 406 135 -77 -440 -182 -43
3882 -43 158 136 60 -96 -59 -233 477 209 84 128 -352 -19 69 353 160 -171 -39 -161 80 381 398 83
3904 83 -130 -147 -126 318 286 150 -37 -399 -56 -155 343 385 72 55 -69 57 102 238 241 -152 -58 52 31 363
3928 363 202 84 -58 6 -229 62 313 387 125 -175 -80 54 229 204 59 -170 -417 -29 210 285 467 -99
$$ packed form
3771D4L35K9k63l31Q0k97O02j27O72p33l12J04K52K87j85K69n21m28M96RL59m6
3793B95q2o26J99M04j79J32k3r1n5J94N5Q4l16N6l49MM26j67M33k31l60j5J99
3816a3L22k9l61L6k28Q3K81J70K46l52r6n53L07J2K41j75r8Q4m2Q2K38K32J23
3839E10q80p1K88L36K48k21k02q2j42L19J73k88M5L3k27l5O4L15l48J70k78n1
3861c24L58M4J50m14pk51N73n4J03j21k32m66K87J63K96L01k71k12l63K58J39
3882d3K01k2p6j56L7j74P10k68j25M4m80L33Q8K84j93l31J32j22K41L01J7l15
3904H3k13j7K1M44l2j36j87l62L43r9M98M2l13j7j24J26M5J36Ll93R4J10k1L32
3928C63j61j18j42O4k35K91K51P4k62l00R5J34J75k5j45k29k47L88K39P5J82n66
$$ plain form
3950 -99 -499 -140 223 242 441 50 16 -306 64 171 538 165 -132 -216 -288 130 112 355 -127 -280 -90 -76
3972 -76 281 332 -104 345 -184 -270 -143 433 532 -169 -106 -91 -51 234 210 -101 155 -254 -425 -132 219 126 186
3995 186 -351 6 -238 117 95 212 53 -308 -238 77 86 42 319 -149 -219 60 252 244 281 -59 -107 -19 12 50
4019 50 -33 -14 -74 -182 -144 156 130 337 98 -101 28 41 5 236 301 -107 -121 109 132 172 -93 -93 -282 -257 205
4044 205 225 -58 -136 69 -131 -84 -56 269 183 -99 -285 -313 -56 131 155 88 -95 -191 -226 243 396 97 14 39
4068 39 -371 -121 175 -47 -128 64 142 100 73 84 -214 34 118 142 -87 104 156 153 -24 -244 -134 202 30 63
4092 63 -36 -164 -137 -133 129 348 -247 -214 24 -75 80 192 49 61 25 -282 179 -186 104 427 47 -16 -76 46
4116 46 -227 245 142 -326 193 121 179 -237 -12 -41 -353 120 186 155 410 66 162 -154 -111 173 43 16 91
$$ packed form
3950i9m00L59L63J9J99l91l4l22L70J07L67l73k97q4p2M18j8K43m82j53J90J4
3972g6L57N1m36M49n29q6J27N76R9p01O3J5M0K85k4l11K56m09j71K93L51r3O0
3995A86n37L57k44L55k2J17j59l61P0L15Rm4K77m68p0K79J92qL7l40m8Q8L1L8
4019E0q3J9o0j08L8L00k6K07k39j99J29J3l6K31O5m08j4K30K3M0k65%j89K5M62
4044B05K0k83p8K05k00M7K8L25q6k82j86k8K57J87K4o7j83r6l5M69J53k99q3K5
4068C9m10K50K96k22q1J92P8m2k7J1k98K48Q4K4k29J91N2lj77k20J10L36j72L3
4092F3r9j28K7MK62K19n95L3K38r9J55J12j43J2l6l07M61l65K90L23l80o3o0J22
4116D6k73M72j03m68N19p2N8m16K25k9l12M73O6l1K55l44R6l16M3K84j30k7P5
$$ plain form
4139 91 102 -77 209 -254 97 -28 -24 18 10 -88 167 -164 160 145 8 -73 175 -382 80 -159 11 66 -188 272
4163 272 153 320 -96 -71 -109 -59 51 -44 157 -160 -113 134 1 -397 -68 39 -237 13 -190 -197 4 -178
4185 -178 356 134 291 -164 96 -48 114 128 274 153 256 211 -215 131 49 0 -201 -49 -18 67 -61 103
4207 103 -165 -294 226 279 -163 72 -144 -75 48 -152 -103 60 -6 -38 -255 85 43 38 -148 -30 7 -260 132
4230 132 128 185 -124 -36 -458 -158 -94 -134 -43 43 -77 207 -487 133 152 90 -213 -128 214 225 42 -226 -205 -246 166
4255 166 71 380 -1 72 -146 -470 -28 -60 -92 29 -23 -72 79 14 -81 214 -39 141 -285 16 111 27 286
4278 286 47 -123 -89 -44 31 -165 30 -137 -66 162 -9 -20 100 -171 -113 -60 23 -155 195 -152 -114 -149 53
4301 53 321 35 88 -7 145 38 51 88 130 -202 -266 -171 -39 55 194 -199 215 -211 -114 82 73 77 -211 -273 -32
$$ packed form
4139I1J1j79K86m63L51j25MM2qr8K55l31L24j5j37q1K48n57M62k39J70N5k54M60
4163B72j19J67m16K5l8N0J10r5K01l17M7K47j33l98L29J07k76K50k03pK01j82
4185a78N34k22J57m55K60j44J62J4J46j21J03m5m26L46q2m9k01J52L1Q5j28J64
4207A03k68j29N20N3m42K35k16O9J23k00M9J63o6l2k17L40m2nj86J18L7k67L92
4230A32mN7l09Q8m22L00O4m0R1Q6j20K84o94O20J9o2l03Q5L42J1j83k68K1m1M12
4255A66r5L09l81P3k18l24M42l2l2J21n2m9J51o5r5K95k53J80m26L01R5q4K59
4278B86k39j70L4M5P5j96J95j67P1K28j71j1J20k71N8N3Q3j78L50l47L8l5K02
4301E3K68k86N3r5J52j07J3L7M2l32o4R5J32R4J39l93M14m26R7J96rMk88o2K41
$$ plain form
4326 -32 -190 208 -60 -174 137 -223 -347 -13 226 -86 -50 -173 -197 133 431 102 12 -180 -447 31 69 7
4348 7 97 -248 81 -172 -77 -49 -113 -208 -347 -377 -126 97 157 -40 -129 -77 -398 30 467 210 235 -246 -222 65
4372 65 169 60 -56 34 -83 109 18 168 140 -278 -261 -12 -31 111 21 -51 -189 -221 -395 52 234 373 -83
4395 -83 -22 -128 98 20 139 206 179 -359 -212 60 304 -176 -78 -75 56 -1 -212 235 -41 165 -216 71 -229
4418 -229 150 157 8 3 -216 81 24 150 4 -151 -82 290 -58 228 331 138 -373 -499 -203 103 50 348
4440 348 -25 -102 -577 -16 -66 286 5 -177 -54 -41 165 -22 150 -474 -406 -246 324 197 284 -81 -191 -379
4462 -379 250 50 53 87 -35 -25 -35 -43 9 94 48 -166 -245 -188 166 131 -161 -98 -129 -316 -81 291 359 63 -109
4487 -109 -247 -93 -5 308 -34 -116 -241 -319 166 109 -18 -101 -390 -199 -21 125 208 150 -2 -410 -22 122
$$ packed form
4326c2j58L98k68j14L11l60j24L34K39l12L6j23k4L30K98l29r0j92k67M78L8o2
4348GR0l45L29k53R5K8o4r5j39l0K51K23O0j97q9N2l21M28M37k57K5m81K4K87
4372F5J04j09j16R0j17J92r1J50k8m18J7K49j9J42r0p2j38l2j74M47J82J39m56
4395h3O1j06K26p8J19O7k7n38J47K72K44m80R8LJ31n7k11M47k76K06l81K87l00
4418b29L79Pj49nk19K97n7J26j46j55O9L72l48K86J03j93n11j26K96L06n3K98
4440C48l73p7m75N61n0L52k81j82J23J3K06j87J72o24O8J60N70j27Q7l65j10j88
4462c79O29k00LL4j22J0j0qN2Q5m6k14p9N7L54l5k92O3l1j87K35L72O8k96j72
4487a09j38J54Q8L13l42q2j25p8M85n7j27q3k89J91J78J46Q3n8j52m08L88J44
$$ plain form
4509 122 161 26 91 71 -170 -320 10 154 51 -205 -225 122 79 -62 25 113 -150 -397 183 278 -8 42 -224
4532 -224 -405 80 30 -50 94 -154 -207 -50 183 184 -57 279 -141 -228 -64 534 123 39 435 35 -288 -178
4554 -178 135 145 60 159 -246 -91 -49 173 -36 -89 -428 -80 225 112 28 57 23 -31 -394 38 215 218 29 -103
4578 -103 -291 29 211 -49 -48 -110 -32 -276 88 130 287 -59 -143 -221 36 28 12 168 -151 -102 118 -12 221 72
4602 72 -73 -4 -87 149 251 133 -16 -142 -86 -63 -97 -60 -141 159 -228 2 -117 -242 130 100 -70 -65 88 62
4626 62 319 103 77 -134 -44 65 10 79 -27 -106 -273 -11 -9 43 326 53 116 -105 -33 86 237 92 -82 -253
4650 -253 -267 415 63 118 -68 -319 -68 -116 174 -88 248 163 63 115 282 -98 -126 115 -232 -101 114 65
4672 65 80 -104 45 -99 238 259 -83 136 -82 15 1 -122 95 232 98 -131 -226 185 135 53 242 314 10
$$ packed form
4509A22L9j35O5k0k41j50L30J44j03k56k0L47m3j41Q7Q8k63k47N80R5k86N0k66
4532b24j81M85n0q0J44k48n3J57K33Jk41L36m20q7J64N98m11q4L96m00l23J10
4554a78L13J0q5R9m05J55M2K22k09n3l39L48L05j13q4K9l4n4l63M32J77Lj89j32
4578a03j88L20J82k60Jo2P8k44L64M2J57l46q4p8K57qj6J56l19M9K20j30K33j49
4602G2j45O9q3K36J02j18j49j26N6K3l4L7q1L00l87K30j19j25L72l0j70NJ53k6
4626F2K57k16k6k11R0J09n5O9j06p9j67K62KN2K83k73O3k21P2J19J51j45j74j71
4650b53j4O82l52N5j86k51K51m8K90k62L36q5j00N2J67l80k8K41l47J31K15m9
4672F5J5j84J49j44L37K1l42K19k18R7j4j23K17J37j34k29r5M11n0q2J89P2l04
$$ plain form
4695 10 174 71 117 -7 -98 -311 49 53 -27 51 327 111 189 161 3 -44 122 -158 -239 -231 -183 -22 -97 88 322
4720 322 -43 -8 -57 38 50 142 -57 -209 45 -49 33 138 190 -97 -152 -241 -276 -77 -157 -314 15 -244 140 -72
4744 -72 -29 247 1 -83 123 146 174 12 -84 -16 281 116 -2 -33 34 79 -115 90 -94 -24 60 -290 102 116
4768 116 -12 -33 143 99 -46 181 143 240 -240 167 -3 317 77 37 297 -6 130 -90 122 -32 44 23
4790 23 35 86 37 -33 -60 256 -9 -88 190 -8 412 19 -127 274 -128 -74 -94 114 240 173 -2 -239 -68
4813 -68 3 307 -100 -78 30 247 157 -40 -194 -204 -88 16 -115 115 -175 -505 0 196 238 209 101 68 -85
4836 -85 -122 0 -59 33 -53 -52 111 79 -2 40 47 41 126 -124 63 17 -62 343 -291 -103 131 -82 98 -182 -60 -95
4862 -95 -412 294 48 190 49 -101 -248 -273 52 340 -21 -34 -54 -197 40 228 25 56 100 -308 125 189
$$ packed form
4695A0J64j03M6j24r1k13L60Mq0P8K76k16P8k8j58m7J66k80q1QM8J61p5J85K34
4720C22l65L5m9R5J2R2j99j52K54r4Q2J05N2k87n5q9l5J99q0j57L29k59L84k12
4744g2M3K76k46q4K06K3K8j62r6O8K97j65j18l1O7M5j94K05j84P0Q4l50L92J4
4768A16j28k1J76m4j45K27l8R7m80M07j70L20k40m0K60l03J36k20K12j54P6k1
4790B3J2N1m9p0k7L16k65p9K78j98M20l93j46M01m02N4k0K08J26o7j75k37J71
4813f8P1L04m07K2J08K17r0j97j54j0J16J04j31K30k90l30N05J96M2k9j08l3j53
4836h5l7J22n9R2q6JJ63l2q1M2PoQ5k50J87m6p9M05o34J88K34k13J80k80J22l5
4862i5l17P06k46J42j41j50j47k5L25K88l61j3k0j43K37J88k03L1M4m08M33O4
$$ plain form
4884 189 142 -13 -283 -15 -17 151 160 -118 17 193 133 133 64 225 151 -225 -125 140 435 229 -43 -268 26
4907 26 -140 400 -49 100 0 -19 53 87 166 226 137 -108 -287 -229 181 -93 -58 -107 -52 -266 -26 -70 347 16
4931 16 -67 185 161 -162 54 38 156 -202 -313 53 174 159 73 -314 -408 -11 162 -42 265 -54 -339 -117
4953 -117 -225 -141 356 199 160 -195 84 121 -103 157 228 -111 9 -268 95 276 114 25 -186 -307 -164 3
4975 3 216 331 -279 -6 73 304 36 99 -195 106 32 114 44 -260 -47 -147 -140 1 -184 244 96 -87 15
4998 15 -290 163 161 -8 140 -6 -88 -162 253 482 103 -91 -111 206 -60 262 181 37 -310 -114 52 95 -31
5021 -31 162 101 68 83 -200 40 -4 -25 -186 -362 29 50 237 -74 -88 -113 8 -204 333 -60 93 32 -230
5044 -230 94 201 36 200 116 120 -290 113 256 141 221 188 -169 -21 111 78 51 108 5 62 -59 145 -17
$$ packed form
4884A89m7j55k70K68kJ68Rk78J35J76o0%o9J61p4l76J00K65K95k06k72k25K94
4907B6j66N40m49J49j00j9P2L4P9O0q9k45j79N8M10k74L5m9N5k14K40m4M17l31
4931A6q3K52k4l23K16j6J18l58j11L66J21j5q6l87r4L97J73k04L07l19k85K22
4953a17j08Q4M97j57l9l55K79L7k24K60P1l39J20k77L63J81j62q9k11j21J43J67
4975CK13J15o10K73P9K31k68O3k94L01p4Q2p0l04K13j00PJ41j85M28j48j83J02
4998A5l05M53kj69J48j46q2p4M15K29l79j94k0L17k66L22q1j44l47J96J66M3j26
5021c1J93o1l3J5k83K40m4k1j61j76L91K1J87l11j4k5J21k12N37l93J53o1k62
5044b30L24J07j65J64q4Mm10M03J43j15Q0l3l57J48J32l3k7N7j03N7j21K04j62
$$ plain form
5067 -17 73 -275 72 -198 102 117 -193 -89 -198 -271 -69 172 103 -3 -349 -83 -38 23 198 79 -132 -375
5089 -375 -282 40 -92 114 41 -345 -59 -63 224 -27 -63 -111 -314 -366 331 -74 130 46 -69 396 146 -23 -122
5112 -122 -182 -135 -471 -112 -45 -45 366 159 -265 -276 83 160 -90 1 321 -307 -350 191 223 176 40 20 -123 79
5136 79 -152 301 -205 -125 10 -151 90 314 179 -242 -70 -279 -126 395 222 70 32 -11 -114 126 79 -7
5158 -7 24 44 205 -104 1 92 -82 -62 -157 -80 67 97 203 307 -58 21 233 238 204 -161 259 -133 240 269 147
5183 147 -3 258 105 -85 52 330 200 -87 -36 -233 -204 41 134 40 124 -144 21 -177 40 48 -231 116
5205 116 -45 -132 35 -34 258 -39 -172 153 -11 179 225 -78 367 40 -307 -285 166 155 -32 -134 45 -217
5227 -217 187 8 -61 -159 16 -277 111 -53 241 -14 -70 23 267 287 42 157 -84 -107 -159 43 49 73 -169
$$ packed form
5067a7R0l48L47k70L00J5l10J04j09p3K02K41o9j06l46K66M5O1J75j19k11k43
5089c75R3L22j32K06p3l86K86mK87k51l6m8k03n2O97m05K04q4j15M65k50j69r9
5112a22o0M7l36L59O7%M11k07m24j1L59P7k50R1L20o28m3N41L2m7j36k0j43K02
5136G9k31M53n06Q0J35j61K41K24j35m21J72k09J53N21j73j52l8m3j03K40m7q6
5158gL1K0J61l09J05R1j74K0r5P7J47L0J06J04l65P9K12Nl4l65M20l92L73K9j22
5183A47j50K61j53j90J37K78j30k87N1j97K9K45R3r4Q4k68J65j98K17Qk79L47
5205A16j61q7J67o9K92k97j33L25j64J90M6l03M45l27l47K2M51j1j87j02J79k62
5227b17M04j79o9r8J75k93L88j64K94k55n6R3K44K0k45J15k41k3n2K02OK4k42
$$ plain form
5250 -169 -99 -92 -108 -12 -58 -68 -79 -164 -303 -199 302 28 -245 -13 -106 15 -53 414 216 -165 -190 -238 19 175
5274 175 -40 -155 -121 -75 -129 115 240 -121 138 -55 -212 196 -28 -144 29 -3 -106 169 -28 27 -273 167
5296 167 -35 -173 152 274 97 143 52 -583 28 -34 130 153 76 -253 -18 -235 29 3 -68 -271 228 -86
5318 -86 115 -22 -18 487 39 -56 -14 193 -84 -103 -28 206 -440 195 47 -230 -28 -57 -69 -5 18 35 -93 -284
5342 -284 -144 311 125 -22 -262 -54 -329 -49 -3 133 -79 -15 -150 -73 -112 312 87 -38 314 -287 -41
5363 -41 -86 35 -175 240 95 -159 75 -3 -110 83 -188 -216 271 45 27 148 -202 133 345 94 -7 33
5385 33 170 187 326 -159 20 -171 10 -163 195 -85 -33 72 -41 -74 109 -41 -167 87 -53 -17 -101 -74
$$ packed form
5250a69P0Pj6R6m6j0j1q5j39J04N01k74k73K32r3J21o8M67j98l81k5m8K57J56
5274A75k15j15L4M6n4K44J25l61K59j93j57M08k24j16J73l2j03K75j97N5l00M40
5296A67k02j38L25J22j77M6r1o35O11o2J64K3p7l29K35k17K64k6p1k03M99l14
5318h6K01j37MN05m48r5M2K07k77j9P5K34o46O35j48k77K02k9j2O4K3J7j28j91
5342b84J40M55j86j47k40K08k75K80M6J36k12O4j35P7l9M24k25j25L52o01K46
5363d1m5J21k10M15j45k54K34p8j07J93k71k8M87k26j8J21l50L35K12k51j01M0
5385C3J37J7J39m85J79j91J81j73L58k80N2J05j13l3J83j50j26K54j40L6q4K7
$$ [...]
8191b37
##END NTUPLES=NMR FID
##END=
