##TITLE=1H_LacDMe-A2-1-f7
 CDCl3, 8 sc, 
 30.12.2019
##JCAMPDX= 6.0         $$ Bruker NMR JCAMP-DX V2.0
##DATA TYPE= NMR FID
##DATA CLASS= NTUPLES
##ORIGIN= UXNMR, Bruker Analytische Messtechnik GmbH
##OWNER= root
$$ XWIN-NMR		Version 3.5
$$ Mon Dec 30 13:57:21 2019 Russian Standard Time (UT+4h)  she@DPX200
##.OBSERVE FREQUENCY= 200.1315
##.OBSERVE NUCLEUS= ^1H
##.DELAY= (6, 6)
##.ACQUISITION MODE= SIMULTANEOUS
##.ACQUISITION SCHEME= undefined
##.AVERAGES= 8
##.DIGITISER RES= 18
##SPECTROMETER/DATA SYSTEM= spect
##.PULSE SEQUENCE= zg30
##.SOLVENT NAME= CDCl3
##.SHIFT REFERENCE= (INTERNAL, CDCl3, 0, 15.7039)
##AUDIT TRAIL= $$ (NUMBER, WHEN, WHO, WHERE, WHAT)
$$ ##TITLE= Audit trail, XWIN-NMR		Version 3.5
$$ ##JCAMPDX= 5.01
$$ ##ORIGIN= Bruker BioSpin GmbH
$$ ##OWNER= she
$$ F:/spectra/data/she/nmr/H-F/1/audita.txt
$$ ##AUDIT TRAIL=  $$ (NUMBER, WHEN, WHO, WHERE, WHAT)
(   1,<2019-12-30 13:56:08.79 +0400>,<she>,<DPX200>,
      <created by zg, POWCHK disabled, PULCHK disabled
       configuration hash MD5:
       00 E9 B6 7A A2 85 ED C7 34 08 36 98 17 FE 4E 26
       data hash MD5: 16K
       64 2C 2A 40 F5 DB 27 26 F8 1E CB 27 07 69 6F CB>)
$$ ##END=
$$ 
$$ hash MD5
$$ 79 14 F3 AD 54 8B 56 34 77 8D BD 3C 74 AC 3B 93
##$RELAX= 
##$RELAX= 
##$RELAX= 
##$RELAX= 
##$RELAX= 
##$RELAX= 
$$ Bruker specific parameters
$$ --------------------------
##$DU= <F:/spectra>
##$EXPNO= 1
##$NAME= <H-F>
##$PROCNO= 1
##$TYPE= <nmr>
##$USER= <she>
##$AMP= (0..31)
100 100 100 100 100 100 100 100 100 100 100 100 100 100 100 100 100 100 
100 100 100 100 100 100 100 100 100 100 100 100 100 100 
##$AQSEQ= 0
##$AQ_mod= 1
##$AUNM= <au_zg>
##$AUTOPOS= <>
##$BF1= 200.13
##$BF2= 200.13
##$BF3= 200.13
##$BF4= 200.13
##$BF5= 200.13
##$BF6= 200.13
##$BF7= 200.13
##$BF8= 200.13
##$BYTORDA= 1
##$CFDGTYP= 0
##$CFRGTYP= 5
##$CHEMSTR= <none>
##$CNST= (0..31)
1 1 145 1 1 1 1 1 1 1 1 1 1 1 1 1 1 1 1 1 1 1 1 1 1 1 1 1 1 1 1 1 
##$CPDPRG= <>
##$CPDPRG1= <>
##$CPDPRG2= <>
##$CPDPRG3= <>
##$CPDPRG4= <mlev>
##$CPDPRG5= <mlev>
##$CPDPRG6= <mlev>
##$CPDPRG7= <mlev>
##$CPDPRG8= <mlev>
##$CPDPRGB= <>
##$CPDPRGT= <>
##$D= (0..31)
0 1.2 0 0 0 0 0 0 0 0.06 0 0.03 0 0 0 0 0.0002 0 0 0 0 0 0 0 0 0 0 0 0 
0 0 0 
##$DATE= 1577699768
##$DBL= (0..7)
120 120 120 120 120 120 120 120 
##$DBP= (0..7)
150 150 150 150 150 150 150 150 
##$DBP07= 0
##$DBPNAM0= <>
##$DBPNAM1= <>
##$DBPNAM2= <>
##$DBPNAM3= <>
##$DBPNAM4= <>
##$DBPNAM5= <>
##$DBPNAM6= <>
##$DBPNAM7= <>
##$DBPOAL= (0..7)
0.5 0.5 0.5 0.5 0.5 0.5 0.5 0.5 
##$DBPOFFS= (0..7)
0 0 0 0 0 0 0 0 
##$DE= 6
##$DECBNUC= <off>
##$DECIM= 24
##$DECNUC= <off>
##$DECSTAT= 4
##$DIGMOD= 1
##$DIGTYP= 9
##$DL= (0..7)
0 120 120 120 120 120 120 120 
##$DP= (0..7)
150 150 150 150 150 150 150 150 
##$DP07= 0
##$DPNAME0= <>
##$DPNAME1= <>
##$DPNAME2= <>
##$DPNAME3= <>
##$DPNAME4= <>
##$DPNAME5= <>
##$DPNAME6= <>
##$DPNAME7= <>
##$DPOAL= (0..7)
0.5 0.5 0.5 0.5 0.5 0.5 0.5 0.5 
##$DPOFFS= (0..7)
0 0 0 0 0 0 0 0 
##$DQDMODE= 0
##$DR= 18
##$DS= 0
##$DSLIST= <SSSSSSSSSSSSSSS>
$$ [...]
##$SUBNAM2= <"">
##$SUBNAM3= <"">
##$SUBNAM4= <"">
##$SUBNAM5= <"">
##$SUBNAM6= <"">
##$SUBNAM7= <"">
##$SUBNAM8= <"">
##$SUBNAM9= <"">
##$SW= 24.9337058887773
##$SWIBOX= (0..15)
0 0 2 0 0 0 0 0 0 0 0 0 0 0 0 0 
##$SW_h= 4990.01996007984
##$TD= 16384
##$TD0= 1
##$TE= 0
##$TE2= 300
##$TE3= 300
##$TEG= 300
##$TL= (0..7)
0 120 120 120 120 120 120 120 
##$TP= (0..7)
150 150 150 150 150 150 150 150 
##$TP07= 0
##$TPNAME0= <>
##$TPNAME1= <>
##$TPNAME2= <>
##$TPNAME3= <>
##$TPNAME4= <>
##$TPNAME5= <>
##$TPNAME6= <>
##$TPNAME7= <>
##$TPOAL= (0..7)
0.5 0.5 0.5 0.5 0.5 0.5 0.5 0.5 
##$TPOFFS= (0..7)
0 0 0 0 0 0 0 0 
##$TUNHIN= 0
##$TUNHOUT= 0
##$TUNXOUT= 0
##$USERA1= <user>
##$USERA2= <user>
##$USERA3= <user>
##$USERA4= <user>
##$USERA5= <user>
##$V9= 5
##$VALIST= <valist>
##$VCLIST= <CCCCCCCCCCCCCCC>
##$VD= 0
##$VDLIST= <DDDDDDDDDDDDDDD>
##$VPLIST= <PPPPPPPPPPPPPPP>
##$VTLIST= <TTTTTTTTTTTTTTT>
##$WBST= 1024
##$WBSW= 4
##$XGAIN= (0..3)
0 0 0 0 
##$XL= 0
##$YL= 0
##$YMAX_a= 501513
##$YMIN_a= -375339
##$ZGOPTNS= <>
##$ZL1= 120
##$ZL2= 120
##$ZL3= 120
##$ZL4= 120
##$ABSF1= 10
##$ABSF2= 0
##$ABSG= 5
##$ABSL= 3
##$ALPHA= 0
##$AQORDER= 0
##$ASSFAC= 0
##$ASSFACI= 0
##$ASSFACX= 0
##$ASSWID= 0
##$AUNMP= <proc_1d>
##$AZFE= 0.1
##$AZFW= 0.1
##$BCFW= 1
##$BC_mod= 2
##$BYTORDP= 1
##$COROFFS= 0
##$CY= 11.3945322036743
##$DATMOD= 1
##$DC= 2
##$DFILT= <>
##$DTYPP= 0
##$F1P= 16.9975609425685
##$F2P= -3.02152046262296
##$FCOR= 0.5
##$FTSIZE= 0
##$FT_mod= 4
##$GAMMA= 1
##$GB= 0.15
##$INTBC= 1
##$INTSCL= 1
##$ISEN= 128
##$LB= 0.24
##$LEV0= 0
##$LPBIN= 0
##$MAXI= 10000
##$MC2= 0
##$MEAN= 0
##$ME_mod= 0
##$MI= 1.114404
##$NCOEF= 0
##$NC_proc= 0
##$NLEV= 6
##$NOISF1= 3.799351
##$NOISF2= 2.8
##$NSP= 1
##$NTH_PI= 0
##$NZP= 0
##$OFFSET= 15.70392
##$PC= 1
##$PHC0= -10150.25
##$PHC1= 20.0008
##$PH_mod= 1
##$PKNL= yes
##$PPARMOD= 0
##$PSCAL= 0
##$PSIGN= 0
##$REVERSE= no
##$SF= 200.130013532006
##$SI= 16384
##$SIGF1= 3
##$SIGF2= 2
##$SINO= 400
##$SIOLD= 16384
##$SREGLST= <1H.CDCl3>
##$SSB= 0
##$STSI= 0
##$STSR= 0
##$SW_p= 3612.71676300578
##$SYMM= 0
##$S_DEV= 0
##$TDeff= 0
##$TDoff= 0
##$TI= <>
##$TILT= no
##$TM1= 0
##$TM2= 0
##$TOPLEV= 0
##$USERP1= <user>
##$USERP2= <user>
##$USERP3= <user>
##$USERP4= <user>
##$USERP5= <user>
##$WDW= 1
##$XDIM= 8192
##$YMAX_p= 0
##$YMIN_p= 0
$$ End of Bruker specific parameters
$$ ---------------------------------
##NTUPLES= NMR FID
##VAR_NAME=  TIME,          FID/REAL,        FID/IMAG
##SYMBOL=    X,             R,               I
##VAR_TYPE=  INDEPENDENT,   DEPENDENT,       DEPENDENT
##VAR_FORM=  AFFN,          ASDF,            ASDF
##VAR_DIM=   8192,          8192,            8192
##UNITS=     SECONDS,       ARBITRARY UNITS, ARBITRARY UNITS
##FACTOR=    0.0002004,     1,               1
##FIRST=     0,             0,               0
##LAST=      1.6414764,     0,               0
##MIN=       0,             -375339,         0
##MAX=       1.6414764,     501513,          0
$$ Real data points
##PAGE= N=1
##DATA TABLE= (X++(R..R)), XYDATA
0@%%%%oJ4qQj6K4l2L7m6N7p2Q8j09J31j51J78k13K49k88L33l84M43n05N76o59
29c51P46q41R47j064J192j332J488j662J848k048K274k523K792l089L421l790
45a992M200m660N180n771O451p241Q175r300J0683j2433J4729j7897K2576l0263
59a7563M5695j26383L83560J92842n99801j88997L49563J58489l28057m1388L62920
70A90880R3312m06190j70106L13819K24407j99211j50700J22158M2547j84882
80a23966q310K49547P5787k43572j26359J68334J07164j40128o4124J57595P2352
91A24320j67173r0891J55542J15025j25516j14822R7424J06201p8825q8126P4630
102G789Q3821o3681p3754M5548L6325o8573k4584J00691M6024j06742p1225Q3455
$$ plain form
0 0 0 0 0 0 -6 8 0 8 -8 16 -16 21 -25 32 -40 48 -61 70 -81 97 -116 133 -155 178 -206 237 -268 308 -351
29 -351 395 -446 501 -563 629 -703 785 -877 971 -1077 1197 -1326 1466 -1623 1798 -1992
45 -1992 2208 -2452 2728 -3043 3408 -3833 4342 -4958 5725 -6708 8021 -9876 12700 -17563
59 -17563 28132 -98251 285309 478151 -121650 -310647 38916 197405 -130652 -172040 190880
70 190880 284192 -121998 -292104 21715 246122 46911 -103789 18369 60916 -123966
80 -123966 -132276 117271 193058 -50514 -176873 -8539 98625 -41503 -105627 51968 124320
91 124320 -42853 -133744 21798 136823 11307 -103515 -6091 100110 21285 -66841 7789
102 7789 91610 27929 -45825 -277 36048 -32525 -57109 43582 89606 -17136 -88361 -4906
114d906O0808q3323n4288R7103P3428q8525q8966O4095Q8339l0412n5311K7492
126E534J9828n7174j6174R4478O0346p8894r4049K1756O4149k897k2673K8618
138B2848K2364n4733o3831K6763Q0625J9016n9449m6490J8495L6323Q08q430K3351
151A7660J6826m6106n7204L0982R0384J4269p7375l4002N9202L1131n8704l5525
163d8462N8499M3393n3121m8246M3236M1719m6598m1034N1429M5421n8419o1589
175g3772N0392P2769l0607o4047K8579N7347l6878o7355L7278Q7888j2385q1958
187c2749m399O4774K989n5874P518N9786r742p0950l393O7955J6767n0976j5810
200b4104L0487j1761l9414K7159O2766j4528o5778M255N3089j4886n1976L3828
$$ plain form
114 -4906 55902 -27421 -81709 15394 88822 297 -88669 -24574 63765 33353 -21958 5534
126 5534 25362 -31812 -47986 46492 106838 27944 -66105 -44349 19800 16903 -5770 22848
138 22848 45212 -9521 -73352 -46589 34036 53052 -6397 -52887 -34392 1931 2739 -5691 17660
151 17660 34486 -11620 -68824 -37842 52542 66811 -10564 -44566 14636 45767 -12937 -48462
163 -48462 10037 53430 309 -47937 -4701 37018 -9580 -50614 815 46236 -12183 -73772
175 -73772 -23380 49389 18782 -45265 -16686 40661 3783 -63572 -26294 61594 49209 -32749
187 -32749 -37148 27626 30615 -25259 -17741 42045 32303 -38647 -42040 25915 42682 -8294 -24104
200 -24104 6383 -5378 -44792 -17633 45133 30605 -35173 -30918 22171 7285 -44691 -10863
212a0863P7994k7233r9475K233J01362K9453p3211l5605M2495J1355m0845O692
224a5648N7785L341n8125k0262L1156K048k1888K6381M3014l3430o9353J3210
236d1771P5033J0117n9016j4431M4877O036m5693j630O1195K4719n2172m5845
248c8581J7367L2766K167m354J0235k76k3588j7111P722J4077P828N638n232k4902
262a6244j7161K2567L9259J495l7331k5600J2530K2592M892k442Q671R762j2472
275A0518l3066j6149K9977M7582N709m7666l5665K2329L8677n560k9328K120K1483
288A0961j3398l2095J1379M8018J3350l9433l2498N772J4525Q888J8163J6473
300C0105j7490l4113l911K2297Q518j364J3229K930l5685k7618L5879N3210j2330
$$ plain form
212 -10863 67131 39898 -59577 -57344 44018 73471 260 -35345 7150 18505 -22340 -15648
224 -15648 42137 45478 -12647 -32909 -1753 295 -21593 4788 47802 14372 -54981 -41771
236 -41771 33262 43379 -15637 -30068 14809 20845 -24848 -26478 34717 59436 7264 -38581
248 -38581 -21214 11552 13719 9365 19600 19324 -4264 -21375 -13653 424 8252 13890 8658 -16244
262 -16244 -33405 -10838 28421 29916 -7415 -33015 -20485 2107 6999 4557 13228 22990 10518
275 10518 -22548 -38697 -8720 38862 44571 -3095 -38760 -16431 22246 16686 -12642 -10522 10961
288 10961 -2437 -34532 -23153 24865 38215 -1218 -33716 -27944 -13419 -4531 13632 30105
300 30105 12615 -21498 -25409 -3112 5406 4042 17271 20201 -15484 -43102 -7223 45987 33657
313C3657n5651j3758K9806O935j6747J5667L5768j0806n2281j9894L1728K9406
325A3830K889j454o904k5691j2968L1564L3948j7315l6868N802K6501r114k1607
338a7387K1215L6830j6519n2505j0885L6621K1806r810n007O478j1425k0494L683
351a7399K3185P395p391k856l595j1385M484K5244Q631k6082j7820J5669J3878
364A1958j3640m672K6746J1476l1138l0719J2917K7461L274p524K766p329j9265
377a7689K263K6028N527k2113m766J9853k429k7461N968M4268R850m7151l2010
390c9862K7848L3435n189j3144N646k293k1015k875K4016Q996j7547o173J1852
403C695m734j7465J1256K7503r447l5853K185L6079J588l4349J092M0345O365
$$ plain form
313 33657 -21994 -35752 -5946 989 -15758 -91 35677 24871 -27410 -47304 -15576 13830
325 13830 16719 15265 8361 -17330 -30298 1266 35214 17899 -18969 -13167 13334 4220 -17387
338 -17387 3828 40658 24139 -28366 -39251 -2630 19176 9366 4359 10837 -588 -21082 -17399
351 -17399 5786 13181 5790 2934 -661 -12046 -7562 17682 26313 231 -17589 -1920 11958
364 11958 -1682 -6354 20392 31868 730 -29989 -17072 10389 13663 6139 8905 1576 -17689
377 -17689 -15426 10602 16129 -5984 -10750 9103 6674 -20787 -14819 29449 39299 -7852 -39862
390 -39862 -12014 21421 16232 3088 8734 6441 -14574 -17449 6567 15563 -1984 -8157 3695
403 3695 -1039 -18504 -7248 20255 10808 -25045 -22860 13219 14807 -19542 -18450 21895 28260
416B8260m2586j8918L3542K2087k0537j2750J9052P023k3401j0267J8697R528
428I730j1309K97R696j7292k3749K2150M4887r208n4534j1768M4235J9372l1538
441i031j0146L7028J2459m3766k9116L4248M1266r462l0266l148Q890m978N47
454e475K0343R137k2261k3813K274J4423J0332J2475N555k2837l5001N31M0400
467F083K5362j6942k4887j363P842o91L220J5478P708j5614k2005l084J7897K3019
481B2023Q128j7070k8476p811J9648J7242m311q330N890J371j7798j4420J4701
494i213K6285L274j9844j5840k2J0788J4715R853o437j7825j0790M785R315J1313
508A0357J4082J733k7170k9111Q000L5685J4478j9045j6463J363O31o439Q322
$$ plain form
416 28260 -14326 -33244 298 22385 1848 -10902 8150 15173 -8228 -18495 202 9730
428 9730 -1579 -1282 8414 -8878 -32627 -10477 34410 25202 -29332 -41100 3135 22507 -9031
441 -9031 -19177 17851 30310 -13456 -42572 -8324 32942 23480 -6786 -9934 -1044 -6022 -5475
454 -5475 14868 24005 1744 -22069 -19795 -5372 4960 17435 22990 153 -34848 -34317 6083
467 6083 31445 14503 -10384 -11747 -3905 -4596 -1376 14102 21810 6196 -15809 -18893 -996 22023
481 22023 30151 13081 -15395 -23206 -3558 13684 9373 1043 6933 8304 -9494 -23914 -9213
494 -9213 17072 20346 502 -15338 -15360 -4572 10143 19996 13559 -4266 -15056 -10271 -956 10357
508 10357 24439 26172 -998 -30109 -22109 13576 28054 9009 -7454 -6091 -5460 -11899 -3577
521c577J9944j095k5625j4072J2131J3444M758Q392L319k2485k7134J2183L6805
534A6988P610k3762n549J6554o927k9287O031M3266J1318m2725k9989K4670K9625
547A7823r015j4739Q755K034k4631j0597K9571K5862j4958k2943M093P382j0438
560a1801j599K5284J0981k5772j9404K0865K1056j6682j8679J7848J9832k0738
572A191k7677J5196L2864l770k7013k893J4563n919j6121J1728K6484k395k5356
585i118p907J1441K598k169J4279J1606k0419k6938J3958L5681J233k9623o963
598a2341K0289N4k2984L792L4224Q583l5999k5870J8930K4692n736j2301P153
611B486N955j4559j1140J4257J5574o421r731M063O58j1317K612K5410R690k8023
$$ plain form
521 -3577 16367 15272 -10353 -24425 -12294 1150 5908 14300 17619 -4866 -32000 -19817 16988
534 16988 24598 836 -4713 11841 4914 -24373 -18342 24924 36242 -6483 -36472 -11802 17823
547 17823 8808 -5931 2824 4858 -19773 -30370 -799 25063 10105 -12838 -8745 -1363 -11801
560 -11801 -13400 11884 22865 -2907 -22311 -1446 19610 2928 -15751 2097 21929 1191
572 1191 -26486 -11290 21574 17804 -9209 -12102 2461 -3458 -19579 -7851 18633 16238 -9118
585 -9118 -17025 -5584 -2986 -5155 9124 20730 311 -26627 -12669 23012 24245 -5378 -12341
598 -12341 7948 8002 -14982 -11190 23034 31617 -4382 -30252 -11322 13370 7634 -4667 2486
611 2486 8441 -6118 -17258 -3001 12573 6152 -3579 484 1142 -10175 -7563 17847 27537 -486
625d86k3556J7839K6315r081k0556J0754K1631j3898l2255N264L4585O563k8460
638e341j3443J8277J0870j2627p472J1392N981j0618m375P325P29n983Q638J4680
652A8033j0638k5604K302K8152O917k2236o683K0278L853k6864j1190K9156K3645
665B9121k0740l2206L325K3992O348r071q21K711j0478j0980R680J8106L207q452
679C742n195n557r002M811K5648J2222k3135k6636P132K4770K814j2929J767J0707
693A1159j2323k3388N146L2529J3870k2087k4343J697J3168M705K591O030k587
706F167j4231p364Q761J2771K495k548k471q122j0213N020K1957J1810j6575k2358
720a4901R05J6513M042q604K159J1855m264k2354n864K2705J7986j2726j8908
$$ plain form
625 -486 -24042 -6203 20112 11031 -9525 1229 22860 8962 -23293 -18029 16556 23119 -5341
638 -5341 -18784 -507 10363 -2264 -9736 1656 7637 -2981 -7356 -31 698 -5285 3353 18033
652 18033 7395 -18209 -15907 12245 19162 -3074 -9757 10521 14374 -12490 -23680 5476 29121
665 29121 8381 -23825 -20500 3492 9840 769 -52 2659 -7819 -18799 -9119 8987 12194 3742
679 3742 -1453 -7010 -16012 -11201 14447 26669 3534 -23102 -15970 8800 11614 -1315 452 11159
693 11159 -1164 -24552 -19406 13123 26993 4906 -19437 -17740 -4572 133 2724 8754 6167
706 6167 -8064 -15428 -6667 6104 8599 6051 3580 -4542 -14755 -9735 12222 24032 7457 -14901
720 -14901 -13996 2517 6559 -2045 114 11969 7705 -14649 -20513 2192 20178 7452 -11456
733a1456K566J1408j239n308Q142R134q608j4839J686J1248L357n6N810k404j8234
748h793q672J8082J7449q432j5131M871P483j3321j1018K1197K4095j4921l4793
761b1904k997K7043J4738r054n747K784r390j3695Q998K4353N117j5725j0237
774e716M58l719J02K0237J6679k0437l3447L820L2326Q695j9494n459J3785n998
788A832k4514L370L5145J4069k7772k4543R530J6030k625p97J0944j514j9770
801a0615o990J8288J1963q439n889M431m705j4154N895K6272M560k6580j6663
814b2626J6561J7062q412j2220P163J0679p354j1538L600J0348O44m693j224o40
828b650q67M012M711m083p908M291J0984l692j5587r74J9341Q756j5386j4519
$$ plain form
733 -11456 -8890 2518 1279 -4029 4113 13247 4639 -10200 -8514 2734 6091 6035 11845 9441 -8793
748 -8793 -17465 617 18066 9634 -5497 -626 6857 -6464 -17482 3715 27810 12889 -21904
761 -21904 -24901 2142 16880 7826 2079 4863 -4527 -18222 -9224 15129 20246 4521 -5716
774 -5716 -5258 -8977 -8875 11362 28041 7604 -25843 -22023 10303 18998 -496 -5955 7830 1832
788 1832 -22682 -19312 15833 29902 2130 -22413 -12883 3147 522 -275 10669 9155 -10615
801 -10615 -17605 683 12646 4207 -1682 2749 -1956 -16110 -10215 16057 20617 -5963 -22626
814 -22626 -6065 10997 2585 -9635 -2472 8207 853 -10685 -7085 3263 3907 -786 -2010 -2650
828 -2650 -3517 495 5206 1123 -6785 -2494 8490 4798 -10789 -11763 7578 16334 948 -13571
842a3571O628J1742k001p208M284P349m920j0883m09J0501P505j941q619o842
856h385Q81R934P750m267r013M94N503l491p013N962J5306L47j8041j2088Q805
871g316J5963L058q304o468r80K372J738k44K313M953K20j0559r960P353J7471
886A1610M100j4318j0164N223O923l188j397Q011K760r049r055L274P636K421
900D787L28m11n635p422J960R810L922m364k602R14n876o628P240J7002K262j7093
916a806j2874N266J2665M462k207k810m705n805J22P508P001j32l877o685p794
931a1671R90J3750J2540o771j7225n413Q749P497n67J686K978o611j1656K29J2827
946A332Q533k570o139o290o523J758J4800J0074q980j5264m09P923j85j642J0311
$$ plain form
842 -13571 -6943 4799 2798 -4410 -126 7223 2303 -8580 -8989 1512 9017 7076 -1543 -8385
856 -8385 -7504 2430 10180 5913 -3100 -2606 2897 -594 -7607 -1645 13661 14008 -4033 -16121 -7316
871 -7316 8647 11705 3401 -3067 -4047 -1675 63 -181 2132 7085 7305 -3254 -13214 -5861 11610
886 11610 15710 1392 -8772 -3549 3374 186 -1211 6800 9560 511 -8544 -5270 2366 4787
900 4787 5115 4704 -931 -8353 -6393 3417 7339 2975 373 1287 -4589 -11217 -3977 13025 15287 -1806
916 -1806 -14680 -9414 3251 7713 5506 2696 -2009 -7814 -7692 -184 6817 6685 2808 -3877 -11671
931 -11671 -10681 3069 15609 8838 -8387 -13800 -5051 2446 1879 3565 6543 -68 -11724 -11495 1332
946 1332 9865 7295 1156 -5134 -11657 -9899 4901 14975 5995 -9269 -9678 -1755 -1940 -3582 6729
961F729P489j4863j9303O157K3088O097j4072q339M387J269m409L703J0046J91
975H170r355m859J051O03M539R942J671j5416j1513R969J5050l256j0381L766
989a9P672p513j3369O305J8999K905j6056r660N917O277Q44L000K145o731p822
1004g106K552P863M70k343M095Q66j1794q218J3102J6772n954j8221o60J3681
1018E105P74j2034J637J4957J699j7421q724J1295J2410k107o644j926j537k069
1032d585L120O872q3n427m84J254m453l821Q976J1564m988j7024m556J3404R786
1047I555m986p628J384L512k656n206K817Q430K211p034q430O21Q112N656l662
1062B696n703K63K732j723l612L009P137J183p365o599J897P313M026k459n056
$$ plain form
961 6729 14218 -645 -19948 -13791 9297 15394 1322 -7017 -2630 -1361 -5770 -2067 7979 8170
975 8170 -1185 -6044 -4993 -4390 149 10091 11762 -3654 -15167 -5198 9852 6596 -3785 -19
989 -19 7653 140 -13229 -6924 12075 14980 -1076 -10736 -4819 1458 2302 5302 7447 716 -7106
1004 -7106 -4554 3309 3779 1436 5531 6397 -5397 -13615 -513 16259 10305 -7916 -8576 5105
1018 5105 5879 -6155 -4518 10439 12138 -5283 -14007 -2712 9698 7591 947 -979 -2516 -4585
1032 -4585 -1465 5407 5324 -103 -587 667 -3786 -7607 1369 12933 7945 -9079 -13635 -231 9555
1047 9555 4569 -3059 -1675 1837 -819 -6025 -3208 5222 7433 399 -8031 -7410 702 6358 2696
1062 2696 -3007 -2744 -12 -1735 -5347 -2338 4799 5982 -1383 -7982 -6085 1228 5254 2795 -2261
1077b261k468K530L819j950k867K874O695l043j1565k467J2446R093p268j1160
1091g592K454P303j889n007M198O617l464p715lM371L33J114N596j196j1903n016
1107a1799J2673J1062q062r899N545O048r558p633J3846J5439j0350k0456J999
1120a1145J6504K734j0150N92Q737n623j2148L479J5340J847j0038k949L082m201
1134c939l479J2627J2043j1915j8942M584J7552j69j3398K884J3366m443j8670
1147a1899k50J9529P357j3171q433N107J813m693M238J0627k668j3377l010R051
1161B21K605m121L956P833p437j6096K518J8277N557j2722o813O548R32p733J518
1176d957J3973L475j4508j1243N801J0242K616j558j561n464o065L036J0724J807
$$ plain form
1077 -2261 -4729 -2199 1620 -330 -3197 -323 6372 3329 -8236 -10703 1743 10836 3568 -7592
1091 -7592 -5138 2165 276 -4731 -533 6084 2620 -5095 -5098 -727 -394 720 6316 5120 -6783 -11799
1107 -11799 874 11936 3874 -6025 -480 5568 -3990 -11623 2223 17662 7312 -13144 -11145
1120 -11145 5359 8093 -2057 -1465 7272 1649 -10499 -7020 8320 10167 129 -2820 262 -3939
1134 -3939 -7418 5209 17252 5337 -13605 -9021 8531 8362 -5036 -2152 11214 6771 -11899
1147 -11899 -12149 7380 14737 1566 -6867 -1760 53 -4640 -402 10225 7557 -5820 -8830 221
1161 221 2826 -1295 2661 10494 3057 -13039 -10521 7756 13313 591 -6222 326 1258 -6475 -4957
1176 -4957 9016 12491 -2017 -13260 -7459 2783 5399 3841 2280 -3184 -9249 -6213 4511 6318
1190F318o209k317L201k882o607L949J3985L385j4629j1778M860J3375L640n819
1204B472m523R13j317l239M38P627O660m470j1382n299O985J0991J587p262n004
1219d823P04J050O67L527N098q28p054n638J663N929N939J627o106q461j99Q685
1235A780M254n895l656O225K574r847p148J0998J4047n058j6433k952J1010N447
1249E346l783j66L482l794p427K419P989J327l735L97J93o135k201J0079Q620
1264A2611r804j3050M957J2737k270j0851L365J1037m230j4115K029J4268J382
1277H066j1353j927R827R59r243j015Q664P91o278P96O316m206q462N094J2188
1292A0217l107j4799o92J3268K195j0683j199J1081O04j3548m712J1285Q007n089
$$ plain form
1190 6318 109 -2208 993 -1889 -8496 -4547 9438 12823 -1806 -13584 -8724 4651 8291 2472
1204 2472 -2051 -1138 -2455 -5694 -5256 2371 9031 4561 -6821 -12120 -5135 5856 7443 181 -4823
1219 -4823 -4119 -3069 -2402 1125 6223 5395 -1659 -7297 -5634 295 6234 7861 1755 -6706 -6905 1780
1235 1780 6034 139 -3517 2708 5282 -4565 -11713 -715 13332 8274 -8159 -11111 -101 5346
1249 5346 1563 1397 4879 1085 -6342 -3923 4066 5393 1658 2055 2248 -3887 -6088 3991 12611
1264 12611 2807 -10243 -5286 7451 5181 -5670 -2305 8732 4502 -9613 -7584 6684 8066
1277 8066 -3287 -5214 4613 5572 -3671 -4686 3978 4769 -1509 -713 5603 1397 -7065 -1971 10217
1292 10217 7110 -7689 -8381 4887 7082 -3601 -4800 6281 6885 -6663 -11375 -90 7917 2828
1306B828n338J989n70m100K832Q538j71q755k064N065M65l699M967O983n657j4094
1322a0781l46J4301P231p900o863K073Q91m763J052Q983L769p764p859J147N815
1337a014M333J813k824p043l220N909P161j401m955J309K972m427o206M591R761
1352F759L41q868m374L605L417r08p71J373J35j368j741r17J040M797L942m274
1368B188q635m24P799M933k663k507J295j328n481K71Q293M577m223o452j495
1383c852P61K088N636L373o480r037J260Q562J807m206K021M699o443j2305L464
1398h652J7789O677j3208j1900L782P847L17j79L247r47q555l492O202N755N30
1413E213l01k306q528o160R745J4914k132j5205m893R273M291o276o02R522P75
$$ plain form
1306 2828 -2510 -521 -1091 -5191 -2359 6179 6008 -2747 -4811 254 719 -2980 1987 8970 3313 -10781
1322 -10781 -11127 3174 10405 2505 -4358 -2285 -1394 -6157 -5105 3878 7647 -117 -7976 -6829 -1014
1337 -1014 3319 5132 2308 -4735 -7955 -2046 5115 3714 -1241 68 3040 -1387 -7593 -3002 6759
1352 6759 7100 -1768 -6142 -2537 880 -28 -799 574 709 -659 -2400 -3317 -2277 2520 6462 2188
1368 2188 -6447 -6871 928 5861 3198 691 1986 658 -4823 -4552 3741 8318 4095 -2357 -3852
1383 -3852 -3091 -1003 4633 8006 1526 -7511 -6251 2311 4118 -88 1933 6632 189 -12116 -8652
1398 -8652 9137 15814 2606 -9294 -5512 2335 2652 2473 5720 4773 -3782 -7274 -1072 4683 5213
1413 5213 4912 2606 -5922 -12082 -2337 12577 10445 -4760 -9653 -380 3911 -2365 -2967 6555 7330
1428G330j2156n548R201R357k448o301j670J06p11K843L896j183m262R70J947
1443A371m905l732P307R217n888j1937O32J1383J830q417j878P754J719q027l260
1458f831O808N258k326l499j140k108j27M867N317l956o226J497L823l312l055
1473e010N504O824n619j0444O67J0538L871m974l615L80j231j233M738N208p57
1488D847n539k418k70L7L553P211q7j0868o070Q009Q664l373p173K444L457m872
1504b448m363P088Q285l824r122j490N018J358N26L000l91n821k289O363L321
1519E211n196l418N612L395o240m783O836O205n636q002L482P275k566n933J530
1534b228N750l72m845o81J848j88m93L658K268m068l031K338J769k642l19N698
$$ plain form
1428 7330 -4826 -10374 -1173 8184 5736 -565 -2235 -2129 -2840 3 3899 2716 -1546 -576 1371
1443 1371 -3534 -7266 41 9258 3370 -8567 -7935 3448 5278 -3139 -5017 2737 4456 -3571 -6831
1458 -6831 -23 5235 2909 -590 -1730 -3838 -3965 902 6219 2263 -3963 -2466 1357 -1955 -5010
1473 -5010 494 7318 1699 -8745 -8078 2460 6331 1357 -2258 -1878 -3109 -4342 396 5604 4847
1488 4847 -692 -3110 -3380 -3343 210 7421 7334 -3534 -9604 -1595 7069 3696 -3477 -1033 2424 -2448
1504 -2448 -6811 277 8562 4738 -4384 -5874 -856 502 1028 4028 3637 -2184 -4473 1890 5211
1519 5211 15 -3403 2209 5604 -636 -5419 1417 7622 1986 -6016 -2534 4741 2175 -3758 -2228
1534 -2228 3522 3150 -1695 -2376 -528 -716 -1209 2449 4717 649 -2382 -44 1725 -917 -1236 4462
1550D462J550q164n855P649Q814k722r505k132M932J590j463J899L047k229o165
1565d292j868L559M432K150j57m673n765J322Q275M322n286o283R75L113J04k99
1581c71L859K301n588o944l4O812M913j198m705l863Q16L382J085j106p64K028
1597F23j67m221j056N530N369k718o916j073L848K576m14k93P50n44k001k057
1613b764o52K145M866J851n573p248J335Q221L286n795l568L554R94m659n94Q202
1629C601N457o555r212M31P151L704o92p82j756l865j613M335M536j093l076j034
1645d63j738k703K615Q603K110r591q912M566R281Q28l930j8K102l915n006M518
1661a653Q346O65o780m410J311K619K830L070j778o565k923M127M764j764k888
$$ plain form
1550 4462 6012 -2152 -8007 -358 8456 5734 -3771 -5903 -971 619 -844 1055 4102 1873 -4292
1565 -4292 -6160 -2601 1831 3981 3824 -849 -6614 -5292 2983 7305 2019 -4264 -3289 -176 -72 -371
1581 -371 3488 5789 201 -6743 -6777 35 4948 3750 -955 -4818 -4002 -620 465 -641 -1405 623
1597 623 456 -3765 -4821 709 6078 3360 -3556 -4629 -781 1795 1381 1088 1838 1294 -707 -2764
1613 -2764 -3416 -1271 3595 5446 -127 -7375 -6040 2181 5467 -328 -3896 -342 652 -4007 -4601 3601
1629 3601 9058 2503 -6709 -6278 873 4577 3885 3103 1347 -2518 -4131 204 4740 3647 571 -463
1645 -463 -2201 -4904 -2289 6314 8424 -1167 -10079 -5513 3768 4596 666 648 2750 -1165 -6171 -1653
1661 -1653 6693 7358 578 -3832 -2521 98 2928 5998 4220 -2345 -5268 -1141 3623 1859 -1029
1676a029K386J176m729m738M805P678j055p723k240N382L134l491j748L135K467
1691C410k501l926Q27M020K313j243k629k324n86J971K930o4k389p57P41q37k443
1708c487P57M879J808n714n130L177P184Q05o236j928L939J972l687j692N029
1723A676M172l555n680J7L947J406j196j32j07j694j088K178P57j585r10K146
1739C52j66l970r09O434M097n471o762L001O621r40m820J551N651j437o091o73
1755c532N074K287l054j056J550j509j906K166L073k138l836J214L189l141k794
1770d413M997O889m638j0067L04R241L681n171k906M185M19m410p25N501L162
1785F049l825m413L95K416J198J928J91m241m803J932N590J39l841O77L532k175
$$ plain form
1676 -1029 1357 2533 -2196 -6934 -2129 5549 4494 -3229 -5469 -87 3047 -444 -2192 943 3410
1691 3410 909 -3017 -2190 1830 4143 2900 271 -2053 -2639 -668 2262 2198 -191 -948 -207 -1044 -3487
1708 -3487 -2730 2149 3957 -1757 -6887 -3710 3474 4279 -1957 -3885 54 2026 -1661 -3353 1676
1723 1676 5848 2293 -3387 -3370 577 1983 787 655 548 -1146 -2234 -56 701 -884 -1794 352
1739 352 186 -3784 -4693 1741 5838 367 -6395 -3394 3227 2287 -2533 -982 4669 3232 -2859 -3532
1755 -3532 1542 3829 775 -281 1269 -240 -2146 20 3093 955 -2881 -1667 1522 -1619 -4413
1770 -4413 584 7473 2835 -7232 -6928 2313 5994 823 -2083 2102 2521 -1889 -2614 2887 6049
1785 6049 2224 -2189 -1794 622 1820 3748 3939 -302 -5105 -3173 2417 2556 -1285 -608 2924 749
1801G49o157L79P866L598n699m934K484M133n53j866J001J786j743l269J59K862
1817G96L155N7l008m479j316L760L898m11l031j337J146l89j683R90L685J183
1833C016l623l542l2N370L508j609m865j447K553J795j144Q7L025J317n599n202
1849f392K678O995J536m454l812M96J192O16J492J524j796k782o44J344J215K245
1865A453K685j666o681k550O278O364k223n519N83K892k065l095L338N625j611
1880C808p186j638M182K822l22o10q09k848k012L381L867p19k647P96J226l592
1896b301k361N686N749l363p443J47O656J601m053r71L540j238m424o44M880K621
1912D082k731k248j69n54q28K951L321k550m233J030L978j226k823J728M649j848
$$ plain form
1801 749 -5408 -5029 2837 6435 736 -4198 -1714 2419 1866 0 1001 2787 1044 -2225 -2066 796
1817 796 3951 4008 1000 -3479 -4795 -1035 2863 2452 -579 -1916 -770 -1159 -2842 -1852 1833 3016
1833 3016 -607 -4149 -4181 1189 4697 3088 -1777 -3224 -671 1124 -20 67 3092 4409 -1190 -6392
1849 -6392 -3714 3281 4817 363 -3449 -2953 -1761 -1145 347 1871 75 -2707 -3351 -2007 -792 1453
1865 1453 4138 2472 -4209 -6759 -481 5883 3660 -1859 -1276 1616 -449 -3544 -206 5419 3808
1880 3808 -3378 -5016 -834 1988 1666 1056 247 -2601 -4613 -1232 2635 1916 -731 65 1291 -2301
1896 -2301 -4662 1024 6773 3410 -4033 -3886 2770 4371 318 -653 2887 1649 -2775 -3419 1461 4082
1912 4082 1351 -897 -1066 -1620 -2448 503 3824 1274 -2959 -1929 2049 823 -2000 -272 4377 2529
1928B529o216j75O722K932m137l604J775J617j838r24K231K024j170k977j234
1943b445M68K226J679j07k996k326K053L100m95j774P2J563q92k812O87M038K477
1960D516k636l896j337K816L044p58k219n82R99M16j933o67K415K004k077l837
1976c732K05L749K110j403k758Q6J198N35r35K16R07J638L04l058k126J952M102
1993B990n14l984j170L562J294k829k388K758K906k037m258J38L529K120r86j393
2009b62j427j15N07J943O13r11P34P96k096l526K300O054Q11o655m105L881N039
2026C581r53k997O51O03k584k210K631M880L29l105l334r74J508L692K615k252
2042B081m408l36L672J291j812J93K488j452n037r42N984M282k806m733j435J628
$$ plain form
1928 2529 -3687 -3862 2860 5792 1655 -1949 -174 1443 -395 -1319 912 2936 1766 -1211 -2445
1943 -2445 -1977 249 1928 1821 -1175 -3501 -1448 1652 1157 -617 -545 1018 126 -2686 -1999 2039 4516
1960 4516 1880 -2016 -3353 -537 2507 1749 -470 -1052 -53 363 -1570 -2237 178 2182 105 -3732
1976 -3732 -3527 222 2332 929 -1829 -1743 -545 -10 -945 -729 178 1816 2120 -938 -3064 -1112 2990
1993 2990 2476 -1508 -2678 884 2178 -651 -3039 -281 2625 588 -3670 -3532 -3 2117 1131 -262
2009 -262 -1689 -1804 -1297 646 1259 348 1082 1878 -218 -3744 -1444 4610 5421 -1234 -5339 -1458 3581
2026 3581 2628 -369 282 885 -1699 -3909 -1278 3602 3931 826 -2508 -3482 -1974 1718 4333 2081
2042 2081 -2327 -2663 1009 2300 488 681 3169 1717 -3320 -4262 1722 6004 3198 -1535 -2970 -1342
2058a342J577O68P25n74j448q34K55n6R30J748J117l574l435K882M914M3m109
2075e13j182K324k6k328O14L509R41k754k882P23P00O17J277M51k039k433J859
2092a142K004j517p77K584J273l767l887L570O146n90n177j644K278M47p47J620
2108F74K400j682l417o28J591J032J136J319k156m760o30O464L613l923m593J480
2124b080K491j951j450M345L869m045o009R04N143J996k068q70l30j873K6L523
2140A621J733l049j906J748K33l437R34N455J276o464l847M748M889k745l907
2155b718K145K926j707k758K045K359r31j761O65N23j055L65K687j205l189m0
2171a649M379j62n453m66N796K261n219l356L144K814j901j426K081J265k760
$$ plain form
2058 -1342 235 903 1628 1054 -394 -1228 -973 -1029 -99 1649 2766 -808 -4243 -1361 3553 3596 -513
2075 -513 -1695 629 603 -1725 -1111 2398 3339 585 -2297 -1574 -874 -257 1020 1471 -568 -3001 -1142
2092 -1142 862 -655 -1432 1152 2425 -1342 -5229 -1659 4487 3897 -1280 -2924 -646 -199 -946 674
2108 674 3074 1392 -2025 -2653 -1062 -30 1106 2425 269 -4491 -5121 1343 4956 1033 -3560 -2080
2124 -2080 411 -1540 -2990 1355 5224 1179 -4830 -3926 1217 3213 1145 275 -55 -1928 -1902 1621
2140 1621 3354 305 -1601 147 380 -3057 -2123 3332 4608 -1856 -5703 -955 3934 1189 -2718
2155 -2718 -573 2353 646 -2112 -67 2292 1361 -400 265 788 -267 98 2785 1580 -1609 -1649
2171 -1649 2730 2568 -2885 -3351 2445 4706 -513 -3869 -725 2089 188 -1238 843 2108 -652
2186f52j645K466J839q93j51M46k459k315L617N009j483o398j039M893J198l961
2202a528R6M130K44n861j953N096L692k456l125k18Q74k63K166J805j663l284
2218b248N64L291j535k276K962M242l784o347J232P409Q03o431j871M573J284
2233A868l732o76L491R90l483j464K324P21j333J183J810j668l055K094L716k396
2249C90l838L045M872j944o248J99N801J165m962j061L742N0l621J64M098M07
2265B259l099j552P03M91L49K964J318l911m273K678N244o28l484O09K456j917
2281B07l588K413N320K0n704k430K433K657R9N01m93k303k390J879K873m53r41
2298A00N34O3k704j323M288L977k624n629L49L794J930j864m19J659j217k640
$$ plain form
2186 -652 -2297 169 2008 1115 964 1410 -1049 -3364 253 5262 3779 -2619 -3658 1235 2433 -1528
2202 -1528 -1432 2698 2942 -2919 -4872 224 3916 1460 -1665 -1883 -1009 -1272 894 2699 1036 -2248
2218 -2248 -1684 1607 72 -2204 758 5000 1216 -5131 -3899 3510 4313 -2118 -3989 584 1868
2233 1868 -1864 -2540 951 1941 -1542 -3006 -682 39 -1294 -111 1699 31 -3024 -930 2786 390
2249 390 -3448 -403 4469 2525 -3723 -3524 2277 3442 -1520 -2581 1161 1211 -2410 -2246 1852 2259
2265 2259 -840 -2392 -1689 -1198 -849 2115 3433 -478 -4751 -2073 3171 2543 -941 -332 2124 207
2281 207 -3381 -968 4352 4372 -1332 -3762 -1329 1328 1427 1928 1435 -868 -3258 -1379 1494 1041 100
2298 100 634 697 -2007 -3330 958 4935 2311 -3318 -2969 825 2755 891 472 2131 914 -1726
2314a726J37K627J588o46j460j559j413J746K871J67l127j437K459J214k422q35
2330a816K996J791l214k979J470L665M63j882n68J02l17n6O87M69m80N41K87j962
2348h03j895J690L900r16l908j210K883J903k328j153K377J095k983k079K106
2363a321L590l15j524j226o20J97J926J388j189k266L65K031j242j361J138L490
2379C061j782m757q18M650L181k914k698O64J577p82o54J207J375q11j324k31
2395a056J35J023J478M73k444k029J620K885l19l101L91K395k78l446j62L444
2411A009J916k812k188R63J911k09r99l6N09J93j96k35l07L48J603J48j796j528
2429a706J597K012l96j643l90J831M8k131r16K224J733j165k499n53J416J984
$$ plain form
2314 -1726 -1589 1038 2626 1980 520 -1039 -2452 -706 2165 2332 -795 -2232 227 1441 -981 -1816
2330 -1816 1180 2971 -243 -3222 -1752 1913 2376 494 -74 28 -289 -345 342 811 331 872 1159 -803
2348 -803 -2698 -1008 2892 1976 -1932 -3142 -259 1644 -684 -1837 540 1635 -1348 -3427 -1321
2363 -1321 2269 1954 430 -796 -1416 -1219 707 2095 906 -1360 -995 1036 -206 -1567 -429 3061
2379 3061 1279 -3478 -4296 354 3535 621 -2077 -1413 164 -618 -1272 -65 1310 499 -825 -1056
2395 -1056 -921 102 1580 2053 -391 -2420 -800 2085 1766 -1335 -944 1451 1173 -2273 -2435 1009
2411 1009 2925 113 -2075 -1112 799 590 -409 -445 64 257 61 -174 -481 -133 1470 1618 -178 -1706
2429 -1706 -109 1903 1507 -136 -526 1305 1353 -778 -1694 530 2263 1098 -1401 -1954 -538 1446
2445A446l39j062q43M11J87J30J58N74J157p94k078j012K080K286n1k075j442
2462a267M56J199R4l84NN86k05j818m07J550K049Q7k714k263J677K414M32j454
2480C7n88R76m03j381j40K223J572j213k352j163J357K243P47j405k126N8J633
2497G5K30o75K2J563K5k883j939K381L760p66k626j296J147J269n32L29N91M10
2515A085j353q39j01J247J862O3k304k265N06K938J481j806j506P11P40j375p78
2532a694K155K466j721l222q5J640K194o8j169r70j52K70L70Q53m23M03K20j265
2550a98j584Q16K953N22j820k841R76K204L5j264j36J268m41j676l5J515J209
2567A503J59j936j359O05J579J640r47j843L10O57L8j413N35K419K10k720j946
$$ plain form
2445 1446 1107 45 -798 -387 -200 -70 88 662 1819 1025 -1053 -2065 15 2301 2250 175 -1267
2462 -1267 -811 388 482 98 103 689 484 -1334 -1741 -191 1858 1945 -769 -3032 -1355 1059 1491 37
2480 37 -551 425 22 -1359 -1499 724 2296 1083 -1269 -2432 -1075 1168 1915 510 -1616 -1558 75
2497 75 305 -370 -348 1215 1240 -1643 -3582 -1201 2559 1793 -833 -2129 -982 287 -245 84 675 1085
2515 1085 -268 -1107 -1208 39 1901 1964 -340 -2605 -2099 839 2320 514 -992 -281 459 -916 -1694
2532 -1694 461 2927 1206 -2016 -2101 -461 1733 1665 496 -474 -626 -356 14 867 444 847 1067 -198
2550 -198 -1782 -966 1987 2509 689 -2152 -1176 1028 1063 -201 -337 931 490 -1186 -1221 294 1503
2567 1503 1662 -274 -1633 -1028 551 2191 1244 -599 -289 368 406 -1007 -472 1947 2157 -563 -2509
2584b509J644K643L11k323j018R53L18k26j88M66P01qj493j018P62K403P99j546
2602F71k762O98K324J03j296j73J070L42j757j075J462K006j67k377j052O70J800
2619D87O35q39j350P50K41j96o60K35J434P72j830j591P24K234L32j824n54Q10
2637a90N62n96p76N24J547m02j340o77L68J557Q27j494j075j30J343N91p16q01
2655h78J355J214j972j403N52K000R10j546j414M69R64N09n98k76O97k05o70p90
2673a082M69J241J319j426j732l87J628J469p21j327J43J105m08j044k9K264K77
2690A759j369k285R35J950M19q84p04j27M54j27k29J58M87O56l96j658k73J541
2708C07J789q64k354m86J871J038j414o77J458Q13j597j997J019K255O62j554
$$ plain form
2584 -2509 -865 1778 2089 -234 -1252 -299 19 -207 -395 71 772 764 -729 -1747 -985 1418 2217 671
2602 671 -2091 -1393 931 1034 -262 -435 635 977 -780 -1855 -393 1613 1446 -931 -1983 -1313 487
2619 487 1122 283 -1067 -317 -76 -272 -932 -697 737 1509 -321 -1912 -1188 1046 1378 -446 -1000 -190
2637 -190 372 -224 -1000 -476 1071 669 -671 -1348 -980 577 1404 -90 -1165 -1295 48 639 -77 -878
2655 -878 477 1691 -281 -1684 -1132 868 1778 232 -1182 -713 251 760 162 -114 583 378 -292 -1082
2673 -1082 -613 628 1947 521 -1211 -1598 30 1499 778 -549 -406 699 291 -753 -782 1482 1759
2690 1759 390 -1895 -960 990 1409 525 -179 -306 148 21 -208 -50 437 1093 697 -961 -1234 307
2708 307 2096 1232 -1122 -1608 263 1301 -113 -790 668 1481 -116 -2113 -1094 1161 1823 269
2724B69j064j72Q24O56n9k64p33Q78m92o05k82J735J315r05l033r44K835K038
2742A997r12j933P4R36o02r12J160J533J88k243j157P49J367J325m85j577j597
2759b089O17K066M51j181n49R48o27j488J10K911J386k143k681J33K712R09j066
2776D19o85j9j46j20j04P31O73M02j181j097n48J729J768n94k141j086J895J613
2794A509j564j047J296J471j521j843M31K099R01j450j202P59O27k3l53l77J90
2811i7J046k59j247p73J125K002k43k413p30J614J234p69j244J068O32m64j818
2828a336Q27J909N64j522j256l91Q19J390O34r68j430L67O92L41o96K54J549j016
2846G31k382l74K759J835j770k139p9J200P06k62J78j14n39l52J66M49M3J021
$$ plain form
2724 269 -795 -967 -143 513 454 190 -543 335 -157 -762 -1044 691 2006 1101 -1932 -2876 -41 1997
2742 1997 1085 -848 -774 162 -440 -1352 -192 1341 1529 -714 -1871 -1122 245 1570 1085 -492 -2089
2759 -2089 -1472 594 1045 -136 -685 263 -364 -1852 -1742 1169 2555 412 -2269 -2136 576 1485 419
2776 419 -266 -285 -431 -551 -655 76 749 1151 -30 -1127 -1675 54 1822 1228 -913 -1999 -104 1509
2794 1509 -55 -1102 194 1665 144 -1699 -1268 831 1732 282 -920 -161 466 443 90 -287 -97
2811 -97 949 690 -557 -1330 -205 1797 1554 -859 -1589 25 1259 490 -754 314 946 482 -1336
2828 -1336 -509 1400 1964 442 -814 -1205 -386 1004 1638 670 -760 -393 299 640 -56 198 1747 731
2846 731 -1651 -2025 734 2569 799 -1340 -1419 -219 487 225 403 289 -250 -602 -436 13 56 1077
2864A077j6j793j098J406K289j249j962l66K341N21j654q09J579P87j112q10O58
2881b11O25k14n26n3N8L93M72n53j029l29J826J152j574j920M77K073l7j415J58
2900f27J395l72j857j2K196J368j320k220l49J190J096N86n0j844p95P85J666
2917H36l63o93P60Q1j394j272J550L222l98l776j099K048J835n57q49L05r0q44
2935f98l76J519N87j24n60n66j346R02J821R59j691k004Q13J918j63j689K77K001
2953A580n06k144R5J692O92j196p12j15R43L6j9l94m6L35P77m69j462k58J822
2972F51J132j604j942J002J517Q3j332q5J788n79j454p98J742J423k82j524r66
2989a228L20R65J086j31j140n85O36M4m44j81J805N25k421j915J859K429K70k250
$$ plain form
2864 1077 1061 -732 -1830 -424 1865 616 -1346 -1712 629 1150 -504 -1313 266 1053 -59 -869 -211
2881 -211 414 200 -326 -379 -321 72 544 -9 -1038 -1367 459 1611 37 -1883 -1406 667 630 -785 -627
2900 -627 768 396 -1461 -1473 723 2091 771 -1449 -1798 -608 488 1074 1024 -820 -1615 -830 836
2917 836 473 -220 540 621 -773 -2045 -495 2727 2329 -1447 -2546 -498 1337 780 -69 236 146 -698
2935 -698 -1074 445 1032 908 348 -218 -1564 -662 1159 2118 427 -1577 -764 1154 991 -698 -421 1580
2953 1580 1074 -1070 -975 717 1409 213 -499 -614 329 365 346 -48 -94 241 1018 549 -913 -1171 651
2972 651 1783 179 -1763 -761 756 839 -493 -578 1210 631 -823 -1621 121 1544 1262 -262 -1228
2989 -1228 -908 57 1143 1012 -128 -713 -77 -33 -477 -658 1147 1672 -749 -2664 -805 1624 1894 -356
3007c56j214R07M83J33O5P70m22p58q07L45P72J138J89j700j626N75K027J011
3025A532j613r70O84O30o24o78J315J142p94k063j18J537P99j94r87m66M5R19
3043I6M05n84l73M5J181n95j138M5J848N60j494j397J314J166o88r41M44J170
3061A064k81j340L0M67N95M29l91j271k80J019Q39n47q64M01P37k60j484M89J674
3080A026N00j610j588J076J513k8r55k56O22j53l25J70J51P76j87m99q95j04J103
3099C37J085p54j850L08J256M80j476J62P23N88q23j345R42J249L58j419o94J18
3117g55J245k81k31r6N8P59l58j220K28P03Q80n11j746L0J451R01j476m42O73
3136a88N85m78r56M80J269J87r80p58k11R21R39k47j008l01P15J83o45o22J233
$$ plain form
3007 -356 -1570 -663 -180 -47 18 788 366 -392 -1199 -854 -82 1056 1245 -455 -2081 -1506 521 1532
3025 1532 -81 -1051 -367 263 -361 -1039 276 1418 624 -1439 -1557 -20 779 585 -402 -868 -823 96
3043 96 501 -83 -456 -411 770 175 -963 -918 930 1490 -4 -1401 -87 1079 391 -550 -106 1064
3061 1064 783 -557 -527 -60 535 964 573 -698 -978 41 880 333 -531 -130 607 347 -1137 -648 1026
3080 1026 1526 -84 -1672 -596 917 889 -66 -322 300 147 -178 -8 143 919 732 233 -662 -766 337
3099 337 1422 668 -1182 -874 382 862 -614 -452 271 859 36 -1309 -367 882 1240 -179 -873 -755
3117 -755 490 209 -22 -118 -60 699 341 -879 -651 52 932 421 -1325 -1295 156 1057 -419 -861 -188
3136 -188 397 -81 -1037 -557 712 899 -81 -839 -1050 -129 810 563 -445 -746 -31 152 -493 -1115 118
3155A18R72q39j789Q3J543R93o50j345JJ201j3o17K32K88L20n90o52o6J216Q14
3175A220k76j765l13Q32J507p60j112M22R23k88j359O7J733P11j595j226L11J093
3193A25Q40p77k42j92K82L55m28K27N34K58n00j508l71J834J396j042j362l10
3211h81J048N05n95q7N38N92j575n26P06R84O99q89j358K35K40J245k01o09m59
3230c88O35J1o59p4J332N80j068j404j28J579R70q75j053J13M67k6m76M09N40
3249D85kp05m73k43R78J117N7j974m84J269Q07o50n73J73Q08l05j044n9J285O43
3269A110r96j216L44M77O71J38p62n88M56P59n33n14M33J108p10j142n79J441
3287a03J052p72r48J31J058j22p06N7M59N25o58p75O5P31O26O4r02r18P58Q75
$$ plain form
3155 118 1090 251 -1538 -1455 88 1081 431 -914 -913 288 275 -342 -110 178 498 -92 -744 -810 406 1220
3175 1220 944 -821 -1134 -302 1205 445 -667 -245 678 390 -969 -902 831 1542 -53 -1279 -968 125
3193 125 965 188 -54 -246 36 391 -37 190 724 982 482 -1026 -1397 437 1833 791 -571 -881
3211 -881 167 672 77 -10 528 1120 -455 -981 -275 709 1408 519 -839 -604 -364 881 680 71 -388
3230 -388 247 258 -401 -475 857 1437 369 -1035 -1163 416 1386 511 -542 -429 38 12 -464 -55 485
3249 485 483 -222 -695 -938 40 1157 1214 -760 -1244 25 832 182 -391 -218 590 285 -759 -818 467 1110
3269 1110 114 -1102 -758 -281 390 528 -234 -822 -366 393 -140 -654 -221 887 177 -965 -1544 -103
3287 -103 949 177 -771 -640 418 296 -410 -353 106 631 -27 -802 -737 -6 620 684 -218 -1136 -378 497
3307D97k18q86L30R02j40r87o30J200R65m54j449L09O98O34p24k11J40L75Ql60
3327am70K69M49Q09j293p64P01J112K98j335m45J140j4q51p20J354R17m27j021
3346b92l90R18L57j4m19k39J6M20M3o02J50L97N10r58j121O74J593K13j705m74
3366i23Q60P28p04l03L87N73m65p22m34J265M27R8o37j054K76J171M27q17r34
3385g81O23O15o17r70Q41J472j25j871m35P79J398m40q75M2J2J14M8l8K6N53o1
3406C10n51p25J79J593M68j432j424J334R43k99r62K93Q50l11j356j44J182L76
3424C24Q1p81m6k53Q20P80o47p14K74P66k49j022L27J533M0j343j146R86J304
3443A034n49o33m0M50j45n41L63O63j43l09j29q66m1J339Q32o69j366m33J657
$$ plain form
3307 497 279 -607 -277 625 485 -502 -1132 68 1033 579 -870 -561 137 771 47 -164 -24 351 359 -1
3327 -1 -471 -202 247 1056 -237 -1001 -300 812 1110 -225 -670 470 456 -395 -1115 239 1156 729 -292
3346 -292 -682 236 593 579 160 -79 -63 357 400 -202 -52 345 855 -103 -1224 -550 1043 1256 -449 -923
3366 -923 -63 665 -39 -342 45 618 153 -569 -1003 262 689 787 150 -904 -628 543 970 153 -781
3385 -781 -158 457 -160 -1130 -289 1183 1058 -813 -1248 -469 929 489 -386 -344 -332 -218 -170 -208 -182 371 310
3406 310 -241 -966 -787 806 1274 -158 -1582 -248 695 396 -566 -273 577 266 -1090 -1234 -52 324
3424 324 405 -376 -422 -675 145 925 278 -436 -162 604 355 -667 -340 1193 1233 -110 -1256 -270 1034
3443 1034 485 -148 -188 262 117 -424 -61 602 459 150 21 -845 -886 453 1285 616 -750 -1183 474
3462D74M01p12m41J150J80j654m99J622J132l33j807m44N25N29N98n9l53q50Q3
3481d58O31r1j64N79N04j168j398Q85J921K77j684j386J098J184m07p65M98J077
3499A133j031n97K62N40J88r9l40o58l1R58O53p35j505Q01J228j65j747K97J608
3518G60k1j094q01J080R94p79m46J17M12j38j80k94l0J74O77R2r44j086J578P18
3538G89p83r14N62J120o75j458N79J729r2j497n48O04J217m4n77Q5p37J02O19
3557H1L10l97j06N82J27j582K3J260J278j149j995M79J878j21q78k03O26k4n49
3576c60M6P17M59o21k27j71k05N68O65k57j119k40J216N01j145o10J178R24j088
3595B31j321P35J413m43j375K36J116O1q75j99L60J48K83L43m61j081k0J746L00
$$ plain form
3462 474 875 163 -278 872 1052 -602 -1101 521 1653 1320 -487 -931 -406 123 721 662 309 -541 -458
3481 -458 173 82 -82 497 1001 -167 -1565 -680 1241 1518 -166 -1552 -454 730 323 -442 56 1133
3499 1133 102 -495 -233 307 495 396 56 -602 -633 325 978 243 -1262 -461 767 602 -1145 -848 760
3518 760 739 -355 -1156 -76 918 139 -307 -190 222 84 -96 -390 -420 -246 431 523 -421 -1507 71 789
3538 789 6 -908 -346 774 99 -1359 -780 949 857 -640 -1188 -584 633 589 12 97 -640 -538 81
3557 81 391 -6 -112 470 597 -985 -962 298 1576 427 -1568 -1089 789 668 -210 -413 213 189 -360
3576 -360 -314 403 862 241 14 -157 -362 206 871 614 -505 -745 471 972 -173 -783 395 1319 231
3595 231 -1090 -355 1058 615 -760 -524 592 653 -222 -421 -61 87 370 713 252 -829 -849 897 1197
3614A197j133r95J206P06j311n09J454P72j175j513P74J281j09n91m18O6j29K1
3632d06O35K63p69k63O73k47n43N93J124o13j652l30J855J080r50j107K47N49
3650A39n11j52K27J245m47j102j6M50L41n9P03j206r69N68J687m15j234M2J314
3669F05L32j919K85J500M60j096j267O59P84m7n39j50M82l18K72J24j87l19N12
3688A73L61l95j052M28J699p75j087J42P26N04j268k68J371L87o92r80R8J032
3706D04j8L9m66j79k14N74L26m64j13J67R66j329j150Q69J900l11j845l02J440
3725B94N79q70j24O02k30l20k45R0J006k72o56k46m26K09J501Pq81r94P26R00
3745F50k73r99K09J169o33j026K99R05P31p51j345Q76K04M73k67j98k57K56L78
$$ plain form
3614 1197 64 -931 275 981 -330 -839 615 1387 212 -1301 -527 754 645 54 -364 -298 -427 -406
3632 -406 229 492 -277 -540 133 -114 -657 -64 1060 447 -1205 -1535 320 1400 450 -657 -410 139
3650 139 -372 -524 -297 948 501 -601 -617 -167 174 115 818 -388 -1357 -789 898 483 -751 -709 605
3669 605 937 -982 -697 803 1263 167 -1100 -441 343 296 -243 -393 89 -229 43 167 -20 -339 173
3688 173 534 139 -913 -485 1214 439 -648 -506 220 724 -544 -812 559 946 254 -726 -628 404
3706 404 386 425 -41 -220 -434 140 466 2 -111 56 1022 -307 -1457 -588 1312 1001 -844 -1146 294
3725 294 873 3 -121 481 251 -69 -314 -224 782 510 -146 -392 -818 -609 892 899 18 -976 -250 650
3745 650 377 -622 -413 756 123 -903 -604 301 1032 281 -1064 -188 16 489 222 24 -233 23 401
3764D01k69o46r2Q54L42r86n59R47R85m68j169L44J002k32j277K10Q08M80o56
3783A9n67J45L98Q4K27l19p90P82L66j85r42O88N52Q8p84q09R63P23q9q26r9M68
3805I3L28r99O7P57K52l92j216N91K76Q51j60l21m49j20N43O23p82k14M66L99
3825E93r27o6K18Q47j59q41m32O46M29j35k25k6R3P6l03J3N6N96J26p98j72M69
3847G8M67Q3o90m58M16N30l94j50J70L28q7n58j99K66Q81K79o52j210O97O51k24
3868B24l39P7J98K59p53l58O42P55Q9o04q71N28P94J07p84l39M50K05m58j19L18
3889B1K56K22p94n04N36M68M51o58k58j79O24j76J58j26J99J25n24q30Q00P50
3909E61l3n37m27OO20Qk81k28L09L06n28l00K01P53J04n30p85K79N26N43m85m00
$$ plain form
3764 401 132 -514 -606 248 590 -396 -955 -8 977 509 -660 -316 686 454 -823 -613 195 675 19
3783 19 -548 -403 -5 79 306 -13 -803 -21 345 160 -782 -94 458 546 -238 -1047 -84 639 550 -276 -375 93
3805 93 421 -578 -511 246 498 106 -1110 -519 -243 608 448 127 -322 -442 101 724 -58 -272 194 593
3825 593 -334 -400 -182 665 506 -335 -767 -121 308 173 -52 -78 15 91 -212 -199 -143 453 579 -219 -391 78
3847 78 545 628 -62 -520 -104 426 32 -118 52 380 293 -265 -464 -198 683 962 310 -900 -203 448 224
3868 224 -115 -38 160 419 -334 -692 -50 705 794 190 -681 -153 641 748 -36 -375 75 280 -178 -297 21
3889 21 277 499 -295 -799 -263 205 656 -2 -260 -439 185 9 167 41 240 365 -159 -989 -189 561
3909 561 528 -9 -436 -430 190 198 -83 -311 -2 304 -224 -524 -323 430 534 4 -781 -502 24 567 82 -318
3931c18Q0M12m60n3j14P56J30n06p77M38J010J1p14m33K16M59j01l07J89J45K71
3952C34k38o55J18P52J68n23n84K04P18on49j27L89L36k39r66O77P62J23n55o62
3973e23J0Q19L31m68k08j62O42l30l94JM00N45m97j048M68P41L58n53n34M38M97
3994E33k1q78l5P94K24p29l83R6P14J11k44n27J54M56L7m08j78J29N24l35n00
4015d66q6R03J97p49k87K76L78L07l97j47J99L95l39n63J50K94O51r04j96l4N42
4036A24J66m44j97nM05p6n20K25K76M70m72l96k34J076L08n69l50p1P24j88n45
4057b93J69J58M02m09q75L64P19L77n47m92j11N86P5r6l23o2L33P1k28k68N78
4078A28O52o97l78l00R29L9l40j94R8L62k19m69LM83L64m60m65l47P91L30j72
$$ plain form
3931 -318 -238 174 -286 -339 -453 303 433 -73 -850 -412 598 609 -105 -538 -322 137 36 -271 -82 63 334
3952 334 96 -559 -441 311 479 -44 -628 -424 294 288 -261 -388 1 337 98 -868 -191 571 694 139 -523
3973 -523 -513 306 637 169 -39 -201 441 111 -283 -282 118 663 166 -882 -414 327 685 132 -402 36 533
3994 533 512 -366 -401 393 617 -112 -495 -399 315 426 182 -345 -191 265 302 -106 -284 -155 369 34 -466
4015 -466 -552 351 548 -201 -488 -212 166 473 76 -71 128 523 184 -379 -229 65 716 -188 -384 -418 124
4036 124 290 -154 -351 -356 49 -27 -547 -322 -46 424 -48 -444 -678 398 706 137 -213 -284 440 252 -293
4057 -293 -124 34 436 27 -848 -484 235 612 65 -427 -538 48 123 27 -296 -358 -25 46 -182 -450 128
4078 128 780 83 -295 -595 334 373 33 -161 -63 299 80 -389 -386 97 461 1 -464 -811 -20 310 138
4099A38r3m76J28J44K54k95K53N91k68q66m3M67J024o28p51r6J017j9Q1l03j30
4120A29l4lm10M9L59M68k82r89j24O35R17j51j090L86K12J60m08o9M42M85n71
4141A11p74O01M17J12j24m06r5J97M39k37n87K87J27K80o92k15L08J044m57q10
4161d74j36P34K75m99j03K64N56l41q82M07M92j67k05J86m38J69Q6Q90r10k64
4181c60K83K09m81l60R15O79p86q96q4P13R61o80j95%J7J7j49J83K32Pl50K18
4203I3m79L61O46j18n86q82Q49R61o94m20j65N09K1n85RR83L75j149l66N00M38
4224C01p8l28K82k42N2J08K09n58L7N80J04l15o70M86Q19o48p71L77R43k52q07
4245c71O8O02J27l02k04K8k23K55J14K64l48k37L67R1k01m16J072O2j075m86N62
$$ plain form
4099 138 45 -431 -303 -159 95 -200 53 644 376 -490 -533 -66 958 330 -421 -517 500 481 562 259 129
4120 129 95 92 -318 -269 90 558 276 -713 -837 -202 715 564 -526 -140 72 232 -176 -245 197 682 111
4141 111 -663 -62 355 467 343 -63 -158 39 478 241 -346 -59 68 348 -344 -559 -251 793 336 -474
4161 -474 -610 124 399 -100 -203 61 617 276 -606 -199 293 126 -79 107 -331 -162 -76 814 -96 -360
4181 -360 -77 132 -349 -709 206 885 99 -797 -881 -168 793 113 -82 -82 -65 -48 -197 -14 218 225 -125 93
4203 93 -386 -25 621 503 -83 -965 -116 845 151 -269 -434 75 96 -489 -480 503 878 -271 -637 -137 301
4224 301 223 -105 177 -65 -13 95 304 -254 -217 363 467 152 -518 -32 787 139 -632 -255 688 436 -371
4245 -371 -303 299 426 124 -80 -52 -275 -20 94 358 10 -227 140 231 30 -386 686 748 -327 -813 -251
4266b51J145k30o58m6j52K79k72N48j91p8k12K2JL03P8P0l83l97j96J219K14q31
4288a8p18P41K70k28o47R91M06p90l86P6M62J00j15k72j36J6l1N49L3o81M9O00
4310B71k71n64J63Q66k88n14l49O63O81k99j021M36O14k40k56k36M40L4j30L46
4330C46n47k32rO71j50j39O7M20k25n34j21J077J17j050o87P72N81j64k13L0K41
4351B51m19K4K03J19j36P2K19r65K46Q49L83n81j151M86O75L04o30p6P65l73o63
4372c98k56P49O21j62j010l9O19K91k15Ml62m47M77N18j19j88O8J56j81o82O39
4393H3L83K41j162M1P87M1m06k73L37J64k54j80O1j89L56j22k00j2j88P35L3l94
4415a18l73M15O47o06o35N25L67J93m92n90L83N76l41j22K95J89m19l3Nq8L97
$$ plain form
4266 -251 894 664 6 -40 -192 87 -185 363 172 94 -118 -96 -95 208 286 356 -27 -424 -620 599 813 -18
4288 -18 -736 5 275 47 -600 391 797 7 -379 -303 159 259 144 -128 -264 -248 -279 270 303 -378 -329 271
4310 271 0 -564 -401 465 177 -337 -686 -23 658 359 -662 -226 388 148 -108 -344 96 130 0 346
4330 346 -201 -433 -442 229 79 -60 7 427 202 -332 -453 624 741 -309 -996 -224 357 193 -20 10 251
4351 251 -168 -144 59 178 42 114 333 -632 -386 463 846 265 -886 -400 275 579 -51 -127 638 265 -398
4372 -398 -654 95 716 554 -456 -495 124 415 200 204 -158 -605 -128 390 271 83 151 307 126 -556 83
4393 83 466 707 -455 -414 373 414 8 -265 72 236 -18 -198 -137 -326 30 -92 -292 -304 -492 243 276 -118
4415 -118 -491 -76 571 -35 -670 -145 222 415 -77 -667 -284 292 -49 -171 124 313 -106 -139 -134 -222 175
4436A75J08l17j94o14P02P85o90o77K76L26nl66L11L72M2o85j64O25O03j89n88
4457a64N7k98M3O82k46l23K09K42J63n74k46Q41L22o30o87L43O87j63m37j94K76
4478i7K5L48k11K8R6l11L76n53j16K79M37m8n53M25k26K48j96m39O21K13n4q02
4500e10K43M30K14m56o0P2K17k03M9O3K67n6o4l47k9K92N96n1q66k52M95L24n06
4523a38JK14K73k75m21J37L96J54k38k78k90N38K12n0k15l29L82L2K6l80L83J37
4545B71l00k49k82P76L97n43o69K54L03L69o16j4M55P2j56o47J6N40K32J18j046
4566g19l9Q59K8j23l17M87J06l49k96p1L89K34J22o44O1N29q2n9j73j23M03m86
4588b63j8J55J71L61m81n91N1L53N50q4l34Q1p6J05P0j81K32L07k43m33l40P16
$$ plain form
4436 175 283 -34 -228 -842 -140 645 -45 -722 -446 -120 -125 -491 -180 192 234 -451 -615 10 613 424 -164
4457 -164 -107 -405 -362 320 74 -249 -40 202 365 -209 -455 386 708 78 -609 -266 421 258 -179 -373 -97
4478 -97 -72 276 65 93 189 -122 254 -299 -415 -136 301 253 -300 125 -101 147 -49 -488 133 346 292 -510
4500 -510 -267 163 377 -79 -139 -67 150 -53 -4 59 326 270 206 -141 -170 122 718 667 -199 -451 44 368 -138
4523 -138 -137 77 350 75 -346 -209 187 341 103 -175 -465 73 285 235 20 -309 73 105 131 -249 134 271
4545 271 -29 -278 -560 216 613 70 -599 -345 -42 327 -289 -303 152 224 68 -579 -563 -23 209 327 -719
4566 -719 -758 101 129 6 -311 176 282 -67 -363 -434 -45 189 311 -333 -272 257 175 116 -57 -180 223 -263
4588 -263 -281 -126 45 406 -75 -666 -615 -262 288 204 -130 -49 -125 -20 50 -131 101 408 165 -268 -608 108
4610A08J86k0k39l36J59N07l63k4P0J67j00l79K4M60K70m05o52J26O11L27n28
4631c1j04L2K6J62N5l85K91M56n44l86kQ40J34m2o78J12n0K73K4l64L57OJ61n07
4655a64l50L11M63l29K36o66L64K49j71lp1M30q0k61j76Q5P04k22n90m06P12K01
4677B66%r5m91K47J07k84l37N83L52k67k97K07L8Q5M85q76k17J21L68nj79n8O04
4700C57J29r21k09N81K27L6n37j7L90N6k0k98pL46m02M57k52L3M85j86n03k93
4722e48K85N51j40m49J53K71j74l1k76P7P52j80n20j7J43J92k5j08k56K47K68
4743B15k85l52L82k8K89k21p43O03J16N84l98o47O68r7l02K03L17K30l01n62J34
4764a95r7Q47j75m17n14L69J85J60l26jJ94j29Q1K47j61J14K01l36l12j10N40
$$ plain form
4610 108 294 274 35 -301 -142 365 2 -22 48 215 115 -264 -240 220 490 85 -567 -441 170 497 -31
4631 -31 -135 -103 -77 85 140 -245 46 502 -42 -428 -430 410 544 502 -176 -64 -114 159 183 -181 176 182 343 -164
4655 -164 -514 -203 260 -69 167 -499 -135 114 -57 -60 -131 299 219 -42 -218 -133 571 349 -241 -647 65 266
4677 266 266 171 -320 -73 34 -250 -587 -4 348 81 -216 -9 29 114 599 -277 -494 -373 -5 -10 -189 -247 357
4700 357 486 -435 -644 -63 164 200 -337 -354 36 92 72 -226 -233 113 -289 168 -84 -51 434 248 -255 -548
4722 -548 -263 288 148 -301 -148 123 -51 -82 -358 -281 471 291 -229 -246 -103 89 64 -44 -300 -53 215
4743 215 -70 -422 -40 -68 221 0 -743 -140 -24 560 162 -485 183 86 -216 -13 304 534 233 -329 -195
4764 -195 -292 555 380 -37 -551 -182 3 163 -163 -164 30 -99 -18 229 68 182 383 47 -265 -375 165
4785A65j69k74q5M33j0j59k21L87j2J51n8k55j18M8O34m98j73K8L03K82n16K6
4807i1L19M6m25r1J58L66k82j41N9k86L77L18m29j0J96l08m1k8j71O09L73m44
4829G4n45K82N19k5l29k49N59l53m42K99O0K29J8k61j84K93K41J02r0n80k59Q26
4851A85r4J76o55N02K7k26j86J00O85j75l56l08L09J57k43M8R1L16p0n05p1J49
4873a44K59K51j41m52J3N54J17j94m52L30K24l54n07J84P13n4o49j69J67M25k6
4894I5o1k5k42N30r2l03J14J31jK03n44l24O47N48p95k25n7Q07k29l53J38J63
4916A25J09k62l64Q9P02m02q2k55K4L31M56j08p68K83J66N8p5n2N62j20n14k84
4938c81L84L40J69l99o80K59L17k2K27k31p6K32k27k5j76J65K58K1m44J84K86
$$ plain form
4785 165 -4 -278 -363 70 60 -99 -320 67 55 206 148 -107 -225 -177 457 -41 -214 -186 117 399 -117 -91
4807 -91 228 274 -151 -242 -84 282 0 -141 -82 -368 9 327 -102 -112 84 -224 -265 -293 -464 145 518 74
4829 74 -471 -189 330 305 -24 -273 286 -67 -509 -210 -150 79 97 -164 -348 -55 186 288 198 -382 -641 185
4851 185 91 267 -388 114 141 -85 -271 -171 514 339 -17 -325 -16 141 -102 -54 37 353 283 -222 -293 -144
4873 -144 115 366 225 -227 -214 340 457 263 -189 141 365 11 -496 -312 401 347 -302 -471 -304 121 95
4894 95 34 9 -233 297 205 -98 16 147 146 349 -195 -519 128 676 -119 -344 -401 406 177 -176 -38 125
4916 125 234 -28 -392 -303 399 -3 -85 -340 -316 15 471 363 -405 -122 44 102 27 -25 537 417 -97 -381
4938 -381 3 343 512 113 -567 -308 9 -13 214 -17 -93 139 -88 -113 -289 -124 134 155 -289 -105 181
4959A81p7k53n08R23j7m58l01J87K19K36r2j95l0j17M81k87o4J58K72r3n77L23
4981h9K88M06m02q08K98M35R7J88m43J42J16L5o38O56r9Q1l56p0j10L29J99J29
5003C84m34k39L46J85J11l50K50J41q8o57o9O76K26n77k18L41N55n48k08N72l01
5024I8j19n6K36j64J21K54k34k38q4M34J52n29j80m7Q36r4o14k60R61J36n63m36
5046c90L89j11J45k49K16k58M7M43k52k18K61L78k63j16n91P33K62l68m07L27
5066b2j41J31p6L8J70J71m69j26J87L27J8J95n82j45k34M29N29k12j64R5J31n47
5088b97Q0K29K43M5p96M8M67M16l11l46J30m8M5O6q8J50J15j58R9k63k22N01K69
5111C74m41k08K46M90m58n0k25K63Q9m17K8M33K58l21j21k47J47K48R4k19j53
$$ plain form
4959 181 104 -149 -657 266 249 -209 -510 -323 -104 132 40 -155 -185 -302 179 -108 -172 -14 258 165 -412 -89
4981 -89 199 605 203 -605 -307 128 225 413 -30 112 228 263 -375 281 182 263 -93 -163 -273 56 255 384
5003 384 -50 -289 57 242 353 3 253 394 306 -351 -420 256 482 -95 -313 28 583 35 -173 399 98
5024 98 -21 -77 159 -5 116 370 136 -102 -186 248 400 -129 -309 -356 480 386 -228 -488 473 609 46 -390
5046 -390 -1 -112 33 -216 0 -258 -211 232 -20 -238 23 401 138 22 -569 164 426 58 -349 -22
5066 -22 -163 -32 -108 -70 100 271 -198 -324 -137 190 208 403 -179 -324 -558 -129 400 188 24 119 250 -297
5088 -297 -217 12 255 300 -496 -448 19 435 124 -222 -92 -140 -95 -29 -117 33 148 -10 89 -174 -396 105 374
5111 374 -67 -275 -29 461 3 -47 -272 -9 80 -337 -309 124 382 61 -60 -307 -160 88 182 -37 -190
5132a90K96O08l45l74K49R1O4o81j94M66N22l92m0L3l6J18o28K63J94L10j55k65
5154h6l96K89N7N40l41n23J86L74n0k34R6M34j58o72N6P63o3k61k89L32J09j4
5176A49j46J41J88j76J32m29K50j08J34J85k11m42J45M94o5m40j06O45N3o44R9
5197a52K21o1m9k93J75L50l34Q26p96k25J15j69K74joK48Oq4m45K71Q4J40n31
5220d36J24Q6M75k19k8K55k07p2m84L50o9N24P4l01o26K98O68k04k26jO8j6j61
5243a28k48K86N60n22p3n11M29M01q0J4l41K43j21p6KL87k8P9l32m74M52L58k9
5266B48k89j15QM94r6l51J07k35K58O7l87N65q3Pk97L6J34L07l5k33j75p2M12
5289B75k60j68J14N11m31O8m79L15L50lo13J34K59Q0J52l27k46J89N16n91j03
$$ plain form
5132 -190 106 714 369 -5 244 335 399 -282 -476 -10 512 120 80 113 77 195 -433 -170 24 334 179 -86
5154 -86 -482 -193 -136 404 63 -460 -274 100 50 -184 -88 346 188 -484 -428 335 272 11 -278 54 163 149
5176 149 3 144 332 156 288 -141 109 1 135 320 109 -333 -188 306 241 -199 -305 340 393 -251 -152
5197 -152 69 8 -41 -334 -159 191 -143 683 -113 -338 -223 -392 -118 -119 -125 123 129 45 -400 -129 -45 95 -436
5220 -436 -312 -226 249 30 2 257 50 -22 -506 -156 -225 299 373 72 -554 -256 412 208 -18 -19 49 33 -128
5243 -128 -376 -90 470 -52 -125 -636 -207 194 114 128 -213 30 -91 -167 -165 222 194 273 -59 -533 -81 277 248
5266 248 -41 -156 -148 346 250 -101 6 -229 29 96 -291 274 191 198 -99 -63 71 378 343 110 -65 -137 275
5289 275 15 -153 -39 472 41 109 -370 -55 295 292 -321 -187 72 152 304 -23 -269 -80 436 -155 -258
5310b58k3N49K65p03r0m1L82M6n40K13K87j71k26M9L02O66n41k73n2j65L73J26
5332A75k26O8l9P3M9k07q2J09K15j37m56J74N86r4l28L9K01j75K87k21m9J17r0
5355a1j98n8J28O80k22k56K9l08J40K12l26N4J35L7o3j95K80QN66p06j18J5K10
5378C3J86j61k72K32J41k6k30Q2K73k56K7l38L42R5J62k46j93J57j62J8J22o7
5400h1L5P9k40K32M2n3J01L1l63o0L41P8k07kJ1L39k94j69K01K87n0J56m97k0
5424a03J6N67l81j04k7J33j7m04L44j49N41l64m23M64p6J69N0l51O4J35M0k13
5446h9P1j29N16m38j54M3J46M2j03k7j86J76J72j59N3K12Q7k45k35J73J80K8k02
5469f8k71N3L06R6n5k63J31K39k77k51J11M73k44j60j11pL33K47p0k70J82rk18
$$ plain form
5310 -258 -281 268 533 -170 -260 -301 81 127 -413 -200 87 -84 -310 -261 41 707 166 -107 -159 -324 49 175
5332 175 -51 17 -22 51 100 -107 -189 -80 135 -2 -458 -284 302 208 -120 -81 120 -55 232 11 -38 79 -11
5355 -11 -209 -267 -139 541 319 63 92 -216 -76 136 -190 -136 -1 36 -27 -222 58 66 632 -74 -192 -177 33
5378 33 219 58 -214 18 159 133 -97 -15 258 2 29 -309 33 128 290 44 -149 8 -154 -136 -14 -81
5400 -81 -46 33 -207 25 67 14 115 146 -217 -277 64 142 -65 -67 -56 283 -11 -180 21 308 258 414 -83 -103
5424 -103 -87 480 99 -5 -32 101 84 -320 24 -125 416 52 -371 93 17 186 236 -115 -51 84 124 -89
5446 -89 -18 -147 369 -69 -223 -180 -34 8 -95 -122 -308 -132 40 -119 -66 146 233 -12 -247 -74 106 134 -68
5469 -68 -339 -286 20 116 61 -202 -71 168 -109 -360 -249 224 -20 -180 -291 -298 35 282 212 -58 124 115 -103
5492a03K41l00J93K18k55k24r8K15J56k5o6l25M14k3oj50R9L98m49l9k6L51l93
5515a97R2qj33K33j18q6J08J20j49Qk48J99L75O6J39o16j73O09l50J60J97j20
5537A08r8mk58M72j12Lq5m3p5j47Q11n08pK0q6J47O8l35K09K0qo8k89L16K43k12
5563H2r1k35M08r0%m8L4J56N3l87j87L81J09Q5o47mO05K75j41m68J8K07J28j05
5587A38q3oo8j72P9j13p3L94K78l32r5J5j04K06l04J90J64Mm13k94N19J4O6k86
5611b76K26L4k18K57J49k70O2J59k83P9j5M19J20l65m99J30N92N7k68k98K39K19
5633B50k33l89L17J65jn74J93M51j17MJ3J8k5Q9J7j2k49M9K05k62l4L11J25K9
5657C40l34l94M87O3r3j69j7L78p6l61j95R75o48K92j41j51J5K60j37k02K38N2
$$ plain form
5492 -103 138 -162 31 249 -6 -230 -328 -113 43 18 -48 -373 41 18 12 -138 -39 359 -90 -129 -155 196 -197
5515 -197 -105 -113 -246 -13 -131 -217 -109 11 -138 -130 -378 -179 196 262 401 -215 -388 221 -129 31 228 108
5537 108 10 6 -252 220 108 111 26 -17 -92 -239 572 64 57 77 -9 138 206 -129 80 100 92 24 -265 51 294 82
5563 82 -9 -244 164 74 74 26 60 216 269 -118 -305 76 185 270 -377 -381 224 499 358 -110 -92 115 243 138
5587 138 55 49 -19 -191 -112 -225 -298 96 374 42 -53 -38 -142 64 -240 -50 114 118 -295 -589 -70 -56 10 -276
5611 -276 -50 -16 -234 23 172 -98 -36 123 -160 -81 -96 323 443 78 -421 -291 301 358 90 -208 31 250
5633 250 17 -372 -55 110 109 -465 -272 179 62 66 79 97 72 161 178 166 -83 -34 171 -91 -125 186 311 340
5657 340 6 -388 99 162 69 -100 -117 261 185 -176 -371 604 -44 248 107 -44 -29 231 94 -108 130 182
5679A82M15n41o7q2J69J89n95R8L54Pr7l7K56j90P8j4l09K84K6r0k24k75Q9M53
5703G9N83q14J72k34M74l90L1q1L10M7o07N04k38M15j90J03n11K03k6K68j00k71
5725b73R9L95k43m4j11N16j67o85J42J2P00j34k07Nj23O5j25l19M19M87m84l57
5747d32J72N9K59k0k08J30J00Q4j9p5k20R2L17l68J1n8O05l58n9Q7k66J86j05
5770h6k12L80J15q6j33q7m03M36M91m07k66m1M45o0j31O8j22N10m38m18O02l4
5792A23R7p64J42N66L6J03l91J59q0J89k74J94Pj02O1l38j2J39K44J78k97K20
5814B00j22J80j73j97p6J81P5j09O6n6J86r9k6l4M7L5k9P5j60K3L93l62kl59M51
5839A08j98K37l61L04L4m46K15K26j02p1K6J2j70J75K65m5m79P9L36L2N0j79k3
$$ plain form
5679 182 597 56 -11 -93 76 265 -330 -232 122 129 32 -5 251 61 139 125 -184 100 126 36 -188 -463 -374 79
5703 79 662 -152 20 -214 260 -130 -99 -180 130 177 -430 74 -164 251 61 164 -347 -144 -170 98 -2 -273
5725 -273 -174 221 -22 -66 -177 339 172 -513 -371 -359 341 207 0 5 -118 -53 -178 -497 -78 409 -75 -432
5747 -432 -260 -201 58 38 -170 -40 60 144 125 50 -170 -78 239 -129 -118 -176 429 71 12 99 -167 19 -86
5770 -86 -298 82 197 111 -22 -109 -512 -76 415 8 -258 -299 146 86 -45 23 -99 411 -27 -445 157 123
5792 123 220 -544 -402 164 200 303 -88 71 -9 180 -94 100 107 5 66 -272 -284 -145 99 277 -20 200
5814 200 78 258 85 -112 -188 -7 68 -41 25 -31 155 56 30 -4 43 78 49 124 -36 -13 380 18 16 -343 108
5839 108 -90 147 -214 90 124 -322 -107 119 17 -54 -28 -16 -186 -11 254 209 -270 -191 145 177 227 48 25
5862B5R0J94m21p4L36O8m79Q3J00M34j04J1m23J64K2J11k59J9j55L26J3k00r6
5885b15K29R0j06k38J02K61j24L54l55j19K34k13j52K88o0j35L87m41o5L54J38
5906B14j2p17M23K01L91o54n8K02J15J71l17j36L29j75J26J6k28L21r9OO6M6k64
5929c3j56L68l64L41JK8l77J37J11Q8k3n7k12J23J53k20J4J47K16n70J00Q1Q5
5952a9J0J54j95j97M2K97L6j64O2J70j76j72K6L1L91j32R9m80J30K05k2j67J87
5975A16j30l6k23R1K94K59j81l06j33N7J91O6k04J24L8J6l82L63Q8R2j47j39p2
5998a58J27L23k72l52J67K8J46J73m79L09l02O09l13N5k59R7O6M0k22L28j08o1
6020e8N0l8J56l20K72l28M27n8J21m35K3K92M5Q4k40q3L11k70p4J04M56m7k76
$$ plain form
5862 25 115 309 -112 -186 150 218 -261 -178 -78 356 252 263 -160 4 26 137 -122 -103 -258 68 81 -119 -215
5885 -215 14 104 -2 -240 -138 123 -1 353 -2 -121 113 -100 -252 36 -24 -159 228 -213 -278 76 214
5906 214 202 -515 -92 109 500 -154 -212 -10 105 276 -41 -177 152 -23 103 119 -109 212 113 119 185 231 -33
5929 -33 -189 179 -185 156 157 185 -192 -55 56 144 121 64 -148 -25 128 -92 -78 69 285 -285 -185 -104 -19
5952 -19 -9 145 -50 -247 -205 92 128 -36 26 196 20 -152 -126 -95 296 164 263 -217 -87 118 96 -71 116
5975 116 -14 -50 -273 -182 112 371 190 -116 -249 -192 -1 65 -139 -15 23 39 -343 20 108 200 53 -86 -158
5998 -158 -31 292 20 -332 -165 -137 9 182 -297 12 -290 319 6 61 -198 -101 -35 5 -217 111 3 -58
6020 -58 -8 -46 110 -210 62 -266 161 103 224 -211 -188 104 149 233 -7 -90 221 -49 -123 -19 437 390 114
6043A14l30j64N06j61R5m94K86m7K64k23O5J0N21l30l39L79p1R1l1j59l10J63
6065a65L33k32J08L3j57J47j60j33K51L35k67j55K4P3K35l19l00M99q0m13L52
6086Ik01K84L90m38k79K31l2L89k01l88J42R5M1j61N3j56K43m9k21Q1N1K23K55
6109C61l58q8j13M88J53n60L03J68k34j70j68K27K12j66N5j0j36K87j7j86k93
6130b45J89k33j0R7J75J87L35p13%J73K67m0l76J49n0KN8q2J48O1O5q1l98M49
6154A27J5J31l00k92P3L02n2j70L32J13k72l18J27L4M6L59k32M1k58K56j30L14
6176B46l90K91j31l15K25L51k46J49N3k62m32Q04k44k05J15M11k90j95R8j57J53
6197B9J24J83o05O4L71o2j54j19J76J05L05m27O9J65k15j07m1j17K22L15m53K4
$$ plain form
6043 114 -216 -380 126 -35 60 -434 -148 -195 69 -154 -89 -79 442 112 -227 152 81 172 141 -18 -328 -165
6065 -165 168 -64 44 77 -80 67 -93 -226 25 360 93 -62 -38 35 270 -49 -349 150 70 -343 9
6086 9 -192 92 482 44 -235 -4 -36 353 152 -236 -94 1 42 -119 -66 -222 21 -28 -249 -168 -117 106 361
6109 361 3 -85 -198 290 443 -117 186 354 120 -50 -218 9 221 55 110 100 -36 251 234 48 -245
6130 -245 -56 -289 -299 -202 -27 160 495 -218 -218 -45 222 182 -194 -45 -95 -93 -35 -117 31 92 157 76 -322 127
6154 127 142 273 -27 -319 -246 56 4 -166 166 279 7 -311 -184 -150 -104 255 23 64 -194 62 -68 246
6176 246 -144 147 16 -299 -74 277 31 180 233 -29 -461 343 99 -106 9 420 130 -65 33 -124 29
6197 29 153 336 -269 -205 166 104 -50 -169 7 112 417 -10 59 224 9 -98 -139 -256 -34 281 -172 -148
6219a48j8K59o8k43R8L69l3Mk67j72M38O8m06j35J56J8J2k13N09m74L90M4l63
6242a75K98k34J53j20r0j66M28P4l77K49j08L00j47q3j93M65qk58j83J65J21J23
6264B34m63M6K22j28J86m3k46J33L96l10j30j41O34K21m64l59K27J24j79q1J96
6285G5J26l84J81OL7J23O5n6m72K56K8K56j23J43l06K54l68O6m8K40J56k81l9
6308f5o7L52n2l5j75J84j52L36n11P9K08P9k39km9J40J80j42n9K22k71k7R7lk87
6333b59J85L04n10K74J30o5L1O2k96J61l5J12k16L2K75J9m21K9K58O1l60J3J5
6356b01M95j74l64L39l08J11J25j15J76o9j49J63j30k1L08Qm05L03o2m1j2k4j03
6379a50K00J60l32k05J85Q8O8k9j91K42J04M2k80K12k48j04J06j37o3L42L14j73
$$ plain form
6219 -148 -166 93 25 -218 -120 249 216 220 -47 -219 219 287 -119 -254 -98 -80 -68 -281 228 -246 144 188 -175
6242 -175 123 -111 42 -78 -168 -334 94 168 -209 40 -68 232 85 2 -191 274 266 8 -175 -10 111 234
6264 234 -229 -183 39 -89 97 54 -192 -59 337 27 -103 -244 390 611 147 -212 15 139 -40 -121 75
6285 75 201 -183 -2 4 41 164 229 173 -299 -43 -15 241 118 261 -45 209 -159 -93 -141 99 255 -26 -65
6308 -65 -132 220 168 133 -42 142 -10 326 -185 -106 102 181 -58 -60 -109 31 211 69 10 232 -39 -66 31 28 -259
6333 -259 -74 230 -280 -6 124 59 90 152 -144 17 -18 94 -122 -90 185 204 -217 -188 70 131 -229 -216 -201
6356 -201 294 120 -244 95 -213 -102 23 -92 84 15 -134 29 -101 -122 186 194 -211 92 30 -11 -23 -47 -150
6379 -150 50 210 -122 -327 -142 -54 14 -15 -206 36 140 182 -98 114 -134 -238 -132 -269 -332 10 324 151
6401A51j64j40J23L20k30l02K12L23n38J47K90j55N0l7K1k69L63l40K06L5l51
6422b85N2L24j58j29K74j73m1L1k88Q51m94J26n3j77K19j07qq1J56r8j2J65j16
6445b2p8J44j37m2o2J42L38m53m1P0J99j09k9J67k15K47j44j04j2K62Mj04K5J16
6469A62q3N1j82m9N2K83j93N4k47J39J02J28j31pn8Q3m77K52K94Ml00R2j82P7
6493a36J34J25r1k04o8J28K65m0k47K41q5J42l61lM89j70k96o2J23J69j64j2q1
6516b04M56m56O1P9J69j63J77N7l73J67K38o6j06q0k10N31j41n7k46J80k57j88
6538d32M42L05l51J30m14M00j92Q2L62J54l95k28J27j59J98R0K1J67n65J23R0
6559d5K90k75j42N8K21J68n10J42R2K8q9p6K32r5l1L29p5k67j22M32j56l9P6p7
$$ plain form
6401 151 -13 -153 -30 290 60 -242 -30 293 -245 -98 192 37 87 50 71 -198 165 -175 31 66 -285
6422 -285 -233 91 -67 -196 78 -95 -136 -105 -393 458 -36 90 37 -140 79 -28 -36 -117 39 -59 -71 94 -22
6445 -22 -100 44 -93 -135 -197 -55 283 -170 -211 -141 58 -51 -80 87 -128 119 -25 -129 -141 121 125 21 46 162
6469 162 79 130 -52 -101 -49 234 41 95 -152 -13 89 217 86 79 21 104 -373 -121 173 177 -123 -31 -213 -136
6493 -136 -2 123 32 -172 -240 -112 153 113 -134 107 22 164 -197 -200 289 119 -177 -239 -116 53 -111 -123 -204
6516 -204 252 -204 -143 -64 105 -58 119 176 -197 -30 208 142 36 -44 -254 277 136 79 -167 13 -244 -432
6538 -432 10 315 -36 94 -320 80 -112 -30 332 486 91 -137 -10 -169 29 119 140 307 -258 -135 -45
6559 -45 245 -30 -172 -114 107 275 -235 -93 -1 27 -62 -138 94 -1 -32 297 222 -45 -167 265 109 70 146 69
6583F9j23l79L30l3L02k79J39j81K92n9M9nk15J54j06J69j76O1K10k0l3l98j9
6606b51M72l58J18j73J90q4k64K44J29O4Rj44j38K87J95k59K69k56J95k35L01
6627C11m65M4J20K27l06L7R9R7K50m88m9nJ70K91k59l04l3K83j50P5j73K29lj15
6651a17j15K67J57j35nj68k38L49M0n31O29p5r7r9J33l0K34k64N3l00M26J60l58
6674h4J65l32K25N40p15R4jj60N19m45J38j7J77K85m82n6L97j31m44P0L90K15
6696C48j96j33j99j00K42J24l19M6rL75J22m28%J43p2J88j03N2rJ56l01j42K86
6719G1k65J43r6J20L58k80j27N4k44O57k20j84l8J29J6K67m99R2J0J08J1n1rO2
6743H5j35j44J18k16L87l4k5j69N2k0j13L21j82L62k00j59J37j72o8K74j12m39
$$ plain form
6583 69 -54 -433 -103 -136 166 -113 26 -155 137 78 127 122 -93 61 -45 124 -52 9 219 199 166 -232 -251
6606 -251 221 -137 -19 -192 -2 -86 -350 -106 23 87 96 -48 -186 101 296 37 306 50 245 10 311
6627 311 -154 -110 10 237 -69 -32 67 164 414 -74 -123 -128 42 333 74 -230 -263 20 -130 -55 -228 1 -2 -117
6651 -117 -232 35 192 57 52 -116 -354 -5 35 -496 133 58 -39 -138 -5 -35 199 -65 -12 -312 114 274 -84
6674 -84 81 -251 -26 514 -201 -107 -108 -268 251 -194 -56 -73 104 389 -93 -149 248 117 -327 -257 133 348
6696 348 152 19 -180 -280 -38 86 -233 -187 -196 179 301 -127 -127 16 -56 132 29 81 72 228 -73 -215 71
6719 71 -194 -51 -147 -27 331 51 -76 -22 -266 391 171 -13 -51 78 94 361 -138 -46 -36 72 83 32 23 85
6743 85 -50 -194 -76 -292 95 61 36 -133 -81 -101 -214 107 -75 287 87 -72 65 -107 -175 99 -13 -452
6765d52M70k55N76m64j25J79K7j28jK55L2RQ4k42J39Lm47M00k09K71j20q5J50
6788F7p6J24Q0l48R6R4J21K27l98j84J98JL9r6J01L57k26p7j42J96j90K00k94
6811a30P1M2Q7k95J21j35K62K85k86r5j7P5P8m1k85J90n8K55k7l20K87j07j07
6834a50m1J27OL79r6l25Q6M4k84L62l02J89L82k42k00J66Q1j01q0j67j9K11J17
6857A43r1k65K38J06rj73j33J88j31L11m88j07N52j98K04j03k13L59j87K53j45
6878A11j21J43k72P6Q8j04Q1j96j5l5J88K10J9k39j96M22j66p1J89J92l93J30
6900D1r1o7L19l92J74j08p9K43J24p1j04j72L39J92Ql15l24K41j39r5M87l3k30
6923e2J39j18K58j59P6l34k27J62K55J13j82K14j73P7j85j65K50K51k10n3K13
$$ plain form
6765 -452 18 -237 339 -125 -250 -71 -44 -172 -173 82 114 123 207 -35 104 107 -340 60 -149 122 2 -83 67
6788 67 -9 115 195 -153 -57 37 158 385 -13 -197 1 2 41 -55 46 403 177 100 -42 154 -36 164 -130
6811 -130 -59 -17 70 -225 -104 -239 23 308 22 -73 -90 -15 63 22 -263 -73 -131 124 97 -223 64 -43 -150
6834 -150 -191 -64 -58 321 225 -100 -14 30 -254 108 -194 -5 377 135 -65 101 182 81 1 -166 -185 26 143
6857 143 52 -213 25 131 122 -51 -184 4 -127 184 -304 -411 141 -57 147 44 -169 190 3 256 111
6878 111 -10 133 -139 -63 25 -79 2 -194 -209 -244 -56 154 173 -66 -262 160 -6 -77 112 304 -89 41
6900 41 -50 -117 202 -190 -16 -124 -203 40 164 93 -11 -183 156 348 356 41 -283 -42 -181 -276 211 178 -52
6923 -52 87 -31 227 68 144 -190 -417 -255 0 113 -69 145 -28 49 -136 -301 -51 200 -10 -63 150
6944A50j04k9o1R2l34J49q1nK67l06J13K80k06j46k20M60N5j54j89J57j6L21m17
6967b24K05L14q8n7k69M5K95l04MK14R4k10j20k47J82ML45m25J41j41K49k43K44
6990HLJ81k41L6OP0J59k43L56l35j02m2L25l68J01L13J63l74j31qk9M5J7M9R9
7015E8j29J91q6k02Q3j43L55l59K90j54K24k03j81L62l37L68q8k61L09r9k70L80
7037A08R0l38L66p9k28k78L67M74q46L39R0P4N7k12k47K1J8K94m9j67K81k7j74
7060f6j5J64k7p2j51J11L20k10j37l9q3K83J61l05J78l25J1M16k97K21l41O70
7082D67n31LJ85j53J05k3k06J21K70j66k28K73O9j78J67k44J18P6J00m60J23m0
7104a52L29Q2k82o6L3N5j41K78Q1n44J35J15K83l77oJ60L11k76j15J46pn0j33
$$ plain form
6944 150 46 17 -44 48 -286 -137 -218 -223 44 -262 -149 131 -75 -221 -441 19 74 -80 -269 -112 -128 193 -224
6967 -224 -19 295 207 150 -119 -74 221 -83 -79 135 229 19 -101 -348 -166 -162 183 -242 -101 -242 7 -236 8
6990 8 11 192 -49 -13 -7 63 222 -21 335 0 -102 -144 181 -187 -86 227 390 16 -115 -123 -152 -107 -90 -41 58
7015 58 -71 120 34 -168 -85 -228 127 -232 58 -96 128 -75 -256 106 -231 137 49 -212 97 -2 -272 108
7037 108 198 -140 226 147 -81 -359 8 482 -364 -25 65 139 196 -16 -263 -242 -224 70 21 -146 135 108 -66
7060 -66 -81 83 56 -16 -167 -56 264 54 -83 -122 -205 78 239 -66 112 -213 -202 214 -83 138 -203 467
7082 467 -64 -61 124 -29 76 53 -153 -32 238 72 -156 117 186 8 175 -69 49 125 225 -235 -112 -152
7104 -152 177 259 -23 -89 -56 -1 -142 136 217 -327 -192 -77 206 -171 -177 -17 294 18 -97 49 42 -8 -141
7127a41J90j72J15j68J2j25L93R6j21j22k20K96p6J66j09J19j13r6R6k11K21K7
7149E7j04q3J0M80k77k02JL06m16lK4K58M6P4j00j49K05m2l5m3j0J7Ok23J31j45
7175b17L66m0J27k01k3M86k80m27J84L2J18m4j87K4K34J24k78k62L49l02J95J55
7197A33m21K22Q6J24j96K40j34k25N0J56k15M14K01k79k23J93J5k27K46p7j08
7218b5k1M4L0l02O26l44J0J11o05K81K72j01k98J91J37J41J51k94J27L3m30M1
7240b25J48J47j13K30l34L1K28r2k63j53M17J95l95O0K69m8M4r3j3jL60j30k34
7263C5M1l42N07k55L9K6k12J64J28J35m85L56J41k58j8K3J72k61k71J35k9L39
7285A10l90J41J49J91m13Pk3K36p8L0L62j82J11l43j56K62J07k24P3M7N2ok00
$$ plain form
7127 -141 49 -123 -8 -176 -164 -289 104 200 79 -43 -263 33 -43 123 14 133 20 -76 20 -191 30 57
7149 57 -47 -130 -120 360 83 -119 -118 188 -228 -231 -207 51 97 171 71 -78 127 85 50 7 -3 14 20 -203 -72 -217
7175 -217 149 109 236 35 12 498 218 -209 -25 7 125 81 -106 -82 152 276 -2 -264 85 -217 -22 133
7197 133 -288 -66 20 144 -52 188 54 -171 -121 35 -180 234 435 156 -67 126 141 -86 160 83 -25
7218 -25 -46 -2 28 -274 352 8 18 129 -476 -195 77 -24 -322 -131 6 147 298 4 131 164 -266 -225
7240 -225 -77 70 -43 187 -147 -116 112 20 -243 -396 21 216 -179 -119 150 102 146 53 40 39 399 269 35
7263 35 76 -266 241 -14 25 51 -161 3 131 266 -219 137 278 20 2 25 197 -64 -335 -200 -229 110
7285 110 -280 -139 10 201 -212 -205 -228 8 -70 -40 322 140 251 -92 -248 14 121 -103 -30 17 69 63 -137
7308a37J65k07J65j60J24J56l25K97j20J75n1j11L3J36K57k13j40j11J92k42J16
7329an4J40N3l56R7Q7J35o0K40k38O1m2p2j3l31L22K15k48N9K37k97J90m13N47
7353B58k88K59k74J51l38L41M6l66J32o9R4J96n1j59m7L87k45r5K15j39J59k17
7375e0%M0J44k39m1J11j4J59L0M9l55m5J67k11J87k7J59r2L8k74O9J07N7j84M52
7400B37j88l6j6O1r9j56J1J60K76m17K79l6r1k04R5J59j20k11Nm3L74J11r7k29
7424a75K37P9j12N1O6j24K70k24K84n28L25j23j72m7M42l75J88m9K92k22r1J58
7446A50r9jJ16j56r8j3K89l51J74r1k7l2L04j59Q2m03K01J93q4j36K26j35K38
7469A88K14n10N5K73L10o99J00K91j64J41n42M09k9J60j24j46J18J11j8l33Q0
$$ plain form
7308 -137 28 -179 -14 -174 -50 106 -219 78 -42 133 82 -29 4 140 397 184 44 -67 125 -117 -1
7329 -1 -55 85 138 -218 -121 -34 101 41 281 43 104 62 -10 -23 -354 -32 183 -65 -6 231 -66 124 -289 258
7353 258 -30 229 -45 106 -232 109 155 -211 -79 -148 -54 142 91 -68 -115 272 27 -68 147 8 167 -50
7375 -50 -50 -10 134 -105 -146 -35 -49 110 140 189 -166 -211 -44 -255 -68 -95 64 -28 10 -264 -195 -88 -31 -215 237
7400 237 49 13 -3 58 -41 -197 -186 -26 250 -167 112 76 -15 -219 -124 35 -85 -296 -291 -334 40 151 54 -175
7424 -175 62 141 29 80 146 22 292 68 352 -176 149 26 -146 -193 249 -126 62 13 305 83 -8 150
7446 150 51 50 166 10 -88 -101 188 -163 11 -80 -107 -139 165 6 88 -315 -114 79 -5 -141 85 -50 188
7469 188 402 -108 -53 220 530 -169 -69 222 58 199 -343 66 37 197 73 -73 45 156 138 -195 -115
7490a15K63j39L20l98j73K33P3M8k23J58j1j06p3J10J3R8k19J55J39k6j18J05
7512A14j25M7J35L2l37q5J25K1J76k01k5K41J04j63j1O1P1k16R8M6p4k61m2J61
7536a08o8N8K65k99J27R1P6l01L04J13j22n1q6j38J74J08j84j29K01k13j63M55
7558A10j26L52j75l22J49o5p8K27l99L07K61k23j80j04L73p3j51n7L00K77l34
7579F9O1J17k61l3j50J10k9rK05J06L8k64L22l73K87m52k8k2M42j48l9M6o0j20
7603a85K91j24K53j52q8j27J77n5p8M27k87J6j89N9K1M11l36j05J49k2k7k7j50
7626a48J48j07M0L10k04k3q3R0l1k71K24q7J27r8K30k54K4K8r1J98p6j31J6J35
7650c4k4m0O7k53q5L96R8k56K11j06K57l29L19j22K1R8k06O2L11k53Lk56O5J60
$$ plain form
7490 -115 148 9 329 -69 -242 -9 64 112 -111 47 36 -70 -143 -33 -20 78 -141 14 153 127 9 114
7512 114 -11 36 171 203 -134 -219 -94 -73 103 -98 -123 118 222 59 48 109 180 -36 62 108 34 -227 -269 -108
7536 -108 -176 -118 147 -152 -25 66 142 -159 145 258 136 85 -1 -139 35 143 -41 -170 31 -182 -345 110
7558 110 -16 336 161 -161 -12 -77 -155 72 -327 -20 241 18 -162 -266 107 34 -117 -174 126 403 69
7579 69 130 247 -14 -47 -197 -87 -116 -125 80 186 224 -40 282 -91 196 -256 -284 -306 136 -12 -51 -5 -65 -185
7603 -185 106 -18 235 83 -5 -132 45 -10 -88 339 52 68 -121 -62 -41 370 34 -71 78 56 29 2 -148
7626 -148 0 -107 -67 243 39 16 -67 23 -8 -279 -55 -142 -15 -113 117 -137 -113 -85 -176 22 -54 -185 -169 -34
7650 -34 -58 -98 -31 -284 -369 27 125 -131 80 -26 231 -98 221 99 120 218 12 74 385 132 135 -121 -56 104
7674A04k92K66l2LJ63k53J5O9j98J20K80o7k62N8k0j29L28j39pK03j29j59k67
7697c45L58O2O9k73J97j17Qq8J44M3J0k76M29j60j15j9o6Q9j42K57J99j66k55
7720a57L18j39Q4J42k11m4j07J00J34j49k2K74j95j48K3k5K3o0O9J3j3N19j68
7743B61k94K43rk67k6R0m2J28l08K15J45m45L37P7k65J12O3r4nJ33pj87J01K96
7767B52l26n7J8P5k07J55o0Q1Lk17N24k10O2l99K65p0K30l4k04J36j58M28l89
7790a02j58L09j14K57j64L9k25J6J18K28jj53J15j74q0L03k31J77L6l53J46l00
7812c11K71j14K88j00J82o20M88L5r7J61m37J59J02J64k15N1j57j32J54M9L91
7833C12k80J38k23J90j68O4k44L83l62J46K83k14J29o05M62L54m95j24M64n8l2
$$ plain form
7674 104 -188 78 46 49 212 -41 -26 43 -155 -35 245 178 -84 -26 -46 -175 153 14 7 210 81 -78 -345
7697 -345 13 75 144 -129 68 -49 -41 -129 15 58 68 -208 221 61 -54 -73 -139 -50 -192 65 264 98 -157
7720 -157 161 22 106 248 37 -7 -114 -14 120 -29 -51 223 28 -120 -97 -122 -99 -159 -90 -77 -90 429 261
7743 261 -33 210 201 -66 -92 -2 -44 84 -224 -9 136 -309 28 105 -160 -48 15 -79 -84 49 42 -145 -44 252
7767 252 -74 -131 -113 -38 -245 -90 -150 -69 -66 -283 241 31 93 -306 -41 -111 119 85 -119 17 -141 287 -102
7790 -102 -260 49 -65 192 28 67 -158 -142 -24 204 203 50 165 -9 -89 214 -17 160 196 -157 -11 -311
7812 -311 -40 -154 134 34 216 -404 84 119 22 183 -254 -95 7 171 -44 7 -150 -282 -128 -79 312
7833 312 32 170 -53 137 -31 33 -211 172 -190 -44 239 25 154 -451 11 365 -130 -254 210 152 120
7854A20k35M0l7K30j51l65L29M8J7j68K45J51p6m05K68j02N0J39L36p63N9J51
7876a19K13k13M0k48J71J19k14J67k4k2J61j09k95M2J87K16n2l9r2o0L05l17K28
7899D5L36l34L9q7J94K5n0k42j67K68l4l3j3J31Q2k60J24K5j74j09K68L2J15m50
7923b69M07m41J65M2J10R0r0m0j96K83J75ll68R2j0K54l05j92Q7J81l7n6K14k24
7947a31K20j12j71K75Q6j20N1j37J59q3%j51n7O9N3O6o7j29L19j74J99on7l23
7971b21J6L50k57m5J04J67o01J10J82p5K59L4q3L6j92K48l9J48O3l48j1L69l22
7994a08J34K11l3k04L9M1J18l65K31M2m2O4k33O0J53k63L94k16J32l38J13J49
8016G9k25K18j56J2j05J14L55l1l35K5L38M1k27k5n4J13k55k7K54k69J23K14o1
$$ plain form
7854 120 -115 -75 -112 118 -33 -398 -69 -21 -4 -172 73 224 148 -257 11 -91 -41 98 434 -329 -270 -119
7876 -119 94 -119 -79 -327 -156 -37 -251 -84 -108 -130 31 -78 -373 -331 -144 72 20 -19 -111 -171 134 -183 45
7899 45 381 47 86 -1 193 218 168 -74 -241 27 -7 -40 -53 78 160 -100 24 49 -125 -234 34 66 181 -269
7923 -269 138 -303 -138 -96 14 104 14 -26 -222 61 236 233 -135 -43 -53 201 -104 -296 -209 -28 -65 -121 93 -131
7947 -131 89 -23 -194 81 167 47 98 -39 120 37 37 -114 -171 -102 -49 17 -50 -179 140 -34 165 159 102 -221
7971 -221 -205 145 -112 -157 -53 114 -487 -377 -195 -270 -11 23 -60 -24 -216 32 -7 141 204 -144 -155 214 -108
7994 -108 26 237 204 0 39 80 198 -167 64 106 64 128 -105 -45 108 -155 239 23 155 -183 -70 79
8016 79 -146 72 -84 -72 -177 -63 292 261 -74 -49 289 330 103 78 24 137 -118 -145 109 -160 -37 177 116
8039A16l96J93%K70o1m87K23J31L1j18J52j03L02l82K01o1k36M18k04l39J95K48
8061I3J4j27L95l50j0p3K29M6k74j0K53o6k29J51o2o7K16K5k35M9P1j91M74m06
8085h4J16j54J77Q5j79J93J73j83p5j09j76M54j48J18l22j0J76j18J32L91o54
8106a97L84k45J25K04j6j59j66K35k93J24J08j70q1K63L2r0R2l57J20n0J23j36
8128a50K61k86K48l0J11k7k76J19K01k30O0j34J53j29K90k36J63J50k20k01J66
8149CK05k44NM0J4j45J97m16M67k35K3K74j35J2q6Q0k05o1J09O86o90k50L84K76
8173C08n19K0J55l44N39l28P3P9J02R9k66K7L3j90L33J2j47K09
$$ plain form
8039 116 -280 -87 -87 183 122 -365 -142 -11 20 -98 54 -49 253 -129 72 11 -225 193 -11 -350 -155 93
8061 93 107 -20 375 25 15 -58 171 217 -57 -67 186 120 -109 42 -20 -87 129 154 -81 -32 39 -152 322 -84
8085 -84 32 -122 55 140 -39 154 327 144 69 -40 -216 238 90 208 -114 -124 52 -66 66 457 -197
8106 -197 187 -58 67 271 255 96 -70 165 -128 -4 104 -66 -147 116 148 58 150 -207 -87 -137 -14 -150
8128 -150 111 -175 73 43 154 127 -149 -30 171 -59 1 -133 20 -109 181 -55 108 258 38 -163 3
8149 3 208 -36 -31 9 23 -122 75 -341 126 -109 -86 188 53 65 -21 59 -146 -207 -98 588 -102 -352 32 308
8173 308 -211 -191 -36 -380 159 -169 -96 -17 85 184 -82 -55 -22 -212 121 133 -14 195
8191A95
$$ Imaginary data points
##PAGE= N=2
##DATA TABLE= (X++(I..I)), XYDATA
0@%%%qJ6qQk4L2l2M0n6P2q8J04j28J54j78K14k55K97l46M00m63N36o14O98p95
28d24R03j019J148j292J450j620J808k019K247k494K769l071L401l765M168m615
44b425N113n670O300p015P831q779R894j1226J2853j4894J7540k1124K6280l4381
58a9703M9024q3652L06211K49633p19461j57391M24990K15129l42126p1662L23293
69A74285O4748m09302j22735L61546K16060k64370j95441J39448R8914j46775
79h3622o139K20514L9995k61191j05508K05204J28499j46860p8429J46036O5509
90A24008j66416p9154J62579J04956j42861j17081J09320J11436q7565r7671P4190
101d259Q3305p3105q2942N0294N5554n2567k5139Q6006L2449j08467o1116R6269
$$ plain form
0 0 0 0 0 -8 8 0 8 -16 16 -16 24 -32 40 -48 56 -72 82 -96 118 -137 160 -186 214 -249 287 -327 371 -424
28 -424 479 -540 608 -684 766 -854 954 -1065 1182 -1312 1457 -1614 1787 -1978 2190 -2425
44 -2425 2688 -2982 3318 -3697 4134 -4645 5249 -5977 6876 -8018 9522 -11602 14678 -19703
58 -19703 29321 -54331 251880 501513 -217948 -375339 49651 264780 -77346 -149008 174285
69 174285 239033 -170269 -293004 68542 284602 20232 -175209 -35761 63153 -83622
79 -83622 -89761 130753 170748 -90443 -195951 9253 137752 -9108 -87537 58499 124008
90 124008 -42408 -121562 41017 145973 3112 -113969 -4649 106787 19222 -78449 -4259
101 -4259 79046 5941 -77001 -26707 28847 -23720 -48859 37147 69596 -38871 -99987 -3718
113c718O9941p8704n2974R1909O3215r5550q1726P8157R2425m5616p5607K3993
125a4255L5279l9530j2325P8134L3609r6186q5261M9498Q5015n126m1006J1780
137c74J5648m6860m1293M7179P7985k823p2716l6458M0115M7055k560k0357P790
150A2331O983l7524l4525M4494P8613q854q9170k9640O5685L2772n8366l2659
162d9860N9141L9296n7183m7442M7220M5649m3259m0217M8826M2654n4740n1891
174f1806N7699P0422l9270o9500K7502N9682l1982o0114M0656P8834k6325q9392
186d3594J114P3134M616n8893J462N5658j0619o6039L608P1494J0968o1362j9634
199c8087L9401L392k9883K3493N2868k2388o7507P797O0061o115m8745K5841O3377
$$ plain form
113 -3718 66223 -12481 -65455 26454 89669 -5881 -87607 -9450 82975 37359 -38248 -14255
125 -14255 21024 -18506 -30831 47303 80912 -15274 -100535 -51037 33978 28852 -12154 -374
137 -374 15274 -31586 -72879 -25700 52285 49462 -23254 -59712 -19597 27458 24898 4541 12331
150 12331 19314 -18210 -52735 -8241 70372 61518 -27652 -57292 8393 41165 -17201 -49860
162 -49860 9281 48577 -8606 -56048 -8828 36821 -6438 -46655 2171 44825 -9915 -61806
174 -61806 -4107 66315 27045 -42455 -14953 44729 12747 -47367 -6711 72123 45798 -43594
186 -43594 -42480 30654 35270 -23623 -22161 33497 22878 -43161 -39553 31941 42909 -18453 -38087
199 -38087 1314 4706 -25177 -1684 51184 28796 -38711 -30914 29147 23032 -25713 128 63505
212F3505l3919r0794J5795J03672J4229r1076l7348N5098K5002l8078K41M8869
224C5196n289o2624j4749M5692J5331k1936J3872K9612l3401n6881K5691P5848
236D6362L78o7875j4505N0549J1508m2759r34N3521R608o2099l8283L5236M3056
249B3763l651j8203M66k177k0692q856J8151J9147K209n270q866j6794m201K7822
263B848L0238j2216m1491j5534K6768K8610n31j1035o29J279j4746k2047J300
276b7186L5958L3767j3797n2684k4401L5411L9858j1764l4952J688K4000o812
288i14k4175J5564M2035n61m8107k5249K3377K9088P197L823J036k2866k8454
301b8206O126L1316J0085j0622q9j860k6172j3473L8524M1748k6578n8656k870
$$ plain form
212 63505 29586 -61208 -45413 58259 72488 -18588 -55936 -838 24164 -13914 -13673 35196
224 35196 29907 -32717 -47466 -1774 13557 -8379 5493 35105 1704 -55177 -29486 46362
236 46362 46740 -21135 -35640 14909 26417 -16342 -17276 36245 45853 -16246 -54529 -19293 23763
249 23763 20112 1909 2375 198 -20494 -29350 -11199 7948 10157 4887 -3979 -20773 -24974 2848
263 2848 33086 20870 -20621 -36155 -9387 19223 18692 7657 7028 8307 -6439 -28486 -27186
276 -27186 8772 42539 28742 -23942 -48343 -12932 26926 15162 -19790 -18102 5898 -914
288 -914 -25089 -9525 32510 31949 -16158 -41407 -18030 11058 18255 22078 23114 248 -28206
301 -28206 -22080 9236 19321 8699 8610 6750 -19422 -32895 5629 47377 20799 -37857 -40727
314d0727M4968J4357j8773N830K3372j7983m7061l349M7056K9705j2618j8016
326F761r107j3975j990L1928K4916k5905l8095R948L2171n795k2191J4979K6888
339C0533k2584m7676L737M8712K0193k2337j5115M852n707j3451J0447K4698L019
352A9321j5591o488N19l547N594J8945Q60k7746j5319K1221J7636j3185q529J8687
366A2378N222l2094k2492K4327L2102k622j7898l448j995j0580O430K4631K597
379A6558k4551o208K0427J493k2193O280L6631j141m9335k1801L9356L5909j4744
392A6681k5150J734K839j3401J067K4460O946k1398r253J4070J219j3249R552
405c883K2555j1291l2113O418L7059J144l4036m90L6748J404m3270j2542L9693
$$ plain form
314 -40727 4241 18598 -175 5655 29027 11044 -36017 -39366 7690 37395 24777 6761
326 6761 -2346 -16321 -18311 13617 38533 12628 -25467 -15519 16652 10857 -11334 3645 30533
339 30533 7949 -39727 -35990 12722 32915 10578 -4537 315 -5392 -18843 -8396 16302 19321
352 19321 3730 -2758 -2239 -5786 -192 18753 19613 -8133 -23452 -2231 15405 2220 -6309 12378
366 12378 17600 -14494 -36986 -12659 19443 16821 -1077 -4525 -6520 -17100 -10670 13961 16558
379 16558 -7993 -14201 6226 7719 -14474 -8194 28437 27296 -22039 -43840 -4484 31425 16681
392 16681 -8469 -6735 -3896 -17297 -16230 8230 15176 -6222 -15475 -1405 -186 -13435 -3883
405 -3883 18672 7381 -24732 -18314 18745 19889 -14147 -14637 22111 23515 -19755 -32297 7396
418G396K1856k6140j8595J7767Q522k1874q170K1690J0842j4476n843Q879q357
431f503j5097K2061L5144j7466n1798j643N1937J8596l5977j5011L2457Q720m1662
444a6242k0108M1655L7753k2275l8714K66J8932R45j929J2842K190k4506j7622
457b6813J3442K2862P041j196n821k1466k0801J5296M2311J4551k9934k8261N403
470a3386J7090K791L38Q326l34j8990j5859Q055K2531J4765o865k4385k1447M525
484b2845K6375J5819j0792j3951K278K966j1948o567J9431K2263o486k4767j1086
497a9310J0734J6148R314j003j3209j6811k607J3241J3239M950J076r403k4503
510a8144j5766J9520L6537M430k9768j8706Q522R649j986O333J3421o259k5023
$$ plain form
418 7396 29252 3112 -15483 2284 10806 -11068 -19238 2452 13294 -1182 -7025 1854 -6503
431 -6503 -21600 461 35605 18139 -33659 -35302 16635 35231 -746 -15757 16700 25420 -16242
444 -16242 -36350 5305 43058 20783 -17931 -17665 1267 2212 283 13125 15315 -9191 -26813
457 -26813 -13371 9491 16532 15336 9515 -11951 -32752 -17456 24855 39406 9472 -18789 -13386
470 -13386 3704 6495 6833 15159 14825 -4165 -20024 -11969 10562 25327 18462 -5923 -27370 -22845
484 -22845 3530 19349 8557 -5394 -3116 -150 -12098 -18665 766 23029 16543 -8224 -19310
497 -19310 -8576 7572 16886 15883 2674 -14137 -16744 -3503 9736 14686 15762 6359 -18144
510 -18144 -33910 -14390 22147 26577 -3191 -21897 -13375 -3726 -5712 621 14042 7783 -17240
523a7240o049K0864J6796j655l830l852j7784j4766K0017L5146j155l1885r883
536a5276J7444j323k1718R102L7051J391m6188k1835L4849L2258j5171k2908O150
549f174O756j5929l333L0346J9404k3091k7002P627J5730m946j853J8800N248
562B1583k7582j6042K3329K0812j8476k0085J6437J8468k0208k3464J8868L1109
574B4749r893l1128j354K0496k42j2876J0806K1777q011k7814l895J9368P663
587I646m475N774N459j9559j9673J8864L3128o939l4319o498K4006M255k0085
600a0416L480K7974O70l8312j8049K8676K7746j0070j8729M797P728j1244p173
613a2922J5724J4108r576j3665M053N223o394K216J8648K198k9018j7919K3610
$$ plain form
523 -17240 -23289 -2425 14371 12716 8886 5034 -12750 -27516 -7499 27647 26492 -5393 -15276
536 -15276 2168 845 -20873 -11771 25280 26671 -19517 -41352 -6503 25755 10584 -12324 -6174
549 -6174 582 -15347 -18680 11666 31070 7979 -19023 -11396 4334 -612 -2465 16335 21583
562 21583 -5999 -22041 1288 22100 3624 -16461 -24 18444 -1764 -25228 -6360 24749
574 24749 14856 -16272 -17626 2870 2628 -10248 558 22335 14324 -13490 -17385 1983 9646
587 9646 5171 10945 16404 -3155 -22828 -3964 29164 22225 -12094 -18592 5414 9669 -10416
600 -10416 -6936 21038 21708 -16604 -34653 -5977 21769 11699 -7030 -2233 5495 -5749 -12922
613 -12922 2802 16910 7334 -6331 -2278 2945 -3449 -1233 17415 19613 -9405 -27324 -3714
626c714K6427j2610k3859Q432J9528j3706k6925J0535L4711J027l2154j1186K3355
639a39J2894j4431r048J2301O222j1091m623Q911L424n687M812Q341j1265k0331
653a9710P183K8087K919k5529q595J9162N556k3761o388K9172J7487k6796k9634
666c0847J2325L0283L961j6591m649L687n332n082J2765J6439l248j5322o384
679g995J173j036P889J8811K357k7096k1341J5787K7230l02j9225k032R419p991
693d352j5892J1246L0353M183l0132k1417J2163K0764M697l801m91m804j1300
706h783k212J3585J1880k901q699m629l958l049Q472J7669K076k1733j8887Q727
720a2442K0939K890j1739j411Q972m799j7119L14K4147J2706j7876j9929O764
$$ plain form
626 -3714 22713 10103 -13756 -5324 14204 498 -26427 -15892 18819 19846 -12308 -23494 -139
639 -139 12755 -1676 -10724 1577 7799 -3292 -7915 996 4420 -1267 3545 11886 621 -19710
653 -19710 -12527 15560 18479 -7050 -15645 3517 9073 -14688 -21076 8096 25583 -1213 -30847
666 -30847 -18522 11761 15722 -869 -5518 -1831 -7163 -12245 520 16959 13711 -1611 -7995
679 -7995 -6822 -7858 31 18842 21199 -5897 -27238 -11451 15779 15477 -3748 -5780 3639 -4352
693 -4352 -20244 -8998 21355 25538 -4594 -26011 -13848 6916 11613 7812 7321 2517 -8783
706 -8783 -10995 2590 14470 11569 2870 -1759 -5717 -8766 -294 17375 19451 -2282 -21169 -12442
720 -12442 8497 11387 -352 -1763 7209 2410 -14709 -14395 9752 22458 4582 -15347 -8583
733h583J6056l53p587M898N874j0251j2331O215J4108J811n422n86l697j2860
747a2708k357J9844J4149j3351j7973N322J0660q579p162J8637J6794k0205l0732
760b7661O200L3943J1068j8087j2189L205k806o738J2277K0243k518k2451j0434
773a5948P722M612K419J2926O954k3339k5954J2519L5310M439k6691r007J4417
786C79o06j7333P205L1750M685l4361k0653J8781K2062m073p262N220k334j6258
800a2798k203K0480J0873j3187j0762M781m8p963P125K1226j895k8366j1450K2361
814a826J8230j1492j4480P135J1401p572j0964O052J1213j156p223j824J837O69
828@K866K568m204o621M084R452m202j3467K344J8028M231j7914j2405J0636J4150
$$ plain form
733 -8583 7473 7120 -467 4431 10305 54 -12277 -6062 8046 9857 4435 3849 152 -12708
747 -12708 -15065 4779 18928 5577 -12396 -7074 3586 -4993 -12155 6482 23276 3071 -27661
760 -27661 -21461 12482 23550 5463 -6726 -3521 -6327 -13065 -788 19455 16937 -5514 -15948
773 -15948 -8226 -3614 -1195 11731 18685 -4654 -30608 -18089 17221 21660 -5031 -14038 379
786 379 -227 -17560 -10355 21395 26080 -8281 -28934 -10153 11909 7836 574 5794 3460 -12798
800 -12798 -15001 5479 16352 3165 -7597 -2816 -2864 -10827 -3702 17524 15629 -12737 -24187 -1826
814 -1826 16404 4912 -9568 -2433 8968 1396 -9568 -3516 7697 6541 -682 -2506 -669 0
828 0 2866 5434 1230 -5391 -1307 8145 3943 -9524 -7180 10848 15079 -2835 -15240 -4604 9546
843I546l455r074K556O582n045q941L037J1732M141o946q775k888N258R444M093
858A1265p760r361J079P488j085n670N718J0762m549j7907o385J4564J5731k844
872A1046j2510o631L288M883K535k28J31J663k199q573m382J0682J4589j964j7920
887e590q184R746R365l309l349N043J181r354o648P122R619j87m208k335l870
902d958l586M811R641J406p405m385J296j397k095Q010J1524l651j8367q576J2049
917e683J4828N53p878n261k725j597L805Q161L741m262o995m879j422O063J2231
932H680N899j2011j6314j78J4531P908l309l189j38n515p079M558J3893M711q267
947D180r508k943J83O106J2314M076j2991j4849L922J2421J961l435M582L061
$$ plain form
843 9546 6091 -2983 -427 6155 1110 -7831 -4794 6938 11079 4133 -4642 -7530 -2272 7172 11265
858 11265 3505 -5856 -4777 2711 1626 -4044 1674 12436 7887 -10020 -16405 -1841 13890 11046
872 11046 -1464 -8095 -4807 76 2611 2383 2514 4177 1978 -6595 -10977 -295 14294 12330 -5590
887 -5590 -13774 -4028 5337 2028 -1321 3722 4903 -4451 -11099 -3977 5642 5455 1247 -1088 -4958
902 -4958 -8544 -3733 5908 7314 -91 -4476 -3180 -4577 -6672 1338 12862 9211 -9156 -17732 -5683
917 -5683 9145 9698 1820 -3441 -6166 -7763 -3958 4203 7944 3682 -3313 -8192 -9614 -3551 8680
932 8680 14579 2568 -13746 -13924 607 8515 5206 2017 1879 -3636 -10715 -6157 7736 12447 4180
947 4180 -5328 -8271 -8088 -1982 10332 14408 1417 -13432 -9510 2911 4872 1437 6019 9080
961I080j3833j3940J2130K3239M98j9845q546Q396N569l179K105P310k482j0909
975d407l546N606M285L140M287k763j4110o520J3356J4408n648j3150K066Q110
989E114n086j0485Q484J6753k377j8698p246J0840R401j210j700r89n225n892
1003h316M917R257k58m986J81J026q400l863J3092J3180j0051j8588J959J6130
1017E280J598j2208P88J3112p41j7012n294J5074J1774o735j0471q31K204K57
1031c205L850M724k303o463r76L041j511j509P365P724q222j5482M1J6039Q772
1046A1885q914r908K661N383j964l508L215O816o80q685n746M428R218L155o086
1061A270o329J341L935p19k192K740N555j247q579m326O152P405J349m666n570
$$ plain form
961 9080 -4753 -18693 -6563 16676 17174 -2671 -11217 -2821 2748 -431 1674 8984 6502 -4407
975 -4407 -7953 -2347 1938 5078 9365 6602 -7508 -14028 -672 13736 8088 -5062 -2996 5114
989 5114 28 -10457 -1973 14780 12403 -6295 -13541 -2701 6700 5490 3790 2801 -2424 -8316
1003 -8316 -3399 5858 5600 614 795 1821 -6579 -10442 2650 15830 5779 -12809 -10850 5280
1017 5280 6878 -5330 -4542 8570 7829 -9183 -14477 597 12371 5636 -4835 -5666 -3462 -3205
1031 -3205 645 5369 3066 -3397 -4373 -1332 -2843 -4352 3013 10737 2515 -12967 -12926 3113 11885
1046 11885 2971 -6937 -4276 1107 -857 -4365 -1150 5666 4986 -3699 -9445 -5017 4201 7356 1270
1061 1270 -5059 -3718 217 -502 -2694 46 5601 4354 -4225 -8551 -2399 5006 6355 1689 -3881
1076c881l66L903L528j394l178K037M089l799q356P03J2687N949j0231j0908M387
1091d830R077q70n727L327N266m038p583J647O682P21j304K021j717r337j081
1106g746J2813Q421j0505j1255N936P744o929n916J2252J0830j3274j8714O335
1119a0008J9747R95j3126j430Q249l700j0023N664J4561o90j3453l185N652k85
1133a032j985R295P208j3584j6484Q592J9191j585j5309M27J2834m499j6017L079
1147i869K0060L626j7002q959Q742N832l804J720P563m284j2844l95J2297L516
1161F199o061O40M704p101j1741N704J8441K017j6403p565Q762M570o068Q40J1138
1176H076n7j5221q089J0763J2529q37o185l124l315k165N945Q901m3q732l199
$$ plain form
1076 -3881 -4247 -344 3184 1790 -1388 649 4738 939 -7417 -6714 5973 11922 1691 -9217 -4830
1091 -4830 4247 3377 -2350 977 6243 2205 -5378 -3731 2951 3672 2368 4389 2672 -6665 -7746
1106 -7746 5067 13488 2983 -8272 -2336 5408 -1521 -7437 4815 15645 2371 -16343 -10008
1119 -10008 9739 10734 -2392 -3822 4427 727 -9296 -3632 10929 10239 -3214 -6399 -747 -1032
1133 -1032 -3017 6278 13486 -98 -16582 -7990 11201 9616 -5693 -5266 7568 3069 -12948 -9869
1147 -9869 10191 13817 -3185 -12144 -3402 2430 -1374 346 7909 3625 -9219 -9614 2683 6199
1161 6199 138 778 5482 -1619 -13360 -7656 10785 12802 -3601 -11166 -2404 2166 -3902 -3062 8076
1176 8076 8019 -7202 -15291 -4528 8001 7164 979 -2145 -5460 -7625 -1680 7221 7178 -1554 -4753
1191d753M136J27m326M204J0791j309j5408q503J0680J3991J7j0211n104K234
1205c434J493j101K106O286K317o990r794k9J0303R513k896j0026l789L524L774
1220A257O14K132J919k882p456k537N130O505L269k883p393n565K647R833K882
1235G472p300m608N468L252q073m207J1196J0883q732j6159O76J4336N659o687
1249C176l685K915l045m962L564Q327N1o727j340J643l295r41Q653N327j0526
1264h65j1393P194J3772l387j1490K386J0359l791j2319K852J5071M12j3105k460
1278f764J0616J696r843r67R030J552p821k20N806k977p356N163J0695m952j4285
1293a0627J756J4066J725j1216k415J0716L97j2508k173J3351P108q265p318K637
$$ plain form
1191 -4753 -617 -490 -4816 -612 10179 8870 -6538 -15041 -4361 9630 9647 -564 -5668 -3434
1205 -3434 -1941 -3042 -936 5350 7667 677 -9117 -9146 1157 10670 7774 -2252 -6041 -2517 1257
1220 1257 1871 4003 5922 3040 -4416 -6953 -1823 4682 7951 5068 -2325 -7890 -5243 4590 7472
1235 7472 172 -4436 1032 4284 -3789 -7996 3200 14083 5351 -10808 -10132 4204 9863 3176
1249 3176 -509 2406 -639 -5601 -2037 6290 6341 -386 -1726 -83 -3378 -4319 4334 9661 -865
1264 -865 -12258 -5064 8708 5321 -6169 -3783 6576 2785 -9534 -6682 8389 8801 -4304 -6764
1278 -6764 3852 5548 -4295 -5262 3768 5320 -2501 -2721 3085 108 -7248 -2085 8610 3658 -10627
1293 -10627 -8871 5195 6920 -4296 -6711 4005 4402 -8106 -10279 3072 10180 1915 -5403 -2766
1307b766K372k469K593O518k040r089j510P331J626l617J689M688n799j1618M052
1322h039J5072M190j1659p820M279L819k329R35P548O74r181o056M651P967K349
1337F400j989m707m776m92P492O041m126o595J018L590l057m332N365Q226k490
1352E568r816l205O554M317j497j916N88N57j482r23M54J862L555N79n069o336
1368f210K131R014L547o221m005J319m8k930J389P444K126o904o483R40M155K895
1384B159K888j25p010o581M072R709J130o492l20L587m775q074O138J6173R98
1399A3477j6369j0392Q277J0516p93l473N68j729o567o07P980N432k607m194k116
1414b597m896q92J0372J0964o349j6073k413J3010N427o972k057O927K1j0977
$$ plain form
1307 -2766 -394 -2863 -270 6248 4208 -4881 -6391 940 2566 -1051 638 5326 -473 -12091 -8039
1322 -8039 7033 11223 -436 -8256 -3977 -158 -2487 -1552 5996 6670 -2511 -8567 -3916 4051 6400
1337 6400 4411 -296 -5072 -5564 1928 7969 3843 -2752 -1734 1856 -1201 -5533 -168 8058 5568
1352 5568 -4248 -7453 -899 3418 1921 5 593 1150 -332 -1255 -801 1061 4616 5195 126 -6210
1368 -6210 -4079 4935 8482 2261 -1744 -425 -473 -3403 -2014 5430 7556 652 -5831 -4891 -736 2159
1384 2159 5047 4922 -2088 -8669 -4597 5112 6242 -250 -570 3017 -1758 -9832 -3694 12479 13477
1399 13477 -2892 -13284 -5007 5509 4716 1243 1811 82 -6485 -7092 888 6320 3713 -481 -2597
1414 -2597 -7493 -8385 1987 12951 6602 -9471 -11884 1126 6553 -419 -2476 4451 4472 -6505
1428f505l272J1541P879o102q506n02L371R29K420K358k763m499Q48K489k352
1443b666k201O871N933o725j1237L300J2628Q56r895j940P838J787p606k383P500
1458B060M731m810n134m8R48J023M444K132m766n947K206M957j652l250M936M727
1474F557o383q575L474J1222K034p979m273K253J378j00L739L384l401o598j297
1489d565L246J991K785L305k869r810l363J0528P955o172p921K472M871l556l090
1504d193O584O576o051r900J030P854K709j932Q34j254n466j029O732K879n731
1519c58l596N184L072n765m163O834N365o890p114M649P678k582o611K070O054
1534C827j217n730l84L733K71n32K144J082l776l201K771K817k229q56L646O56
$$ plain form
1428 -6505 -9777 1764 9643 3541 -4965 -5467 -2096 -1167 1253 3611 848 -3651 -2803 -314 -2666
1443 -2666 -4867 2004 7937 1212 -10025 -6725 5903 6759 -3136 -5076 2762 4549 -3057 -5440 2060
1458 2060 6791 1981 -3153 -3201 -2253 -1230 3214 5346 580 -5367 -3161 1796 144 -3106 1830 6557
1474 6557 174 -8401 -4927 6295 8329 350 -3923 -1670 -292 -392 3347 6731 3330 -3268 -4565
1489 -4565 -1319 672 3457 6762 3893 -5917 -9280 1248 9203 3031 -4890 -2418 2453 -1103 -4193
1504 -4193 2391 8967 2916 -6984 -5954 1900 4609 2677 3511 2257 -3209 -4238 2494 5373 -358
1519 -358 -3954 1230 4302 -1463 -5626 1208 6573 -317 -7431 -2782 4896 2314 -4297 -2227 3827
1534 3827 2610 -3120 -3504 229 500 -32 2112 3194 -582 -3783 -1012 1805 -424 -1280 2366 3022
1550C022o975l907Q168P758n609r886l9P359K390k207L8J934k573n093L47N828
1566E55L985l05l075m011l023L668P546J367p428n585K684M858M28j339J895K64
1582B484n533m745L383P591L167m281n740j471K895M286M41j975o64Q71j40k488
1598a919J75N399K717m944o200O53N638K430j946j577j03p84j239r29J538K176
1614A085L096o27n942m947M222Q251J565p236l737M503K273l120p19O772K777
1629H216q230q069L641R530K449m321l654j041k220N06M921L501l397m293n66
1644c027O97j98K886O096q67j0144n552P726J0171j403o754j433K518k107k681
1659d072M684O692j757q432l265M096L838J547j82l518m935q92N848M462l000
$$ plain form
1550 3022 -3953 -7860 308 8066 2457 -7429 -7468 -109 2281 74 112 2046 -527 -5620 -5273 555
1566 555 4540 4235 1160 -2851 -5874 -2206 5340 6707 -721 -6306 -3622 1236 1664 325 2220 2484
1582 2484 -3049 -7794 -4411 3180 6347 2066 -3674 -5145 -2250 2036 2477 502 -162 709 569 -1919
1598 -1919 -1744 3655 6372 1428 -4772 -4119 1519 3949 2003 426 323 -461 -1700 -2629 -1091 1085
1614 1085 4181 3554 -2388 -7335 -3113 5138 6703 -533 -4270 233 2506 -614 -1333 5439 8216
1629 8216 -14 -8083 -4442 5088 7537 3216 -438 -1479 -3699 -3193 1728 5229 1832 -2461 -3027
1644 -3027 -2330 -2528 358 6454 5587 -4557 -10109 -2383 7788 6385 -369 -1802 716 -1391 -4072
1659 -4072 612 7304 5547 -2885 -6150 -2054 1784 3331 3149 -369 -5304 -6196 -348 4114 1114
1674A114l813J575J501l799k394N680O550l129p983r81O737L458l999k525K661
1689F53K562l659l362K416L941P64k928l426q67J577K419J892j055k923q64J580
1705a280k3j433J634M177k12n287l328M832O633j070p199j223M636K332l641j291
1721a743M354K623m888n272J656N371Q43k820r55K55j098o3J920J203j591j390
1737a595J976M18k723Q7N651K120o173n436M513P214j942n618J130N044k142n861
1753c337l59O338J575m200j692J751j07j715J538K502j793m145J837L995j707
1768D81k883M167M895n448q394K191J1023J897p549l301L995J264m191o38N674
1783C183J882n467m062J559L964P62k37j016l514k804L556N783r79m540M2L078
$$ plain form
1674 1114 -2699 -1124 377 -3422 -5816 -136 6414 3285 -4698 -5679 1058 4516 517 -2008 653
1689 653 3215 -444 -3806 -1390 2551 3315 387 -3039 -3906 -2329 90 1982 927 -1996 -2860 -1280
1705 -1280 -1303 -2736 -1102 3075 2863 -2424 -5752 -920 5713 4643 -2556 -3779 857 3189 -452 -1743
1721 -1743 2611 5234 346 -4926 -3270 2101 2944 124 -831 -576 -1674 -1737 183 1386 -205 -1595
1737 -1595 381 799 -1924 -1837 3814 5934 -239 -5675 -1162 6052 4110 -1508 -378 4666 2524 -3337
1753 -3337 -3696 2642 4217 17 -1675 76 -31 -1746 -208 2294 501 -3644 -1807 2188 481
1768 481 -2402 1765 6660 1212 -7182 -4991 6032 7929 380 -2921 1074 2338 -1853 -2491 3183
1783 3183 5065 -402 -4464 -2905 1059 1821 1584 568 -2946 -5750 -2194 3589 2610 -1930 -1888 1190
1799A190j058m768J907P604J562p038n016M085M913r28l289K6J847j481k327R76
1815a795K944J278j222l839k743R67M684L249k108m008l98J896Q17j155J253K743
1831B563l9l858k480K331N063J624l705m901m1L755J981j675n72J730l83m825
1847c432k935M408O646l43o417k826K420K672P95M55L72k223k160P18K727J485
1863B362R17K98k725m954o07P477M730m439o361L52M529j324k419K552M163k682
1879A869o940K2O255K960k615k244j56j432l1L416L526j887l694M26J694j959
1895g90r51M403M148m615p959K117P374O52n103j516L236K51m250K40N398J369
1911D004m153l075J217J119J10J928K034k921l872J957M201o12l520J529L704
$$ plain form
1799 1190 132 -4636 -2729 4875 6437 -601 -5617 -1532 3381 2453 -836 -810 1037 -444 -2771 -1795
1815 -1795 1149 2427 1205 -2634 -5377 -4410 274 3523 1415 -2593 -2991 -1095 -278 -1433 -180 2563
1831 2563 2524 -1334 -3814 -1483 3580 5204 1499 -3402 -3443 312 2293 618 46 1776 1393 -3432
1847 -3432 -6367 -1959 4687 4344 -2073 -4899 -2479 193 988 1443 1815 -408 -2568 -1850 877 2362
1863 2362 3279 3577 852 -4102 -4709 2768 7498 3059 -3302 -2950 1579 255 -2164 388 4551 1869
1879 1869 -5071 -5049 1206 4166 1551 -693 -849 -2281 -2312 1104 4630 2743 -951 -525 1169 -790
1895 -790 -1741 2662 6810 2195 -5764 -3647 3727 4379 -724 -2240 996 1247 -3003 -2763 2635 4004
1911 4004 -149 -3224 -2007 -888 -778 1150 3184 263 -3609 -1652 2549 1937 -1583 -54 3650
1926C650k471n193R40O852J529n873l784K805K678j622p46J889R52k239k633N04
1942b762J416K224J070j390k801j181K876L235r34k776j39J705l77j771O78L261
$$ plain form
1926 3650 1179 -4014 -3074 3778 5307 -566 -4350 -1545 1133 -489 -1235 654 1606 -633 -3266 -2762
1942 -2762 -1346 878 1948 558 -2243 -3424 -548 2687 1753 -1023 -1162 543 166 -1605 -927 2334
$$ [...]
8191B07
##END NTUPLES=NMR FID
##END=
