##TITLE=1H_Lac-PbMe-C3
 CDCl3, 8 sc, 
 17.9.2019
##JCAMPDX= 6.0         $$ Bruker NMR JCAMP-DX V2.0
##DATA TYPE= NMR FID
##DATA CLASS= NTUPLES
##ORIGIN= UXNMR, Bruker Analytische Messtechnik GmbH
##OWNER= root
$$ XWIN-NMR		Version 3.5
$$ Tue Sep 17 16:11:05 2019 Russian Standard Time (UT+4h)  she@DPX200
##.OBSERVE FREQUENCY= 200.1315
##.OBSERVE NUCLEUS= ^1H
##.DELAY= (6, 6)
##.ACQUISITION MODE= SIMULTANEOUS
##.ACQUISITION SCHEME= undefined
##.AVERAGES= 8
##.DIGITISER RES= 18
##SPECTROMETER/DATA SYSTEM= spect
##.PULSE SEQUENCE= zg30
##.SOLVENT NAME= CDCl3
##.SHIFT REFERENCE= (INTERNAL, CDCl3, 0, 15.7039)
##AUDIT TRAIL= $$ (NUMBER, WHEN, WHO, WHERE, WHAT)
$$ ##TITLE= Audit trail, XWIN-NMR		Version 3.5
$$ ##JCAMPDX= 5.01
$$ ##ORIGIN= Bruker BioSpin GmbH
$$ ##OWNER= she
$$ F:/spectra/data/she/nmr/H-F/1/audita.txt
$$ ##AUDIT TRAIL=  $$ (NUMBER, WHEN, WHO, WHERE, WHAT)
(   1,<2019-09-17 16:10:04.84 +0400>,<she>,<DPX200>,
      <created by zg, POWCHK disabled, PULCHK disabled
       configuration hash MD5:
       00 E9 B6 7A A2 85 ED C7 34 08 36 98 17 FE 4E 26
       data hash MD5: 16K
       2A 98 27 05 97 3A 1D CE C8 D6 9E 06 70 A7 73 5E>)
$$ ##END=
$$ 
$$ hash MD5
$$ D6 2C 23 2B 81 DE 97 5C 4A C3 D9 1C 36 9E 2D 3B
##$RELAX= 
##$RELAX= 
##$RELAX= 
##$RELAX= 
##$RELAX= 
##$RELAX= 
$$ Bruker specific parameters
$$ --------------------------
##$DU= <F:/spectra>
##$EXPNO= 1
##$NAME= <H-F>
##$PROCNO= 1
##$TYPE= <nmr>
##$USER= <she>
##$AMP= (0..31)
100 100 100 100 100 100 100 100 100 100 100 100 100 100 100 100 100 100 
100 100 100 100 100 100 100 100 100 100 100 100 100 100 
##$AQSEQ= 0
##$AQ_mod= 1
##$AUNM= <au_zg>
##$AUTOPOS= <>
##$BF1= 200.13
##$BF2= 200.13
##$BF3= 200.13
##$BF4= 200.13
##$BF5= 200.13
##$BF6= 200.13
##$BF7= 200.13
##$BF8= 200.13
##$BYTORDA= 1
##$CFDGTYP= 0
##$CFRGTYP= 5
##$CHEMSTR= <none>
##$CNST= (0..31)
1 1 145 1 1 1 1 1 1 1 1 1 1 1 1 1 1 1 1 1 1 1 1 1 1 1 1 1 1 1 1 1 
##$CPDPRG= <>
##$CPDPRG1= <>
##$CPDPRG2= <>
##$CPDPRG3= <>
##$CPDPRG4= <mlev>
##$CPDPRG5= <mlev>
##$CPDPRG6= <mlev>
##$CPDPRG7= <mlev>
##$CPDPRG8= <mlev>
##$CPDPRGB= <>
##$CPDPRGT= <>
##$D= (0..31)
0 1.2 0 0 0 0 0 0 0 0 0 0.03 0 0 0 0 0 0 0 0 0 0 0 0 0 0 0 0 0 0 0 0 
##$DATE= 1568722204
##$DBL= (0..7)
120 120 120 120 120 120 120 120 
##$DBP= (0..7)
150 150 150 150 150 150 150 150 
##$DBP07= 0
##$DBPNAM0= <>
##$DBPNAM1= <>
##$DBPNAM2= <>
##$DBPNAM3= <>
##$DBPNAM4= <>
##$DBPNAM5= <>
##$DBPNAM6= <>
##$DBPNAM7= <>
##$DBPOAL= (0..7)
0.5 0.5 0.5 0.5 0.5 0.5 0.5 0.5 
##$DBPOFFS= (0..7)
0 0 0 0 0 0 0 0 
##$DE= 6
##$DECBNUC= <off>
##$DECIM= 24
##$DECNUC= <off>
##$DECSTAT= 4
##$DIGMOD= 1
##$DIGTYP= 9
##$DL= (0..7)
0 120 120 120 120 120 120 120 
##$DP= (0..7)
150 150 150 150 150 150 150 150 
##$DP07= 0
##$DPNAME0= <>
##$DPNAME1= <>
##$DPNAME2= <>
##$DPNAME3= <>
##$DPNAME4= <>
##$DPNAME5= <>
##$DPNAME6= <>
##$DPNAME7= <>
##$DPOAL= (0..7)
0.5 0.5 0.5 0.5 0.5 0.5 0.5 0.5 
##$DPOFFS= (0..7)
0 0 0 0 0 0 0 0 
##$DQDMODE= 0
##$DR= 18
##$DS= 0
##$DSLIST= <SSSSSSSSSSSSSSS>
##$DSPFIRM= 0
$$ [...]
##$SUBNAM2= <"">
##$SUBNAM3= <"">
##$SUBNAM4= <"">
##$SUBNAM5= <"">
##$SUBNAM6= <"">
##$SUBNAM7= <"">
##$SUBNAM8= <"">
##$SUBNAM9= <"">
##$SW= 24.0689530833862
##$SWIBOX= (0..15)
0 0 2 0 0 0 0 0 0 0 0 0 0 0 0 0 
##$SW_h= 4816.95568400771
##$TD= 16384
##$TD0= 1
##$TE= 0
##$TE2= 300
##$TE3= 300
##$TEG= 300
##$TL= (0..7)
0 120 120 120 120 120 120 120 
##$TP= (0..7)
150 150 150 150 150 150 150 150 
##$TP07= 0
##$TPNAME0= <>
##$TPNAME1= <>
##$TPNAME2= <>
##$TPNAME3= <>
##$TPNAME4= <>
##$TPNAME5= <>
##$TPNAME6= <>
##$TPNAME7= <>
##$TPOAL= (0..7)
0.5 0.5 0.5 0.5 0.5 0.5 0.5 0.5 
##$TPOFFS= (0..7)
0 0 0 0 0 0 0 0 
##$TUNHIN= 0
##$TUNHOUT= 0
##$TUNXOUT= 0
##$USERA1= <user>
##$USERA2= <user>
##$USERA3= <user>
##$USERA4= <user>
##$USERA5= <user>
##$V9= 5
##$VALIST= <valist>
##$VCLIST= <CCCCCCCCCCCCCCC>
##$VD= 0
##$VDLIST= <DDDDDDDDDDDDDDD>
##$VPLIST= <PPPPPPPPPPPPPPP>
##$VTLIST= <TTTTTTTTTTTTTTT>
##$WBST= 1024
##$WBSW= 4
##$XGAIN= (0..3)
0 0 0 0 
##$XL= 0
##$YL= 0
##$YMAX_a= 211216
##$YMIN_a= -328630
##$ZGOPTNS= <>
##$ZL1= 120
##$ZL2= 120
##$ZL3= 120
##$ZL4= 120
##$ABSF1= 10
##$ABSF2= 0
##$ABSG= 5
##$ABSL= 3
##$ALPHA= 0
##$AQORDER= 0
##$ASSFAC= 0
##$ASSFACI= 0
##$ASSFACX= 0
##$ASSWID= 0
##$AUNMP= <proc_1d>
##$AZFE= 0.1
##$AZFW= 0.1
##$BCFW= 1
##$BC_mod= 2
##$BYTORDP= 1
##$COROFFS= 0
##$CY= 11.3945322036743
##$DATMOD= 1
##$DC= 2
##$DFILT= <>
##$DTYPP= 0
##$F1P= 20.1720416913024
##$F2P= 0.152960286110954
##$FCOR= 0.5
##$FTSIZE= 0
##$FT_mod= 4
##$GAMMA= 1
##$GB= 0.15
##$INTBC= 1
##$INTSCL= 1
##$ISEN= 128
##$LB= 0.24
##$LEV0= 0
##$LPBIN= 0
##$MAXI= 10000
##$MC2= 0
##$MEAN= 0
##$ME_mod= 0
##$MI= 1.114404
##$NCOEF= 0
##$NC_proc= 0
##$NLEV= 6
##$NOISF1= 3.799351
##$NOISF2= 2.8
##$NSP= 1
##$NTH_PI= 0
##$NZP= 0
##$OFFSET= 15.70392
##$PC= 1
##$PHC0= -9578.411
##$PHC1= 21.40096
##$PH_mod= 1
##$PKNL= yes
##$PPARMOD= 0
##$PSCAL= 0
##$PSIGN= 0
##$REVERSE= no
##$SF= 200.130013532006
##$SI= 16384
##$SIGF1= 3
##$SIGF2= 2
##$SINO= 400
##$SIOLD= 16384
##$SREGLST= <1H.CDCl3>
##$SSB= 0
##$STSI= 0
##$STSR= 0
##$SW_p= 3612.71676300578
##$SYMM= 0
##$S_DEV= 0
##$TDeff= 0
##$TDoff= 0
##$TI= <>
##$TILT= no
##$TM1= 0
##$TM2= 0
##$TOPLEV= 0
##$USERP1= <user>
##$USERP2= <user>
##$USERP3= <user>
##$USERP4= <user>
##$USERP5= <user>
##$WDW= 1
##$XDIM= 8192
##$YMAX_p= 0
##$YMIN_p= 0
$$ End of Bruker specific parameters
$$ ---------------------------------
##NTUPLES= NMR FID
##VAR_NAME=  TIME,          FID/REAL,        FID/IMAG
##SYMBOL=    X,             R,               I
##VAR_TYPE=  INDEPENDENT,   DEPENDENT,       DEPENDENT
##VAR_FORM=  AFFN,          ASDF,            ASDF
##VAR_DIM=   8192,          8192,            8192
##UNITS=     SECONDS,       ARBITRARY UNITS, ARBITRARY UNITS
##FACTOR=    0.0002076,     1,               1
##FIRST=     0,             0,               0
##LAST=      1.7004516,     0,               0
##MIN=       0,             -328630,         0
##MAX=       1.7004516,     211216,          0
$$ Real data points
##PAGE= N=1
##DATA TABLE= (X++(R..R)), XYDATA
$$ [...]
2666C927k47r99n31P20J234J58j2o29p62L01J087R58J8q94p13J00L89N08J015
$$ 3927 3680 2681 2150 2870 4104 4262 4250 3621 2859 3160 4247 5205 5223 4329 3616 3716 4105 4613 5628
2685E628q4q45r63L15J195P06k07l93q61J10N36P59J75m29r83J92K46M69Q40k18
$$ 5628 5544 4699 3736 4051 5246 5952 5745 5352 4491 4601 5137 5896 6071 5642 4659 4851 5097 5566 6406 6188
2705F188j027r15L43J066O97k40q04m08J9L04J83O24J15j137n40L1J004L16j63
$$ 6188 5161 4246 4589 5655 6352 6112 5308 4900 4919 5223 5406 6030 6145 5008 4468 4499 5503 5819 5656
2724E656j032q97L39J021k60K53n48n37j72nO19J77J79j305j068O18R22R1p44
$$ 5656 4624 3727 4066 5087 4827 5080 4532 3995 3823 3818 4437 4614 4793 3488 2420 3038 3960 4051 3307
2743C307o46j20l30L36L41j49l76m50o15j1Q31M39o24j211m32O84M64j75p26O2
$$ 3307 2661 2541 2211 2547 2888 2739 2363 1913 1298 1287 2118 2557 1933 722 290 974 1438 1263 537 599
2763E99l72o50k26J009L05m34j581j00O55L67o7p09m69l95N9K52J79j13k40n18
$$ 599 227 -423 -649 360 665 231 -1350 -1450 -795 -428 -495 -1204 -1673 -2068 -2009 -1757 -1578 -1691 -1931 -2449
2783b449n69J52J040N0r49r60K13M59L12l20m40j26m53j02M19P16l71n96p45o
$$ -2449 -3018 -2866 -1826 -1776 -2725 -3685 -3472 -3013 -2701 -3021 -3461 -3587 -4040 -4142 -3723 -3007 -3378 -3974 -4719 -4725
2803d725M79Q70l70o68o31K33N43o3j54J31k7p31l75J026R54n46j133l89N16M76
$$ -4725 -4246 -3376 -3746 -4414 -5045 -4812 -4269 -4332 -4486 -4355 -4382 -5113 -5488 -4462 -3508 -4054 -5187 -5576 -5060 -4584
2823d584L15p9m18m87N1J61O87M66j98p03l60n2Q37Q23m33q59j25L47J6P63J10
$$ -4584 -4269 -4348 -4766 -5253 -5202 -5041 -4354 -3888 -4086 -4789 -5149 -5201 -4364 -3541 -3974 -4833 -4958 -4611 -4595 -3832 -3722
2844c722l00l75p09N31J053K17n39m39M9Q6M47N55O6l26o44R7M01O74J54k40l85
$$ -3722 -4022 -4397 -5106 -4575 -3522 -3305 -3844 -4283 -4234 -4148 -3701 -3146 -3080 -3406 -4050 -3953 -3552 -2878 -2724 -2964 -3349
2865c349n32L11J376j0n56n32L12M28j28N63M10k44q19P7O93N51L7j06p54L72
$$ -3349 -3881 -3570 -2194 -2204 -2760 -3292 -2980 -2552 -2680 -2117 -1707 -1951 -2770 -2693 -2000 -1449 -1412 -1518 -2272 -1900
2885a900oN88M03J11o07J04k5L43O56K58k77l86n59J095N36j52j46K41l53K04
$$ -1900 -1906 -1318 -915 -804 -1411 -1307 -1332 -989 -333 -75 -352 -738 -1297 -202 334 182 36 277 -76 128
2905A28K65N53J30q0m69o5P30M38J88l55l50j36N70P61Ol39k2J45k9L62L55O12
$$ 128 393 946 1076 996 527 462 1192 1630 1818 1463 1113 977 1547 2308 2314 1975 1953 2098 2069 2431 2786 3398
2927C398p73l88n2O10R35k16k06l31L49l6P62j02k04k95R6J75N7Q39J95r62n87
$$ 3398 2625 2237 2185 2795 3730 3514 3308 2977 3326 3290 4052 3950 3746 3451 3547 3722 3779 4618 4813 3851 3264
2948C264K28J049N99k01n61n6J84q1L25L59j56n04l1m6N57P23l28n22p63K68R05
$$ 3264 3492 4541 5140 4939 4378 4322 4506 4425 4750 5109 4953 4449 4418 4372 4929 5652 5324 4802 4039 4307 5212
2969E212J52k95n36j47P7L9J76N70Q3j031o08M84M78N14m73m81n49L01M05Q5o6
$$ 5212 5364 5069 4533 4386 4463 4502 4678 5248 5331 4300 3692 4176 4654 5168 4695 4214 3665 3966 4371 4456 4390
2990D390m77j89m30o2L34M21j42r75o12K73R99j7q45l81j46r0O4K35O16o10j096
$$ 4390 3913 3724 3294 3232 3566 3987 3845 2870 2258 2531 3530 3513 2668 2287 2141 2051 2115 2350 2966 2356 1260
3011A260k92NJ060K82q47p48n61M52P41k99k73n1o72l21m63J024M88r00j106K24
$$ 1260 968 973 2033 2315 1468 720 159 611 1352 1053 780 729 57 -264 -727 297 785 -115 -1221 -997
3031i97J38N72j67j98n86k66j96J8M27K25m14n70m43Q5P00O6m50j148k7O33J9
$$ -997 -859 -287 -454 -652 -1238 -1504 -1700 -1682 -1255 -1030 -1444 -2014 -2457 -2372 -1672 -1606 -2056 -3204 -3231 -2598 -2579
3052b579R3l6Mq27l93N02O44J66m66p99m11N72O83J46o28k24k28j20N63n5K84
$$ -2579 -2486 -2522 -2518 -3345 -3738 -3236 -2592 -2426 -2892 -3691 -4102 -3530 -2847 -2701 -3329 -3553 -3781 -3901 -3338 -3393 -3109
3073c109m8q83p00M70J133n8n51p08K46M59j13m9M85j26j043j14R24L42K76o89
$$ -3109 -3157 -4040 -4740 -4270 -3137 -3195 -3746 -4454 -4208 -3749 -3862 -3911 -3426 -3552 -4595 -4709 -3785 -3443 -3167 -3856
3093c856l89k68L88O90K72m54m44L6j70J63Q37J35m22q63M9O53M90o7n44J86k2
$$ -3856 -4245 -4513 -4125 -3435 -3163 -3617 -4061 -4025 -4195 -4032 -3195 -3060 -3482 -4345 -4296 -3643 -3153 -3220 -3764 -3578 -3600
3114c600j35L00O06j88j88l83L3O19L11K44o01j44l43O98J65J54r9R8l61P9O70
$$ -3600 -3735 -3435 -2829 -3017 -3205 -3588 -3555 -2936 -2625 -2381 -2982 -3126 -3469 -2771 -2606 -2452 -2551 -2453 -2814 -2735 -2065
3135b065j16N04o83k3J05J76M30q8n1k5q5M4P94j15m4q9l9J43K67L64J63k46n47
$$ -2065 -2181 -1677 -2360 -2383 -2278 -2102 -1672 -1760 -1811 -1836 -1921 -1877 -1083 -1198 -1242 -1331 -1370 -1227 -960 -596 -433 -679 -1226
3158a226L37N58j15r6M49Oo3j24P25m0J00j04k03N02O4L12j17J08k98M99M59J10
$$ -1226 -889 -331 -446 -542 -93 -87 -150 -274 451 411 511 407 204 706 770 1082 965 1073 775 1274 1733 1843
3180A843k32K34J14j51J48L77L80j01p62L03N23N23q3l57PM7K19K23K56P2j52
$$ 1843 1611 1845 1959 1808 1956 2333 2713 2612 1850 2153 2676 3199 3116 2759 2766 2813 3032 3255 3511 3583 3431
3201C431k1k64J71N41J30J58o32R9N74J61k12l39j13L24j46M38L09K20p24k24
$$ 3431 3410 3146 3317 3858 3988 4146 3514 3613 4187 4348 4136 3797 3684 4008 3862 4300 4609 4829 4105 3881
3221C881P3M89N81k09p58k35K08N58r0k9n3l38j88k0K48P10l33n03o27N1J096
$$ 3881 3954 4443 5024 4815 4057 3822 4030 4588 4498 4469 4416 4078 3890 3870 4118 4828 4495 3992 3365 3416 4512
3242D512Q7n37j46k97j82P5J09L45L4o22l10m72P76M18j65j086Lp8O04p2m61K08
$$ 4512 4599 4062 3916 3619 3437 3512 3621 3966 4000 3378 3068 2596 3372 3790 3625 2539 2542 2464 3068 2996 2535 2743
3264B743k49o08l59O35N94m58q42n62R7Q04ol83n97l27L16m9j56N04Np28j000
$$ 2743 2494 1886 1527 2162 2756 2298 1456 894 991 1795 1789 1406 809 482 798 749 593 1097 1102 374 -626
3285f26O7O16J024q16j068n3L68KL8L14l79n66n37J47L57K88J01p67p21k1P83
$$ -626 -559 57 1081 265 -803 -856 -488 -486 -448 -134 -513 -1079 -1616 -1469 -1112 -824 -723 -1490 -2211 -2232 -1449
3306a449L16l81q60K16j1l70L24L48L39j088n90M29Q35K25o18n30j56k0L44o7
$$ -1449 -1133 -1514 -2374 -2158 -2169 -2539 -2215 -1867 -1528 -2616 -3206 -2777 -1942 -1717 -2335 -2865 -3021 -3041 -2697 -2764
3326b764L30j99o93J16j80K20P71m05m16o78K32Q36k36k05n03J25p7K75j58N71
$$ -2764 -2434 -2633 -3326 -3210 -3390 -3170 -2399 -2804 -3220 -3898 -3666 -2830 -3066 -3271 -3774 -3649 -3726 -3451 -3609 -3038
3346c038q2q69o3M06M83K44o17k18r6J57J35J26N47l79n46j46J20M82L05j62o42
$$ -3038 -3120 -3989 -4052 -3646 -3163 -2919 -3536 -3754 -3850 -3693 -3558 -3432 -2885 -3264 -3810 -3956 -3836 -3354 -3049 -3211 -3853
3367c853k95N85M33K5j00k57r7j64L51M70j3k66m45kM17M41P6j68m39L11M3N71
$$ -3853 -4148 -3563 -3130 -3105 -3205 -3462 -3559 -3723 -3372 -2902 -2915 -3181 -3626 -3628 -3211 -2770 -2694 -2862 -3301 -2990 -2947 -2376
3389b376j64P9k53j62o8K98J57M58k56k97N41l91O26J3J3p3l83K16P23J04m0k01
$$ -2376 -2540 -2461 -2714 -2876 -2944 -2646 -2489 -2031 -2287 -2584 -2043 -2434 -1808 -1795 -1782 -1855 -2238 -2022 -1299 -1195 -1235 -1436
3411a436R4k07N36M69O5m42m19KM88K28K69q3K61l39nM88M17L3l09o3J87N09J77
$$ -1436 -1342 -1549 -1013 -544 -479 -921 -1340 -1338 -850 -622 -353 -436 -175 -514 -519 -31 386 419 110 47 234 743 920
3434I20J38k34j91K81K19M53k37J44o7j63K44N66K64j8m27k28M22L71K46l51K6
$$ 920 1058 824 633 914 1133 1586 1349 1493 1426 1263 1507 2073 2337 2319 1892 1664 2086 2457 2703 2352 2378
3455B378J94O1KK64K68j08m4m09L38P85j65K68o47OO43J35m16k0L55k30j13j88
$$ 2378 2572 2633 2635 2899 3167 3059 3015 2606 2944 3729 3564 3832 3185 3191 3834 3969 3553 3533 3888 3658 3545 3357
3477C357N56M41k48l93k56L42M74k4k48M2j52J62m8m2K13j1n26l46M68M70N06
$$ 3357 3913 4354 4106 3713 3457 3799 4273 4249 4001 4043 3891 4053 4005 3963 4176 4165 3639 3293 3761 4231 4737
3498D737p76o34J58M32j30q3P3k3l81l50L6N74N67r22o36k3N08k0J3j71k66L4
$$ 4737 3961 3327 3485 3917 3787 3704 3777 3754 3373 3023 3059 3633 4200 3278 2642 2619 3127 3107 3120 2949 2683 2717
3520B717jn60L91J22L58j304l91O52O13j53m04p81K67J67k66n17K20L0Q7n28J36
$$ 2717 2716 2156 2547 2669 3027 1723 1332 1984 2597 2444 2040 1259 1526 1693 1427 910 1130 1160 1247 719 855
3541H55K75J90k62o26k89M16N19o42p29L98J47P4p69K52M37m24m61m58M71L58
$$ 855 1130 1320 1058 432 143 559 1078 436 -293 105 252 326 -443 -191 246 -178 -639 -1097 -626 -268
3561b68j7n62o33K18K05K37k34k00Q6k98j0j48J80K57n52n03K17O76M8o47j47
$$ -268 -285 -847 -1480 -1262 -1057 -820 -1054 -1254 -1168 -1466 -1476 -1624 -1444 -1187 -1739 -2242 -2025 -1349 -1301 -1948 -2095
3582b095n2J29m25k5O08l33r7n09j05P00N8k28j63k91j23J30M60l87j57O9j54
$$ -2095 -2147 -2018 -2443 -2468 -1860 -2193 -2290 -2799 -2904 -2204 -2146 -2374 -2537 -2828 -2951 -2821 -2361 -2748 -2905 -2836 -2990
3603b990k84M65K47l7q02n4K81M64M3n52m1k7J11M6J20j24j77k48O0J13J45M67
$$ -2990 -3274 -2809 -2562 -2599 -3401 -3455 -3174 -2710 -2667 -3219 -3260 -3287 -3176 -3130 -3010 -3134 -3311 -3559 -3499 -3386 -3241 -2774
3625b774l75n13P1J84K78J44m21P5j8k81J69O30K4m36j05k58O95O2N2o1m40j90
$$ -2774 -3149 -3662 -3591 -3407 -3129 -2985 -3406 -3331 -3349 -3630 -3461 -2831 -2807 -3243 -3348 -3606 -2911 -2849 -2797 -2858 -3298 -3488
3647c488M21K46L53k54l45j10J03M08K97K40r5m75qK84N41J27l41k18J15r5L93
$$ -3488 -3067 -2821 -2468 -2722 -3067 -3177 -3074 -2666 -2369 -2129 -2224 -2699 -2707 -2423 -1882 -1755 -2096 -2314 -2199 -2294 -1901
3668a901K96lk10j06j66M88O12K44j12q93M14K85N35rj56J6l31J52M43P91J26
$$ -1901 -1605 -1608 -1818 -1924 -2090 -1602 -990 -746 -858 -1751 -1337 -1052 -517 -526 -682 -666 -997 -845 -402 389 515
3689E15p72j37J69L48L51M98l03n01K58P8L07L61R8l7k46p7J77O48J72l75l85
$$ 515 -257 -394 -225 123 474 972 669 168 426 504 811 1172 1270 1233 987 910 1087 1735 1907 1532 1147
3710A147L00K46K33N72L8m6o61j33L25J293k76k60m10k91N80N98J90n70k02L03
$$ 1147 1447 1693 1926 2498 2536 2490 1829 1696 2021 3314 3038 2778 2368 2077 2657 3255 3445 2875 2673 2976
3730B976Q0J42R7L71q8m84k84N40Q41l89m57J49j34Q6N7M8L08j93k26k75L64L12
$$ 2976 3056 3198 3295 3666 3578 3094 2810 3350 4191 3802 3345 3494 3360 3446 3503 3551 3859 3666 3440 3165 3529 3841
3752C841qk47m93r9N40J55k75o7k77M60m44j03K84M53m41k70m24O68N02o44j98
$$ 3841 3833 3586 3093 2994 3534 3689 3414 3347 3070 3530 3086 2983 3267 3720 3279 3009 2585 3253 3755 3111 2913
3773B913m33M56K35m10K60j53k73j37k83L8M28K00m19p06L40N73l29l48l05J03
$$ 2913 2480 2936 3171 2761 3021 2868 2595 2458 2175 2213 2641 2841 2422 1716 2056 2629 2300 1952 1647 1750
3793A750J7j88P9m0K04m00l83j89M06K26l64n04j3K61K1l85k08M13Kl84l66M28
$$ 1750 1767 1579 1658 1618 1822 1422 1039 850 1256 1482 1118 614 601 862 883 498 290 703 705 321 -45 383
3815C83J31kl00n34L61J4k1k77j17j69J57j82o1j40K5P2l02o6K53L48o08j97k26
$$ 383 514 512 212 -322 39 53 32 -245 -362 -531 -374 -556 -617 -757 -732 -660 -962 -1028 -775 -427 -1035 -1232 -1458
3838a458M81l8l70k67J32P9l6j42K35J1m03j58J10K63k72p7j53k38K93m3j4J45
$$ -1458 -977 -1015 -1385 -1652 -1520 -1441 -1477 -1619 -1384 -1373 -1776 -1934 -1824 -1561 -1833 -1910 -2063 -2301 -2008 -2051 -2065 -1920
3860a920l06o1o1k91J67M47k84l40l39K61M00J5k00m68q3J08k70M38m9J58l64
$$ -1920 -2226 -2287 -2348 -2639 -2472 -2025 -2309 -2649 -2988 -2727 -2327 -2312 -2512 -2980 -3063 -2955 -3225 -2787 -2836 -2678 -3042
3881c042q2J07P5M81j22o12j86J13K78K3o6k40J25l51M28J4J61j63k67r4k5N42
$$ -3042 -3124 -3017 -2942 -2461 -2583 -3195 -3381 -3268 -2990 -2967 -3033 -3273 -3148 -3499 -3071 -3057 -2896 -3059 -3326 -3420 -3445 -2903
3903b903k2N9n4k6j08J62K54j36j9l29K85K11J54K38L2o34j02L24K87L40n0m27
$$ -2903 -2925 -2866 -2920 -2946 -3054 -2892 -2638 -2774 -2793 -3122 -2837 -2626 -2472 -2234 -2202 -2836 -2938 -2614 -2327 -1987 -2037 -2464
3925b464K47l73K78M07K0k19M00k20j25L52N52p0n91J29L19J71J60k1K80l17q
$$ -2464 -2217 -2590 -2312 -1905 -1885 -2104 -1704 -1924 -2049 -1697 -1145 -1215 -1806 -1677 -1358 -1187 -1027 -1048 -768 -1085 -1093
3946a093J19M77N83n58p4m23O50K42J61j95L31j12k80L16P49J50k8o23J27m3N55
$$ -1093 -974 -497 86 -472 -546 -969 -319 -77 84 -111 220 108 -172 144 893 1043 1015 392 519 476 1031
3967A031L31l94o5O8M24k29M18J79L6j51j93K37M84K29j96l26J82J72K65K29k36
$$ 1031 1362 968 903 971 1395 1166 1584 1763 1799 1648 1455 1692 2176 2405 2209 1883 2065 2237 2502 2731 2495
3988B495k91K84r6k86O95K76k20k74k47N29M44k20m33J51J60K1l15N30K38O4o88
$$ 2495 2204 2488 2392 2106 2801 3077 2857 2583 2336 2865 3309 3089 2656 2807 2967 2988 2673 3203 3441 3505 2817
4009B817J57R8J62M55l60o12J11L40J41l76J50N5l42K57m05K60N47l96k50k24
$$ 2817 2974 3072 3234 3689 3329 2717 2828 3168 3309 2933 3083 3138 2796 3053 2648 2908 3455 3059 2809 2585
4029B585M8P57m84m28p8L82m3J42m59L71J21p10k33J22O76J01p39l31J04J59L21
$$ 2585 2633 3390 2906 2478 2400 2782 2739 2881 2422 2793 2914 2204 1971 2093 2769 2870 2131 1800 1904 2063 2384
4050B384m24M5J46k11l94R2J96K64k59l75j77N66k51j27l48J71O9n3k70j32K64
$$ 2384 1960 2005 2151 1940 1546 1638 1834 2098 1839 1464 1287 1853 1602 1475 1127 1298 1367 1314 1044 912 1176
4071A176j65m28j24K99o1J30l57q6j35L05j22j21l05M41n50j23J0L74l49j87m03
$$ 1176 1011 583 459 758 697 827 470 384 249 554 432 311 6 447 -103 -226 -216 158 -191 -378 -781
4092g81M15J5K35m75k53O7L28m31N6p2K08k19k23k77M61kk09k09Jj86M83j61k63
$$ -781 -366 -351 -116 -591 -844 -777 -449 -880 -824 -896 -688 -907 -1130 -1407 -946 -948 -1157 -1366 -1365 -1551 -1068 -1229 -1492
4115a492m4l39o8L9J14P4k17j45L9n43O90j7k08m98J5K91q3n0n5oJ01m34J6M08
$$ -1492 -1536 -1875 -1943 -1904 -1790 -1716 -1933 -2078 -2039 -2582 -1892 -1909 -2117 -2615 -2600 -2309 -2392 -2442 -2497 -2503 -2402 -2836 -2820 -2412
4139b412j94J08j93j73k12L14J25j62j56K2Q3%k31L27L35m92l01j2M80M0j99j89
$$ -2412 -2606 -2498 -2691 -2864 -3076 -2762 -2637 -2799 -2955 -2933 -2850 -2850 -3081 -2754 -2419 -2911 -3212 -3224 -2744 -2704 -2903 -3092
4161c092K24m64N84m2j70L2l8j30K67R3M29j66m85l7J53L22j32ml46L65L65j7
$$ -3092 -2868 -3332 -2748 -2790 -2960 -2928 -2966 -3096 -2829 -2736 -2307 -2473 -2958 -2995 -2842 -2520 -2652 -2656 -3002 -2637 -2272 -2289
4183b289K3L42l26J2K9j89N75k32O5j3O5K64j06M46l42L28K6J31k21M55J71n1
$$ -2289 -2266 -1924 -2250 -2238 -2209 -2398 -1823 -2055 -1990 -2003 -1938 -1674 -1780 -1334 -1676 -1348 -1322 -1191 -1412 -957 -786 -837
4205h37l08J61M45J17J21l57K89j18J43R3J18o4kM73l50L87l4M3J96J96j33J20
$$ -837 -1145 -984 -539 -422 -301 -658 -369 -487 -344 -251 -133 -197 -199 274 -76 311 277 320 516 712 579 699
4227F99J25j01K27L06J81l88K66K3K68j76R1K6K04K64r0l06M22l52L62o9q9L81
$$ 699 824 723 950 1256 1437 1049 1315 1338 1606 1430 1521 1547 1751 2015 1925 1619 2041 1689 2051 1982 1893 2274
4249B274j81o3J24LK51J83m92R0L15J85p4m37L43K31l15J26K17j15J31m00LM62
$$ 2274 2093 2030 2154 2157 2408 2591 2099 2189 2504 2689 2615 2178 2521 2752 2437 2563 2780 2665 2796 2396 2399 2861
4271B861M6J89l21k17M4J25J07j26l17L87l41k9p7N87M11p98m20J69M58P0k28
$$ 2861 2907 3096 2775 2558 2602 2727 2834 2708 2391 2778 2437 2408 2331 2918 3329 2531 2111 2280 2738 2808 2580
4292B580j92L4K0j9p1L0O8Q6o07J12K10J93N2l65m27J78K02J23m42J79J4j54o13
$$ 2580 2388 2422 2442 2423 2352 2382 2450 2536 1929 2041 2251 2444 2496 2131 1704 1882 2084 2207 1765 1944 1958 1804 1191
4315A191L02M52n5k50m90M0N87l0k70k42J72m89M01l26L89O4p17k0k20K00Q96
$$ 1191 1493 1945 1890 1640 1150 1190 1777 1747 1477 1235 1407 918 1319 993 1382 1446 729 709 489 689 1585
4336A585n03o01l54N40J77j60k97L7j78k56j38K99K72j78m89n3m80O88J32j15
$$ 1585 1082 481 127 667 844 684 387 424 246 -10 -148 151 423 245 -244 -297 -777 -89 43 -72
4356g2J14m70p1k46P8J85J11k84j33m83O56K37l34k41k47j6Q5j68K18k58K28n28
$$ -72 42 -428 -499 -745 -667 -482 -371 -655 -788 -1271 -615 -378 -712 -953 -1200 -1216 -1131 -1299 -1081 -1339 -1111 -1639
4378a639r0K32R0J91m64k91k59O60j39m4pn75L23m3k73K71p1k2k23J83J32m7J16
$$ -1639 -1729 -1497 -1407 -1216 -1680 -1971 -2230 -1570 -1709 -1753 -1760 -2335 -2012 -2055 -2328 -2057 -2128 -2150 -2373 -2190 -2058 -2105 -1989
4401a989l13m51J57j78L04r0N2k68r3K24o4K22J85m17k74K46k6L57m35M6K09l21
$$ -1989 -2302 -2753 -2596 -2774 -2470 -2560 -2508 -2776 -2869 -2645 -2709 -2487 -2302 -2719 -2993 -2747 -2773 -2416 -2851 -2805 -2596 -2917
4423b917P0K25J74k56J71l02J09K18Qj51pR4j02L62j83L44j99M8oj69J64J49N4
$$ -2917 -2847 -2622 -2448 -2704 -2533 -2835 -2726 -2508 -2500 -2651 -2658 -2564 -2666 -2304 -2487 -2143 -2342 -2294 -2300 -2469 -2305 -2156 -2102
4446b102J44j07j58M79k15J10R1J9O0P6l3R9M8K15nl14N12J04K39k71P2k84K49
$$ -2102 -1958 -2065 -2223 -1744 -1959 -1849 -1758 -1739 -1679 -1603 -1636 -1537 -1489 -1274 -1279 -1593 -1081 -977 -738 -1009 -937 -1221 -972
4469i72J43LK38J11K93l80J39J97J53p6P6J95L52k88k8n2L92J36j54J47N2J89
$$ -972 -829 -826 -588 -477 -184 -564 -425 -228 -75 -151 -75 120 472 184 156 104 496 632 478 625 677 866
4491H66q0Q4j55O80k35m7k48L48L32j41m4n70O38K35j30N1l5L9o5L5L10q8K79
$$ 866 786 870 715 1395 1160 1113 865 1213 1545 1404 1360 790 1428 1663 1533 1584 1549 1588 1523 1558 1868 1780 2059
4514B059k22k8j32M27R8k4m33K96L91q5n17L49M54k59k96l20N45K89q2k25qj91
$$ 2059 1837 1809 1677 2104 2202 2178 1745 2041 2432 2347 1830 2179 2633 2374 2078 1758 2303 2592 2510 2285 2277 2086
4536B086Q1L94l26M26k04j55Ok05J64L26j56m91J93j92O32l26o3M25l21k06k7
$$ 2086 2167 2561 2235 2661 2457 2302 2308 2103 2267 2593 2437 1946 2139 1947 2579 2253 2190 2615 2294 2088 2061
4557B061M58J7k38l22k37K45q6L89l90q4J07m4J51m09L25J47k81m23J27M09K30
$$ 2061 2519 2536 2298 1976 1739 1984 1898 2287 1897 1813 1920 1876 2027 1618 1943 2090 1809 1386 1513 1922 2152
4578B152n92k93L27J42j10l52R3K93m32l5l6K60l9j96m62j50M80K09j79m25l8
$$ 2152 1560 1267 1594 1736 1626 1274 1367 1660 1228 1193 1157 1417 1378 1182 720 570 1050 1259 1080 655 617
4599F17J64r0L1k57J39M58q00o8k3L42j06r1j76j18K02j70J91j00l81q9M8J4r5
$$ 617 781 691 722 465 604 1062 262 194 171 513 407 316 140 22 224 54 245 145 -236 -325 -277 -263 -358
4622c58Q5n1l16k16L08K41m30m0k07o3J55j68J71J40l97l2j33O2K35k88J65k09
$$ -358 -273 -324 -640 -856 -548 -307 -737 -777 -984 -1047 -892 -1060 -889 -749 -1146 -1178 -1311 -1249 -1014 -1302 -1137 -1346
4644a346m63Q4K18L8j24l67N4J60j23j73N30m69k5l35M22j21K2k04j43J61l93
$$ -1346 -1809 -1725 -1507 -1469 -1593 -1960 -1906 -1746 -1869 -2042 -1512 -1981 -2006 -2341 -1919 -2040 -2018 -2222 -2365 -2204 -2597
4665b597K45Q8M2k39K45k53Q1J11n6n4n27M53M1K03pm41K17k61J88O4j45M24j44
$$ -2597 -2352 -2264 -2222 -2461 -2216 -2469 -2388 -2277 -2333 -2387 -2914 -2461 -2420 -2217 -2224 -2665 -2448 -2709 -2521 -2457 -2602 -2178 -2322
4688b322l13J75M82l84K27l46L4L10M6j17j03K54MJ52l90J02O58O2o54o3K90K11
$$ -2322 -2635 -2460 -1978 -2362 -2135 -2481 -2447 -2137 -2091 -2208 -2311 -2057 -2053 -1901 -2291 -2189 -1531 -1469 -2123 -2186 -1896 -1685
4710a685J31o6N1L21k12Jj7q1N80k55j8k83N53N9J1j24N9N20k54q1P0K43K17j39
$$ -1685 -1554 -1620 -1569 -1248 -1460 -1459 -1476 -1557 -977 -1232 -1250 -1533 -980 -921 -910 -1034 -975 -455 -709 -790 -720 -477 -260 -399
4734c99j68M69K17j04j18l7J95J29j58p6K87J61J38p9J56k4l21L39p1N4M33p1
$$ -399 -567 -98 119 15 -103 -140 55 184 26 -50 237 398 536 457 613 589 268 607 536 590 1023 952
4756I52K5l86L74N5N4j79K76K12m47P4P9M60Oj13pj62J02L05J44k47j11L95j62
$$ 952 977 591 965 1020 1074 895 1171 1383 936 1010 1089 1549 1555 1442 1435 1273 1375 1680 1824 1577 1466 1861 1699
4779A699j93J69J11N3q4j10K58l6K77n96J03K49L5Oj24P4K32j60j57K21Q1J11
$$ 1699 1506 1675 1786 1839 1755 1645 1903 1867 2144 1548 1651 1900 1935 1941 1817 1891 2123 1963 1806 2027 2108 2219
4801B219j60l49K46M0L82m15J00j75J08k05m1L70J23k8l87j41L74P5k98oK3J28
$$ 2219 2059 1710 1956 1996 2378 1963 2063 1888 1996 1791 1750 2120 2243 2215 1828 1687 2061 2136 1838 1832 1855 1983
4823A983j68Q7k23M59j66m61j29J41L24J24l11l20Q7M64j90m08J92J38J7k73p6
$$ 1983 1815 1902 1679 2138 1972 1511 1382 1523 1847 1971 1660 1340 1427 1891 1701 1293 1485 1623 1640 1367 1291
4844A291L9M03r1k87K1j96N27k78k73k74J93k07p3o4J75K69k04k24j42L16j65
$$ 1291 1330 1733 1642 1355 1376 1180 1707 1429 1156 882 1075 868 795 731 906 1175 971 747 605 921 756
4865G56R8l99J70K7J47n28L4j3o0P2Q8l22L30o65K16k2J49j00k62m8j63K69j49
$$ 756 854 455 625 652 799 271 305 292 232 304 392 70 400 -265 -49 -71 78 -22 -284 -332 -495 -226 -375
4888c75j63P5l51K70k00l0l12J37j1k1N4j62J19r2l05k02J81J64r8j13%r3J69
$$ -375 -538 -463 -814 -544 -744 -774 -1086 -949 -960 -981 -927 -1089 -970 -1062 -1367 -1569 -1388 -1224 -1322 -1435 -1435 -1528 -1359
4911a359n41L72m55L50K79m08o4J95j42l6l26R1r5L9j04M55k06J06j31J12j85
$$ -1359 -1900 -1528 -1983 -1633 -1354 -1762 -1826 -1631 -1773 -1809 -2135 -2044 -2139 -2100 -2204 -1749 -1955 -1849 -1980 -1868 -2053
4932b053q2K01j47k23j47N33r5j93K0k9k2K1J82K4j10k39L4J75r3MJ73M8j39J69
$$ -2053 -2135 -1934 -2081 -2304 -2451 -1918 -2013 -2206 -2186 -2215 -2237 -2216 -2034 -2010 -2120 -2359 -2325 -2150 -2243 -2239 -2066 -2018 -2157 -1988
4956a988R5m29J15J40P2J1nJ36K82o9k67l25O03J12o9J94j95K39L4j99J58J22
$$ -1988 -1893 -2322 -2207 -2067 -1995 -1984 -1989 -1853 -1571 -1640 -1907 -2232 -1629 -1517 -1586 -1392 -1587 -1348 -1314 -1513 -1355 -1233
4978a233L5l00R9J18J68J33L7K07oj26L4K49K6R7k53lJ79O46J1m18l08L90k74
$$ -1233 -1198 -1498 -1399 -1281 -1113 -980 -943 -736 -742 -868 -834 -585 -559 -462 -715 -718 -539 107 118 -300 -608 -218 -492
5001d92L97K67j64L16m24J22k2L81j33J72k28k30M85K28O3L7m50K98L53m23J93
$$ -492 -95 172 8 324 -100 22 0 381 248 420 192 -38 447 675 738 775 325 623 976 553 746
5022G46Q7j47L00l56M53k55L63q3J05k28M2R3o5K51k6L10k55p1pK70N30o62j67
$$ 746 833 686 986 630 1083 828 1191 1108 1213 985 1027 1120 1055 1306 1280 1590 1335 1264 1257 1527 2057 1395 1228
5045A228L54k51j3K89P1O3k44j82L96R7J29l54n1j92L46K00m6j36N0k16L30l62
$$ 1228 1582 1331 1318 1607 1678 1741 1497 1315 1711 1808 1937 1583 1532 1340 1686 1886 1840 1704 1754 1538 1868 1506
5067A506J65K50k13J9j08K64L28j59l24k48K9M74r3l77J36K03o5j9k30K17L24
$$ 1506 1671 1921 1708 1727 1619 1883 2211 2052 1728 1480 1509 1983 1890 1513 1649 1852 1787 1768 1538 1755 2079
5088B079m79k2r7J31L89K3n16J79N9k45k5K31J6j14o2l29M94j70j45k82O9n7L53
$$ 2079 1600 1578 1481 1612 2001 2024 1508 1687 1746 1501 1476 1707 1723 1609 1547 1218 1712 1542 1397 1115 1184 1127 1480
5111A480j07l96K17j28J93l50J61P5K13m30j65K13j76rr7Q5R5n4j88k1k15j98
$$ 1480 1373 977 1194 1066 1259 909 1070 1145 1358 928 763 976 800 791 694 779 874 820 632 611 396 198
5133A98L62k34q7J88r3k99o6J66K84l43Ok3k19Q7m9k64p9L63j39m43J34j20j9
$$ 198 560 326 239 427 334 35 -31 135 419 76 82 59 -160 -73 -122 -386 -465 -102 -241 -684 -550 -670 -689
5156f89J30M2m68L31n7k10k50J2L36j25l85k4Q3j2r5j28J37Q6K38l26n8p2l4k9
$$ -689 -559 -517 -985 -654 -711 -921 -1171 -1159 -823 -948 -1333 -1357 -1274 -1286 -1381 -1509 -1372 -1286 -1048 -1374 -1432 -1504 -1538 -1567
5180a567k1m04L15L4r0j00L86j38l17k97K43j05L38J0l87J80K5j3L8o1j15Q1J7
$$ -1567 -1588 -1992 -1677 -1643 -1733 -1833 -1447 -1585 -1902 -2199 -1956 -2061 -1723 -1713 -2100 -1920 -1895 -1908 -1870 -1931 -2046 -1965 -1948
5203a948j45j13L54j0j93j0p6K65kM22n69l6K64P4l57L01J22M7k24K33o0M34k41
$$ -1948 -2093 -2206 -1852 -1862 -2055 -2065 -2141 -1876 -1878 -1456 -2025 -2061 -1797 -1723 -2080 -1779 -1657 -1610 -1834 -1601 -1661 -1227 -1468
5226a468M1q12O08K80J93k10Q8Q6j71J9l24N46M7l3k56l7N46k09j47J79QN5J08
$$ -1468 -1427 -2239 -1631 -1351 -1158 -1368 -1280 -1194 -1365 -1346 -1670 -1124 -1077 -1110 -1366 -1403 -857 -1066 -1213 -1034 -1026 -971 -863
5249h63J59k72J90M54n77J73O2O46j37l25R0K14k03N5J94J66p7j19m3K80J13L25
$$ -863 -704 -976 -786 -332 -909 -736 -674 -28 -165 -490 -400 -186 -389 -334 -140 26 -51 -170 -213 67 180 505
5271E05o71Q8j04K98L42j14nK22m5j10q3J82M22m54j30K61K62k88M13k57J47J16
$$ 505 -166 -78 -182 116 458 344 339 561 516 406 323 505 927 473 343 604 866 578 991 734 881 997
5293I97o7k29K72P4K8k46J49N4K56j73j5J25K0P5j3l67M09J51l11k71K65M38L3
$$ 997 930 701 973 1047 1075 829 978 1032 1288 1115 1100 1225 1245 1320 1307 940 1349 1500 1189 918 1183 1621 1654
5316A654j62k66J2K97r0k23J09Q4K61M2k52M9M3j7l03L11K79q7l99K40K09k56
$$ 1654 1492 1226 1238 1535 1445 1222 1331 1415 1676 1718 1466 1515 1558 1541 1238 1549 1828 1741 1342 1582 1791 1535
5338A535L69j00j75O2j49l0p9L14M3j99n5j20R0N8J99k7m7k86L87P6l90J71l18
$$ 1535 1904 1804 1629 1691 1542 1512 1433 1747 1790 1591 1536 1416 1506 1564 1763 1736 1689 1403 1790 1866 1476 1647 1329
5361A329R7KK02l53N62m32k24J97J28M7J7l57O0L2P8k60j19M01l88j36k17L99
$$ 1329 1426 1428 1630 1277 1839 1407 1183 1380 1508 1555 1572 1215 1275 1307 1385 1125 1006 1407 1019 883 666 1065
5383A065k10L4j11k08M33J9k04l17K19m68L69j06j65P0j34J78j34l1l5l3n3r9
$$ 1065 855 889 778 570 1003 1022 818 501 720 252 621 515 350 420 286 464 330 299 264 231 178 79
5405G9j19r1j97N2M3L9J89l29l73O7L36K9j02j96o4qJ45r9j92k85J19J9k32P1
$$ 79 -40 -131 -328 -276 -233 -194 -5 -334 -707 -640 -304 -275 -377 -573 -637 -645 -500 -599 -791 -1076 -957 -938 -1170 -1099
5429a099J99j41m31p0M62O3j49l73J71P8o8j69K61Q2j32j31l11J25K63M5k66O0
$$ -1099 -900 -1041 -1472 -1542 -1080 -1017 -1166 -1539 -1368 -1290 -1358 -1527 -1266 -1184 -1316 -1447 -1758 -1633 -1370 -1325 -1591 -1531
5451a531l17M00j92O0j55J29K3m9l25L17J52n9l44j85K97J72N6l67K08M1j7or2
$$ -1531 -1848 -1448 -1640 -1580 -1735 -1606 -1583 -1632 -1957 -1640 -1488 -1547 -1891 -2076 -1779 -1607 -1551 -1918 -1710 -1669 -1686 -1692 -1784
5474a784L12J56k96j87N2M79l99r1N5K10k04R7p8K32J11m88L86K7N3M16l10j52
$$ -1784 -1472 -1316 -1612 -1799 -1747 -1268 -1667 -1758 -1703 -1493 -1697 -1600 -1678 -1446 -1335 -1823 -1437 -1410 -1357 -941 -1251 -1403
5496a403m8N13m21M43m40K94J76l99L07k12J71M2J58j31J20L18r6j82L4J95j31
$$ -1403 -1451 -938 -1359 -916 -1356 -1062 -886 -1285 -978 -1190 -1019 -977 -819 -950 -830 -512 -608 -790 -756 -561 -692
5517f92K02k18R8J72j12R7j71J51K28r8j03%L68n7j4J09J31j43j25J00j97K98
$$ -692 -490 -708 -610 -438 -550 -453 -624 -473 -245 -343 -446 -446 -78 -135 -149 -40 91 -52 -177 -77 -274 24
5539B4K84q3l72N53P3K5j94k45L98J64m44M00l45L29K0K20m0o6R7l2j74M71p2
$$ 24 308 225 -147 406 479 504 310 65 463 627 183 583 238 567 587 807 767 701 798 766 592 1063 991
5562I91o0m12K32J02r1L30l28J96M2L87o37N2Q14k83l85K15l9J11R0k76L8M57
$$ 991 931 519 751 853 762 1092 764 960 1002 1389 752 804 1618 1335 950 1165 1126 1237 1327 1051 1089 1546
5584A546j38k60L76J09n31M56k98J22j38N44k9l98J35K02j88k08N12k36J86j52
$$ 1546 1408 1148 1524 1633 1102 1558 1260 1382 1244 1788 1759 1361 1496 1698 1510 1302 1814 1578 1764 1612
5604A612j09J82O5M0l9m02K77N9j41m9R9J35Mm0k02j09j48N3J22J24j84J04K30
$$ 1612 1503 1685 1750 1790 1751 1349 1626 1685 1544 1495 1594 1729 1733 1693 1491 1382 1234 1287 1409 1533 1349 1453 1683
5627A683l31j32L11j08j2j35p6q5J03j78M19j23k90m9k99K82K07j95q2k67Q3J31
$$ 1683 1352 1220 1531 1423 1411 1276 1200 1115 1218 1040 1459 1336 1046 997 698 980 1187 992 910 643 726 857
5649H57k83k7M39l27R3l68L72M4m69J19p7r1k00O7O6j29Q2j07J5L7m00O00j38
$$ 857 574 547 986 659 752 384 756 800 331 450 373 282 82 149 215 86 168 61 76 113 -287 313 175
5672A75l72k55J82O6l14N9k09J51K31k52L7k50N22m29l70PR7L24j00n53O3K91
$$ 175 -197 -452 -270 -204 -518 -459 -668 -517 -286 -538 -501 -751 -229 -658 -1028 -1021 -924 -600 -700 -1253 -1190 -899
5694h99k26J08k15j45J85p2k00L5J73l7j98J90k91J52J72j18q8l8l6K24j15J42
$$ -899 -1125 -1017 -1232 -1377 -1192 -1264 -1464 -1429 -1256 -1293 -1491 -1301 -1592 -1440 -1268 -1386 -1474 -1512 -1548 -1324 -1439 -1297
5716a297j91K26n36K83k21J34j01r9O3J96J03k19J20p6P9q4j10l0J94K23k32j33
$$ -1297 -1488 -1262 -1798 -1515 -1736 -1602 -1703 -1802 -1739 -1543 -1440 -1659 -1539 -1615 -1536 -1620 -1730 -1760 -1566 -1343 -1575 -1708
5738a708K1J34J17k22M72j10O4m25K65k7R7J21j84J10J73j45R4o4p2K59m5j98
$$ -1708 -1687 -1553 -1436 -1658 -1186 -1296 -1232 -1657 -1392 -1419 -1322 -1201 -1385 -1275 -1102 -1247 -1153 -1217 -1289 -1030 -1075 -1273
5760a273K11j97K87r0j48J9L52M7J1m05L40J81j20J78j17J10ok34j79M68j91m1
$$ -1273 -1062 -1259 -972 -1062 -1210 -1191 -839 -792 -781 -1186 -846 -665 -785 -607 -724 -614 -620 -854 -1033 -565 -756 -797
5782g97L21lj41N2J64k09K78J43L06l58k08L97k02l03O37P0k44j11J83L37m06
$$ -797 -476 -479 -620 -568 -404 -613 -335 -192 114 -244 -452 -55 -257 -560 77 147 -97 -208 -25 312 -94
5803i4K51q0L5L7r5J47k51K01L33k71J02K0J24j4R1q1J00O0j97j9J72K66l63L30
$$ -94 157 77 112 149 54 201 -50 151 484 213 315 335 459 445 536 455 555 615 418 399 571 837 474 804
5827H04k76J69M03j3j69l4R2j6Pj36J49K33N4j19k3K42l05J21j81K89o8J18j83
$$ 804 528 697 1100 1087 918 884 976 960 967 831 980 1213 1267 1148 1125 1367 1062 1183 1002 1291 1223 1341 1158
5850A158L7j26L33n8k15K90J77j98J04J2j00J5M36k08l64L29k15J98J0j90J01
$$ 1158 1195 1069 1402 1344 1129 1419 1596 1398 1502 1514 1414 1429 1865 1657 1293 1622 1407 1605 1615 1425 1526
5871A526N7m0l24L02MN6j97j59K43J37j10m00M03j05j34J38L6j9m5k33L43j56
$$ 1526 1583 1543 1219 1521 1525 1581 1384 1225 1468 1605 1495 1095 1498 1393 1259 1397 1433 1414 1369 1136 1479 1323
5893A323k46K52j81J2J08K7k12K76k72j49J89k49k00L07k50J37K72m72o3M98k14
$$ 1323 1077 1329 1148 1160 1268 1295 1083 1359 1087 938 1127 878 678 985 735 872 1144 672 609 1107 893
5914H93k34P7k44j06l1R7on8PK12n49q6O4m09n3N63l19L48k35j52k43L83n1l21
$$ 893 659 736 492 386 355 452 446 388 395 607 58 -28 36 -373 -426 137 -182 166 -69 -221 -464 -81 -132 -453
5938d53L4K74k25k20k09K81J12q8k59k41L87k75M12m01J0K06l08r9j04L83k45
$$ -453 -419 -145 -370 -590 -799 -518 -406 -494 -753 -994 -607 -882 -470 -871 -861 -655 -963 -1062 -1166 -783 -1028
5959a028j11J04k74K79q4k95K56n6K39j70k50J71K68k64L4p9l1MR5J46n58M40
$$ -1028 -1139 -1035 -1309 -1030 -1114 -1409 -1153 -1209 -970 -1140 -1390 -1219 -951 -1215 -1181 -1260 -1291 -1287 -1192 -1046 -1604 -1164
5981a164j10j00q5J47N0n5k0j69K17J7k65n1P1R0m9n8J18Q5r4P3j13K19O6j0j27
$$ -1164 -1274 -1374 -1459 -1312 -1262 -1317 -1337 -1506 -1289 -1272 -1537 -1588 -1517 -1427 -1476 -1534 -1416 -1331 -1425 -1352 -1465 -1246 -1180 -1190 -1317
6006a317q6J34N6j9j40J40M70l03r7J05J16K19o56n4L52o8K81o9o1J19J13q8j05
$$ -1317 -1403 -1269 -1213 -1232 -1372 -1232 -762 -1065 -1162 -1057 -941 -722 -1378 -1432 -1080 -1148 -867 -936 -997 -878 -765 -853 -958
6029i58k10M34j30J30p9J91j01j28J64j5L3l6R9j03J9J92j41J58M8M2pl0k14K46
$$ -958 -1168 -734 -864 -734 -813 -622 -723 -851 -687 -702 -669 -705 -606 -709 -690 -498 -639 -481 -433 -391 -398 -428 -642 -396
6053c96L1J84m22K27MJ87l2j75K63j30J51J67k8j58J07P0j54j7J59J10R6k83N99
$$ -396 -365 -181 -603 -376 -372 -185 -217 -392 -129 -259 -108 59 31 -127 -20 50 -104 -121 38 148 244 -39 560
6076E60n2J25l94J35N05m25L5K19O9j63J56m00M5J23J11k97N35k00j9KK69p3m3
$$ 560 508 633 239 374 879 454 489 708 777 614 770 370 415 538 649 352 887 687 668 670 939 866 823
6099H23K12j51j8K29Oj29N7l57M24L09r8l64J84o9M7K41oK1K17j77K56k10J4j73
$$ 823 1035 884 866 1095 1101 972 1029 672 1096 1405 1307 943 1127 1058 1105 1346 1340 1361 1578 1401 1657 1447 1461 1288
6123A288O6K62k64L21n5l77K43k11PL6K8J45L35k98N3j65L60m34kN9j10J35k17
$$ 1288 1354 1616 1352 1673 1618 1241 1484 1273 1280 1316 1344 1489 1824 1526 1579 1414 1774 1340 1338 1397 1287 1422 1205
6146A205QK49p6J83r8j88j19j40L88k34%J89k91j15K58j31M7l6o2j63J06M3j2
$$ 1205 1213 1462 1386 1569 1471 1283 1164 1024 1412 1178 1178 1367 1076 961 1219 1088 1135 1099 1037 874 980 1023 1011
6169A011J15O6m34J99k11K45k93J03K83m84m8R6j49pk05n5J62n3j72o8L7k1P9
$$ 1011 1126 1192 758 957 746 991 698 801 1084 600 552 648 499 492 287 232 394 341 169 101 138 117 196
6192A96l50J56R6J38j39l07k3L05k78K4p9J12lk47p2p2P3m8p6k85K98j59L9m2
$$ 196 -154 2 98 236 97 -210 -233 72 -206 -182 -261 -149 -152 -399 -471 -543 -470 -518 -594 -879 -581 -740 -701 -743
6216g43n7PJ82l76K92j52J95l36Q0j85K24J09l83K60qj89K29p5m35J36J13k94
$$ -743 -800 -793 -611 -987 -695 -847 -652 -988 -908 -1093 -869 -760 -1143 -883 -891 -1080 -851 -926 -1361 -1225 -1112 -1406
6238a406j54K08J52M5l33J01J83M1K32k30j49R8M22o06q4K85K12l34P7k15K76
$$ -1406 -1560 -1352 -1200 -1155 -1488 -1387 -1204 -1163 -931 -1161 -1310 -1212 -790 -1396 -1480 -1195 -983 -1317 -1240 -1455 -1179
6259a179J95j63k35P7J74j89K5J27K09l28O5j75M55j61%j94J3K40r5K41k72K28
$$ -1179 -984 -1147 -1382 -1305 -1131 -1320 -1295 -1168 -959 -1287 -1222 -1397 -942 -1103 -1103 -1297 -1284 -1044 -1139 -898 -1170 -942
6281i42j80J00k06K39j70N32n01M6J2j04J54o5L03l03J75k18K69J05O5p8k74J90
$$ -942 -1122 -1022 -1228 -989 -1159 -627 -1128 -1082 -1070 -1174 -1020 -1085 -782 -1085 -910 -1128 -859 -754 -689 -767 -1041 -851
6303h51J14J13N5p2J32P0j70P0l9K21Q4o1j86n2J30L58J13k52j81M96l18Q9rq
$$ -851 -737 -624 -569 -641 -509 -439 -609 -539 -578 -357 -273 -334 -520 -572 -442 -84 29 -223 -404 92 -226 -137 -146 -154
6327a54K4J10k23K24K13Q8j76k60J52J54J77k17J59K25j36n2k5J97N3n6k05K72
$$ -154 -130 -20 -243 -19 194 282 106 -154 -2 152 329 112 271 496 360 308 283 480 533 477 272 544
6349E44n4L5jj17L62k44J75J72l8j51J71J5l9N8J18j71j7K7K20p1Q4k32L89k84
$$ 544 490 525 524 407 769 525 700 872 834 683 854 869 830 888 1006 835 818 845 1065 994 1078 846 1235 951
6373I51K33k56J40L78r9m7q6J3J2K57m04L29k09M1J12j57o4L28r4O7m2k88K62
$$ 951 1184 928 1068 1446 1347 1300 1214 1227 1239 1496 1092 1421 1212 1253 1365 1208 1144 1472 1378 1445 1403 1115 1377
6396A377J79P7k38m4j29L63j03m93J63l8K45r4m0J36q8J25M4j86Q6l30K61j84
$$ 1377 1556 1633 1395 1351 1222 1585 1482 989 1152 1114 1359 1265 1225 1361 1273 1398 1442 1256 1342 1012 1273 1089
6418A089R9j63m39K08N13l12j60j8O2J5m15J61r4m1K98k3l90L43J64k20k04O4
$$ 1089 1188 1025 586 794 1307 995 835 817 879 894 479 640 546 505 803 780 390 733 897 677 473 537
6440E37j50K90l67J97k11m4n2J4R3k9l65M68k97O3J5l05m2r4K52k70N4RJ12k22
$$ 537 387 677 310 507 296 252 200 214 307 278 -87 381 84 147 162 -143 -185 -279 -27 -297 -243 -234 -122 -344
6464c44J68k57o8K63j7j99J71k08N0J87l14m6K9n6K09m23o9L73m1Q0l59J32j26
$$ -344 -176 -433 -501 -238 -255 -454 -283 -491 -441 -254 -568 -614 -585 -641 -432 -855 -924 -551 -592 -512 -871 -739 -865
6487h65M2j11M3j14R7J33l69o1M17J8k00j69jL09k99J98k76L31j89J60k49p0J96
$$ -865 -823 -934 -891 -1005 -908 -775 -1144 -1205 -788 -770 -970 -1139 -1140 -831 -1130 -932 -1208 -877 -1066 -906 -1155 -1225 -1029
6510a029o4j51R3J17r6N1k51P1M15l49j41J99m1J01K5N5N4k29K34k72P3J43J03
$$ -1029 -1093 -1244 -1151 -1034 -1130 -1079 -1330 -1259 -844 -1193 -1334 -1135 -1176 -1075 -1050 -995 -941 -1170 -936 -1208 -1135 -992 -889
6533h89lj91J2j03K49m44L28K4O4n2m72L24J34OJ34l21K14j09K07l16L08Q8j84
$$ -889 -892 -1083 -1071 -1174 -925 -1369 -1041 -1017 -953 -1005 -1477 -1153 -1019 -1013 -879 -1200 -986 -1095 -888 -1204 -896 -808 -992
6556i92R5J61K25k75J3r3qQ2J36J70l87J16M17%r3j89k0N28l22l20N25j7Q8k04
$$ -992 -897 -736 -511 -786 -773 -866 -874 -792 -656 -486 -873 -757 -340 -340 -433 -622 -642 -114 -436 -756 -231 -248 -160 -364
6580c64J55p7k95L19L30k30k03L85j47M2J45L61l99P0j45K92j72O2N4L3M9R5j32
$$ -364 -209 -286 -581 -262 68 -162 -365 20 -127 -85 60 421 22 92 -53 239 67 129 183 216 265 360 228
6603B28M92j45j41o9J56KJ55j77K15k23K5J62L18l06K35k66J95K40m06L23j1q4
$$ 228 720 575 434 365 521 523 678 501 716 493 518 680 998 692 927 661 856 1096 690 1013 1002 918
6625I18k83M10m9k27L71r8j1L09m5k54J92K12j36r4l0j61J52O3j51J38P0k4Q0
$$ 918 635 1045 996 769 1140 1042 1031 1340 1295 1041 1233 1445 1309 1215 1185 1024 1176 1239 1088 1226 1296 1272 1352
6648A352j08m0J16j57J87j36J89j40K41k75P2K25m66KN5k3K24k65M10j60m10L7
$$ 1352 1244 1204 1320 1163 1350 1214 1403 1263 1504 1229 1301 1526 1060 1062 1117 1094 1318 1053 1463 1303 893 930
6670I30K01J27k35R3K02j95n6J0K46k09m83J95J34J35k61j6j45M86n62J16j35
$$ 930 1131 1258 1023 1116 1318 1123 1067 1077 1323 1114 631 826 960 1095 834 818 673 1159 597 713 578
6691E78J18J9j52j55L66J2j04k46Q2N1j17j99J06J23m00J93l0k30J50r4N9J40
$$ 578 696 715 563 408 774 786 682 436 518 569 452 253 359 482 82 275 245 15 165 71 130 270
6713B70l84L40q4j68j54K15j13N4l20k63P81l45j45J20l83M49l49k02N55o5k10
$$ 270 -114 226 142 -26 -180 35 -78 -24 -344 -607 174 -171 -316 -196 -579 -130 -479 -681 -126 -191 -401
6734d01J17l99J53Q8o8k62L76j02k49L22m41K38K72j08k34j86J14J39K04m78j78
$$ -401 -284 -683 -530 -442 -510 -772 -396 -498 -747 -425 -866 -628 -356 -464 -698 -884 -770 -631 -427 -905 -1083
6755a083L06J7j72L8J5p7m8j33J79L02m20R7k29M05L67p71M15k49J37l4j03j26
$$ -1083 -777 -760 -932 -894 -879 -956 -1004 -1137 -958 -656 -1076 -979 -1208 -803 -436 -1207 -792 -1041 -904 -938 -1041 -1167
6777a167mM88n61j10L67N7J04k07k93J62K07k7o6K30j84P2m69N6k1M85R2m74J94
$$ -1167 -1171 -683 -1244 -1354 -987 -930 -826 -1033 -1326 -1164 -957 -984 -1050 -820 -1004 -932 -1401 -1345 -1366 -881 -789 -1263 -1069
6800a069J34m2j28J78p6J98j52Or7J45lN1l51R8L77j03j91J29M60k46l62M21j50
$$ -1069 -935 -977 -1105 -927 -1003 -805 -957 -951 -1048 -903 -906 -855 -1206 -1108 -731 -834 -1025 -896 -436 -682 -1044 -623 -773
6823g73J82J6l02K63l1K4J36J00l24L17j37k00J67j13P28m39j20J2k1k5Q4K5R9
$$ -773 -591 -575 -877 -614 -645 -621 -485 -385 -709 -392 -529 -729 -562 -675 53 -386 -506 -494 -515 -540 -456 -431 -332
6846c32J42M5ML9J83Ok40Q7p4K64o0l2J04r1L03l23k44N11k99L05M6j6m0J19M3
$$ -332 -190 -145 -141 -102 81 87 -153 -66 -140 124 64 32 136 45 348 25 -219 292 -7 298 344 328 288 407 450
6871D50jK5J78Pnj23K49j51K58k74K41O3k81o1L76N1k60L91l9j44lJ33N4j64J70
$$ 450 449 474 652 659 654 531 780 629 887 613 854 917 636 575 951 1002 742 1133 1094 950 947 1080 1134 970 1140
6896A140j6J52j86J45j32l0K24k47j50L31N2l02K97k91R7K52k2j3L9J76n81J68
$$ 1140 1124 1276 1090 1235 1103 1073 1297 1050 900 1231 1283 981 1278 987 1084 1336 1314 1301 1340 1516 935 1103
6918A103r2J84P7j79j37M47k68n2K75l39J96J92l57k05K37k55K01j46J35J92l19
$$ 1103 1011 1195 1272 1093 956 1403 1135 1083 1358 1019 1215 1407 1050 845 1082 827 1028 882 1017 1209 890
6939H90o8J29O4j82P8k83pJ69j70J83j79K5j50J23R6k41M83m65P3l39M9K22k0
$$ 890 822 951 1015 833 911 628 621 790 620 803 624 649 499 622 718 477 960 495 568 229 278 500 480
6962D80j3k84K09j39p3M04Nm66o7M36l95L04k14oj94J57q3m6j73J13J22j65L6
$$ 480 467 183 392 253 180 584 589 123 56 492 97 401 187 181 -13 144 61 15 -158 -45 77 -88 -52
6985e2j12J56k5k81j09L23M9j67q6p5Q7k11K44Q9p08L77K10p0j0o3m6K08j64m3
$$ -52 -164 -8 -33 -314 -423 -100 -51 -218 -304 -379 -292 -503 -259 -170 -878 -501 -291 -361 -371 -434 -480 -272 -436 -479
7009d79k58K40j2J22k10l1K40n40q2K30O1J65l95Q6Q1JK60n69N5J45J59j18J1
$$ -479 -737 -497 -509 -387 -597 -628 -388 -928 -1010 -780 -719 -554 -949 -863 -782 -781 -521 -1090 -1035 -890 -731 -849 -838
7032h38k51L05P6k94Q0l9q8k1J26j09R0P1j14r0J60j82O1N2j25K14k71K21M0k24
$$ -838 -1089 -784 -708 -1002 -922 -961 -1049 -1070 -944 -1053 -963 -892 -1006 -1096 -936 -1118 -1057 -1005 -1130 -916 -1187 -966 -926 -1150
7056a150J43J15L2p7k11K9LM4K24l0J92l90JL39l24J01j54J70J62j39J12p1j47
$$ -1150 -1007 -892 -860 -937 -1148 -1119 -1116 -1072 -848 -878 -686 -1076 -1075 -736 -1060 -959 -1113 -943 -781 -920 -808 -879 -1026
7079a026J92KkK0m9J4r6R8J58M2q5J47M7M4j63j21J5oN41Kl19O3k29K99k13o8
$$ -1026 -834 -832 -834 -814 -863 -849 -945 -847 -689 -647 -732 -585 -538 -494 -657 -778 -763 -769 -228 -226 -545 -482 -711 -412 -625 -693
7105f93M18k55K39J0p5K05K78k57O5n1J13J08j99LJ33K27l1j25J58q6l7k04Q06
$$ -693 -275 -530 -291 -281 -356 -151 127 -130 -65 -116 -3 105 -94 -91 42 269 238 113 271 185 148 -56 750
7128G50l62j06n7K32k30L62j90j02K45NJ53o1k01J99L01m56L41j63l7L21j30L7
$$ 750 388 282 225 457 227 589 399 297 542 547 700 639 438 637 938 482 823 660 623 944 814 851
7150H51p3J04k12K75N9j36K77k53k79q2L49J72q5N0Q9j62L85k77j4k13K25M0K
$$ 851 778 882 670 945 1004 868 1145 892 613 531 880 1052 967 1017 1106 944 1329 1052 1038 825 1050 1090 1092
7173A092j83K46R3L3l77oJ13j39M3K15j60J55l87J46O9k9J49k9k62K1K00m6k58
$$ 1092 909 1155 1248 1281 904 898 1011 872 915 1130 970 1125 738 884 953 924 1073 1044 782 803 1003 957 699
7196F99J05R3j1K3k77N2k44N28l27N9K4r7J25O2J63j94k06Q7k93j0L46j16j7J4
$$ 699 804 897 886 909 632 684 440 968 641 700 724 627 752 814 977 783 577 664 371 361 707 591 574 588
7220E88K32m23M1l6j90L92k63N1N6j10R6R7l95J35Kj22K23k71J49l1j99j31jO04
$$ 588 820 397 438 402 212 604 341 392 448 338 434 531 136 271 273 151 374 103 252 221 22 -109 -110 494
7244D94n61K3MJ14j19J84k77K35m4m91oJ25L64N5k50k60K92k31L18oo54M56k92
$$ 494 -67 -44 -40 74 -45 139 -138 97 53 -438 -444 -319 45 100 -150 -410 -118 -349 -31 -37 -691 -235 -527
7267e27kj60K29K24J35l28j62J51N8p6j92R0j25P9K6k77J91p0l6k41K56qKk07
$$ -527 -529 -689 -460 -236 -101 -429 -591 -440 -382 -458 -650 -560 -685 -606 -580 -857 -666 -736 -772 -1013 -757 -765 -763 -970
7291i70j15M70j9l14J00j50J30J37l19j7M43j92J60j68k36L36l02K8j5J56N0k4
$$ -970 -1085 -615 -634 -948 -848 -998 -868 -731 -1050 -1067 -624 -816 -656 -824 -1060 -724 -1026 -998 -1013 -857 -807 -831
7313h31k06J8p1K66k83J03k0J93m7K32m04J54J16k30L9j37K50j81Q2j1p7K25k22
$$ -831 -1037 -1019 -1090 -824 -1107 -1004 -1024 -831 -878 -646 -1050 -896 -780 -1010 -971 -1108 -858 -1039 -957 -968 -1045 -820 -1042
7336a042J26j52K54mQ2r6J78l16j23L36j85J96N1L42l79J41J6m26K7J80J33L37
$$ -1042 -916 -1068 -814 -818 -736 -832 -654 -970 -1093 -757 -942 -746 -695 -353 -732 -591 -575 -1001 -974 -794 -661 -324
7358c24k00j09j52L98l3j59L10r0K14j66j50K03L07k20PJ41k61J97j38K59j17
$$ -324 -524 -633 -785 -387 -420 -579 -269 -359 -145 -311 -461 -258 49 -171 -164 -23 -284 -87 -225 34 -83
7379h3P4L25k38J28k84K46j46J67L11n11K31p3P7p3K31K9M2pq5n7L86j05k07P7
$$ -83 -9 316 78 206 -78 168 22 189 500 -11 220 147 224 151 382 411 453 446 361 304 690 585 378 455
7403D55j32K97J00j02N1j6j49J67J77K3K01l57K6J1J48j50J85j14J10l78L44J1
$$ 455 323 620 720 618 669 653 504 671 848 871 1072 715 741 752 900 750 935 821 931 553 897 908
7425I08m2o3j70J82K90k10K72m36K09J63j87q1j9L32M1j45L6j60J14m8K54l97
$$ 908 866 803 633 815 1105 895 1167 731 940 1103 916 835 816 1148 1189 1044 1080 920 1034 986 1240 843
7447H43o4P4k21k5L63J13j07l9N6l01J20J30m22L35p0j08M3J96J7J66m42K52k29
$$ 843 779 853 632 607 970 1083 976 937 993 692 812 942 520 855 785 677 720 916 933 1099 657 909 680
7470F80p5k0L36k92K8K91j27k31J96k47Q0o7k27k0L45k8N2n43L38J07J21k42O3
$$ 680 605 585 921 629 657 948 821 590 786 539 619 552 325 305 650 622 674 131 469 576 697 455 518
7493E18J23J0m29N9P0j58L2l38L69R5k46J39j84J47l95M02k58J80j18J00j13l0
$$ 518 641 651 222 281 351 193 225 -113 256 351 105 244 60 207 -188 214 -44 136 18 118 5 -25
7515b5K0j33j09O8j34J74Rj46K44k11o3M6%j45J95p2o7P7k29k0k2J68m7P2K69
$$ -25 -5 -138 -247 -179 -313 -139 -130 -276 -32 -243 -306 -260 -260 -405 -210 -282 -349 -272 -501 -521 -543 -375 -422 -350 -81
7540h1m80Q7k52N15P3n81L2R4l0L7q7l1j10J22N9n64O33l04R6l54K12J23l25k27
$$ -81 -561 -474 -726 -211 -138 -719 -687 -593 -623 -586 -673 -704 -814 -692 -633 -1197 -564 -868 -772 -1126 -914 -791 -1116 -1343
7564a343M69n0J26K5j75J51j47M66o66J32J01K46k90j17j5K71K5J24p7k85qM7
$$ -1343 -874 -924 -798 -773 -948 -797 -944 -478 -1144 -1012 -911 -665 -955 -1072 -1087 -816 -791 -667 -744 -1029 -1037 -990
7586i90PR7j30n7J4J45K9j39L35j27k76J80n2OJ33K57m02R4j64L0J69J96k29K93
$$ -990 -983 -886 -1016 -1073 -1059 -914 -885 -1024 -689 -816 -1092 -912 -964 -958 -825 -568 -970 -876 -1040 -1010 -841 -645 -874 -581
7610e81l26J12K7L84k67m7K16j68L93l34P8J38J97j89j17J80j20R3J54m30J88
$$ -581 -907 -795 -768 -384 -651 -698 -482 -650 -257 -591 -513 -375 -178 -367 -484 -304 -424 -331 -177 -607 -419
7631d19q2J77J99j15K85k61N6M11j06o7L24k68j18J08R5j68R0J93j54P7l05L84
$$ -419 -501 -324 -125 -240 45 -216 -160 251 145 78 402 134 16 124 219 51 141 334 180 257 -48 336
7653C36j62K72j82p6R0K09j58K38k94L97r7q7j0K70k41o7L53k03J52k26L13j10
$$ 336 174 446 264 188 278 487 329 567 273 670 573 486 476 746 505 438 791 588 740 514 827 717
7675G17M9j25J03j7K89J23o93K48p2L59Q6l86k69L21J34r5J28j51Q0k32L99j31
$$ 717 766 641 744 727 1016 1139 446 694 622 981 1067 681 412 733 867 772 900 749 829 597 996 865
7697H65J17l7J09R2l63L60j62j59j6R8j55l4j13K2N1LK75Q1j21k41P6N1k10M2
$$ 865 982 945 1054 1146 783 1143 981 822 806 904 749 715 602 624 675 678 953 1034 913 672 748 799 589 631
7721F31K54k98J11QJ70o8j52l11M80Jn2k04q2J29N5r5k2k02K64O2k82j59K58K34
$$ 631 885 587 698 706 876 808 656 345 825 826 774 570 488 617 672 577 555 353 617 679 397 238 496 730
7745G30M6j92O9k21K2k94J56J32j85j80L33Q3k22Q8k94K02j39J11lP4k89P4R2
$$ 730 776 584 653 432 454 160 316 448 263 83 416 499 277 365 71 273 134 245 242 316 27 101 193
7768A93p6k4j76J04K18k79l21M23j2k05L20l7o4n3m3M4l98L45m14K49j1m1O3j14
$$ 193 117 93 -83 21 239 -40 -361 62 50 -155 165 128 64 11 -32 12 -386 -41 -455 -206 -217 -258 -195 -309
7792c09k09J02J83k9k90N2J89l49J41M0k00K26k96L9j19J66K90j33k14N0J74l31
$$ -309 -518 -416 -233 -262 -552 -500 -311 -660 -519 -479 -679 -453 -749 -710 -829 -663 -373 -506 -720 -670 -496 -827
7814h27J67m8j66J67k40j34N1K53j71J41Qm47M59k78L46%N7k8n8k44J11J11j64
$$ -827 -660 -708 -874 -707 -947 -1081 -1030 -777 -948 -807 -799 -1246 -787 -1065 -719 -719 -662 -690 -748 -992 -881 -770 -934
7837i34R9m19L78j44P1J02m40N50l93K88j40m6J30j27P3r9N28m75K55j21RK20
$$ -934 -835 -1254 -876 -1020 -949 -847 -1287 -737 -1130 -842 -982 -1028 -898 -1025 -952 -1051 -523 -998 -743 -864 -855 -635
7859f35q2j46l1J73m39L93k77N59k07Rj87O6k2K33J01q2k59N52j84l96L31j21
$$ -635 -717 -863 -894 -721 -1160 -767 -1044 -485 -692 -683 -870 -804 -826 -593 -492 -574 -833 -281 -465 -861 -530 -651
7881f51K67j09J49K1r1p7L62k26L50j67k28K80J06j8R6k47QK90Q5o4m0j84K11
$$ -651 -384 -493 -344 -323 -414 -491 -129 -355 -5 -172 -400 -120 -14 -32 64 -183 -175 115 200 136 96 -88 123
7904A23j32M2k3M94j44l86N6J45J58J24%k52K15j40J49j70j2j40J32K87l9P0j61
$$ 123 -9 33 10 504 360 -26 30 175 333 457 457 205 420 280 429 259 247 107 239 526 487 557 396
7927C96J5K88j30j76L21n8J0j82L00J2J61l63j16J85K40l33l3K36l99K77P2N4
$$ 396 411 699 569 393 714 656 666 484 784 796 957 594 478 663 903 570 537 773 374 651 723 777
7949G77l09L07q3L1j1R9j90J72O1l3J4J76l56K66j40m3Q8m1j7P4oj11J52P5k41
$$ 777 468 775 692 723 712 811 621 793 854 821 835 1011 655 921 781 738 826 785 768 842 836 725 877 952 711
7974G11j05K30k55K09k9Ok55J98J2P3l2p8K44k43J63j66k13J49j41J24j41J52
$$ 711 606 836 581 790 761 767 512 710 722 795 763 685 929 686 849 683 470 619 478 602 461 613
7996F13M5J74k76J05j14L1j73n2K93l0k21m8L65l07j21Q3J48j68Q7l1j17M26k87
$$ 613 658 832 556 661 547 578 405 353 646 616 395 347 712 405 284 367 515 347 434 403 286 712 425
8019D25jl82M10j86P4k92J07r6L69L7j35J15j50l01K27k42k1R6j37k2j54L39l7
$$ 425 424 42 452 266 340 48 155 59 428 465 330 445 295 -6 221 -21 -42 54 -83 -105 -259 80 43
8042D3j44k02J68o6P5j8J21J4k63n1q3L31K0m4l01l82K79J12k0Q0l99J38op4L12
$$ 43 -101 -303 -135 -201 -126 -144 -23 -9 -272 -323 -406 -75 -55 -99 -400 -782 -503 -391 -411 -331 -730 -592 -598 -672 -360
8067c60k77K74k34M8j03K8p0N6Q0k68K37j14J51l95J12K00j31l37K92K27k12J80
$$ -360 -637 -363 -597 -549 -652 -624 -694 -638 -558 -826 -589 -703 -552 -947 -835 -635 -766 -1103 -811 -584 -796 -616
8089f16k36J82k37m6p8j02J29L7l3l5K60J23j22j87o5J57P8j9Qm6k46K47j4K23
$$ -616 -852 -670 -907 -953 -1031 -1133 -1004 -967 -1000 -1035 -775 -652 -774 -961 -1026 -869 -791 -810 -802 -848 -1094 -847 -861 -638
8113f38r0l81L07j69J76j2J63k09M9n8J37n3J06j28J54j80jK81k84K01n6J04J17
$$ -638 -728 -1109 -802 -971 -795 -807 -644 -853 -804 -862 -725 -778 -672 -800 -646 -826 -827 -546 -830 -629 -685 -581 -464
8136d64j8q9j07L09j12q5J32J90j47M0j52J0J93k48M06k06k44J35K48J9J29k06
$$ -464 -482 -571 -678 -369 -481 -566 -434 -244 -391 -351 -503 -493 -300 -548 -142 -348 -592 -457 -209 -190 -61 -267
8158b67J48J45o7R1k78L39K05l26j55o3M45j26j37K98j3p6K32k38J05J62l9l41
$$ -267 -119 26 -41 50 -228 111 316 -10 -165 -228 217 91 -46 252 239 163 395 157 262 424 385 44
8180D4K69J77m76M43l91L91l2o7J6J17J61
$$ 44 313 490 14 457 66 457 425 358 374 491 652
8191F52
$$ Imaginary data points
##PAGE= N=2
##DATA TABLE= (X++(I..I)), XYDATA
0@%%%%%%%Qj6J6j6J6k0K8l2M0m8N4o2P2q8J03j17J34j55J76j99K28k59K90l26
$$ 0 0 0 0 0 0 0 0 8 -8 8 -8 8 -12 16 -16 24 -24 30 -32 40 -48 55 -62 72 -83 93 -106 122 -137 153 -173
31a73L68m12M59n12N71o35P05p82Q68r62J065j178J304j446J604j783J988k224
$$ -173 195 -217 242 -270 301 -334 371 -411 457 -505 560 -618 686 -760 844 -939 1049 -1175
49a175K497k821L214l700M315n124O241p889J0564j5615K8346j13507k33976L01007
$$ -1175 1322 -1499 1715 -1985 2330 -2794 3447 -4442 6122 -9493 18853 -94654 -328630 -27623
63b7623K21733j84007j80903J52827R8340j64193p8866J88347Q1501j67238q5143
$$ -27623 194110 10103 -170800 -17973 80367 -83826 -162692 25655 107156 -60082 -145225
74a45225J28044M2472j05293J1917J35347l6035j79059O48J84993M0761j41439
$$ -145225 -17181 25291 -80002 -68085 67262 31227 -147832 -147184 37809 78570 -62869
85f2869m9681R5137J4144q7784Q366J04433k648j09984k1332Q6140K3395n4720
$$ -62869 -112550 -17413 -3269 -91053 -82687 21746 19098 -90886 -112218 -26078 -2683 -57403
97e7403J239M7487l0299o6775L2339Q6500o670p2063n969L8382j2852j8940M5913
$$ -57403 -56164 -8677 -38976 -105751 -73412 13088 6418 -65645 -71614 -33232 -46084 -65024 -19111
110a9111L0627n9634m8635M8588M8953l3089k8741L4839P668n3971p394O5943
$$ -19111 11516 -48118 -96753 -48165 788 -32301 -61042 -26203 -18535 -72506 -79900 -13957
122a3957K1478n1337k0410K9462n002k7449L3967N0924l5288o6782K1718O6079
$$ -13957 7521 -43816 -64226 -34764 -39766 -67215 -33248 17676 -17612 -84394 -62676 3403
134C403r313m9889J4576M3223k2948m5246K6169N5559j3716n0683M56L2210j588
$$ 3403 -5910 -55799 -41223 2000 -20948 -66194 -40025 15534 1818 -48865 -48409 -16199 -17787
147a7787j3298K1794J5210l6731k8094L7537L9333k6975l6605K4288L1760k6572
$$ -17787 -31085 -9291 5919 -30812 -58906 -21369 17964 -9011 -45616 -21328 10432 -16140
159a6140k9111L4687L7693l2454m1553K4382M1448j1116k6712R869J2218j6547
$$ -16140 -45251 -10564 27129 -5325 -46878 -22496 18952 7836 -18876 -9007 3211 -13336
171a3336k329K8234N229k9817o573K6621L478k1640N498K5704r289l0378P182
$$ -13336 -15665 12569 17798 -12019 -18592 8029 11507 -10133 -4635 21069 11780 -18598 -11416
184a1416L2523J120k3055j392J4518l713q293J2003J0137j2698r772J3204R692
$$ -11416 21107 22227 -828 -2220 12298 8585 292 12295 22432 9734 -38 13166 22858
197B2858j0113l685J3492n37k0175j311K7903J2217k3440j7957J5254J4815j0234
$$ 22858 12745 9060 22552 22015 1840 529 28432 40649 17209 -748 14506 29321 19087
210A9087o772J4682N980j9232r189K0335J4348j3647j0603R330J431j0678R113
$$ 19087 12315 26997 32977 13745 4556 24891 39239 25592 14989 24319 25750 15072 24185
223B4185K3453q265l2013M05L1334O633k0685o00J7260r171k3573J2315L1568
$$ 24185 47638 39373 7360 7765 39099 45732 25047 24447 41707 32536 8963 21278 52846
236E2846k807k7986n959J5578K008k259J1078L080k0151j1996J7094J4677p177
$$ 52846 50039 22053 16094 31672 33680 31421 42499 45579 25428 13432 30526 45203 38026
249C8026n040P024n889j8374N578K8320O057k6176j7000J2536J4472j481k989
$$ 38026 32986 40010 34121 15747 21325 49645 55702 29526 12526 25062 39534 38053 35064
262C5064K900n315j3245k068J4099J0696l012q592r094o409M749J6593Q347j4769
$$ 35064 37964 32649 19404 17336 31435 42131 39119 30527 21433 15024 19773 36366 44713 29944
276B9944j9967K966J5887M052p626n23J786j1040j0705J1765J9664k687j9931
$$ 29944 9977 12943 28830 32882 25256 24733 26519 15479 4774 16539 36203 33516 13585
289A3585r032N306L923K933P451o63j5717j1322P416J1850J086k530l126j0534
$$ 13585 4553 9859 13782 16715 24166 23503 7786 -3536 3880 15730 16816 14286 11160 626
303F26j0087R520J9330p62j9072r192O902L724k717N179O549r457j7632j644J5525
$$ 626 -9461 59 19389 18627 -445 -9637 -2735 989 -1728 3451 10000 543 -17089 -18733 -3208
318c208R835m261j0006q634l587N508J1370L843r406j0869j739K475L345O555
$$ -3208 6627 2366 -7640 -16274 -19861 -14353 -2983 860 -8546 -19415 -21154 -18679 -15334 -8779
332h779M935q477j6727l383J5891J1840o574j2462l813J677R36M185P860j457
$$ -8779 -3844 -12321 -29048 -32431 -16540 -4700 -11274 -23736 -27549 -25872 -24936 -20751 -12891 -14348
346a4348j3169j0121N224J2224N144k868r020q124p29R976R232j790r686m641
$$ -14348 -27517 -37638 -32414 -20190 -15046 -17914 -26934 -35058 -35787 -25811 -16579 -18369 -28055 -32696
360c2696M37J464L962P320J446j1186j0911M204J3742N845p368q326j450J821
$$ -32696 -32259 -30795 -26833 -19513 -18067 -29253 -40164 -35960 -22218 -16373 -23741 -32067 -33517 -31696
374c1696K835N212M466k513j0067o124O059J0757N141m419p634o744J326R777
$$ -31696 -28861 -23649 -19183 -21696 -31763 -37887 -31828 -21071 -15930 -20349 -27983 -34727 -33401 -23624
388b3624J0139k449j0908n060L619M321L966N129J48j1127q925P815J4674K526
$$ -23624 -13485 -15934 -26842 -31902 -28283 -23962 -19996 -14867 -14719 -25846 -34771 -26956 -12282 -9756
402i756q116n833k083j046N652J2116L270j1581j0968K911Q662N473K955K37r067
$$ -9756 -17872 -23705 -25788 -26834 -21182 -9066 -5796 -17377 -28345 -25434 -16772 -11299 -8344 -8107 -17174
417a7174j0437M483J5977O842p903q962j450J589L554Q493O458o322j3803l751
$$ -17174 -27611 -23128 -7151 -309 -8212 -17174 -18624 -17035 -13481 -4988 1470 -4852 -18655 -22406
431b2406J1001J1934K738m949q732p441K758J3537J1089m397j2850n212M242O176
$$ -22406 -11405 529 3267 -1682 -10414 -17855 -15097 -1560 9529 5132 -7718 -12930 -8688 -2512
445b512O194O545k336j5021q404J1781J7046J819j0638n783j176o46N724J3545
$$ -2512 3682 10227 7891 -7130 -15534 -3753 13293 15112 4474 -1309 -2485 -3131 2593 16138
459A6138L374j3703j1440M769R989M234L000N08r900j1201O557J7635M388r437
$$ 16138 19512 5809 -5631 -862 9127 13361 16361 16869 6969 -4232 2325 19960 24348 14911
473A4911n091Q29l759l91J3156J1919r606j7370j010J2573P725j11m16m467r847
$$ 14911 9820 10649 6890 6499 19655 31574 21968 4598 3588 16161 23886 23775 23359 18892 9045
488I045j338J3436J0327l712q976l211j040P75R615J0926l792j6454p189J1328
$$ 9045 7707 21143 31470 27758 18782 15571 14531 15306 24921 35847 32055 15601 8412 19740
502A9740J1235Ml310j946n529n878O023J2988K800j0807q483J623M165L170N654
$$ 19740 30975 30979 27669 25723 20194 14316 20339 33327 36127 25320 16837 18460 22625 25795 31449
517C1449J846q748j0529K138J1770N428m123l802m297m217J882J0635O094q267
$$ 31449 33295 24547 14018 16156 27926 33354 29231 25429 21132 16915 18797 29432 35526 27259
531B7259j0160P27M452J359J958M135l527j1816l742J0136R434m649q126k660
$$ 27259 17099 17826 22278 23637 25595 29730 26203 14387 10645 20781 30215 25566 17440 14780
545A4780M65l42L143N074j474q088m081K924L395J381J257k286p677m273P120
$$ 14780 15245 14903 18046 23120 21646 13558 9477 12401 15796 17177 18434 16148 8471 4198 11318
560A1318Q297m565q700k98N078l135m797M100N791n216r878L32P536K495m087
$$ 11318 19615 15050 6350 6052 11130 7995 3198 7298 13089 7873 -2005 -1673 5863 8358 4271
575D271m442k236l84M100K628m087n515K252M520m301o246N124Q420o463j2356
$$ 4271 -171 -2407 -2791 1309 3937 -150 -5665 -3413 1107 -3194 -9440 -4316 4104 -2359 -14715
590a4715K424J2256J157j0557n425M924L352j394j617r20k063o28J264o64j249
$$ -14715 -12291 -35 1122 -9435 -14860 -9936 -6584 -7978 -9595 -10515 -12578 -13206 -11942 -12606 -13855
605a3855K104K014n802o424M609R669o61j0411m586O340N134k418l403J376J308
$$ -13855 -11751 -9737 -15539 -21963 -17354 -7685 -8346 -18757 -23343 -17003 -11869 -14287 -17690 -16314 -15006
620a5006l304l266K182N909J612n662o932l88P055N879l023p597k529L308L838
$$ -15006 -18310 -21576 -19394 -13485 -11873 -17535 -24467 -24855 -17800 -11921 -14944 -22541 -25070 -21762 -17924
635a7924m31m95J740q41n744l233N965R083K67r054o722K396P378M869j664m875
$$ -17924 -18355 -18850 -17110 -17951 -23695 -26928 -20963 -11880 -11613 -20667 -27389 -24993 -17615 -12746 -14410 -19285
651a9285m418N89L998K755J407J301k558p718l355Q175J1293n62j1032o812L431
$$ -19285 -23703 -23114 -19116 -16361 -14954 -13653 -16211 -23929 -27284 -19109 -7816 -8378 -19410 -26222 -22791
666b2791O358L942J385j778n372m460K409N973M888J321m531q386k847P638J1172
$$ -22791 -16433 -12491 -11106 -12884 -18256 -22716 -20307 -14334 -9446 -8125 -12656 -21042 -23889 -16251 -5079
681e079J105q685p040Q05M450M518L311K2m918n592j460N455R159M168o650j1146
$$ -5079 -3974 -12659 -19699 -18894 -14444 -9926 -6615 -6593 -11511 -17103 -18563 -13108 -3949 219 -6431 -17577
697a7577k383R551R563N75n378m504k971Q28O312P711R26o685p163q94N256Q978
$$ -17577 -19960 -10409 -846 -271 -5649 -10153 -13124 -12296 -5984 1727 2653 -4032 -11195 -12089 -6833 2145
713B145M849m629j1157m462Q027J0646K509m558n224m009M0O088Q238K596n825
$$ 2145 6994 2365 -8792 -13254 -5227 5419 7928 3370 -1854 -5863 -5823 265 8503 11099 5274
728E274p895k527M876R743N478l392r656n163N354Q925M098j156m916n194j562
$$ 5274 -2621 -5148 -272 9471 14949 11557 1901 -3262 2092 11017 15115 13959 9043 3849 2287
743B287N366P899L233l512p279m418K686Q476P437j808q984o055K998Q035M352
$$ 2287 7653 15552 18785 15273 7994 3576 6262 14738 22175 20367 11383 5328 8326 16361 20713
758B0713p10k193m410l772J103Q133P547k286r773n968L462R069N294k006p203
$$ 20713 20003 17810 13400 9628 10731 18864 26411 24125 14352 8384 11846 20915 26209 24203 17000
773A7000m569K184M792K997R77o33l567n988j057Q656Q944k488j0965n881N031
$$ 17000 12431 14615 19407 22404 23381 22748 19181 13193 12136 20792 29736 27248 16283 10402 15433
788A5433Q015K646l167l776k486n25N06K906N008Q03p614q226J963J0418M883
$$ 15433 23448 26094 22927 19151 16665 16140 16646 19552 24560 25363 17749 9523 11486 21904 26787
803B6787m839q446k796K965M232K208n17l138k980k655R9M487N441j276r225n751
$$ 26787 21948 13502 10706 13671 17903 20111 19594 16456 13476 10821 10920 15407 20848 19572 10347 4596
819D596M605P927R25n508l895o58j70J591K335J352k714n099k713J716N443L235
$$ 4596 9201 17128 18053 12545 8650 7992 7822 9413 11748 13100 10386 5287 2574 4290 9733 12968
835A2968m114q092k203N086M941j369l814j771j324j356J044M328J667m111o144
$$ 12968 8854 762 -1441 3645 8586 7217 3403 1632 308 -1048 -4 4324 5991 1880 -4264
850d264k191M255N351N41n104n196o66K708K955J262j374l990l629M57L273L424
$$ -4264 -6455 -2200 3151 3692 -1412 -6608 -7274 -4566 -1611 -349 -1723 -5713 -9342 -8885 -5612 -2188
866b188K5l609n112k061M128N773p8m655m312p77J439K834M026j263o258m367
$$ -2188 -2163 -5772 -10884 -12945 -8817 -3044 -3122 -7777 -12089 -12866 -11427 -8593 -4567 -5830 -12088 -16455
882a6455J957N036K326j198k712m986j566M859N178l84m649k605j198N1L081N345
$$ -16455 -14498 -9462 -7136 -8334 -11046 -16032 -17598 -12739 -7561 -7945 -12594 -15199 -16397 -16346 -13265 -7920
898g920J8p312n648L273N881K046j179k889l884k297L686O017J466m731m248j214
$$ -7920 -7902 -15214 -20862 -17589 -11708 -9662 -10841 -13730 -17614 -19911 -16225 -10208 -8742 -13473 -17721 -18935
914a8935J102M115M191j99n947n598J667N947L716p55l403l865j979K889N592
$$ -18935 -17833 -13718 -9527 -9726 -15673 -21271 -19604 -13657 -9941 -10696 -14099 -17964 -19943 -17054 -11462
929a1462L001l673n785k300L197M570L223r51n005l901J213M918L319p96k487
$$ -11462 -8461 -12134 -17919 -20219 -17022 -12452 -9229 -10180 -15185 -19086 -17873 -12955 -9636 -10432 -12919
944a2919k594j792J063N318M588k266o907k687M290M800J888j330k528k888n05
$$ -12919 -15513 -17305 -16242 -10924 -6336 -8602 -15509 -18196 -13906 -9106 -7218 -8548 -11076 -13964 -14469
959a4469L513M438J040k774l498j563J857M944M095k028n550k485L365M461J922
$$ -14469 -10956 -6518 -5478 -8252 -11750 -13313 -11456 -6512 -2417 -4445 -9995 -12480 -9115 -4654 -2732
974b732n83k123k253j559K439N709K774l550n089n78L821L765K053r65l033k624
$$ -2732 -3315 -5438 -7691 -9250 -6811 -1102 1672 -1878 -6967 -7545 -3724 41 2094 1129 -1904 -4528
990d528J043M691L226l14k567k892r84K984N863K500m667m492Q99M295J969N95
$$ -4528 -3485 1206 4432 4118 1551 -1341 -2325 659 6522 9022 4355 -137 762 5057 7026 7621
1006G621O27j296l545r46N579M720o93m431k039Q44K476L863K002l011l858k88
$$ 7621 8248 6952 3407 2461 8040 12760 12067 7636 5597 6441 8917 12780 14782 11771 7913 7625
1022G625L083K702J582M72k667m564K48O533M753k309n043k012K324J632K559
$$ 7625 10708 13410 14992 15464 12797 8233 8481 15014 19767 17458 12415 10403 12727 14359 16918
1037A6918J600r47m106l069K381N422K932k560m606k716J696M960K601j290m203
$$ 16918 18518 17571 13465 10396 12777 18199 21131 18571 13965 11249 12945 17905 20506 19216 15013
1052A5013k352L85K033K304K764j033n486m342K525O968K527m241m700j337R99
$$ 15013 12661 13046 15079 17383 20147 19114 13628 9286 11811 18779 21306 17065 12365 11028 12027
1067A2027K361K740J083l169m992j372L218L617J979k221n469l799K405N967J783
$$ 12027 14388 17128 18211 15042 10050 8678 11896 15513 17492 15271 9802 6003 8408 14375 16158
1082A6158l208l763j153j010J139L925L217l161p975k969N054N558Q01l440m677
$$ 16158 12950 9187 8034 7024 8163 12088 15305 12144 4169 1200 6254 11812 12613 9173 4496
1097D496k482R11L775K472p40l509l364j912J556N039L415l898p585k636M514
$$ 4496 2014 2925 6700 9172 8432 4923 1559 -353 1203 6242 9657 5759 -1826 -4462 52
1112E2N023J75k499k956l090q98K196N257R97m332n445j618K894M768J779k638
$$ 52 5075 5250 2751 -205 -3295 -4193 -1997 3260 4257 -75 -5520 -7138 -4244 524 2303 -335
1128c35n503k766K123M316J111p98k330l812k580K385O044K038m622o021r01L059
$$ -335 -5838 -8604 -6481 -2165 -1054 -1852 -4182 -7994 -10574 -8189 -2145 -107 -4729 -10750 -11651 -8592
1144h592L679J581j467m123l124N56L353K816J82k077m263k477J580N933K261
$$ -8592 -4913 -3332 -4799 -8922 -12046 -11490 -8137 -5321 -5139 -7216 -11479 -13956 -12376 -6443 -4182
1159d182l657n384j472K332L427J449n71k784l015o61K124L859J080k198m261
$$ -4182 -7839 -13223 -14695 -12363 -8936 -7487 -8058 -10842 -13857 -14518 -12394 -8535 -7455 -9653 -13914
1174a3914k691K276N143J906k733m253j267J873J632J282R42j039l520k776K511
$$ -13914 -16605 -14329 -9186 -7280 -10013 -14266 -15533 -13660 -12028 -10746 -9804 -10843 -14363 -17139 -14628
1189a4628M868J821l487l946p77K400L076J343j312k849j259Q52J523J696J424
$$ -14628 -9760 -7939 -11426 -15372 -16149 -13749 -10673 -9330 -10642 -13491 -14750 -13898 -12375 -10679 -9255
1204i255p02l963k123K774N259L55l757k438J087J627J035M47M87j143j760N38
$$ -9255 -9957 -13920 -16043 -13269 -8010 -7655 -11412 -13850 -12763 -11136 -10101 -9654 -9167 -10310 -12070 -11532
1220a1532J282K017J213r14l205j027L087M060m26l279p90J325J537NJ721N21
$$ -11532 -10250 -8233 -7020 -7934 -11139 -12166 -9079 -5019 -5445 -8724 -9514 -8189 -6652 -6647 -4926 -4405
1236d405j562j606N77K604K005l39j014j328k78K640K348j77j980p11R23J064
$$ -4405 -5967 -7573 -6996 -4392 -2387 -2726 -3740 -5068 -5346 -2706 -358 -535 -2515 -3226 -2303 -1239
1252a239J822R66k80j483j222J426K956J249n00k371p29J254K058K060Q9j470
$$ -1239 583 1549 1269 -214 -1436 -10 2946 4195 3695 1324 595 1849 3907 5967 6056 4586
1268D586j684M61K240J884M81r72j534o12J478K358J776j042j954j326J198K482
$$ 4586 2902 3363 5603 7487 7968 6996 5462 4850 6328 8686 10462 9420 7466 6140 7338 9820
1284I820K291L00k595k547O12L327K089m06j507p30r52lK388L048L31l945l380
$$ 9820 12111 12411 9816 7269 7881 11208 13297 12891 11384 10654 9702 9699 12087 15135 15466 11521 8141
1301H141J320M403K817j261m122j524J300K540J140Q7q79j486k508j88L618M045
$$ 8141 9461 13864 16681 15420 11298 9774 11074 13614 14754 14841 13962 12476 9968 9780 13398 17443
1317A7443q74n466l441K300M678J213k014k377j045k87K68K132K412l97l994l834
$$ 17443 16569 11103 7662 9962 14640 15853 13839 11462 10417 10130 10398 12530 14942 14545 10551 6717
1333F717Q46M823K883k239m774k182J952K879R21q05j031j864k024j086L634L878
$$ 6717 7563 12386 15269 13030 8256 6074 8026 10905 11826 11021 9990 8126 6102 5016 8650 12528
1349A2528q31n722l599J461M355K012j854l022j481m67P18J794J569j93l539l806
$$ 12528 11697 5975 2376 3837 8192 10204 8350 5328 3847 3380 4098 5892 7461 7268 3729 -77
1365g7J67M704L371j810m971k907J370L389J873j120j988j735j603m6K525K896
$$ -77 90 4794 8165 6355 1384 -1523 -153 3236 5109 3989 2001 266 -1337 -1383 1142 4038
1381D038r92m007l465R20L341K312q19l382k882lL006J645p24r87j580k114r66
$$ 4038 3046 -961 -4426 -3506 -165 2147 1328 -2054 -4936 -4939 -1933 -288 -1012 -1999 -3579 -5693 -6659
1398f659L245L233p74m767k499J550K501J170M8j964k918j063J938K464M53j484
$$ -6659 -3414 -181 -955 -5722 -8221 -6671 -4170 -3000 -2952 -4916 -7834 -8897 -6959 -4495 -4042 -5526
1414e526j912k209n54K729L182n28m022k287J236K317O04J86n35k591j792J502
$$ -5526 -7438 -9647 -10201 -7472 -4290 -4818 -8840 -11127 -9891 -7574 -6970 -6784 -7319 -9910 -11702 -10200
1430a0200K443P40j055j724j752m75K032K775r1l575k344J362J674Q56L40k17
$$ -10200 -7757 -7017 -8072 -9796 -11548 -12023 -9991 -7216 -7307 -10882 -13226 -11864 -10190 -9334 -8994 -9211
1446i211j900j868O70K442J417j239j954p17M05Q53K127L71k100k129N40J765
$$ -9211 -11111 -12979 -12309 -9867 -8450 -9689 -11643 -12360 -11955 -11102 -8975 -8604 -10704 -12833 -12293 -10528
1462a0528J276M41p28j595j560Q66K805J274j724j922j56J051N59J063J437j116
$$ -10528 -9252 -8811 -9539 -11134 -12694 -11828 -9023 -7749 -9473 -11395 -11551 -10500 -9941 -8878 -7441 -8557
1478h557k287o12K430K421j53j364j416J59R87J681J444j78j927j008O18J903
$$ -8557 -10844 -11456 -9026 -6605 -6758 -8122 -9538 -9379 -8392 -6711 -5267 -5445 -7372 -8380 -7762 -5859
1494e859J352R91j116k901j30K817K957o95j925k73M54K79R86K165P56k037k044
$$ -5859 -4507 -3516 -4632 -7533 -7663 -4846 -1889 -2584 -4509 -4782 -4328 -4049 -3063 -898 -142 -2179 -4223
1511d223J081K859J759j21j520j383M1K233K035M68j441p09j13J02J371K790O81
$$ -4223 -3142 -283 1476 1355 -165 -1548 -1507 726 2761 3229 1788 1079 966 1068 2439 5229 5910
1528E910l085k498J906L167J253q23j117m12l07N38K481J473q52j728q29Q27J892
$$ 5910 2825 327 2233 5400 6653 5830 4713 4301 3994 4532 7013 8486 7634 5906 5077 5904 7796
1545G796K715m37l028j493J078K761O46m20j2j035j448K21L184K244j500l181
$$ 7796 10511 10074 7046 5553 6631 9392 10038 9618 9606 8571 7123 7344 10528 12772 11272 8091
1561H091j053J909K011P13M0j610j345k48J299J688P99r63j847j789J069K794
$$ 8091 7038 8947 10958 11671 11711 10101 8756 8508 9807 11495 12294 11331 9484 7695 8764 11558
1577A1558J648j581l122o46J457J721k5K43n15j923k057J723K934Q74k544k375
$$ 11558 13206 11625 8503 7857 9314 11035 11010 11253 10738 8815 6758 8481 11415 12289 9745 7370
1593G370m96J335J530Q02p64j731j321J52J361J142L90j400k309j552J756K969
$$ 7370 6874 8209 9739 10541 9777 8046 6725 6877 8238 9380 9770 8370 6061 4509 6265 9234
1609I234O4k525k053L26L55N60N80Q11j241k461r71J889J863J48j812j976q11
$$ 9234 9298 6773 4720 5046 5401 5961 6541 7352 6111 3650 2679 4568 6431 6579 4767 2791 1980
1626A980J257K281J77j923k120J42N94M1J133Q41j496k871n34K014K111n53k016
$$ 1980 3237 5518 5695 3772 1652 1794 2388 2429 3562 4403 2907 36 -498 1516 3627 3074 1058
1643A058j457o13N14J682P71j274j908r24O41J053Q50q7j276k384n79K159K005
$$ 1058 -399 -1012 -498 1184 1955 681 -1227 -2151 -1510 -457 393 306 -970 -3354 -3933 -1774 231
1660B31j071j811j331k2N43P47J076q52k056j356O38J431J199l81k016k204j09
$$ 231 -840 -2651 -3982 -4004 -3461 -2714 -1638 -2490 -4546 -5902 -5264 -3833 -2634 -3015 -5031 -7235 -7344
1677g344K162K284j078k553o88K79M31O82R85n99k191j605N57K197J456o82k615
$$ -7344 -5182 -2898 -3976 -6529 -7217 -6938 -6507 -5825 -4840 -5439 -7630 -9235 -8678 -6481 -5025 -5707 -8322
1694h322j725M87K243J269o98j822j173j69R81R28J040o03k107j462N82L035R67
$$ -8322 -10047 -9560 -7317 -6048 -6746 -8568 -9741 -9910 -8929 -8001 -6961 -7564 -9671 -11133 -10551 -7516 -6549
1711f549j445k012o93M62R67J276R53j477j922q77J035K241J091o37k364j909
$$ -6549 -7994 -10006 -10699 -10237 -9270 -7994 -7041 -8518 -10440 -11317 -10282 -8041 -6950 -7587 -9951 -11860
1727a1860J293K850J302j550j422p68L37O31J834J780r38l266j098K033L032R94
$$ -11860 -10567 -7717 -6415 -7965 -9387 -10155 -9818 -9187 -7353 -5573 -6511 -9777 -10875 -8842 -5810 -4816
1743d816j409j746j188Q20K197J687k34j385j220n53J275K449J915j582k831q52
$$ -4816 -6225 -7971 -9159 -8339 -6142 -4455 -4689 -6074 -7294 -7847 -6572 -4123 -2208 -3790 -6621 -7473
1759g473K375K511O19p97m82j516J13J876K282R15j875k097j34J839K833P35j209
$$ -7473 -5098 -2587 -1968 -2765 -3247 -4763 -4650 -2774 -492 423 -1452 -3549 -3683 -1844 989 1724 515
1776E15j990p39J399K132J296K10j142j757m55J908K905J221k171k155o8J797
$$ 515 -1475 -2214 -815 1317 2613 2823 1681 -76 -531 1377 4282 5503 3332 1177 1109 2906
1792B906K135N93l20j229j590N51J775K447l0j427j597k39J928J853M79j161j712
$$ 2906 5041 5634 5314 4085 2495 3046 4821 7268 7238 5811 4214 3975 5903 7756 8235 7074 5362
1809E362n16R25J569J241P2j419k346L80K525K020l96j929j144L60Q74Q89J256
$$ 5362 4846 5771 7340 8581 8653 7234 4888 5268 7793 9813 9417 7488 6344 6704 7578 8467 9723
1826I723j66j853j125j1K028J911n49k316j037N1J743J135j59j142o21o01LJ276
$$ 9723 9557 7704 6579 6568 8596 10507 9958 7642 6605 6656 8399 9534 9375 8233 7612 7011 7014 8290
1844H290R98J42j886j785Q41J798Q34q33j700j36Q8N43M12M70l88j414j211N84
$$ 8290 9288 9430 7544 5759 6600 8398 9232 8399 6699 6563 6651 7194 7606 8076 7688 6274 5063 5647
1862E647J558J241r08k443q08J106J490K60j060r38j37j25m21J052P02k63j738
$$ 5647 7205 8446 7538 5095 4287 5393 6883 7143 6083 5145 5008 4883 4462 5514 6216 5953 4215
1879D215j448J113J287K91j197j292k95P36O82M0o12n70p80k4K13P82N37j001
$$ 4215 2767 3880 5167 5458 4261 2969 2674 3410 4092 4132 3520 2950 2170 2146 2359 3141 3678 2677
1897B677j594j054J432J785n90j651p93j98O46N42J4j72r58p62k42Q98P88k23
$$ 2677 1083 29 1461 3246 2656 1005 212 14 660 1202 1216 1044 86 -676 -918 -20 768 545
1915E45j237j516n51J535J350n31j638j296O53M79K88K3L58j171j830l03J563
$$ 545 -692 -2208 -2759 -1224 126 -405 -2043 -3339 -2686 -2207 -1919 -1896 -1538 -2709 -4539 -4842 -3279
1932c279J191L7j700j595k40J447J587l13k324q45k5Q34J92O43N34k061j990l88
$$ -3279 -2088 -2051 -3751 -5346 -5586 -4139 -2552 -2865 -5189 -6034 -6059 -5225 -5033 -4390 -3856 -5917 -7907 -8295
1950h295K710J777p85k275j638M35J271J018K23j140j300n50K39J161Q53J79j414
$$ -8295 -5585 -3808 -4593 -6868 -8506 -8071 -6800 -5782 -5559 -6699 -7999 -8549 -8310 -7149 -6296 -6117 -7531
1967g531k395L76K409J421o21j953o99l60R22R14J267p19j883j553O60K448J304
$$ -7531 -9926 -9550 -7141 -5720 -6341 -8294 -8993 -9353 -8431 -7517 -6250 -6969 -8852 -10405 -9745 -7297 -5993
1984e993n73j723j550j14J971J709L4j359r41l31K04J501J978Q6k248j751O50
$$ -5993 -6566 -8289 -9839 -9953 -7982 -6273 -6239 -7598 -8539 -8870 -8666 -7165 -5187 -5101 -7349 -9100 -8450
2001h450K456J082n71p89q00m89O82K319J270j013k399k68J126J744J401k30j211
$$ -8450 -5994 -4912 -5483 -6272 -7072 -7561 -6879 -4560 -3290 -4303 -6702 -6970 -5844 -4100 -2699 -2929 -4140
2018d140j717K91J838J765J19l46j311r87N04L095J511j327k640J54J804J130
$$ -4140 -5857 -5566 -3728 -1963 -1844 -2190 -3501 -4488 -3984 -889 622 -705 -3345 -3191 -1387 -257
2034b57M45N73q04j544l88J406K245Q08r19j408r83P67K651J285r82j420m57J174
$$ -257 188 761 -43 -1587 -1975 -569 1676 2484 1565 157 -826 -59 2592 3877 2895 1475 1018 2192
2052B192O53N39J051k50j923j083J860K294O83j614j060k19P71J117J063J82j609
$$ 2192 2845 3384 4435 4185 2262 1179 3039 5333 6016 4402 3342 3123 3894 5011 6074 6256 4647
2069D647o37k39J174J331Q69q39k091k09J611J727q4j100q64L35L9O15J144N08
$$ 4647 4010 3771 4945 6276 7145 6306 4215 4006 5617 7344 7260 6160 5296 5631 5670 6285 7429 7937
2087G937j184j755L52J119J372k09j028q96o4R50R60K21o70p04o13jM89J259M91
$$ 7937 6753 4998 5350 6469 7841 7632 6604 5708 5644 6594 7554 7775 7105 6401 5788 5787 6276 7535 8026
2106H026j250j804M13J605M58k84n16r75j57m5R92J111o70j142j003M25J087R47
$$ 8026 6776 4972 5385 6990 7448 7164 6648 5673 5516 5471 6463 7574 6904 5762 4759 5184 6271 7218
2124G218m92j121j205K40R90Q71n41n56n86o28K74Q56R84n14j428q82L73J240
$$ 7218 6726 5605 4400 4640 5630 6501 5960 5404 4818 4190 4464 5320 6304 5790 4362 3480 3853 5093
2142E093K92n96r35m23l45P40P44N6r21j023m15K57Q95N34m39j626j146J049Q31
$$ 5093 5385 4789 3854 3431 3086 3826 4570 4626 3705 2682 2267 2524 3419 3953 3514 1888 742 1791 2622
2161B622K57p53l53o09n15K52J296J4r92j461j91M82R69N5m87j164j156Q09J025
$$ 2622 2879 2126 1773 1164 649 901 2197 2211 1219 -242 -433 49 1018 1073 586 -578 -1734 -925 100
2180A00Q3p13m02r78o15L84J434M86j212j780j73P38Q30m0n30j334n40J06J144
$$ 100 183 -530 -932 -1910 -2525 -2141 -707 -221 -1433 -3213 -3386 -2648 -1818 -1858 -2388 -3722 -4262 -4156 -3012
2199c012M19o43l75j080p59M01J612J87r54k029k99J288R10j01r50m21o95p4K74
$$ -3012 -2593 -3236 -3611 -4691 -5450 -5049 -3437 -3250 -4204 -6233 -6532 -5244 -4334 -4435 -5385 -5806 -6501 -6575 -6301
2218f301J172L1o08j729m52R05J429J25q48j554k00P16J011j18m79j20m15p81
$$ -6301 -5129 -5098 -5706 -7435 -7887 -6982 -5553 -5428 -6276 -7830 -8030 -7314 -6303 -6421 -6900 -7020 -7435 -8216
2236h216K80J790P56j565j386M0J330N62p3l10l75o00j8P98P08O90j113o06o21
$$ -8216 -7936 -6146 -5390 -6955 -8341 -8301 -6971 -6409 -6482 -6792 -7167 -7767 -7785 -6987 -6279 -5589 -6702 -7308 -7929
2255g929R51J745K52j358p39N20R30M47j2L4j7r59k21J316J479K2j392n34N33
$$ -7929 -6978 -5233 -4981 -6339 -7078 -6558 -5628 -5181 -5193 -5159 -5176 -6135 -6356 -5040 -3561 -3539 -4931 -5465 -4932
2274d932P37J107K74r25l15j99R09O75M29N93r54q66J83J430J468n14j265o5O10
$$ -4932 -4195 -3088 -2814 -3739 -4054 -4253 -3344 -2669 -2240 -1647 -2601 -3467 -3284 -1854 -386 -900 -2165 -2230 -1620
2293a620M56N17P44K59j247n55J045J360M23m06n63n42O52J150L41l4l44p15M53
$$ -1620 -1164 -647 97 356 -891 -1446 -401 959 1382 976 413 -129 523 1673 2014 1980 1636 921 1374
2312A374L48R79L44j06j151k21P72J392K63q83p18K56M11P16O26L14m89j167J88
$$ 1374 1722 2701 3045 2939 1788 1567 2339 3731 3994 3111 2393 2649 3060 3776 4402 4716 4227 3060 3248
2331C248Q16J172K04q19r50l0P54J217J13l05p10m36J14O93J012M59j291j295
$$ 3248 4064 5236 5440 4621 3671 3641 4395 5612 5725 5420 4710 4274 4388 5081 6093 6552 5261 3966
2349C966K40J436J120m28r74m38k02N92N65P64P6j221q43k00J095J279N6j112
$$ 3966 4206 5642 6762 6334 5360 4922 4720 5312 5877 6641 6717 5496 4653 4453 5548 6827 6883 5771
2367E771j430L61J000O80m0n08n80m55Q0L74J346J57j544r89J19Q68J150m30o11
$$ 5771 4341 4702 5702 6382 6342 5834 5254 4799 4879 5253 6599 6756 5212 4223 4342 5210 6360 5930 5319
2386E319p21l98N12O93N06Oj183q89P8Q20J198j5j554j229J58J049P67J23p60
$$ 5319 4598 4200 4712 5405 5911 5917 4734 3845 3923 4743 5941 5926 4372 3143 3301 4350 5117 5240 4480
2405D480o49q93J19J027R69l15j505q84lJ065Q39J22j355j298j02Q96O29k9k73
$$ 4480 3831 2938 3057 4084 5053 4738 3233 2349 2346 3411 4250 4372 3017 1719 1617 2513 3142 3113 2840
2424B840r62q41j25J081O84Nj583j210J63O95J110k68p83j234n22O07Q03n4rq99
$$ 2840 1878 1037 912 1993 2677 2682 1099 -111 52 747 1857 1589 806 -428 -950 -343 460 406 397 -502
2444e02r59o37J096J531o63j573j125K00P61N92l10o00m56r61J73L78Q57k04j161
$$ -502 -1461 -2098 -1002 529 -134 -1707 -2832 -2632 -1871 -1279 -1589 -2189 -2645 -3606 -3433 -3055 -2198 -2402 -3563
2463c563q15k36P44R64k89j122r50L68N06mK14K08o81j149m81J315R45m20j349
$$ -3563 -4378 -4614 -3870 -2906 -3195 -4317 -5267 -4899 -4393 -4397 -4183 -3975 -4656 -5805 -6286 -4971 -4026 -4446 -5795
2482e795n23Q1O98M51j03q26o50K70j85N20K98L48o29j396J63J139R39m62j263
$$ -5795 -6318 -6237 -5539 -5088 -5191 -6017 -6667 -6397 -6582 -6062 -5764 -5416 -6045 -7441 -7278 -6139 -5200 -5662 -6925
2501f925J73L46J2j84O78k1n89m56L36P62K55J36r81n82O01R14L85r1q10J84n
$$ -6925 -6752 -6406 -6394 -6578 -5900 -5921 -6510 -6966 -6630 -5868 -5613 -5477 -6458 -7040 -6439 -5525 -5140 -5231 -6041 -5857 -5862
2522e862Q5L68O36K99r97o98R48J066L67n47p70N06L41N0O52j21k10K1q5M16P65
$$ -5862 -5777 -5409 -4773 -4474 -5471 -6169 -5221 -4155 -3788 -4335 -5105 -4599 -4258 -4208 -3556 -3677 -3887 -3866 -3951 -3535 -2770
2543b770L6k4p68QJ078R60j92n30l05N82L16j05O54M54l76q54K40J404Q03o38
$$ -2770 -2734 -2758 -3526 -3518 -2440 -1480 -1672 -2202 -2507 -1925 -1609 -1714 -1060 -606 -982 -1836 -1596 -192 611 -27
2563b7p63L78K59M18M87K80n2p60K64J70M22R94j11j018o26O06J376K00n78j82
$$ -27 -790 -412 -153 265 752 1032 980 220 484 654 1076 2070 1959 941 315 921 2297 2497 1919 1737
2583A737J91j38j58R95R56j7j247k52N72P61Q96o07m76m98J86P07P37M1j25q34
$$ 1737 1928 1790 1632 2627 3583 3566 2319 2067 2639 3400 4296 3689 3213 2715 2901 3608 4345 4386 4261 3427
2603C427l18L42J250O54o45j281m30J053Q23K67k15l53n10k22M47J426j6q98p84
$$ 3427 3109 3451 4701 5355 4710 3429 2999 4052 4875 5142 4927 4574 4064 3842 4289 5715 5699 4801 4017
2622D017j52Q06P71M89m30j204j98K92J071P8N6k85q02l65O10J424K60j333j103
$$ 4017 3865 4671 5442 5931 5501 4297 4099 4391 5462 5540 5596 5311 4509 4144 4754 6178 6438 5105 4002
2641D002L54L09P89L23j88o58j024n6J199P22k3p81p99p53Q18J170J85r12r44
$$ 4002 4356 4665 5454 5777 5589 4931 3907 3851 5050 5772 5749 4968 4169 3416 4234 5404 5589 4677 3733
2660C733l03N07Q38J09J33p74p78n73P58R34J44n14j309l84K04J312K14n76j019
$$ 3733 3430 3937 4775 4884 5017 4243 3465 2892 3650 4584 4728 4214 2905 2521 2725 4037 4251 3675 2656
2679B656l69L31L77N40j17m56j123o24O70J272k11q38j176j35J37P92L75l53r24
$$ 2656 2287 2618 2995 3535 3418 2962 1839 1215 1885 3157 2946 2108 932 797 934 1726 2101 1748 824
2698H24o03J71J60L99L19n09j158q21N20J514m15p98p26m36J27K57L44L3p83q88
$$ 824 221 392 552 951 1270 761 -397 -1218 -698 816 401 -397 -1123 -1559 -1432 -1175 -831 -798 -1581 -2469
2718b469m27P89M35L47j141r07j85M28P90k88n02l35k57k89J41J41L55l42j448
$$ -2469 -2896 -2107 -1672 -1325 -2466 -3373 -3558 -3130 -2340 -2628 -3130 -3465 -3722 -4011 -3870 -3729 -3374 -3716 -5164
2737e164j71J068R11n32q91m35K15J39J97L86k12o29n69k24L46R58j65l16j183
$$ -5164 -5335 -4267 -3356 -3888 -4779 -5214 -4999 -4860 -4663 -4277 -4489 -5118 -5687 -5911 -5565 -4607 -4772 -5088 -6271
2756f271J63J152L93l96p39j65P6j73J12R78M7q03p80N26R08L90k53q77j91K04
$$ -6271 -6108 -4956 -4563 -4959 -5698 -5863 -5787 -5960 -5848 -4870 -4823 -5626 -6406 -5880 -4972 -4582 -4835 -5712 -5903 -5699
2776e699P19L37m70N97l09n99L2M69J139k44p28n99N49J094Nk16k75N2p9L07M24
$$ -5699 -4980 -4643 -5113 -4516 -4825 -5424 -5392 -4923 -3784 -4028 -4756 -5355 -4806 -3712 -3707 -3923 -4198 -4146 -4225 -3918 -3494
2797c494O66j43r36j84M50R09N53Rq54j23L08J181l71J02j11j57k39J08J090Q67
$$ -3494 -2828 -2971 -3907 -4091 -3641 -2732 -2179 -2170 -3024 -3147 -2839 -1658 -2029 -1927 -2038 -2195 -2434 -2326 -1236 -369
2817c69n92j032j98J116O28J21j77j04m88L13M80O45K18m29l12k27P78P03K62
$$ -369 -961 -1993 -2191 -1075 -447 -326 -503 -607 -1095 -782 -302 343 561 132 -180 -407 371 1074 1336
2836A336l08o24n6O02J80M42kl32l36m6R91N98J08o04p83L57Q57J01L32j30l60
$$ 1336 1028 404 348 950 1130 1572 1570 1238 902 856 1847 2445 2553 1949 1166 1523 2380 2481 2813 2683 2323
2857B323l17O6P71O48rl58p34L13N13M39J82q31l41N29K07J25N09J9o95k50J47
$$ 2323 2006 2072 2843 3491 3482 3124 2390 2703 3216 3655 3837 3006 2665 3194 3401 3526 4035 4054 3359 3109 3256
2878C256P02Q07k45r25j36J74K86N21J69j73o28n5M54J37M29M2m15q23m7J306
$$ 3256 3958 4765 4520 3595 3459 3633 3919 4440 4609 4436 3808 3753 4207 4344 4773 4815 4400 3577 3530 4836
2898D836L55m79m69j46j9K55L45J46k16j05q14O45M83J11k02n42k70%J41J143
$$ 4836 5191 4712 4243 4097 4078 4333 4678 4824 4608 4503 3689 4334 4817 4928 4726 4184 3914 3914 4055 5198
2918E198n97j061K20J87k2L18J26j98o67m00M94N83J27n00q84j78M70K10K43l62
$$ 5198 4601 3540 3760 3947 3925 4243 4369 4171 3504 3104 3598 4181 4308 3808 2924 2746 3216 3426 3669 3307
2938C307o47j54K83K08j09M5l63q35j28L35O79J56r42l87l48J45M3K12Q8m51o05
$$ 3307 2660 2506 2789 2997 2888 2933 2570 1735 1607 1942 2621 2777 1835 1448 1100 1245 1288 1500 1588 1137 532
2959E32j36J13R3L13q20o49j96M70N51M3r44l74j81K81k1m1J36l14j030m5K26
$$ 532 396 509 602 915 95 -554 -750 -280 271 314 -630 -1004 -1185 -904 -925 -966 -830 -1144 -2174 -2219 -1993
2980a993O75r9p96m45k53N31J59m0k72n92j79k40N16K44J94l66j417j56R70Q24
$$ -1993 -1318 -1417 -2213 -2658 -2911 -2380 -2221 -2261 -2533 -3125 -3304 -3544 -3028 -2784 -2590 -2956 -4373 -4529 -3559 -2735
3000b735p69m54k67N1mJ31K18K13p27q37J85J011J63N4o78m53l15R17M03l55o03
$$ -2735 -3504 -3958 -4225 -4174 -4178 -4047 -3829 -3616 -4343 -5180 -4995 -3984 -3821 -3767 -4445 -4898 -5213 -4296 -3893 -4248 -4851
3021d851J9j12rJ36Q07N04j296q90K84R88P90m42k68l01M3J35O12J55l5o20l76
$$ -4851 -4832 -4944 -4953 -4817 -4010 -3506 -4802 -5692 -5408 -4420 -3630 -4072 -4340 -4641 -4598 -4463 -3851 -3696 -3731 -4351 -4727
3042d727o6O85J034J8r96p32M63N92O18l1k38K82p35j62Q38P08L05j145j08J45
$$ -4727 -4793 -4108 -3074 -3056 -4052 -4784 -4321 -3729 -3111 -3142 -3380 -3098 -3833 -3995 -3157 -2449 -2144 -3289 -3397 -3252
3062c252J039K03K2m13k74j92K17R43L50j32l39n15O4Q87R63m13p65l78M94O06
$$ -3252 -2213 -2010 -1988 -2401 -2675 -2867 -2650 -1707 -1357 -1489 -1828 -2343 -2279 -1392 -429 -842 -1607 -1985 -1491 -885
3082h85K83J16J06n11p0pQ33L56j59n58n1K34L16O05J03l71l05K92J62J38L78
$$ -885 -602 -486 -380 -891 -961 -968 -135 221 62 -496 -547 -313 3 608 711 340 35 327 489 627 1005
3103A005K89l56o63K13Q80N66o00k34L9K72J81J40R08k14o96j61K61O39L52j93
$$ 1005 1294 938 275 488 1368 1934 1334 1100 1139 1411 1592 1732 2640 2426 1730 1569 1830 2469 2821 2628
3123B628l83j6J4N71M34l99l40O0J74j69K50O70j30n11l21P19K20J04j75Lq0j25
$$ 2628 2245 2229 2243 2814 3248 2849 2509 2569 2743 2574 2824 3494 3364 2853 2532 3251 3471 3575 3400 3403 3323 3198
3145C198P26k15J07k56J02l27L34n8O98k10p43kM83L43J35n68J27j54J0J63K76
$$ 3198 3924 3709 3816 3560 3662 3335 3669 3611 4309 4099 3356 3354 3837 4180 4315 3747 3874 3720 3730 3893 4169
3166D169J8no50K28K01N57p4m41k8m09M04L03k67k61J57j37j99M27N8K0n15m39
$$ 4169 4187 4182 3532 3760 3961 4518 4444 4003 3975 3566 3970 4273 4006 3745 3902 3765 3566 3993 4051 4071 3556 3117
3188C117J94QM04l36k82j2o3L1P1%m65n2m6j76K29J54r5p63l94J94O44k42m37
$$ 3117 3311 3319 3723 3387 3105 3093 3030 3061 3132 3132 2667 2615 2569 2393 2622 2776 2681 1918 1524 1718 2362 2120 1683
3211A683k84j48O8j00K44J4k92m76k81r5L46J73j92q09r8K28L07q7m97m98J19
$$ 1683 1399 1251 1319 1219 1463 1477 1185 709 428 333 679 852 660 -149 -247 -19 288 201 -296 -794 -675
3232f75j96L8o4O48o51p10p21M51J116k68o36n41j39k28M87N9Q0r6o68m04J93
$$ -675 -871 -833 -897 -249 -900 -1610 -2331 -1880 -764 -1032 -1668 -2209 -2348 -2576 -2089 -2030 -1950 -2046 -2714 -3118 -2925
3253b925N74K48p59p82m8M97M53l45m04j49P3m11R1N99K38j83j140j99N89P46
$$ -2925 -2351 -2103 -2862 -3644 -3692 -3195 -2742 -3087 -3491 -3640 -3567 -3978 -3887 -3288 -3050 -3233 -4373 -4572 -3983 -3237
3273c237k31n90j49k39K27M24l2J51P2n36o57M04Q77M42r06n05j26R47K06l61
$$ -3237 -3468 -4058 -4207 -4446 -4219 -3795 -3827 -3676 -3604 -4140 -4797 -4393 -3516 -3074 -3980 -4485 -4611 -3664 -3458 -3819
3293c819J13j34m73j35M14O95N79q26r43J01N56Q70J89n19m95J95M06k84K57O41
$$ -3819 -3706 -3840 -4313 -4448 -4034 -3339 -2760 -3586 -4529 -4428 -3872 -3002 -2813 -3332 -3827 -3632 -3226 -3510 -3253 -2612
3313b612r9q87j50N35J115j14n03k25R7M77K10J66K3n9n86J40N03K60M22m82n29
$$ -2612 -2711 -3598 -3748 -3213 -2098 -2212 -2715 -2940 -2843 -2366 -2156 -1990 -1967 -2026 -2612 -2472 -1969 -1709 -1287 -1769 -2298
3334b298j14O33O45J94n83j87J73K86L87p0L17k08n21L94J01O84L8n90P8j48N52
$$ -2298 -2412 -1779 -1134 -940 -1523 -1710 -1537 -1251 -864 -934 -617 -825 -1346 -952 -851 -167 -129 -719 -641 -789 -237
3355b37N04pJ22m14j25K39J10O68L6l35k81L75L8O38m1n23JJ6N92l41L38K63j50
$$ -237 267 260 382 -32 -157 82 192 860 896 561 280 655 693 1331 1290 767 768 784 1376 1035 1373 1636 1486
3378A486l74L28N08Q1J17n07j15L67R7N22k9m54J84k31RP66M72n22R5n04L53N39
$$ 1486 1112 1440 1948 2029 2146 1639 1524 1891 1988 2510 2481 2027 2211 1980 1989 2755 3227 2705 2800 2296 2649 3188
3400C188p8K10k26L3p6K84K26J64m38r8l9K55J25P94l72n76q3J94M43L5j56M5
$$ 3188 3110 3320 3094 3127 3051 3335 3561 3725 3287 3189 3150 3405 3530 4324 3952 3376 3293 3487 3930 3965 3809 3854
3422C854j12J55L8j1K33j78k48k62N62l1r3J7m50J46pM24p7r9m12J20k61M8K32
$$ 3854 3742 3897 3935 3924 4157 3979 3731 3469 4031 4000 3907 3924 3474 3620 3613 4037 3960 3861 3449 3569 3308 3356 3588
3445C588O21q93o01L33K64N42l94j08l97m6J71k32M81k47j93m54j07J27M93p9
$$ 3588 4209 3316 2715 3048 3312 3854 3460 3352 2955 2909 3080 2848 3329 3082 2889 2435 2328 2455 2948 2869
3465B869m20p39J3L17L59n76j19m2k23l11L4M57J59q22n49r7P48j07Lo11j49J72
$$ 2869 2449 1710 1723 2040 2399 1823 1704 1662 1439 1128 1162 1619 1778 956 407 310 1058 951 954 343 194 366
3487C66j24l33K19l46J35q20l3Q6N73K16j014n82J25M53J49l33j50pl49m94M16
$$ 366 242 -91 128 -218 -83 -903 -936 -850 -277 -61 -1075 -1657 -1532 -1079 -930 -1263 -1413 -1420 -1769 -2263 -1847
3508a847K93J55q65j56k02K38O17n43j71m56K10l1J07k01L73j86n78n18P38N29
$$ -1847 -1554 -1399 -2264 -2420 -2622 -2384 -1767 -2310 -2481 -2937 -2727 -2758 -2651 -2852 -2479 -2665 -3243 -3761 -3023 -2494
3528b494r7q97j75M03R3K16l36L0R2m88J16l7K69P4l82p14O75M69J03k89o17L25
$$ -2494 -2591 -3488 -3663 -3260 -3167 -2951 -3287 -3257 -3165 -3653 -3537 -3574 -3305 -3231 -3613 -4327 -3652 -3183 -3080 -3369 -3986 -3661
3550c661L75j63n08O10jj73m99L79L84M71l16l38K2J48N1J78k59j16K08q9K29
$$ -3661 -3286 -3449 -3957 -3347 -3348 -3521 -4020 -3641 -3257 -2786 -3102 -3440 -3418 -3270 -3219 -3041 -3300 -3416 -3208 -3297 -3068
3571c068j00O89o6n61m30K72N85N80q25j50M73Mk17L59L52P7q5m36M97K15mk52
$$ -3068 -3168 -2479 -2545 -3106 -3536 -3264 -2679 -2099 -2924 -3074 -2601 -2597 -2814 -2455 -2103 -2026 -2111 -2547 -2050 -1835 -1839 -2091
3593b091N5k46M47K43k7j41J2o2L34M6J4M75l00l94J23N36K24j86R8k91J81L59
$$ -2091 -2036 -2282 -1835 -1592 -1619 -1760 -1748 -1810 -1476 -1430 -1416 -941 -1241 -1635 -1512 -976 -752 -938 -840 -1131 -950 -591
3615e91P4K33m40K67k47J65L51K81J1o0k76j34O50K26p1k7j06P8J27M0N21r9j90
$$ -591 -517 -284 -724 -457 -704 -539 -188 93 104 44 -232 -366 284 510 439 412 306 384 511 551 1072 973 783
3638G83j96K96M77K81j67l48J3J55K67L60J51k60l70J56J91M11L26j24Qm22M48
$$ 783 587 883 1360 1641 1474 1126 1139 1294 1561 1921 2072 1812 1442 1598 1789 2200 2526 2402 2410 1988 2436
3659B436K85J10J52k83k54j10N23K60L70n07o1k49J40N72Q2k4l61k57K28M19L61
$$ 2436 2721 2831 2983 2700 2446 2336 2859 3119 3489 2982 2921 2672 2812 3384 3466 3442 3081 2824 3052 3471 3832
3680C832k55o6j40j61L84K52j8J15o14k65N66M34m1j12k04n70L86j80L24L23n09
$$ 3832 3577 3511 3371 3210 3594 3846 3828 3943 3329 3064 3630 4064 4023 3911 3707 3137 3523 3343 3667 3990 3481
3701C481J34k93k39M96M68k75o53l15L32L66j37j99l6k09j77J23L59J98n60n01
$$ 3481 3615 3322 3083 3579 4047 3772 3119 2804 3136 3502 3365 3166 3130 2921 2744 2867 3226 3424 2864 2363
3721B363m40K97M36J84l08n75J8K26l56J17K64l36K1p74m56R90J01k53o24m75
$$ 2363 1923 2220 2656 2840 2532 1957 1975 2201 1845 1962 2226 1890 1911 1137 681 1671 1772 1519 895 420
3741D20N43L61j88p9l63k92k1m38K91L12l34j28n64j43N86J45n12p35L08L97m45
$$ 420 963 1324 1136 1057 694 402 381 -57 234 546 212 84 -480 -623 -37 108 -404 -1139 -831 -434 -879
3762h79Q7K13k52j00q06K44L38J01l21n69Q4J78J92l30k77N38m36p5l45l6P54
$$ -879 -792 -579 -831 -931 -1737 -1493 -1155 -1054 -1375 -1944 -1860 -1682 -1490 -1820 -2097 -1559 -1995 -2070 -2415 -2451 -1697
3783a697j92j016P7L80L53l59k98J2J98J06l63M2K59R2k20p68L30N72j67l56j24
$$ -1697 -1889 -2905 -2828 -2448 -2095 -2454 -2752 -2740 -2542 -2436 -2799 -2757 -2498 -2406 -2626 -3394 -3064 -2492 -2659 -3015 -3139
3804c139Q0J06L5m0j35K69J52k76k32R6N16l22l71J00J94M78k63m62L76M0m0r5
$$ -3139 -3059 -2953 -2918 -2958 -3093 -2824 -2672 -2948 -3180 -3084 -2568 -2890 -3261 -3161 -2967 -2489 -2752 -3214 -2838 -2798 -2838 -2933
3826b933J06m4K79k00k30K41K53R0o10o0K91K16O1o21L86K79j71K01j32K31L07
$$ -2933 -2827 -2871 -2592 -2792 -3022 -2781 -2528 -2438 -3048 -3108 -2817 -2601 -2540 -3161 -2775 -2496 -2667 -2466 -2598 -2367 -2060
3847b060m13j55L36L18l6j63J6j39L3L28p5K32m91K18K18N7L62k41Q5n9k51M77
$$ -2060 -2473 -2628 -2292 -1974 -2010 -2173 -2157 -2296 -2263 -1935 -2010 -1778 -2269 -2051 -1833 -1776 -1414 -1655 -1570 -1629 -1880 -1403
3869a403L06K1j68j80K44p0L89J39l4l29k3J14N66r6J07m3k01K75L93m4K98l07
$$ -1403 -1097 -1076 -1244 -1424 -1180 -1250 -861 -722 -756 -1085 -1108 -994 -428 -524 -417 -460 -661 -386 7 -37 261 -46
3891d6L7j79k70P05J70L48m90K3k7M01L96j56q6k42M65J5J85L04n1j86lK0q6O02
$$ -46 -9 -188 -458 247 417 765 275 298 271 672 1068 912 826 584 1049 1064 1249 1553 1502 1316 1313 1333 1247 1849
3915A849J91r5n68K19M86K59R8m62K40k31J36M41K53Kk62o1K14j43M94Q5k74k47
$$ 1849 2040 1945 1377 1596 2082 2341 2439 1977 2217 1986 2122 2563 2816 2818 2556 2495 2709 2566 3060 3145 2871 2624
3937B624j05M61J77J30K0k94O3j85J75L14J98J42p45J29L59R8J84o16J12k28K46
$$ 2624 2519 2980 3157 3287 3307 3013 3076 2891 3066 3380 3578 3720 2975 3104 3463 3561 3745 3129 3241 3013 3259
3958C259k19M28K82l26m81r0K71J51N31o80j39j02J91p0j89M04j84k96l09J94
$$ 3259 3040 3468 3750 3424 2943 2853 3124 3275 3806 3126 2987 2885 3076 3006 2817 3221 3037 2741 2432 2626
3978B626P81l66m11n06J91K59K44n17J28k53j75o5k83L38M5j86j22m57L54O50
$$ 2626 3407 3041 2630 2124 2315 2574 2818 2301 2429 2176 2001 1936 1653 1991 2036 1850 1728 1271 1625 2275
3998B275k38j016j4J99j17j62J86M9k3n29k27K94K30j23n11m48Q7N39j66n49j51
$$ 2275 2037 1021 1007 1206 1089 927 1113 1162 1139 610 383 677 907 784 273 -175 -88 451 285 -264 -415
4019d15K83j21p8m00L42L57p78l13j6M61l2k33k12j10K41J14j16l53K73m39l6
$$ -415 -132 -253 -331 -731 -389 -32 -810 -1123 -1139 -678 -710 -943 -1155 -1265 -1024 -910 -1026 -1379 -1106 -1545 -1581
4040a581j08L33J14l12l39l8k60N26J12l67j9j22P5m62L13L91k62n08j37J20K30
$$ -1581 -1689 -1356 -1242 -1554 -1893 -1931 -2191 -1665 -1553 -1920 -1939 -2061 -1986 -2448 -2135 -1744 -2006 -2514 -2651 -2531 -2301
4061b301K77l17l39J65J18j22l6j91M29k19k6N2J18K81j24m37m79N34L87k73l25
$$ -2301 -2024 -2341 -2680 -2515 -2397 -2519 -2555 -2746 -2317 -2536 -2562 -2510 -2392 -2111 -2235 -2672 -3151 -2617 -2230 -2503 -2828
4082b828l6Q7L25k08j8M05l17l52K4M1M88q2l5l26P3M23O2l68m4L13k24J3N9L25
$$ -2828 -2864 -2777 -2452 -2660 -2678 -2273 -2590 -2942 -2918 -2877 -2389 -2471 -2506 -2832 -2759 -2336 -2274 -2642 -2686 -2373 -2597 -2584 -2525 -2200
4106b200j22pm96J88K80K25q2K4j47n4J25L9L48N5l68Nj4M48L27k11j52k27K98
$$ -2200 -2322 -2329 -2825 -2637 -2357 -2132 -2214 -2190 -2337 -2391 -2266 -2227 -1879 -1824 -2192 -2187 -2201 -1753 -1426 -1637 -1789 -2016 -1718
4129a718L26j47ML11l04j01L66q3K17L05k2k74j90N87J21q9K35n55K00L11L00
$$ -1718 -1392 -1539 -1535 -1224 -1528 -1629 -1263 -1346 -1129 -824 -846 -1120 -1310 -723 -602 -691 -456 -1011 -811 -500 -200
4150b00j20o0L17l91K39L13J6L44l25kn2L91m6K04L8q2J35J14J77J55K36r9r0
$$ -200 -320 -380 -63 -454 -215 98 114 458 133 131 79 470 424 628 666 584 719 833 1010 1165 1401 1302 1212
4173A212j54M95N6M4l62O2O40J4l84L36K30k17K53q9K85r3K1r1l4J03p1N98j83
$$ 1212 1058 1553 1609 1653 1291 1353 1993 2007 1623 1959 2189 1972 2225 2136 2421 2328 2349 2258 2224 2327 2256 2854 2671
4196B671j03l61O73k75P0K69r6Q9l52J87L69q9j41k12J68J87%O1K78l63P8j07
$$ 2671 2568 2207 2880 2605 2675 2944 2848 2937 2585 2772 3141 3052 2911 2699 2867 3054 3054 3115 3393 3030 3108 3001
4218C001PL95m78j9N1n2mK73l36R1m47L65j00P8J11J0q4k07l27J42M68m71j53
$$ 3001 3008 3403 2925 2906 2957 2905 2901 3174 2838 2929 2482 2847 2747 2825 2936 2946 2862 2655 2328 2470 2938 2467 2314
4241B314k96K86M5k65j46L51n60J92j32j21K11J75o22k14M9M65r0%o57K89J64
$$ 2314 2018 2304 2349 2084 1938 2289 1729 1921 1789 1668 1879 2054 1432 1218 1267 1732 1642 1642 985 1274 1438
4262A438k51j62m13M86l52n60M28M33j86k25n24J21j81L82r6l35K73j52l62m3
$$ 1438 1187 1025 612 1098 746 186 614 1047 861 636 112 233 52 434 338 3 276 124 -238 -281
4282b81N3l8K29m67m99M6Q00j87l56k34P6q9L1q3M4r0K8m11QM27J84l89m82k2
$$ -281 -228 -266 -37 -504 -1003 -957 -157 -344 -700 -934 -858 -947 -916 -999 -955 -1045 -1017 -1428 -1420 -993 -809 -1198 -1680 -1702
4306a702K84J34n8k94j54J69l54J23j08K73o4m48n0L29K13O1o70j11P3J94Q0r7
$$ -1702 -1418 -1284 -1342 -1636 -1790 -1621 -1975 -1852 -1960 -1687 -1751 -2199 -2249 -1920 -1707 -1646 -2316 -2427 -2354 -2160 -2080 -2177
4328b177J01j99p8o4j07N82J43l38k45m07K27M10k66R8N3k53l98L95p4M12l6l28
$$ -2177 -2076 -2275 -2353 -2417 -2524 -1942 -1799 -2137 -2382 -2789 -2562 -2152 -2418 -2320 -2267 -2520 -2918 -2523 -2597 -2185 -2221 -2549
4350b549k25L81L9Q5j54l05M7L8R3K16k8R3k03j73J42M52J1q5n00K7J49J37L70
$$ -2549 -2774 -2393 -2354 -2269 -2423 -2728 -2681 -2643 -2550 -2334 -2362 -2269 -2472 -2645 -2503 -2051 -2040 -2125 -2625 -2598 -2449 -2312 -1942
4373a942j68j42r0j19L61Q8L48O3o11j12M4L47K85K4j11j40J48O7J68J90J06k59
$$ -1942 -2110 -2252 -2342 -2461 -2100 -2012 -1664 -1601 -2212 -2324 -2280 -1933 -1648 -1624 -1735 -1875 -1727 -1660 -1492 -1302 -1196 -1455
4395a455o0qL04N3J78k26k12J41K72L09j31J13k14K50L04N2Q4j35M6l94K48L17
$$ -1455 -1515 -1523 -1219 -1166 -988 -1214 -1426 -1285 -1013 -704 -835 -722 -936 -686 -382 -330 -246 -381 -335 -729 -481 -164
4417a64L08k50J5K82L68l02j9L69j38m1J32NL47M40l05p2l31K04N22J0J74k06
$$ -164 144 -106 -91 191 559 257 238 607 469 428 560 565 912 1352 1047 975 644 848 1370 1380 1554 1348
4439A348J64O2p1J46K40J0j07m4j44N98j56J00j6JQ9qJ08nnR7k66M78q7J39k27
$$ 1348 1512 1574 1503 1649 1889 1899 1792 1748 1604 2202 2046 2146 2130 2131 2220 2212 2320 2315 2310 2407 2141 2619 2532 2671 2444
4464B444lj63M23k60M5n5J88J91k56N0k37N76m74lj25K94J43j19n0r8J46L5J08
$$ 2444 2441 2278 2701 2441 2486 2431 2619 2810 2554 2604 2367 2943 2469 2466 2341 2635 2778 2659 2609 2511 2657 2692 2800
4487B800n74J28L05j98n5q5K93Nm99m2L11L9j1n65K63J56L2k39k26j85N40m16
$$ 2800 2226 2354 2659 2461 2406 2321 2614 2619 2120 2078 2389 2428 2417 1852 2115 2271 2303 2064 1838 1653 2193 1777
4509A777j51J65L24k40n42Q4J38m7K23m55k14K73j57j0l3K24P2j84n08l40P29
$$ 1777 1626 1791 2115 1875 1333 1417 1555 1508 1731 1276 1062 1335 1178 1168 1135 1359 1431 1247 739 399 1128
4530A128Q0k10p49M8J19K42l06j35R4J24l41J0J49J21j48o38k8M81k44K08l87
$$ 1128 1208 998 249 297 416 658 352 217 311 435 94 104 253 374 226 -412 -440 41 -203 5 -382
4551c82q1J10j30q6J9K41k21r8p07M86L79J5k93n68L14P8rk72k93L00K71n53k88
$$ -382 -463 -353 -483 -569 -550 -309 -530 -628 -1335 -849 -470 -455 -748 -1316 -1002 -924 -933 -1205 -1498 -1198 -927 -1480 -1768
4574a768K51L99q9n12J10J16l4J2q7j17K93m86Q1j74L28L3k13m77L80O1L74j49
$$ -1768 -1517 -1118 -1207 -1719 -1609 -1493 -1527 -1515 -1602 -1719 -1426 -1912 -1831 -2005 -1677 -1644 -1857 -2334 -1954 -1893 -1519 -1668
4596a668n44J2P0J34m5kj1Pk55j87L07J85Nn32L17J31m5N2m0j53n2K94m53o7K49
$$ -1668 -2212 -2200 -2130 -1996 -2041 -2043 -2054 -2047 -2302 -2489 -2182 -1997 -1992 -2524 -2207 -2076 -2121 -2069 -2109 -2262 -2314 -2020 -2473 -2540 -2291
4621b291J08k93j96M48J91n6k39n2j61M9K42J46K00j23l1p3O8L2K83K4k64K48
$$ -2291 -2183 -2476 -2672 -2224 -2033 -2089 -2328 -2380 -2541 -2492 -2250 -2104 -1904 -2027 -2058 -2131 -2063 -2031 -1748 -1724 -1988 -1740
4643a740k46K45K00k8m13q5L37K8L89k47M59j43k93j69N90M7J45k32K17K4R8K7
$$ -1740 -1986 -1741 -1541 -1569 -1982 -2067 -1730 -1702 -1313 -1560 -1101 -1244 -1537 -1706 -1116 -1069 -924 -1156 -939 -915 -817 -790
4665g90L6j77n9K55J71r1L94oj28J9%K37K48q4j76K54J38J5j35L90r2Q4p1O6K37
$$ -790 -754 -931 -990 -735 -564 -655 -261 -267 -395 -376 -376 -139 109 25 -151 103 241 256 121 511 419 503 432 498 735
4690G35J00J78m02K60J44K89j26q5K24mM0j15J33L16q7J48M7l58M35K7l88M23
$$ 735 835 1013 611 871 1015 1304 1178 1093 1317 1313 1353 1238 1371 1687 1600 1748 1795 1437 1872 1899 1511 1934
4712A934j29MJ33J68k7M1j09Qk7M33n06M09l27k6K20K42k20N2q5K51j05p7L05
$$ 1934 1805 1809 1942 2110 2083 2124 2015 2023 1996 2429 1923 2332 2005 1979 2199 2441 2221 2273 2188 2439 2334 2257 2562
4735B562K62l17o58M15j15M97j93k41k0m1K64qJ90k41Nj66n5j37N42j21l26r2
$$ 2562 2824 2507 1849 2264 2149 2646 2453 2212 2192 2151 2415 2407 2597 2356 2361 2195 2140 2003 2545 2424 2098 2006
$$ [...]
8191H16
##END NTUPLES=NMR FID
##END=
