##TITLE=1H_Lac-PbMe-C2
 CDCl3, 8 sc, 
 17.9.2019
##JCAMPDX= 6.0         $$ Bruker NMR JCAMP-DX V2.0
##DATA TYPE= NMR FID
##DATA CLASS= NTUPLES
##ORIGIN= UXNMR, Bruker Analytische Messtechnik GmbH
##OWNER= root
$$ XWIN-NMR		Version 3.5
$$ Tue Sep 17 16:17:17 2019 Russian Standard Time (UT+4h)  she@DPX200
##.OBSERVE FREQUENCY= 200.1315
##.OBSERVE NUCLEUS= ^1H
##.DELAY= (6, 6)
##.ACQUISITION MODE= SIMULTANEOUS
##.ACQUISITION SCHEME= undefined
##.AVERAGES= 8
##.DIGITISER RES= 18
##SPECTROMETER/DATA SYSTEM= spect
##.PULSE SEQUENCE= zg30
##.SOLVENT NAME= CDCl3
##.SHIFT REFERENCE= (INTERNAL, CDCl3, 0, 15.7039)
##AUDIT TRAIL= $$ (NUMBER, WHEN, WHO, WHERE, WHAT)
$$ ##TITLE= Audit trail, XWIN-NMR		Version 3.5
$$ ##JCAMPDX= 5.01
$$ ##ORIGIN= Bruker BioSpin GmbH
$$ ##OWNER= she
$$ F:/spectra/data/she/nmr/H-F/1/audita.txt
$$ ##AUDIT TRAIL=  $$ (NUMBER, WHEN, WHO, WHERE, WHAT)
(   1,<2019-09-17 16:16:25.98 +0400>,<she>,<DPX200>,
      <created by zg, POWCHK disabled, PULCHK disabled
       configuration hash MD5:
       00 E9 B6 7A A2 85 ED C7 34 08 36 98 17 FE 4E 26
       data hash MD5: 16K
       03 5A 5F 9E E7 FF 3C 94 4C 93 2A 99 BE D6 1C C6>)
$$ ##END=
$$ 
$$ hash MD5
$$ 44 67 A9 79 E5 40 80 68 A7 79 52 4F 8E 3F 8E FE
##$RELAX= 
##$RELAX= 
##$RELAX= 
##$RELAX= 
##$RELAX= 
##$RELAX= 
$$ Bruker specific parameters
$$ --------------------------
##$DU= <F:/spectra>
##$EXPNO= 1
##$NAME= <H-F>
##$PROCNO= 1
##$TYPE= <nmr>
##$USER= <she>
##$AMP= (0..31)
100 100 100 100 100 100 100 100 100 100 100 100 100 100 100 100 100 100 
100 100 100 100 100 100 100 100 100 100 100 100 100 100 
##$AQSEQ= 0
##$AQ_mod= 1
##$AUNM= <au_zg>
##$AUTOPOS= <>
##$BF1= 200.13
##$BF2= 200.13
##$BF3= 200.13
##$BF4= 200.13
##$BF5= 200.13
##$BF6= 200.13
##$BF7= 200.13
##$BF8= 200.13
##$BYTORDA= 1
##$CFDGTYP= 0
##$CFRGTYP= 5
##$CHEMSTR= <none>
##$CNST= (0..31)
1 1 145 1 1 1 1 1 1 1 1 1 1 1 1 1 1 1 1 1 1 1 1 1 1 1 1 1 1 1 1 1 
##$CPDPRG= <>
##$CPDPRG1= <>
##$CPDPRG2= <>
##$CPDPRG3= <>
##$CPDPRG4= <mlev>
##$CPDPRG5= <mlev>
##$CPDPRG6= <mlev>
##$CPDPRG7= <mlev>
##$CPDPRG8= <mlev>
##$CPDPRGB= <>
##$CPDPRGT= <>
##$D= (0..31)
0 1.2 0 0 0 0 0 0 0 0 0 0.03 0 0 0 0 0 0 0 0 0 0 0 0 0 0 0 0 0 0 0 0 
##$DATE= 1568722585
##$DBL= (0..7)
120 120 120 120 120 120 120 120 
##$DBP= (0..7)
150 150 150 150 150 150 150 150 
##$DBP07= 0
##$DBPNAM0= <>
##$DBPNAM1= <>
##$DBPNAM2= <>
##$DBPNAM3= <>
##$DBPNAM4= <>
##$DBPNAM5= <>
##$DBPNAM6= <>
##$DBPNAM7= <>
##$DBPOAL= (0..7)
0.5 0.5 0.5 0.5 0.5 0.5 0.5 0.5 
##$DBPOFFS= (0..7)
0 0 0 0 0 0 0 0 
##$DE= 6
##$DECBNUC= <off>
##$DECIM= 24
##$DECNUC= <off>
##$DECSTAT= 4
##$DIGMOD= 1
##$DIGTYP= 9
##$DL= (0..7)
0 120 120 120 120 120 120 120 
##$DP= (0..7)
150 150 150 150 150 150 150 150 
##$DP07= 0
##$DPNAME0= <>
##$DPNAME1= <>
##$DPNAME2= <>
##$DPNAME3= <>
##$DPNAME4= <>
##$DPNAME5= <>
##$DPNAME6= <>
##$DPNAME7= <>
##$DPOAL= (0..7)
0.5 0.5 0.5 0.5 0.5 0.5 0.5 0.5 
##$DPOFFS= (0..7)
0 0 0 0 0 0 0 0 
##$DQDMODE= 0
##$DR= 18
##$DS= 0
##$DSLIST= <SSSSSSSSSSSSSSS>
##$DSPFIRM= 0
$$ [...]
##$SUBNAM2= <"">
##$SUBNAM3= <"">
##$SUBNAM4= <"">
##$SUBNAM5= <"">
##$SUBNAM6= <"">
##$SUBNAM7= <"">
##$SUBNAM8= <"">
##$SUBNAM9= <"">
##$SW= 24.0689530833862
##$SWIBOX= (0..15)
0 0 2 0 0 0 0 0 0 0 0 0 0 0 0 0 
##$SW_h= 4816.95568400771
##$TD= 16384
##$TD0= 1
##$TE= 0
##$TE2= 300
##$TE3= 300
##$TEG= 300
##$TL= (0..7)
0 120 120 120 120 120 120 120 
##$TP= (0..7)
150 150 150 150 150 150 150 150 
##$TP07= 0
##$TPNAME0= <>
##$TPNAME1= <>
##$TPNAME2= <>
##$TPNAME3= <>
##$TPNAME4= <>
##$TPNAME5= <>
##$TPNAME6= <>
##$TPNAME7= <>
##$TPOAL= (0..7)
0.5 0.5 0.5 0.5 0.5 0.5 0.5 0.5 
##$TPOFFS= (0..7)
0 0 0 0 0 0 0 0 
##$TUNHIN= 0
##$TUNHOUT= 0
##$TUNXOUT= 0
##$USERA1= <user>
##$USERA2= <user>
##$USERA3= <user>
##$USERA4= <user>
##$USERA5= <user>
##$V9= 5
##$VALIST= <valist>
##$VCLIST= <CCCCCCCCCCCCCCC>
##$VD= 0
##$VDLIST= <DDDDDDDDDDDDDDD>
##$VPLIST= <PPPPPPPPPPPPPPP>
##$VTLIST= <TTTTTTTTTTTTTTT>
##$WBST= 1024
##$WBSW= 4
##$XGAIN= (0..3)
0 0 0 0 
##$XL= 0
##$YL= 0
##$YMAX_a= 169076
##$YMIN_a= -264081
##$ZGOPTNS= <>
##$ZL1= 120
##$ZL2= 120
##$ZL3= 120
##$ZL4= 120
##$ABSF1= 10
##$ABSF2= 0
##$ABSG= 5
##$ABSL= 3
##$ALPHA= 0
##$AQORDER= 0
##$ASSFAC= 0
##$ASSFACI= 0
##$ASSFACX= 0
##$ASSWID= 0
##$AUNMP= <proc_1d>
##$AZFE= 0.1
##$AZFW= 0.1
##$BCFW= 1
##$BC_mod= 2
##$BYTORDP= 1
##$COROFFS= 0
##$CY= 11.3945322036743
##$DATMOD= 1
##$DC= 2
##$DFILT= <>
##$DTYPP= 0
##$F1P= 20.1720416913024
##$F2P= 0.152960286110954
##$FCOR= 0.5
##$FTSIZE= 0
##$FT_mod= 4
##$GAMMA= 1
##$GB= 0.15
##$INTBC= 1
##$INTSCL= 1
##$ISEN= 128
##$LB= 0.24
##$LEV0= 0
##$LPBIN= 0
##$MAXI= 10000
##$MC2= 0
##$MEAN= 0
##$ME_mod= 0
##$MI= 1.114404
##$NCOEF= 0
##$NC_proc= 0
##$NLEV= 6
##$NOISF1= 3.799351
##$NOISF2= 2.8
##$NSP= 1
##$NTH_PI= 0
##$NZP= 0
##$OFFSET= 15.70392
##$PC= 1
##$PHC0= -9580.498
##$PHC1= 24.20096
##$PH_mod= 1
##$PKNL= yes
##$PPARMOD= 0
##$PSCAL= 0
##$PSIGN= 0
##$REVERSE= no
##$SF= 200.130013532006
##$SI= 16384
##$SIGF1= 3
##$SIGF2= 2
##$SINO= 400
##$SIOLD= 16384
##$SREGLST= <1H.CDCl3>
##$SSB= 0
##$STSI= 0
##$STSR= 0
##$SW_p= 3612.71676300578
##$SYMM= 0
##$S_DEV= 0
##$TDeff= 0
##$TDoff= 0
##$TI= <>
##$TILT= no
##$TM1= 0
##$TM2= 0
##$TOPLEV= 0
##$USERP1= <user>
##$USERP2= <user>
##$USERP3= <user>
##$USERP4= <user>
##$USERP5= <user>
##$WDW= 1
##$XDIM= 8192
##$YMAX_p= 0
##$YMIN_p= 0
$$ End of Bruker specific parameters
$$ ---------------------------------
##NTUPLES= NMR FID
##VAR_NAME=  TIME,          FID/REAL,        FID/IMAG
##SYMBOL=    X,             R,               I
##VAR_TYPE=  INDEPENDENT,   DEPENDENT,       DEPENDENT
##VAR_FORM=  AFFN,          ASDF,            ASDF
##VAR_DIM=   8192,          8192,            8192
##UNITS=     SECONDS,       ARBITRARY UNITS, ARBITRARY UNITS
##FACTOR=    0.0002076,     1,               1
##FIRST=     0,             0,               0
##LAST=      1.7004516,     0,               0
##MIN=       0,             -264081,         0
##MAX=       1.7004516,     169076,          0
$$ Real data points
##PAGE= N=1
##DATA TABLE= (X++(R..R)), XYDATA
0 0 0 0 0 0 0 0 0 -8 8 -8 16 -16 24 -24 32 -40 48 -56 64 -73 88 -104 119 -137 159 -182 207 -234 265 -303
30 -303 340 -382 428 -479 535 -596 663 -737 817 -906 1003 -1111 1230 -1361 1509 -1673 1859
47 1859 -2069 2310 -2590 2921 -3317 3801 -4407 5195 -6265 7813 -10255 14707 -25450 106853
61 106853 14963 -228544 -20678 138198 43376 -80479 28841 82511 -30214 -96876 20041
72 20041 77068 5135 -39005 4943 -11721 -52290 4230 93871 41718 -70597 -68775 22512
84 22512 43827 5378 4565 29642 330 -42286 -23461 30883 34347 -4445 -22670 -12735 -13829
97 -13829 -16018 10847 32977 -5334 -63110 -54171 8347 31310 380 -17370 -10624 -21708 -37610
110 -37610 -11308 25618 16030 -17082 -20614 -10882 -13058 659 29412 14853 -39056 -46863 5227
123 5227 31262 4016 -13195 -3630 -14404 -36436 -18318 18962 15266 -14436 -17853 -7940 -15924
136 -15924 -17290 11198 23578 -11408 -40330 -12274 31273 25763 -10462 -18960 2891 8203 -9324
149 -9324 -7251 21988 30968 -2483 -28654 -9379 21710 18059 -4205 -8285 1932 5594 7131
162 7131 10581 1865 -10502 -1720 16640 9862 -9504 -1057 23868 19662 -7825 -12539 8453 18265
176 18265 9453 4819 8998 7445 3909 8239 12966 6215 -2733 2638 16194 16020 2260 -3231 8600
191 8600 15840 2321 -11255 -303 17805 14385 -2961 -7217 4228 11039 6220 -5227 -12983
204 -12983 -2604 20430 21593 -8597 -24229 2026 23297 2090 -19354 -382 18751 1854
216 1854 -14533 194 12746 -239 -11052 -7011 -7239 -5832 11478 15793 -15356 -33952 -5878
229 -5878 16916 -6222 -25487 -2077 13440 -11882 -27733 -4795 11800 -3526 -17160 -11745
241 -11745 -8147 -5207 8817 10560 -12274 -23964 -5518 4819 -8417 -7827 12411 7462 -22373
254 -22373 -25031 1825 10735 -4558 -11824 -8006 -10724 -10124 3989 9036 -5286 -16628 -12573 -7081
268 -7081 -1380 11424 15309 -4065 -19871 -6720 10795 6366 -1312 7232 11247 -4069 -12496 4235
282 4235 21635 13281 -9236 -17428 -3141 15527 18242 4275 -7624 -4353 2242 161 -1837 7161
296 7161 15660 10855 -3521 -9717 1114 19449 22660 2556 -13555 -523 23478 21217 2771
309 2771 627 9977 5144 -5701 2691 19043 17147 2977 -3953 -4257 -2193 7669 15825 3836
323 3836 -11125 -2707 13281 7039 -5701 3126 11695 -3969 -14409 5032 23545 9926 -9232
336 -9232 -4521 5191 436 -2914 5572 8060 -995 -4692 -1828 -3159 -3219 3155 928 -14023 -14913 5192
352 5192 12375 -7501 -19928 -6124 4560 -6807 -13841 -653 7558 -5320 -16319 -6493 5296
365 5296 658 -10385 -10993 -3766 1497 1750 -3414 -10260 -10127 -2587 -742 -8229 -10055 625 3337
380 3337 -11005 -18746 -3792 9387 -1644 -17730 -12450 2221 3715 -3719 -4699 -2525 -4038 -5391
394 -5391 -3646 -2527 1254 8582 6057 -10493 -15782 2550 17657 7218 -9010 -6908 1581 1833
408 1833 3863 10637 6036 -7929 -11003 249 9266 10745 9792 939 -11967 -8978 10259 18183
422 18183 5715 -1734 3055 986 -5208 7277 24228 14404 -10597 -12213 8114 17841 11679 7712
436 7712 5198 -2587 -5695 4187 13135 12425 8128 2742 -7526 -10690 6225 23823 14330 -10205
450 -10205 -15662 -162 10780 9060 6938 6367 -1609 -12104 -8605 8326 20320 12833 -5187 -15238
464 -15238 -8804 6181 15622 10491 -4045 -13561 -8784 1581 5735 4540 3632 -2708 -16629 -20866
478 -20866 -1040 19183 11056 -13084 -20818 -10389 -2872 30 6244 5831 -9321 -20585 -11194 4313
492 4313 9309 5883 -3908 -18998 -22408 -847 19624 9925 -13588 -17387 -8373 -7341 -5695 7400
506 7400 10537 -8751 -24571 -13199 4152 6245 852 -3571 -10623 -14733 -4470 7549 6825 -818
520 -818 -2732 -6723 -13770 -5890 15885 19539 -3289 -18678 -7232 7040 5617 1711 5939 3682
534 3682 -7838 -10866 927 12695 11467 883 -9366 -11072 -71 14380 15969 2624 -7735
547 -7735 -3814 3170 4817 6956 12412 10335 -3572 -9860 3607 18815 14360 -1250 -5456 3516
561 3516 7877 4997 5403 8834 6392 -1073 -3730 1106 7385 11438 9227 -416 -8001 -964 11032
576 11032 9391 -813 22 6641 2421 -5670 1036 13214 8854 -6805 -8928 3245 9612 4213
590 4213 -1101 -1175 51 205 -1046 -2412 -284 5066 3519 -5919 -10592 -1740 6876 1649 -8685 -7247
606 -7247 283 946 -4849 -6310 -941 1389 -3961 -10145 -7538 1360 3911 -3907 -10635 -5757 1961
621 1961 -1542 -9200 -6920 2420 2074 -7752 -11412 -3782 2578 -501 -6273 -7564 -4890 -2459 -2418 -4008
637 -4008 -4368 -1843 -1114 -5647 -9737 -4468 4943 4433 -6576 -10676 -1804 4024 -684 -3310 2195 3020
653 3020 -5180 -7830 2779 10061 3580 -4636 -4129 -1075 996 5024 7345 806 -5480 -1307 4085
668 4085 751 -712 7458 9155 -4401 -10525 4323 15993 6874 -4205 550 6033 1571 946
682 946 10393 12874 2379 -4336 578 5679 7786 10138 7830 -2675 -7058 3280 12361 7039 -1196
697 -1196 1252 4014 -1870 -4233 6547 14495 5001 -8538 -7407 4379 10784 6796 1707 -604
711 -604 -1593 -982 1640 5625 6449 2375 -3607 -6103 -1984 5173 7499 495 -8103 -8248 -1447 2301
727 2301 223 -962 -35 -3346 -9891 -8381 2340 7975 282 -9807 -9499 -2372 2060 1452 -1081
742 -1081 -3809 -6011 -5942 -4431 -168 3226 1132 -8185 -13679 -6574 4223 4282 -4542 -9031 -6502 -3748
758 -3748 -3427 -2063 -408 -1775 -5347 -7372 -5444 423 5059 1262 -8197 -9389 119 6114 -301
773 -301 -5544 133 3212 -3561 -7605 403 7912 2521 -5456 -4781 495 2450 2563 1428 -1993 -2922
789 -2922 1686 4049 33 -662 5482 5926 -2898 -5667 5771 12410 3471 -5770 297 8420 4995
804 4995 -592 2150 5782 3416 497 2442 4440 4511 4495 2735 -1321 -48 7514 9526 44 -4001
820 -4001 4202 9532 2302 -3007 3584 8736 1847 -4503 2489 9826 5755 -2839 -3113 2240 5597
835 5597 5229 2367 -1783 -2230 1830 4166 1581 -250 1881 1199 -4407 -4215 4763 8590 -561 -9846
851 -9846 -6633 3365 5866 776 -4261 -4063 -2054 -1963 -1805 -165 1248 -864 -6728 -8246 -1766 5075
867 5075 2291 -5790 -8520 -3786 -242 -1410 -2368 -821 -1397 -5279 -8441 -5076 1789 3787 -1924 -9113
883 -9113 -9644 -2950 2844 1739 -3268 -6239 -5108 -4205 -3368 -483 3203 1415 -7355 -11226 -3921 6872
899 6872 6538 -2853 -7658 -3927 -615 -166 1907 4003 721 -6122 -6476 31 5939 5887 1611 -4929
915 -4929 -7190 -579 6958 6018 -520 -1119 1679 -963 -3539 3664 12106 6279 -6262 -6770 3458
930 3458 9396 7103 2449 -267 -1167 830 4817 6200 4769 4158 2345 -3489 -3055 7174 13425 4476
946 4476 -5687 -2027 5885 5023 1285 4453 6235 -21 -4903 -71 6980 7060 2988 20 -2904 -1655
962 -1655 4038 7181 2767 -1961 -341 590 -2090 -1134 5841 7029 -2742 -8974 -3084 4997 4310 -611
978 -611 -2916 -3077 -2930 -1187 999 601 -1201 -1326 -3287 -6058 -3330 3096 3684 -4485 -8784 -3494 1539
995 1539 -1166 -4361 -1701 393 -4048 -7308 -3702 917 896 -2395 -5342 -6183 -3867 566 966 -3506
1011 -3506 -5131 -2175 -1728 -5064 -3729 2491 3135 -5393 -9509 -2549 4239 1135 -4577 -3961 -110 -128
1027 -128 -2678 -2003 918 2723 -276 -4272 -4337 875 4970 2382 -2761 -2936 1070 2968 230 -558
1043 -558 2504 4162 169 -3667 -1054 5478 6500 482 -3034 1017 4818 1930 63 3520 6058
1058 6058 1744 -2834 187 5932 6757 3435 180 -798 1548 5143 5281 1713 896 3837 3218 -1260
1074 -1260 -8 7528 8567 28 -4379 794 6086 4557 1339 1633 1418 -101 291 1609 3083 3949
1090 3949 2702 -2319 -4930 971 7410 4181 -3401 -3022 1396 956 -1747 421 3517 713 -4014
1105 -4014 -4314 -1198 2142 3273 707 -5538 -6927 -251 3367 -1183 -4292 -569 -204 -6238 -6911 1168
1121 1168 4896 -1770 -8356 -5494 -1374 -578 -621 -1022 -3630 -5575 -2914 -1598 -2491 -1401 1506 -1522
1137 -1522 -8291 -7621 1840 5281 -1845 -7257 -3785 -465 -1943 -3542 422 1947 -2941 -6325 -3789
1152 -3789 1006 2876 1069 -2502 -4643 -3418 1814 3442 103 -1914 427 1355 -2606 -2863 3229
1167 3229 7091 1047 -6400 -2923 5028 5604 647 -1225 946 754 -639 1041 4200 4628 1305 -1285
1183 -1285 -1355 1595 5224 6051 1215 -1877 795 4986 3759 842 2489 4993 2441 -1808 543 5969
1199 5969 6869 1551 -2481 90 3997 4097 1491 1170 2833 2371 -7 -1193 1487 4538 3729 -25
1215 -25 -2985 -1004 3507 4889 955 -2856 -305 2256 575 -1543 1536 4372 169 -5304 -3257
1230 -3257 2762 3425 -1200 -3482 -1606 -262 -712 -1483 -1504 -955 -882 -2330 -3940 -2051 1507 212 -4478
1247 -4478 -5374 -911 841 -2037 -3548 -1614 -657 -2355 -3754 -3462 -2322 -94 -126 -3724 -5717 -1273
1263 -1273 2362 -2109 -6819 -2527 2409 -1530 -5839 -2254 2151 -856 -4243 -2206 -70 -2057 -1476
1278 -1476 1098 -352 -3125 -678 1738 -2330 -3740 2206 5204 -1719 -5932 726 5769 836 -4149
1293 -4149 271 4491 409 -2370 1296 4144 1950 -93 -244 514 1548 3298 3058 -377 198 3366
1309 3366 3405 -804 -675 4613 6274 585 -2936 1736 6517 4654 -148 -420 3027 3623 1255 978
1325 978 4318 4975 860 -2392 438 4718 5220 1838 -736 -246 1583 2897 1978 794 911 1373 46
1342 46 -1516 869 4724 3668 -2355 -4318 197 4265 1822 -1449 -603 1355 -117 -2074 -1528 1562
1358 1562 2449 -413 -4203 -3798 205 2766 -274 -4551 -4125 -1558 -1001 -2000 -1139 278 -979 -4002
1374 -4002 -5640 -2085 2015 1968 -2374 -5784 -3449 442 337 -2245 -2574 -854 -1494 -4610 -4284 717
1390 717 2669 -1900 -6572 -5791 -1037 1306 -593 -2813 -2831 -2285 -2145 -2052 -649 1018 1012 -2194 -4655 -2697
1408 -2697 3058 4819 -487 -4862 -2157 2062 1306 -1086 1114 3814 57 -5177 -2462 3959 4587
1423 4587 193 -2204 -563 313 1361 3127 2481 -295 -442 1790 1400 527 4019 6535 1348 -4543
1439 -4543 -438 6960 6004 180 505 3573 1670 -1457 1649 4964 3327 -130 -866 358 1530 3895
1455 3895 4594 296 -3227 -234 4469 2908 251 1805 3680 -360 -2969 613 5273 3884 -829
1470 -829 -1892 120 1611 1801 693 -396 -269 -181 -922 -1563 1091 2854 200 -4323 -4249 443 2322
1487 2322 -181 -2423 -1855 -571 -1205 -2524 -1892 416 930 -2152 -5083 -2972 1721 1625 -2968 -4953
1503 -4953 -2158 -86 -1466 -2699 -981 -131 -1504 -4307 -4374 -1123 1230 -184 -3827 -3762 -484 21
1519 21 -2460 -3063 -659 54 -2074 -3643 -1460 927 696 -1586 -3298 -2859 2 1982 -68 -2547
1535 -2547 -742 1708 -841 -3771 -396 4208 2299 -2895 -2374 2181 2840 795 -365 -96 433 1012
1551 1012 1285 768 636 2579 2155 -1354 -2167 2289 5167 1762 -1407 1000 4064 1774 -800 1591
1567 1591 4626 3148 -9 249 2389 3782 3308 1541 205 474 2698 2993 1226 792 2927 2701
1583 2701 -1222 -1975 2160 4922 2222 -2163 -1288 2386 2786 141 -259 1999 1734 -581 -1197 1268
1599 1268 3604 2386 -849 -2718 -1319 1775 2914 327 -2135 -1116 451 -1265 -2833 85 2455
1614 2455 -754 -5474 -3692 1095 1619 -1893 -3241 -1826 -1662 -1735 -718 -107 -318 -1006 -2240 -4017 -2581
1631 -2581 1379 2280 -2865 -5557 -2151 593 -955 -2916 -1517 -282 -2513 -4196 -2622 371 678
1646 678 -1775 -3784 -4567 -1965 1078 1158 -1712 -2815 -1044 -419 -1593 -590 2265 2262 -2201 -4155 -442
1663 -442 3455 2810 -977 -2679 -1103 1031 1004 258 813 1211 196 -2280 -1636 1646 3735 1849 -1289
1680 -1289 -1886 1489 3769 2532 282 347 2623 1902 -404 1309 4913 4558 -708 -2249 1159 4049
1696 4049 3464 989 946 1115 1628 1538 1110 1238 2801 2501 -230 -1842 1883 5490 2081 -1989 -503
1713 -503 2981 2551 -143 729 3176 2079 -923 -1089 604 1849 2144 969 -1433 -1610 1278 2386
1729 2386 -940 -2102 817 1784 -1803 -3288 435 2710 -480 -3701 -2190 551 388 -938 -1324 -1657
1745 -1657 -883 -605 -1538 -2873 -1461 960 -302 -3636 -3232 212 958 -2414 -3959 -1209 312 -1879
1761 -1879 -3564 -1781 602 -332 -2812 -3543 -1697 -92 -451 -1899 -2396 -1207 -700 -1576 -2290 -1557 527
1778 527 415 -2509 -3479 -318 2589 442 -2928 -2012 1005 865 -1721 -650 2677 2087 -1323 -2196 -197
1795 -197 2129 2025 719 -1356 -1293 341 2043 1108 -131 797 2053 -758 -1919 1905 5392 2741
1811 2741 -2104 -1655 2496 4023 1975 1388 1967 1683 197 523 2535 3948 3409 958 -1907 -556
1827 -556 3568 4962 1678 -1427 -69 1927 1201 837 2688 3671 546 -2506 -1359 2863 4747 2414
1843 2414 -758 -1287 99 1848 2472 1618 883 294 -831 -1297 222 3125 3191 -1446 -4663 -2426 1709
1860 1709 2065 -446 -1727 -1190 -1744 -2003 -694 1246 1356 -1527 -3865 -3468 -172 2416 1599 -2368 -4195
1877 -4195 -2212 441 -533 -989 359 156 -3703 -5405 -1585 2793 856 -3591 -4601 -2589 -1106 -26
1893 -26 -373 -1468 -2738 -2704 -1711 -1779 -245 1928 602 -4450 -5064 126 3709 560 -2956 -1782 36
1910 36 -1400 -1191 957 2270 228 -2731 -2455 -327 2673 2814 -89 -3006 -1848 1646 2363 -277
1926 -277 -24 1316 796 -1369 -1231 2215 4284 1468 -2026 -1080 2234 3718 2240 43 609 1590 1085
1943 1085 485 1644 3297 2800 -350 -1322 679 3405 3815 1043 -960 453 2701 2443 640 478
1959 478 2370 1729 -787 -494 2696 3793 970 -1410 -409 1831 2044 891 455 304 975 1111 218
1976 218 -306 904 1771 -131 -2118 -295 2661 1130 -2337 -2097 428 1127 -671 -1584 -827 -265 -522
1993 -522 -1191 -1525 -1087 322 -95 -2694 -2281 513 1531 -1955 -4002 -1410 1382 -175 -2524 -1613 -198
2010 -198 -1127 -2492 -1770 -71 -575 -2135 -2920 -2746 -816 1057 -589 -3685 -3645 67 586 -1929 -2250
2027 -2250 50 603 -2424 -3171 218 2745 397 -2730 -2269 309 1674 682 -308 -664 -665 -686 -664 -422
2045 -422 1256 2019 -296 -3077 -1969 2098 3641 275 -2330 -440 1751 1165 63 2002 2937 722
2061 722 -1708 -401 3021 4125 2319 50 -912 892 3096 3213 1547 591 1311 910 -156 1011
2077 1011 3346 3913 -433 -2667 -182 3518 3551 1146 -456 -374 657 861 1525 2456 2353 1171 -1003
2094 -1003 -1307 1848 4249 2198 -1070 -2322 410 2486 1443 194 -86 -193 -1365 -1988 -482 1872
2110 1872 1917 -1195 -3506 -2071 1262 1447 -536 -1974 -1004 -385 -876 -1085 292 907 -304 -3096 -3162
2127 -3162 -461 1986 305 -3234 -3446 -1147 -466 -1500 -1826 -340 -513 -2680 -3134 -1484 434 201
2143 201 -2158 -3172 -2417 -131 979 -846 -2663 -1420 141 -1596 -2393 -406 1748 -152 -2873 -1943
2159 -1943 768 891 -894 -1587 -624 -235 35 -28 -815 -695 947 633 -1300 -1180 1697 2292 -502 -1751
2177 -1751 716 2763 690 -1268 375 2541 1668 209 403 1343 1295 1144 864 459 1629 2592 1421
2194 1421 -407 421 3096 2825 78 -982 1835 2917 1345 -119 1241 2192 784 -295 714 2438
2210 2438 2227 709 -803 -273 1979 3096 1542 -347 -268 1438 1247 56 576 2060 1810 -1302 -1844
2227 -1844 1027 3449 1490 -1534 -2072 -284 804 365 -48 66 -99 -1114 -1998 -1064 1057 1764 -918
2244 -918 -3407 -2656 683 2074 -225 -2282 -1775 -972 -1178 -1506 475 1347 -819 -3705 -3803 -479 1884
2261 1884 642 -2485 -3717 -2324 -480 -210 -981 -489 -1176 -2934 -3696 -1469 1786 2333 -1299 -4402
2277 -4402 -3146 576 1899 341 -1466 -1054 -1213 -1990 -632 1780 2206 -489 -3240 -3029 152 2703
2293 2703 2414 -775 -2928 -1660 333 697 578 1428 1208 -1282 -2887 -229 4016 3882 4 -2125
2309 -2125 -614 1949 2710 2087 1651 460 99 -528 819 2554 3916 2265 -1639 -2866 811 4154
2325 4154 2923 -68 -401 504 472 585 1892 3510 1988 -1280 -1677 714 3586 3964 1683 -1647 -1298
2342 -1298 1538 2467 1654 966 1744 604 -1863 -955 2351 3653 566 -2870 -2126 660 2055 1340 -26
2359 -26 -821 -1218 -1071 -277 182 1171 941 -1319 -3077 -1624 1989 2118 -1283 -3021 -1324 51 -459 -945
2377 -945 -310 -278 -1825 -2986 -1960 11 600 -769 -2713 -2814 -1005 69 -211 -1925 -2021 -1033 -807 -1964
2395 -1964 -1429 406 457 -2376 -3306 -1082 1273 563 -1687 -2243 -998 -6 -636 -806 -400 478 -465 -1954
2413 -1954 -1448 523 1360 -225 -1891 -1508 902 1762 -261 -1509 -345 928 452 -873 283 1476
2429 1476 1050 -821 -1021 1217 2332 797 -1201 -517 1519 2224 1071 272 427 1489 1257 480 413
2446 413 1895 2278 449 -679 737 3361 2166 -115 -754 891 2530 1610 652 634 1011 530 -71
2463 -71 527 1960 2714 1192 -924 -737 1687 2958 1174 -1066 -527 1343 987 -207 702 1682 832
2480 832 -1738 -1536 687 1924 1353 -1079 -2197 -912 917 1006 -670 -1151 -232 -206 -1775 -1331 1160
2497 1160 2225 -1415 -3537 -2081 962 1076 -930 -1701 -1919 -1193 -1189 -669 -291 -193 -891 -2561 -3217 -1121
2515 -1121 1496 1028 -2768 -3683 -1380 632 -602 -1343 -631 -337 -1484 -2722 -1084 1291 1099 -1150
2531 -1150 -2921 -1937 122 1110 262 -1458 -1348 -473 -632 -886 325 1375 185 -2365 -2384 265 2392
2548 2392 1218 -1326 -1802 247 1201 654 242 1477 1283 -202 -1095 205 2625 2505 421 -1541 -255
2565 -255 1880 2072 750 122 1003 1393 537 414 1672 2729 1563 -839 -563 1658 2858 1373 -307
2582 -307 178 1554 1679 731 460 1283 1658 422 -528 610 2311 2327 392 -1033 335 1997 1226 -468
2600 -468 -357 1074 1241 -137 -419 678 989 357 -959 -673 717 1544 20 -1516 -754 681 822
2617 822 -744 -1935 -450 762 -589 -1474 -450 623 -613 -1724 -1767 115 640 -421 -2170 -2008
2633 -2008 -719 223 -684 -1711 -1407 -612 -903 -2073 -1556 128 290 -2230 -3607 -1273 1012 436 -2016
2650 -2016 -2403 -1241 -435 -924 -922 -131 -273 -1439 -2194 -1722 84 1464 193 -2341 -2607 -328 1564 170
2668 170 -957 -567 -163 -950 -1335 577 2445 687 -1857 -2170 -86 2158 2183 206 -1002 -856 175
2685 175 1218 1397 1453 1185 -63 -1495 -345 2716 3804 1031 -1739 -1176 968 2127 1813 1373 945
2702 945 106 -613 115 2095 3511 2362 -870 -1535 356 3097 3159 1066 -409 -73 455 834 1370 2179
2720 2179 2039 -249 -1951 -576 2390 3473 1359 -1563 -1490 459 1253 1202 1006 769 -436 -1945 -1199
2737 -1199 997 2610 1422 -1772 -3316 -1271 1537 1731 -286 -1073 -919 -1015 -1605 -304 1648 706 -1769
2754 -1769 -3500 -2054 915 1992 15 -2333 -3116 -1489 -224 -488 -365 122 -1121 -3099 -2851 108
2770 108 2058 295 -2672 -3320 -1176 403 512 -512 -1188 -1047 -1859 -1779 -474 1105 1147 -1359 -3305
2787 -3305 -2025 1149 2123 77 -1567 -1286 -375 -359 -392 445 1200 -43 -2152 -1694 795 2671 1194
2804 1194 -918 -1360 -175 1239 1124 500 403 669 117 -607 398 2292 2604 18 -1422 -238 2104
2821 2104 2146 701 -86 924 1130 482 267 1613 2102 985 -50 -278 1472 2711 1719 67 -551
2838 -551 987 1980 793 98 707 1728 645 -582 410 2129 1867 30 -918 141 1989 1348 -200
2855 -200 -681 348 749 130 -628 25 928 767 -922 -1128 218 1076 -252 -1620 -626 838 782 -1040
2873 -1040 -1185 -487 566 -248 -1319 -749 -15 -322 -1387 -1490 -297 158 -449 -2111 -1886 -178 103 -661
2891 -661 -2036 -1522 -133 -600 -1560 -1501 -76 -198 -1843 -2149 -687 855 -239 -1649 -2206 -1025 33
2908 33 -104 -892 -1209 -504 -552 -1149 -1561 19 1036 -696 -2276 -1369 919 1305 -214 -931 -615 116 -245
2927 -245 -352 497 909 538 -764 -1132 -52 2105 1505 -320 -1332 69 1444 954 375 854 1186 624
2945 624 -629 697 2455 2355 519 -831 -364 1581 2502 1490 434 529 1127 833 461 1358 2454
2962 2454 1547 -623 -875 1264 2671 1716 -183 -489 586 1324 835 199 781 1107 76 -1001 -194
2979 -194 1821 2038 266 -1458 -522 1039 1510 211 -588 -174 670 -228 -689 2 1186 359 -1809 -1665
2997 -1665 234 1192 -42 -1699 -1153 -132 176 -610 -909 -285 -234 -975 -1890 -1189 470 453 -1402 -2387
3015 -2387 -1273 316 13 -1491 -1553 -483 -351 -1318 -1750 -575 288 -786 -1907 -1525 170 576 -214
3032 -214 -1827 -1704 -167 519 -602 -1501 -221 300 -536 -1513 -632 881 354 -1107 -1641 268 888 351
3050 351 -892 -755 434 592 93 -679 343 827 176 -605 -321 1291 2159 201 -1020 1 1794
3067 1794 1518 303 -150 754 1062 504 29 896 1564 973 -402 -388 1600 2482 1652 -59 -141 1018 1819
3086 1819 948 202 925 1392 59 -439 556 2525 1976 -21 -1310 -13 1678 1835 411 -410 182
3103 182 611 202 17 1005 1532 318 -1459 -990 1349 2127 595 -1065 -1080 20 500 146 206 313 -316
3122 -316 -1442 -1863 -282 1252 793 -1329 -2624 -1449 474 1075 -524 -1201 -1086 -918 -1153 -831 449
3139 449 601 -1178 -2842 -1922 270 1088 -172 -1788 -1824 -1070 -523 -529 -308 20 -981 -2123 -2220 -519 1594
3158 1594 467 -1463 -2594 -1768 266 719 -38 -922 -583 -1079 -1603 -588 1086 1506 -144 -2007 -1858
3175 -1858 762 1582 681 -381 -860 -352 140 340 508 1544 734 -1222 -1538 187 2576 1950 -273
3192 -273 -1060 -124 1181 1215 848 1270 1119 145 -729 150 2276 2448 635 -766 -831 1216 2400 1273
3210 1273 272 146 868 441 181 1364 2170 1343 -616 -1290 668 2492 1792 215 -677 -144 848 681
3228 681 614 740 1113 260 -1110 -474 1544 2047 182 -1700 -688 494 614 136 -495 -90 69 -403
3246 -403 -1205 -14 981 413 -1281 -2219 -852 1172 786 -914 -1551 -272 7 -786 -1188 -51 400 -458
3264 -458 -1982 -1867 134 580 -743 -1653 -1110 -266 -248 -663 -1153 -721 247 -1247 -1806 -1009 640 246 -1112
3283 -1112 -1768 -372 282 -245 -1244 -908 367 -261 -1194 -1100 185 821 -225 -1431 -911 144 609 -184
3301 -184 -732 -30 676 298 -815 -750 826 1066 105 -1092 -35 1161 914 -287 -10 711 928 -91
3319 -91 -542 618 1768 1065 -118 -267 817 1865 882 295 340 1333 1033 364 66 1262 1880 398
3337 398 -207 -90 1710 2105 562 -291 521 1150 935 426 612 1445 1203 -67 -318 452 1781 1420 -153
3356 -153 -817 45 997 855 -304 65 861 266 -938 -552 1035 1146 -190 -1396 -1006 643 742 163
3374 163 -999 -821 -116 -398 -945 -483 376 370 -1077 -2125 -428 1213 305 -1208 -1673 -578 -2 -843
3392 -843 -973 -426 -406 -948 -1683 -1202 115 547 -740 -1926 -1709 -49 309 -641 -1346 -840 -255 -774 -1329
3411 -1329 -584 718 164 -1467 -1642 -589 618 277 -722 -1115 -189 -61 -258 -663 65 330 -44 -1284
3429 -1284 -780 681 1361 54 -1603 -537 831 1025 -450 -204 733 734 105 -367 508 1708 1082 -338
3447 -338 -745 691 1653 1391 112 -260 1086 1106 364 52 1070 1662 511 -333 225 1580 1727 463
3465 463 -178 678 1529 1242 258 187 1268 1154 53 78 735 1597 1002 -389 -200 854 1444 454 -479
3484 -479 26 933 607 -112 -648 487 742 -100 -761 -67 667 398 -1002 -938 -155 708 480 -771 -748 -209
3504 -209 380 -323 -1273 -199 391 -333 -1382 -942 273 696 -643 -1620 -931 18 -339 -910 -895 -484 -324
3523 -324 -1133 -1563 -607 142 -324 -1537 -2237 -227 361 -93 -1601 -1336 -351 -508 -844 -741 80 358 -534
3542 -534 -1593 -774 735 764 -779 -1429 -976 174 566 -345 -446 98 247 -818 -884 548 1215 231 -1166
3561 -1166 -1041 350 1359 753 30 21 99 259 265 363 1199 1244 48 -961 172 2054 2086 417 -673 152
3581 152 1040 1064 469 1250 1364 653 -430 112 1265 2156 1122 -383 -473 621 1737 1415 289 151
3599 151 826 489 8 671 1559 1282 -219 -937 147 1571 1683 240 -462 -149 444 376 197 253 644
3618 644 16 -1257 -982 622 1475 459 -1385 -1474 -17 609 205 -580 -566 -188 -691 -1166 -432 665 331
3637 331 -873 -1932 -970 186 204 -759 -1567 -1150 -542 -603 -771 -36 36 -446 -1722 -2009 -110 867 -406
3656 -406 -1515 -1604 -573 -57 -505 -792 -257 -375 -1005 -1480 -775 733 685 -1009 -2099 -844 375 446 -204
3675 -204 -616 -312 218 -757 -531 383 1009 213 -1251 -964 755 1118 392 -142 -138 289 579 11 376 665
3695 665 969 -10 -844 149 1242 1655 483 -442 64 1349 698 2 486 1075 1086 -215 -290 1176 1848
3714 1848 1159 16 0 706 1476 983 117 592 1187 537 -113 200 1494 1347 383 -693 14 1255 1407
3733 1407 301 -596 226 631 56 -154 261 694 688 -474 -749 -42 1151 239 -479 -389 640 559 -516
3752 -516 -1001 217 272 -175 -1181 -780 294 284 -345 -1498 -695 -57 105 -736 -913 -262 -330 -1034 -1427 -430
3772 -430 366 224 -1287 -1594 -391 0 -360 -1320 -715 -298 -448 -1111 -1170 39 235 -559 -1479 -1285 31
3791 31 402 -512 -888 -748 63 28 -729 -567 165 466 -929 -1575 -709 783 542 -582 -1172 -245 333 -28
3811 -28 -501 433 704 169 -346 -369 992 1111 527 -244 -178 402 1096 225 321 487 1030 664 -427 224 1611
3832 1611 1472 76 -757 592 1157 1168 368 119 613 1101 102 153 677 1391 617 -204 -172 1211 1760 526
3852 526 -225 -7 929 737 112 395 990 711 -109 -550 193 1029 1163 -45 -685 -56 754 446 -188 -297
3872 -297 585 324 -181 -684 198 817 -73 -875 -953 281 336 -397 -1075 -636 -202 -476 -791 -917 410 532
3892 532 -945 -1184 -949 317 145 -1201 -1449 -415 354 -346 -1026 -688 -75 -325 -1402 -1370 -595 260 -490
3911 -490 -1563 -990 -210 68 -752 -985 -523 -4 -90 -996 -696 264 387 -937 -1388 -529 717 252 -495
3930 -495 -742 8 430 -149 -728 -151 851 244 -420 -575 486 1027 144 -545 117 803 855 -130 -384 437
3950 437 1132 461 -355 191 1022 999 110 -132 684 1142 909 -209 124 898 841 914 29 424 1143 963 171
3971 171 29 894 1300 726 -196 377 1445 1066 -367 -236 731 995 365 -124 170 842 1110 116 -320
3990 -320 579 1001 488 -639 -366 701 799 -107 -507 -178 742 346 -403 -214 462 361 -670 -1123 -415
4009 -415 400 333 -846 -1069 -543 401 -361 -791 -494 84 -69 -1157 -1145 -235 468 -882 -1560 -934 87
4028 87 50 -626 -1149 -905 -307 -805 -1060 -786 -13 -107 -1019 -1163 -496 521 157 -876 -865 -462 45 -331 -584
4049 -584 -251 8 -619 -1376 -560 425 638 -325 -1282 -744 402 519 -94 -368 201 141 -150 -473 379 770
4069 770 474 -259 -869 165 1164 781 -182 -68 360 651 100 213 798 1334 256 -605 289 1394 1511
4088 1511 620 -407 195 815 750 534 538 921 1051 -130 -446 921 1568 971 -171 -349 428 1326 983
4107 983 331 151 794 267 -84 178 984 810 57 -652 -377 596 1062 116 -353 -180 478 345 -429 289
4127 289 584 -88 -691 -795 -68 678 341 -1071 -949 -128 417 -44 -765 -471 -301 -347 -1057 -1037 255 415
4147 415 -752 -1407 -1003 59 32 -318 -1022 -832 -58 -397 -851 -467 31 -274 -974 -1232 -73 467 25
4166 25 -1147 -1105 -407 391 -572 -958 -399 87 -466 -1020 -694 271 368 -403 -994 -352 282 399 -151 -257 39
4187 39 323 -161 -413 93 918 708 -519 -649 82 887 731 -441 -96 706 734 -299 170 649 1105 678
4207 678 -307 -186 957 1150 412 41 505 877 857 86 7 1169 1149 250 -319 395 1352 996 152 70 537
4228 537 848 343 41 237 1131 756 -163 -299 273 995 635 -69 -394 188 788 -243 -459 204 935 157
4248 157 -914 -299 434 783 -261 -513 -121 551 413 -359 -619 -15 37 -381 -855 -374 644 -102 -1052
4267 -1052 -1175 -424 407 -263 -843 -818 -261 -450 -1146 -824 130 105 -669 -1374 -733 77 360 -411 -1263 -697
4287 -697 -134 -119 -916 -551 -93 -298 -919 -1061 36 376 81 -1308 -684 -174 272 -130 -511 -169 59 -203
4307 -203 -322 -319 349 764 -360 -1107 -453 530 592 -19 -444 -140 303 489 -32 562 811 444 -572 -576 354
4328 354 1382 869 -239 -257 450 674 417 222 615 843 460 -443 391 1149 1286 318 -250 66 1014 938
4348 938 638 -26 588 1061 272 89 426 1285 243 -361 -321 568 971 689 -151 7 254 629 178 9
4368 9 429 406 79 -342 -511 857 889 118 -638 -293 626 -6 -593 -346 242 208 -563 -740 -12 425 107
4389 107 -828 -843 -257 591 -246 -1303 -877 -160 -257 -717 -862 -241 171 -607 -1047 -589 -49 2 -693 -863 -444
4410 -444 -142 -157 -665 -940 30 -266 -632 -791 -211 206 -206 -931 -705 267 295 -221 -818 -601 -11 12 -340
4431 -340 -947 10 469 -70 -550 -321 523 194 -872 -853 233 854 313 -416 -490 616 372 138 -49 290
4451 290 571 370 170 200 869 760 -32 -322 297 1040 912 97 -69 743 972 518 -159 609 1155 706
4471 706 130 223 1123 1419 654 -240 314 643 631 217 104 499 632 310 -257 280 1035 659 85 -668 -46
4492 -46 839 553 -170 -248 285 385 -284 148 525 728 -51 -983 -506 273 838 144 -639 -390 -141 -29 -300
4513 -300 -486 58 170 -825 -1023 -347 811 317 -1001 -1304 -391 180 -88 -458 -685 -170 -335 -1096 -725
4532 -725 117 539 -612 -1416 -1010 -292 460 -256 -980 -676 -237 -344 -800 -256 215 14 -840 -816 -239 719
4552 719 404 -753 -996 -514 247 58 -428 -119 187 -63 -373 -157 758 788 -73 -973 -488 606 812 267
4572 267 104 -33 77 11 -161 380 506 497 -669 -669 487 1273 914 -158 -147 553 794 160 151 559 752 522
4594 522 -269 -16 1157 1097 570 -86 245 892 823 357 29 25 635 332 5 520 940 489 -127 -406 410
4615 410 816 531 81 -478 699 361 125 -219 374 536 -8 -468 94 513 750 -508 -728 -600 353
4634 353 162 -754 -364 -69 76 -322 -502 -338 124 13 -709 -759 -117 220 -377 -696 -705 61 56 -753 -991 -296
4656 -296 22 -438 -864 -765 -44 -104 -624 -1036 -545 -100 -481 -799 -745 136 271 -520 -1024 -329 54 -13 -624
4677 -624 -496 -41 356 -473 -1046 -520 398 379 -560 -695 33 135 126 -98 -75 565 208 -485 -472 58 907 227
4699 227 -391 -281 451 814 249 -183 215 543 89 7 305 625 533 183 -471 331 1131 702 147 -93 482
4720 482 740 472 234 372 566 797 -153 52 727 952 522 -293 -88 769 716 298 -68 299 528 155
4740 155 -198 146 1248 729 142 -773 258 990 798 30 -556 45 779 -18 -246 51 467 102 -1010
4759 -1010 -682 269 655 14 -925 -434 91 -4 -145 -389 -62 6 -931 -680 -200 295 -16 -784 -1368 -443
4779 -443 315 151 -670 -884 -300 -394 -787 -871 -364 -183 -704 -952 -898 215 590 -664 -841 -674 -353 -109
4799 -109 -348 -372 18 -46 -525 -1086 -279 368 87 -634 -719 -325 484 269 -409 -119 400 -135 -450 85 251
4820 251 580 -304 -312 -61 626 529 -29 -376 152 556 367 147 84 779 627 -133 -2 224 1030 484 -9
4841 -9 92 752 1087 713 59 667 783 599 -116 236 639 990 -58 -10 90 822 740 -19 -163 369 570
4862 570 394 -249 126 409 511 50 -81 277 602 383 -179 -49 274 454 25 -389 -25 688 19 -268
4882 -268 -374 241 83 -158 -442 -160 441 109 -716 -691 283 293 -317 -518 -525 -181 -52 -395 -570 -247 240
4903 240 -772 -862 -764 319 315 -429 -1006 -634 75 129 -329 -699 -395 -508 -717 -642 -175 308 -224 -1271 -1001
4924 -1001 -236 232 12 -582 -567 -120 36 -377 -709 -48 -4 -552 -1040 -201 462 459 -335 -634 -94 269 236
4945 236 -126 -281 143 -66 -498 161 623 1031 379 -468 -345 711 1249 529 86 -246 241 255 168 521
4965 521 1075 675 -123 -651 447 1153 1056 -154 -536 99 766 542 334 489 555 246 -317 71 1024 1163
4985 1163 262 -670 -238 504 1270 600 118 404 505 341 -81 339 890 480 -343 -912 58 898 426 -157
5005 -157 -701 22 235 16 -526 92 -19 -317 -721 -465 49 765 -120 -765 -765 -91 540 -526 -337 -508
5025 -508 -98 -376 -849 -230 255 -153 -857 -908 -356 356 -71 -510 -760 -274 -63 -459 -690 -284 150 -649
5045 -649 -1127 -619 295 107 -241 -726 -804 275 86 -428 -503 -253 33 -417 -705 134 557 139 -503 -510 105
5066 105 460 -7 -284 -161 -1 249 -335 -100 304 427 421 -377 -6 556 693 8 -331 12 499 490 -109
5087 -109 37 646 733 361 71 435 686 550 -103 90 567 800 335 133 148 507 713 241 206 429 963
5108 963 441 -62 79 764 855 -115 -154 514 760 392 -145 -135 333 409 -289 -33 172 818 196 -419 -158
5129 -158 538 485 -109 -484 -137 329 13 -347 -569 -219 -181 -189 -870 -493 222 -164 -734 -437 47 225 -86
5150 -86 -425 -510 -189 -149 -569 -855 -93 158 -782 -621 -741 -3 88 -787 -1079 -257 105 96 -639 -494 -200 -194 -508
5173 -508 -616 -274 10 -422 -974 -802 66 487 -285 -756 -422 -74 156 -196 -207 -71 171 -306 -625 -144
5193 -144 555 692 -169 -783 -64 460 218 -390 -175 158 156 185 -297 495 845 371 -310 -354 489 816 366
5214 366 -59 129 458 319 9 126 493 592 164 137 503 1128 518 -102 -348 462 1023 490 -5 339 418
5235 418 734 -5 115 748 610 197 -135 -41 286 745 161 -200 12 349 252 -189 -118 277 509 328 -412
5256 -412 4 757 539 -259 -627 49 208 -201 -462 -350 -18 173 -300 -484 222 437 -170 -527 -433 -5
5276 -5 177 -586 -818 -144 33 -205 -443 -609 -264 167 -480 -787 -560 14 -316 -732 -475 -187 161 -337 -560
5297 -560 -434 -196 14 -340 -544 -114 -78 -264 -817 -460 201 308 -791 -560 -226 516 48 -566 -54 -22
5317 -22 413 -276 -453 43 382 -117 -468 -55 686 797 52 -516 -73 534 260 -172 -62 53 412 -172
5337 -172 -179 374 815 333 10 -200 247 931 527 365 328 429 570 11 382 754 1082 400 -363 168 790
5358 790 905 142 -117 201 598 595 300 438 680 204 -50 -233 479 770 207 -329 -487 244 697 350 14
5379 14 58 58 -256 -345 137 382 147 -149 -583 -185 531 344 -110 -653 -723 111 213 -65 29 -28 -258 -719 -592
5402 -592 -147 531 -392 -894 -564 -116 48 -119 -318 -316 -342 -362 -481 -396 -44 105 -799 -1100 -482 294 274 -216
5424 -216 -819 -537 -141 -232 -294 -343 294 -419 -803 -509 -129 577 -133 -892 -870 207 220 33 -258 -111 192
5445 192 -441 -199 9 582 562 -206 -920 -137 504 549 69 -264 -56 459 125 -184 273 675 253 -351 -163
5466 -163 801 645 540 -255 -18 471 631 369 163 542 813 259 -376 165 1000 748 -89 -162 125 761
5486 761 667 196 -128 316 589 -107 -317 479 785 257 -355 -488 681 907 385 -253 42 527 66 27
5506 27 -473 263 499 -201 -318 86 617 423 -581 -570 -129 419 -201 -245 -433 -61 -81 -460 -592 -60 383
5527 383 129 -942 -559 -154 91 -144 -742 -400 -139 -218 -685 -212 -91 48 -501 -764 -512 59 -97 -427
5547 -427 -551 -229 114 -486 -1033 -233 134 -25 -558 -692 -325 153 -307 -592 -403 -67 -118 -222 -460 -41
5567 -41 401 284 -556 -424 111 272 -72 -306 7 454 216 -348 -517 258 585 45 -521 118 721 537
5587 537 -55 -40 281 734 15 -45 234 610 246 -185 -73 382 703 309 -240 7 570 583 393 -71 326
5608 326 755 242 58 270 819 855 140 -348 4 393 408 -2 -49 32 481 101 -233 448 745 250 -113
5629 -113 -23 528 607 47 -168 -84 64 85 119 -339 -14 6 -65 -410 -308 599 393 -647 -606 0 327 72
5651 72 -299 -176 -45 -315 -368 -454 -174 19 -143 -627 -726 -84 426 -64 -420 -604 -266 -39 -390 -445 -24 165
5673 165 -384 -614 -530 93 179 -693 -876 -453 -182 -314 -487 -497 -163 -75 -103 -433 -153 369 -50 -445 -264 -34
5695 -34 568 -189 -594 -365 236 174 -221 -38 127 324 -222 -115 259 697 165 -332 -203 360 675 -15 -126
5716 -126 13 287 353 -61 -100 474 701 144 -58 78 652 803 -86 -169 486 888 583 128 272 607 670
5737 670 316 -79 346 828 291 -78 6 499 729 422 -200 245 669 438 -121 -54 677 431 -257 -59 274
5758 274 331 389 -415 -582 -30 254 285 -446 -32 25 78 -283 -587 153 413 131 -762 -574 120 258 -82 -817
5780 -817 -554 34 -22 -295 -180 6 -17 -611 -717 -357 336 -115 -904 -758 -36 -9 50 -582 -237 -174 122 -515
5802 -515 -410 148 -3 -163 -846 -656 135 316 -36 -982 -504 153 -104 -143 99 139 114 -675 -576 -54 209
5823 209 27 -437 -499 -4 227 42 237 -60 83 165 -561 -144 701 748 82 -378 -13 217 757 270 43
5844 43 282 276 28 -218 313 583 560 -96 -408 423 800 600 -218 13 407 526 760 223 709 757 114 -259
5866 -259 238 718 976 184 -283 92 531 692 394 -221 317 309 -260 -117 228 706 257 -266 -197 324 371
5887 371 135 -169 -10 -135 228 -109 -339 310 153 -194 -543 -160 420 292 -265 -518 -582 166 -74 -351
5907 -351 80 -134 -112 -359 -675 -207 14 108 -699 -688 -337 392 -173 -395 -437 -269 -245 -607 -461 -40 366 -240
5929 -240 -1044 -409 39 -90 -539 -373 -24 -45 -187 -630 -162 -54 -46 -196 -326 18 296 -126 -453 -325 81
5950 81 347 35 -270 -100 308 -146 -63 -90 336 471 -34 -306 -232 491 577 -99 39 386 444 155 -58 176
5972 176 586 366 32 -115 89 655 646 -14 268 719 492 286 163 546 668 297 -250 109 472 574 137
5993 137 -118 56 458 527 -232 83 316 352 325 -95 222 541 300 -17 -383 127 327 65 -112 86 281
6014 281 291 -662 -453 -99 743 -274 -539 -250 143 39 -175 -497 136 281 -65 -590 -309 171 231 -462
6034 -462 -588 -277 297 115 -381 -559 -312 -310 -381 -673 38 307 -238 -872 -587 -58 125 -307 -565 -558 -155 -101
6056 -101 -554 -444 -24 -265 -406 -431 -275 237 115 -304 -630 43 365 -6 -262 -235 123 -278 -119 30 -181
6077 -181 536 -211 -283 -274 252 412 102 -175 -347 523 200 112 -77 456 473 -17 -185 -44 867 792 25 -116
6099 -116 317 319 601 -74 206 659 452 -271 -81 394 745 556 -151 -241 524 583 197 -102 96 325 231 -23
6121 -23 -133 612 537 213 -159 35 600 402 -115 -56 49 353 -10 -288 100 365 -21 -424 -160 583 190
6142 190 -150 -626 -356 134 -32 -83 -338 137 147 184 -721 -212 275 79 -232 -746 -439 113 -47 -538 -361
6163 -361 -34 107 -218 -383 -549 174 -79 -477 -527 -25 47 -320 -878 -249 54 116 -411 -884 -467 -78 -233
6184 -233 -279 -510 249 -77 -342 -304 -66 364 91 -452 -481 -33 -58 86 -253 85 -106 111 -725 -83 20
6205 20 412 -204 -524 34 636 558 -92 68 141 511 218 -336 -130 267 367 90 -106 343 690 541 -391
6226 -391 250 501 547 190 223 280 720 337 90 181 331 201 -191 -150 246 477 528 268 89 210 279 404
6248 404 90 461 742 345 -403 74 361 574 96 -199 -206 264 399 21 -476 134 17 -310 -411 59 555
6269 555 283 -214 -424 -196 83 374 -612 -172 -194 -3 -304 -306 88 193 -208 -739 -329 208 107 -370 -478
6290 -478 -376 -329 87 -360 -605 -98 -234 -454 -852 -314 325 -46 -428 -591 -442 323 -78 -516 -145 -242 -58
6311 -58 -301 -447 19 371 -343 -557 -198 211 129 -249 -374 -86 171 134 127 -199 60 99 -40 -414 223 512
6333 512 615 -117 38 114 617 96 65 66 181 239 -374 -53 353 557 119 -273 29 573 592 228 81 342
6355 342 166 198 -17 -33 500 330 -232 39 369 972 309 -163 217 532 771 305 214 215 344 253 -286 -107
6377 -107 309 731 314 -295 -169 167 445 -47 -32 138 462 -114 -140 112 518 2 -169 -356 -143 400 5
6398 5 -135 -227 42 -36 -97 -448 -143 201 2 -485 -452 -371 144 -424 -779 -296 -64 -31 -600 -556 -209 -32 -232
6421 -232 -618 -583 292 195 -528 -464 -129 78 188 -595 -399 -19 -17 -256 -407 113 182 -51 -376 -291 -50 71
6443 71 -153 -219 77 -9 -239 -196 -170 -69 70 -374 -383 -52 117 89 -270 -193 79 564 94 -302 339 526 210
6466 210 -362 -172 213 679 113 29 -136 116 425 113 -83 427 408 -75 -271 69 504 305 294 -308 -65
6487 -65 406 215 114 66 549 730 -45 -176 290 563 323 -323 -59 448 448 457 59 134 422 389 -196 256 362
6510 362 477 112 -317 -287 421 314 -109 -98 45 191 385 -342 -68 228 139 -466 -433 -178 117 77 -707 -360
6532 -360 -188 166 -202 -694 -206 -59 39 -346 -201 149 42 -235 -718 -258 336 -266 -142 -467 -241 -201 -54
6553 -54 -544 -6 -100 -131 -408 -289 -189 261 -171 -320 -208 3 33 -214 -309 -182 276 -200 -209 -312 317 188
6575 188 -381 -104 -152 558 31 -121 -10 39 189 -172 -153 -38 202 102 -195 -233 -54 404 396 -266 -71 288
6597 288 263 168 -179 141 517 73 -278 56 350 609 163 -180 371 426 394 169 90 415 308 125 -22 371
6619 371 435 424 -150 -14 -68 643 139 -201 76 641 -73 242 -245 250 548 -152 -99 -11 323 240 -17 -372
6641 -372 281 452 140 -214 -184 184 183 -104 -310 -128 142 124 -380 -373 -55 158 -329 -633 72 9 102 -371 -230
6664 -230 -209 26 -290 -719 -177 283 188 -569 -663 -245 24 6 -681 -341 -80 -145 -431 -508 -184 -26 -324 -345
6686 -345 -386 -159 -146 -414 -397 -244 128 50 -474 -357 241 191 -180 -594 -17 131 23 -283 -357 302 246 -54
6708 -54 -307 -352 -173 -15 84 -51 55 333 22 -392 -93 544 476 147 -43 51 368 126 147 40 256 386
6730 386 -202 202 251 751 497 -55 99 412 633 153 71 306 233 277 -118 264 428 575 -209 -454 234
6751 234 589 361 224 -274 235 306 -28 -155 51 459 96 -151 -386 102 488 32 -302 -326 358 140 85
6772 85 -136 -1 336 -5 -56 67 556 451 -448 -534 -65 183 -22 -72 -119 194 -71 -141 -564 -168 263 -336
6794 -336 -452 -280 73 31 -133 -373 -466 -42 -12 -169 -254 -372 178 -194 -513 -394 -152 143 -486 -366 -210
6815 -210 -44 -161 -291 -339 -10 -17 -107 -339 -142 270 -142 -233 -13 86 277 -217 -104 -5 3 26 -62 -26 150 -18
6839 -18 9 -167 289 228 488 -133 -342 157 527 227 140 490 410 345 150 70 -18 534 350 94 -124 225 428
6862 428 339 130 100 478 402 -117 164 436 165 213 169 69 445 366 13 33 365 451 116 -100 128 464 370
6885 370 62 -349 228 459 -15 -30 -77 -24 164 -129 -267 -92 162 122 -218 15 80 438 -245 -121 115 24
6907 24 234 -361 62 8 -32 -455 -375 -276 -23 -36 -362 -151 -400 -81 -312 -256 -204 98 -80 -422 -115 38 -1
6930 -1 -366 -694 -484 -215 217 -118 -276 -317 -90 -89 -583 -311 -223 144 -195 -470 -139 -75 241 -329 -50 136
6952 136 51 170 -327 81 415 99 -198 -312 191 189 -227 -344 125 187 324 -65 8 36 488 105 -254 2
6974 2 453 181 -98 -33 339 759 209 151 -61 509 392 130 13 339 408 44 84 -25 720 589 216 58
6996 58 31 615 154 176 32 361 394 225 -131 195 481 487 165 -264 214 467 242 78 282 174 214 -181
7018 -181 -76 398 138 -32 -398 -261 180 539 1 -309 144 318 151 -371 -149 64 207 -209 -382 -41
7038 -41 85 65 -476 -354 -184 3 -318 -336 -448 -16 -107 -544 -189 -206 221 -480 -605 -130 7 -21 -22 -391 -340
7061 -340 -78 -162 -444 -433 -48 -194 -119 -364 -64 273 -353 -173 -287 -322 -90 -228 -272 -143 116 17 -102 -297
7083 -297 55 437 41 -141 142 171 -73 -169 -390 78 349 234 -47 157 137 191 -7 -134 275 210 -112 -190
7105 -190 38 295 516 57 218 235 286 218 -157 11 395 358 -217 238 11 406 404 -33 -57 435 411 367 37
7128 37 168 483 165 -44 2 320 252 196 -167 115 285 472 266 -294 45 340 -52 -86 6 262 112 -389
7150 -389 -168 159 -130 -122 -317 -452 -59 277 -52 -451 -186 224 -172 -587 -357 158 4 -388 -566 -421 57
7171 57 -52 -479 -384 59 305 -102 -625 -439 79 -10 -439 -475 -78 135 -24 -397 -884 97 -84 -226 -181 -221
7193 -221 -108 -150 -377 -79 70 -168 142 -607 -484 93 -172 -215 -361 -112 185 -85 -137 -56 114 242 -151
7214 -151 -141 191 327 -83 18 -71 264 325 111 -128 158 474 34 60 24 548 311 -160 -366 235 319 476
7236 476 -11 200 323 415 91 90 579 615 89 -180 -132 262 326 96 37 79 382 270 -60 46 286 293 -50
7259 -50 122 65 418 378 170 -90 -97 356 146 -189 116 155 27 -142 -397 196 -7 -113 -246 -129 -18 -15 253
7282 253 -493 50 64 77 -224 -394 -101 108 -301 -305 -116 44 22 -424 -321 -104 -112 136 -730 -410 58 -60
7304 -60 -130 -444 -67 -54 -155 -340 -177 -131 -31 -423 -624 -134 187 -252 -559 -521 -180 89 -173 -263 -184 102
7326 102 14 -181 -168 -35 -67 -16 -312 103 -82 98 -287 -269 40 138 -169 -260 26 282 365 -74 -343 170 295
7349 295 -129 -294 -327 439 246 154 -282 9 64 376 -117 194 103 455 36 -112 133 401 458 63 -54 313
7371 313 648 77 163 69 454 -131 -59 61 267 261 120 -94 37 319 174 299 -120 311 548 53 -55 -200
7393 -200 145 -65 234 -368 -111 110 312 -15 -80 268 146 -347 -452 42 411 198 -330 -296 192 77 -154
7414 -154 -386 -108 -110 21 -261 -678 -50 67 -232 -590 -207 43 65 -465 -280 -11 -96 -48 -349 -590 83 -90
7436 -90 31 -174 -337 230 -294 -396 -238 -230 -159 -189 -334 -334 -214 7 -357 -282 -34 -153 -345 -446 -344 -20 239
7459 239 -412 -177 135 32 -6 -85 -155 232 87 -22 -97 168 413 109 -44 -205 409 490 105 -308 76 95
7481 95 397 -68 -26 285 498 185 -31 66 333 301 -52 14 228 242 163 96 198 248 83 -92 -162 383 356 233
7505 233 -187 -41 359 126 36 150 235 9 258 63 -144 231 182 53 -3 300 618 204 -171 -109 -2 356
7527 356 136 -94 -37 362 124 -122 -164 61 7 -72 -217 -271 131 -79 -158 -256 20 -78 -108 -226 -372 34 103
7550 103 -390 -277 -98 -132 -311 -650 -475 171 330 -240 -159 -318 -132 -246 34 -293 -73 375 -271 -564 56
7571 56 187 234 -313 -420 -151 202 -60 -205 -103 279 -91 -445 -280 -14 104 26 -414 -263 145 190 -57
7592 -57 122 41 174 290 31 34 9 23 136 -155 79 363 86 -167 -292 135 458 49 -46 382 201 106 -45
7615 -45 -79 663 484 111 -113 42 510 140 455 12 327 267 345 81 225 428 287 -68 -120 311 326 304
7637 304 261 54 216 335 145 -131 384 346 38 -280 -95 153 351 -165 -64 -19 227 263 -257 -168 -1 192
7659 192 -159 -228 29 311 239 -70 -341 -128 216 -115 -542 -383 -2 107 -76 -140 68 -48 -310 -418 -241
7680 -241 509 -26 -145 -297 -113 -80 -281 -332 -76 105 -223 -323 -347 -130 9 -337 -367 -541 -112 541 -111
7701 -111 -144 -199 -115 166 -205 6 127 58 -145 -430 -174 83 128 -70 -80 -58 -6 68 -464 79 393 134 -234
7724 -234 -115 -205 482 58 60 -241 179 312 -12 -93 25 175 386 -44 -165 363 176 -124 -16 77 307 129
7746 129 442 87 258 539 193 2 27 381 409 -36 219 209 456 191 204 -20 387 239 128 12 121
7767 121 497 9 89 -101 71 88 406 -314 -231 292 262 -123 -94 369 124 -141 -77 -320 243 -53 -274 -354
7789 -354 11 -77 121 -403 -201 269 -116 -406 -340 -248 -110 -214 -75 -377 210 177 -296 -151 -201 146 143 -498
7811 -498 -218 -150 -193 -461 -306 -204 68 -6 -350 -208 177 -85 -220 -380 -52 -18 -19 -375 -197 18 133 54
7833 54 -223 -115 146 279 -32 -32 -77 191 -238 -36 -20 142 304 12 -210 338 8 -198 -119 -28 159 311
7855 311 -177 -359 115 201 111 87 -24 414 179 232 51 -209 668 59 -18 -90 395 478 228 75 161 307 538
7878 538 219 -156 1 300 228 210 -283 449 243 -90 19 119 160 26 -317 -179 148 128 -113 -89 246 172
7900 172 100 -226 -364 166 80 -256 -174 64 408 434 -209 -436 37 -31 -290 -274 -321 208 231 -187 -273 81 30
7923 30 -164 -448 -276 -55 22 -79 -494 -269 127 -27 -293 -128 -84 149 -172 -534 -84 -197 -22 -226 -573
7944 -573 -70 179 -235 -527 -127 338 47 -56 -259 -169 115 -189 -184 -204 -224 141 -121 -257 -16 103 -179 -580
7966 -580 19 384 40 -153 -231 152 255 -19 -125 -169 269 524 83 -47 80 404 22 -223 -268 354 337
7987 337 106 98 69 149 195 127 -226 305 457 275 -183 205 254 243 -64 141 258 596 149 -15 334 320 206
8010 206 313 1 -144 435 -45 -10 -27 303 394 154 -188 36 260 24 -4 -191 -53 130 121 81 189 205 -176
8033 -176 -73 -244 -71 120 147 -34 -472 -125 114 -69 -18 -49 269 -110 -247 -177 103 155 -384 -184 -282 -39
8055 -39 -51 -61 -397 90 -360 -135 -543 -157 125 -275 -442 -538 -94 202 -268 -215 -355 -115 -111 -106 67 2 -202
8078 -202 -166 -389 44 -221 -150 -290 -542 -95 166 72 -289 -326 60 -111 -240 -167 423 185 -262 -243 -164 262
8100 262 236 244 -248 132 160 147 -26 348 336 170 45 -171 -86 292 201 -348 -111 180 388 518 206 325 -74
8123 -74 143 310 98 199 505 16 -180 -153 511 111 79 -187 6 176 112 101 -41 229 325 54 87 -14
8145 -14 354 322 -93 -313 -369 462 63 13 386 548 -75 -275 -223 94 321 -137 -173 -179 72 -73 -125 -246 -150
8168 -150 29 174 -106 -206 28 -87 -329 -394 -132 157 -130 -275 -507 -138 -88 -218 -265 -100 52 48 -114 -103
8190 -103 -45
8191d5
$$ Imaginary data points
##PAGE= N=2
##DATA TABLE= (X++(I..I)), XYDATA
0 0 0 0 0 0 0 0 0 0 0 3 -8 8 -8 8 -16 16 -16 24 -24 32 -34 40 -48 56 -64 72 -81 92 -104 117 -131 148 -166
33 -166 184 -206 228 -254 282 -312 344 -384 424 -467 520 -576 639 -711 795 -891 1004 -1138
51 -1138 1302 -1507 1771 -2125 2625 -3388 4681 -7285 14537 -72088 -264081 -23306 169076
64 169076 35925 -115044 -14461 63885 -43845 -103005 19608 81240 -13045 -69354 -11897
75 -11897 3857 -29946 10293 74258 12161 -93279 -66466 42329 57443 -6208 -22695 2532
87 2532 -15529 -47818 -20538 30955 22172 -27513 -42607 -18026 -6708 -8344 6297 15973 -20593
100 -20593 -61024 -32593 34423 45200 -2834 -27602 -11615 -7412 -14127 9348 37475 17761
112 17761 -20972 -19804 2964 6904 10255 23573 5821 -37504 -32540 24462 43477 2767 -22665
125 -22665 -7141 -3966 -16285 2470 34366 22743 -12979 -14464 5994 6339 3475 22913 28874
138 28874 -4941 -25140 8714 46825 29612 -13145 -16878 11657 20210 2702 1965 24332 25266
151 25266 -8893 -27181 59 30844 19788 -7972 -9018 7154 11703 7819 6544 304 -7255
164 -7255 2275 18879 10582 -8162 -90 21270 13545 -13801 -13918 11133 19280 4239 -4054 855
178 855 1648 -2418 155 4050 -2297 -9232 -2802 8233 4687 -9918 -13178 -943 4971 -8065 -17961
193 -17961 -5087 11214 3958 -15202 -16491 -1634 3765 -4505 -13822 -14021 -1869 13463 7595 -20666
207 -20666 -29554 -476 19008 -4715 -26220 -6320 13865 -4274 -22589 -6969 7620 -6962
219 -6962 -19007 -10138 -3518 -3607 4853 4760 -21141 -32542 -833 21756 -3069 -23820 -1127 16324
233 16324 -8153 -22846 2337 19474 105 -15466 -4372 5716 6147 11015 8391 -11494 -18721
246 -18721 3875 16134 1480 -3376 11864 7454 -18283 -16129 13642 20836 -630 -9478 428
259 428 3678 3598 12740 14582 -679 -9860 870 11755 14417 18434 15711 -2906 -13284 4202
273 4202 22522 14382 1494 6474 10448 -1724 -7349 9499 22054 7533 -13595 -12835 6959
286 6959 21645 16093 -2573 -11437 -2739 7485 6768 3705 9427 13915 5077 -7330 -7374 6256 19467
301 19467 14540 -6652 -16724 127 21149 13027 -10000 -12316 511 -213 -9947 -2192 11436
314 11436 5029 -12719 -16042 -8468 -2858 3573 6432 -5120 -17650 -7268 8992 1864 -11991
327 -11991 -5706 4232 -7193 -15880 2395 16689 -1514 -21893 -13836 1047 -2716 -8589 -1880
340 -1880 109 -9715 -13706 -7501 -5731 -6934 -2719 -4011 -14357 -12951 5366 9456 -10940 -20978
354 -20978 -3954 8976 -1750 -10444 1572 8861 -4467 -14128 -1860 9735 2745 -9120 -7005
367 -7005 2643 6242 2526 -3300 -7325 -4610 3162 5101 -1863 -3705 5195 7690 -4688 -9759 5598
382 5598 16852 3839 -11003 -2289 14279 13097 1851 285 4342 4139 3224 5542 7670 8463 10898
397 10898 6267 -6109 -6860 12071 22618 7122 -9891 -3794 9316 9269 6487 8607 3932 -7338
411 -7338 -5710 8925 15856 10463 3347 -3310 -9329 -1797 15938 18698 1754 -7364 418 3443
425 3443 -625 6999 17653 4973 -17926 -13462 11140 17740 3674 -5352 -5441 -7958 -7352 3062
439 3062 9589 3434 -5257 -8907 -11800 -9489 5826 16635 1206 -21669 -19982 1995 12101 3873
453 3873 -3893 -5528 -9609 -13888 -6214 9212 13235 -1038 -18378 -20648 -6406 8060 10009 -2175
467 -2175 -15919 -19070 -8308 3543 4792 -2049 -6759 -10580 -16471 -13439 5753 19095 3781 -20413
481 -20413 -21363 -2676 7875 5691 4827 1322 -10996 -16096 -1854 13497 11817 130 -9571 -15475
495 -15475 -10290 10924 23309 5662 -18512 -16627 1026 5993 4123 10055 9351 -8841 -18002 -690
509 -690 17760 14285 2092 -2623 -3891 -2892 7441 16996 11386 -501 -2408 -581 -1592 6241 21335
524 21335 17808 -6937 -17504 413 17114 11580 2221 3722 3365 -4588 -4465 8981 16929 9563
538 9563 -3268 -8810 -3013 9184 18645 12834 -2953 -10361 -1448 8420 8542 6501 6886 3298 -7833
553 -7833 -9121 5598 16807 7158 -10122 -10940 1388 6973 1357 -1333 710 -1601 -7155 -6623 382
568 382 5189 4628 -842 -9109 -12011 -2167 8178 3678 -8215 -7458 556 -1760 -8472 -3010 6728
583 6728 187 -14199 -13080 1592 6435 -2864 -9197 -7287 -4108 -3860 -4437 -4824 -2813 -29 -2430
598 -2430 -10053 -11198 -1357 6022 -1874 -11431 -8235 1075 987 -5561 -6192 -416 1246 -4128 -7928 -3655
614 -3655 4172 4300 -3967 -9044 -2114 5056 1535 -6267 -2827 5577 3937 -5892 -7199 2320 7707
629 7707 2461 -4230 -3271 1290 3806 3022 1206 917 2967 3290 326 -1737 4233 10902 7831 -3077
645 -3077 -4483 5525 11664 5221 519 5037 6616 -593 -1776 7981 13082 4375 -4344 -1320 4641
660 4641 6257 7116 7045 766 -4109 1409 7978 4720 1388 6485 7680 -3740 -7088 8088 17226
675 17226 4339 -8257 -1706 6556 2839 -14 6815 7190 -3772 -8937 -986 5647 4524 2260
689 2260 -1111 -8499 -9470 1665 9156 962 -8691 -5017 -78 -3593 -5229 3564 8152 -3215 -14985
704 -14985 -9146 4919 8281 92 -7385 -7398 -5039 -3523 -828 831 -769 -5744 -9893 -8490 -2558
719 -2558 2799 1395 -6425 -12522 -8977 -159 2969 -1258 -4825 -3775 -5066 -8013 -4496 5208 7150
734 7150 -3369 -11524 -7454 1907 5306 1445 -2769 -4564 -4332 -2428 377 2863 3224 -629 -7484
749 -7484 -8785 505 9588 6451 -4365 -7037 -1187 3107 3211 2644 3499 1769 -1350 -1093 2486 7163
765 7163 8068 2680 -4662 -3458 7034 11223 3167 -2924 2625 6148 550 -2049 5664 10671 3708
780 3708 -4334 -1068 5942 6831 4401 2352 301 558 4944 6640 2817 1049 5503 5660 -2036 -2968
796 -2968 7452 11735 1264 -7011 293 9172 4210 -2957 -229 4388 1787 -1775 449 2946 1693
811 1693 484 -1123 -3143 -1178 4755 4664 -4573 -7347 1071 5971 -1741 -7276 -614 4585 -2216 -8102
827 -8102 -963 5480 -360 -8909 -6841 439 2353 -552 -4467 -6359 -5302 -1072 1005 -2812 -5345
842 -5345 -3495 -2717 -6075 -5334 1763 3408 -5994 -12764 -6411 3998 4071 -3939 -7896 -5472 -2166 -1300
858 -1300 -1611 -996 -382 -2839 -6847 -5934 1114 5509 661 -7622 -7795 -446 3428 580 -1541 -450
874 -450 -519 -3920 -4352 107 5682 5017 -2305 -7076 -3830 3915 7582 3740 -2359 -3606 -380 2532
890 2532 3214 4570 5294 2181 -4402 -4613 4080 12025 7935 -2819 -5228 1375 6100 5373 4300 4430
906 4430 1344 -3504 -1426 6267 9902 5991 339 -3719 -2445 5397 10844 6576 -1377 -2120 2662
921 2662 2342 468 6039 10268 2887 -8207 -5196 6957 10947 3902 -2363 -2970 -1383 1598 4990
936 4990 4079 664 -1015 -1859 -4656 -2156 6135 8779 -2194 -10961 -4447 5030 3413 -2414 -1044
951 -1044 1051 -4151 -7387 -980 4913 2162 -3837 -6407 -5582 -2928 2068 2761 -2980 -7317 -4722 -1555
967 -1555 -3384 -2782 1910 1233 -7992 -11259 -2840 5070 1653 -5257 -6580 -4768 -2941 -1026 567 -1258
983 -1258 -3189 -3671 -3604 -4215 -1677 3455 2048 -5943 -8515 -1226 4013 317 -4006 -1444 730 -2381
999 -2381 -4303 -6 4289 2510 -2021 -3498 -2193 873 4145 3107 -1250 -2507 878 2697 253
1014 253 393 5347 4812 -2865 -5118 3184 9513 4357 -2090 -971 3904 3669 1329 1537 4780 4901
1030 4901 1319 -1302 704 5319 7307 3188 -1449 -535 4319 5330 2350 749 3339 4547 1130
1045 1130 -1652 1761 7239 6001 -747 -3065 1863 5378 2693 -478 2392 3953 -318 -3240 601
1060 601 5733 4389 -472 -3029 -1856 752 3698 2498 -1446 -2753 348 526 -3397 -1906 4034
1075 4034 3301 -5270 -8044 -735 4200 425 -4003 -3141 -2317 -3013 -2507 -738 71 -914 -2464 -6053 -6317
1092 -6317 28 4681 -368 -8145 -6335 101 -349 -3621 -2083 485 -2810 -6673 -5198 -599 1293
1107 1293 93 -3196 -7332 -6020 517 3790 -1870 -5629 -1985 127 -4795 -4754 2851 5279 -2937
1122 -2937 -7936 -3045 2821 2501 210 -854 -2081 -2596 461 2242 714 601 2080 20 -4929 -2594
1138 -2594 6396 7719 -1178 -6001 -165 4649 2216 184 2928 3828 -301 -2879 1623 6159 5983
1153 5983 1898 -917 -1362 1934 5820 6163 2161 -446 1886 3486 1351 497 5516 7400 770 -5460
1169 -5460 -501 7774 6787 -10 -1957 1254 2320 1122 2028 4319 3395 -368 -1992 -93 2994 5136
1185 5136 3549 -1339 -3243 222 3977 2343 -1394 -136 1828 -538 -3541 -965 3881 2862 -2979
1200 -2979 -5761 -1820 2081 1193 -1935 -2752 -808 -943 -3165 -3261 -540 1884 -286 -4230 -5408 -2267
1216 -2267 1861 1462 -3266 -5866 -2774 388 -1221 -3653 -1485 473 -3234 -7335 -3952 2423 1815
1231 1815 -4112 -5998 -2582 -167 -1214 -2313 -2079 -1705 -1561 -2012 -3116 -970 1569 -29 -4290 -4360
1247 -4360 901 2477 -645 -2514 14 988 -923 -1846 -756 567 1745 1216 -1631 -2945 1580 4551
1263 4551 198 -3581 824 5545 1352 -2980 817 5358 2017 -1795 890 3686 1919 1627 3549
1278 3549 2508 -251 1723 4396 1080 -865 4624 6772 301 -3687 3242 8107 2040 -3081 1809
1293 1809 6122 1805 -1325 2163 5426 2225 -1016 79 2200 2699 3257 2280 -638 -320 2738 3184
1309 3184 -1051 -810 3661 4348 -1445 -4195 1295 5659 2273 -3476 -2437 1769 2055 -1015 -1439 1124
1325 1124 1050 -2695 -4582 -944 2872 1701 -2893 -4454 -2603 -174 287 -840 -2320 -2329 -1523 -2020 -2811
1342 -2811 -1069 1591 -475 -5693 -6095 -405 2719 -818 -4708 -3781 -1237 -2098 -3672 -2845 -173 -30
1358 -30 -3214 -5548 -3830 651 1856 -2083 -5240 -3824 -304 843 -1139 -1059 -138 -838 -3239 -3088 669
1375 669 3542 1786 -2989 -4633 -706 3168 1963 -1596 -1924 292 145 -2179 -778 3510 3956 -1185
1391 -1185 -4825 -2159 3702 4805 1793 -1033 -439 960 1846 2021 2838 3641 2619 -198 -1092 1905
1407 1905 6281 5726 7 -3776 247 5430 3634 380 1586 3820 445 -3114 271 6408 5628
1422 5628 -410 -2319 953 2847 2884 3146 1935 -427 -101 2421 2737 1184 2996 4160 -568 -5123
1438 -5123 -186 6555 4621 -2822 -2783 1494 580 -2337 -202 3263 568 -3779 -3081 -159 975 1446
1454 1446 674 -3070 -4799 -1113 3081 1120 -2634 -1784 -39 -2466 -4771 -329 3335 410 -4575
1469 -4575 -4744 -1641 249 -608 -2216 -2902 -2218 -2036 -2277 -2424 -413 653 -2442 -6109 -4136 681 2401
1486 2401 -1373 -3859 -2322 -993 -1142 -1789 -1380 512 690 -2228 -4002 -1373 2828 1351 -3208 -4234
1502 -4234 -510 2019 368 -1352 214 962 -631 -2366 -1339 2012 3182 746 -2105 -1335 2330
1517 2330 2486 221 -771 1777 2610 239 -1020 1653 3501 2514 -47 -745 936 3873 4296 1766
1533 1766 -330 1284 3486 1471 -797 2114 5811 3033 -1984 -619 3862 4494 1445 -343 1337
1548 1337 1500 1923 1955 1353 1302 1994 1818 -784 -695 3298 4999 849 -2684 708 3724 1312 -1984 745
1566 745 3206 1564 -1623 -1369 1248 1895 681 -1355 -2246 -922 1145 625 -1376 -1734 -182 -679 -3045
1583 -3045 -3192 1055 2956 -1073 -5342 -2993 1098 1073 -2396 -2609 -528 -447 -2850 -2760 -282 1229 -1285
1600 -1285 -3973 -4710 -2132 701 653 -2913 -4532 -3062 -610 -1914 -3455 -1136 1043 -2493 -5692 -2573
1616 -2573 2325 2042 -2638 -3786 -1297 28 -211 12 291 -463 -1236 -1613 -2341 -430 2668 2276 -2724
1633 -2724 -4750 -548 3034 614 -1888 -225 1578 -483 -1916 841 3365 2431 -325 -1619 -725
1648 -725 2072 4754 3608 -46 -837 1792 2560 1383 1771 3771 2844 -764 -1651 2361 5250 3248
1664 3248 -969 -1851 938 3271 3047 1471 1480 2007 1062 -346 515 3894 4565 1798 -1488 -546 2756
1681 2756 4191 2084 -766 -92 2161 1354 -245 790 3484 2257 -2568 -3367 659 3485 1409 -1468
1697 -1468 -1286 -532 44 1 -333 -495 457 26 -2159 -2908 568 3198 -579 -4987 -2774 1699 878 -2684
1715 -2684 -1949 210 -660 -3370 -2900 -630 -12 -667 -2340 -3316 -2852 -141 451 -2801 -3577 -692 371
1732 371 -2715 -3812 15 1591 -2137 -4809 -2204 733 54 -1630 -1846 -1277 -1200 -734 -1192 -1980 -590
1749 -590 762 -138 -2680 -2164 1299 1722 -1639 -2633 704 1784 -438 -1923 521 2166 925 -1535
1765 -1535 -1561 833 2425 1314 23 -249 835 1589 1010 119 1289 2881 1986 -514 -628 2858 4503
1782 4503 1661 -1254 289 3266 3015 -9 825 3848 2867 -858 -1133 2236 3978 2552 462 -502
1798 -502 193 1875 3027 1811 -12 1087 1853 611 -855 2552 5187 1589 -3124 -1577 3526 4055
1814 4055 855 -514 577 182 -751 90 1256 1860 504 -1766 -3213 -1150 2498 2514 -1404 -4058
1830 -4058 -1564 1106 345 -1051 382 827 -1874 -3808 -1458 1841 2368 -1138 -3954 -3150 -477 699
1846 699 38 -1686 -2176 -2251 -2787 -2677 -674 1354 -3 -4449 -5997 -2172 1797 1222 -2223 -3126 -2238
1863 -2238 -1697 -1421 -191 919 85 -2847 -4000 -1610 1502 2354 265 -3278 -3879 -627 1735 334
1879 334 -1110 -6 -466 -2936 -3466 1176 4356 666 -3529 -3208 342 1871 1578 1182 -674 -1491 -358
1896 -358 1110 1745 2038 2939 1300 -2399 -2168 3593 5852 1701 -2124 -393 2616 1748 1048 2387 2972
1913 2972 415 -1542 -291 2445 4220 2684 -135 -1862 10 3655 3561 1064 412 1662 1552 -316
1929 -316 454 3637 4169 482 -2200 -456 3015 3795 838 -1171 -670 1032 904 -280 1222 1653 608
1946 608 -2071 -2259 409 2475 1449 -1459 -2480 -714 1614 793 -1510 -1376 431 153 -2298 -1938
1962 -1938 1449 1738 -1890 -4107 -1437 794 418 -1455 -2001 -1253 -1033 -1080 -1588 -1926 -1069 -459 -1862 -3159
1980 -3159 -1602 977 -551 -4013 -3362 -289 509 -1801 -2685 -1277 -777 -900 -1201 -1353 -935 -167 -942
1997 -942 -2099 -1409 976 1342 -2227 -3310 -248 2362 130 -2520 -1185 802 -248 -1540 -467 932
2013 932 516 -1194 -1168 -330 1351 2153 600 -2066 -751 2349 2764 168 -308 1911 2566 20 -678
2030 -678 2607 4079 1230 -2000 -412 2318 3350 1658 472 118 546 1200 1274 1287 2184 2319 195
2047 195 -1815 134 4012 4349 123 -1756 710 3345 2240 530 1723 2428 139 -1466 729 3557
2063 3557 3519 380 -1796 -1300 526 2693 1551 -1058 -1377 -434 -105 -702 32 1967 862 -2493 -3797
2080 -3797 -222 2942 2047 -1667 -2629 -1244 -40 352 63 176 -349 -1766 -2754 -2013 289 1766 -697
2097 -697 -4191 -4013 -442 1031 -417 -2448 -2348 -1707 -2185 -2344 -703 794 289 -2890 -4168 -1804 1137
2114 1137 1073 -1643 -2577 -1467 -323 -853 -971 -111 200 -1281 -3146 -2403 818 2535 -161 -3381 -2591
2131 -2591 289 1133 -700 -1101 479 269 -1568 -1519 785 2264 910 -1162 -1238 617 2044 2228 234
2148 234 -1217 534 2166 605 -475 1295 3036 739 -1485 4 3205 2722 294 -162 1163 1688
2164 1688 1395 1239 819 1098 1785 1382 -43 513 2776 3120 308 -1183 1667 3544 972 -905 833
2181 833 2665 1600 -17 474 1416 1673 504 113 820 986 1593 554 -887 -99 2305 1611 -1456
2198 -1456 -1836 1228 2191 -230 -1666 -423 755 -243 -1538 -313 1242 381 -1672 -2291 -1229 981
2214 981 999 -1074 -2441 -1613 339 -205 -1401 -1552 -237 -762 -3055 -2908 344 1440 -1029 -3948 -3729
2231 -3729 -751 383 -571 -1618 -1512 -1505 -1847 -2153 -612 789 215 -2256 -3721 -1732 1623 2019 -1245
2248 -1245 -3040 -2119 -283 -659 -409 542 669 -1297 -3440 -2093 1381 2619 230 -2415 -2527 -119
2264 -119 1566 1371 319 94 -159 -945 -674 1201 3531 2564 -990 -2601 -89 3199 3737 924 -927
2281 -927 -33 561 743 1557 2769 2707 -272 -2438 -671 3015 4709 2336 -1052 -1660 365 2584 2663
2298 2663 1880 1664 1260 -390 -1084 1925 5146 3507 -1055 -2237 608 3115 2861 1452 -42 -647
2314 -647 -647 114 1187 2192 2321 -67 -3198 -2271 1668 4130 1331 -2315 -2107 158 397 191 1121 1548
2332 1548 -799 -3123 -2265 825 2870 1529 -1713 -3482 -2487 481 1376 -762 -1767 -1879 -1571 -2913
2348 -2913 -1677 1079 1442 -2481 -5227 -2502 790 1003 -706 -2081 -2466 -2305 -941 -345 -24 -36 -1047
2365 -1047 -2716 -3032 -1085 1716 1158 -2499 -3644 -1217 514 -348 -1098 -681 -667 -1615 -1885 -459 1402
2382 1402 1045 -966 -2611 -1788 677 1605 513 -1065 -909 673 657 -256 131 1344 1123 -949 -1313
2399 -1313 1236 3240 1638 -614 -1051 927 1821 1219 412 931 1516 606 29 739 2151 2217 963 -840
2417 -840 582 2579 2571 1001 -623 759 2388 1600 151 1052 2367 1652 -225 -129 2262 2768 1081
2434 1081 -743 243 2026 2109 591 -428 152 1172 1038 -148 278 1376 1369 -467 -1315 287 2304
2451 2304 992 -1650 -1781 120 1488 -48 -905 -741 -97 -405 -897 -466 856 813 -1058 -2408 -1745
2468 -1745 747 1505 -694 -2941 -1760 172 -449 -1647 -831 48 -1129 -2894 -2428 123 932 -731
2484 -731 -2825 -2989 -952 560 379 -1356 -1774 -671 -753 -1692 -1188 839 463 -2113 -3681 -1138 1772
2501 1772 931 -1574 -2327 -1323 -324 -263 -194 324 25 -570 -1701 -1521 781 2734 1184 -2239 -2212 676
2519 676 2412 963 -346 227 872 -184 -784 1160 2924 1670 -768 -1665 282 2297 2777 777
2535 777 -717 75 1246 1476 851 1348 1991 1106 -912 -650 2609 3989 1495 -916 -574 2045 2488
2552 2488 1328 728 1221 1237 427 -179 1320 2909 1858 -340 -1261 389 2493 2057 300 -768 274
2569 274 1128 259 -238 1092 1566 -119 -1657 -1197 1247 2102 -176 -1522 -857 733 1095 -212 -977
2586 -977 156 217 -835 -1610 -552 709 544 -1668 -2273 -760 781 -377 -2166 -1828 -90 -163 -1317
2603 -1317 -1798 -499 -333 -1148 -2026 -1606 -254 -89 -1421 -2531 -1459 95 -345 -2142 -2002 -822 59
2620 59 -889 -1881 -932 171 -666 -2135 -1367 513 485 -950 -2003 -1282 152 748 -543 -1300 -876 -22
2638 -22 88 -702 -442 1218 794 -1269 -1885 327 2470 1271 -1151 -1231 612 1368 694 390 962 965 77
2657 77 -479 786 2111 2422 623 -1446 -526 2020 3200 993 -409 335 1522 711 151 2236 2958
2674 2958 1336 -1384 -895 2062 3250 2010 19 -624 443 1786 2055 1275 1056 780 -415 -880 685
2691 685 3098 2452 -106 -2480 -981 1857 2243 984 -279 -78 -308 -688 479 1627 2004 -265 -2264
2708 -2264 -2241 529 2496 1590 -1423 -2459 -1151 148 236 113 673 -319 -1920 -3111 -829 1919 1798
2725 1798 -1172 -3810 -2304 -189 675 0 -1041 -1144 -2215 -2053 -1531 868 1259 -725 -3521 -3586 -294
2742 -294 1663 900 -1638 -2373 -1566 -962 -894 56 1066 -308 -2883 -3164 -579 1905 1743 -994 -2865
2759 -2865 -2186 108 1094 491 1 217 -833 -1660 -789 1785 2893 -15 -2646 -2077 849 2627 1493
2776 1493 259 -529 18 -118 567 1124 2184 1495 -665 -1453 353 3134 2877 248 -1468 -50 1431
2793 1431 1649 1029 1815 1841 451 -995 386 2874 3174 1303 -1075 -609 1320 2403 1950 633 334
2810 334 819 251 26 1068 2419 1783 -770 -1403 249 2164 2005 -655 -674 393 870 197 93 1330
2828 1330 1211 -189 -1375 -831 1066 1594 229 -1560 -1556 344 1251 -138 -1245 -469 293 -826 -1532
2845 -1532 -407 806 63 -1668 -2190 -815 448 -310 -1696 -1471 -783 -149 -817 -1907 -1168 85 -454
2862 -454 -1660 -2126 51 220 -1190 -2227 -1394 304 -73 -1736 -1726 -396 183 -690 -1413 -963 66 -112
2880 -112 -1180 -1295 -225 556 -560 -1583 -1037 215 768 -231 -1642 -427 794 371 -694 -830 849
2897 849 639 -963 -1118 547 1613 839 -784 -709 765 1768 956 237 36 774 812 -3 321 1729
2915 1729 1820 574 -945 305 2491 2259 209 -321 691 1348 1224 779 961 1410 846 -151 218 1178
2933 1178 2356 1677 -362 -976 1078 2241 1179 115 605 1345 308 -154 528 1880 1391 -581 -1173
2950 -1173 -160 1974 1709 189 -951 -492 648 443 -248 405 628 -2 -1818 -1818 481 1589 -49
2967 -49 -2100 -1880 -155 256 -168 -676 -456 -615 -1114 -1439 -771 749 163 -1585 -2841 -921 406 563
2985 563 -1328 -2238 -919 -143 -904 -1403 -544 162 -728 -2365 -1788 250 1018 -628 -2277 -1432 -252 61
3003 61 -742 -833 -617 5 -622 -1130 -866 831 440 -1271 -1739 -201 1258 293 -1066 -974 356 500 -350
3022 -350 -636 655 1178 -156 -852 -219 1261 1313 514 -790 -341 1372 1479 596 -88 797 1708 319
3040 319 -327 909 2139 1126 -264 -449 1382 2070 981 -16 -148 1405 1709 751 135 1065 1537 584
3058 584 -117 532 1708 1823 -3 -1113 663 1984 1346 -203 -75 623 1237 455 -9 900 1093 158
3076 158 -995 -460 1233 1989 374 -1523 -1111 544 882 105 -1001 -128 150 -569 -942 -224 1275 206
3094 206 -1692 -2010 -175 1256 272 -1191 -1507 -941 -381 -622 -887 -163 -77 -879 -2362 -1745 847 1125
3112 1125 -854 -2839 -1723 -38 -205 -784 -956 -713 -1002 -1839 -1588 -128 762 -78 -1963 -2373 -525
3129 -525 1056 561 -981 -1608 -744 -246 -709 -106 615 784 -1033 -1969 -766 1449 1852 71 -1638 -1345
3147 -1345 281 1038 666 422 181 -183 -914 -835 1171 2245 1287 -1004 -1602 379 2091 1760 450 -198
3165 -198 294 354 72 975 2204 1805 59 -1145 322 2354 2683 878 -630 -169 499 1135 1205 1491
3183 1491 1428 393 -869 -747 1467 2813 1636 -876 -1514 584 1987 1611 522 481 391 -304 -294 963
3201 963 2065 1318 -534 -1816 -731 1328 1728 457 -1405 -972 -98 -124 -87 422 1114 -465 -1903 -1466
3219 -1466 538 1608 467 -1523 -1679 -581 209 112 -464 -410 -318 -947 -1881 -949 625 781 -1253 -2837
3237 -2837 -1626 194 182 -950 -1167 -1005 -926 -1230 -1068 -5 353 -487 -2182 -2011 -336 931 7 -1509
3255 -1509 -1783 -271 7 -505 -1171 401 547 -886 -1840 -877 875 696 -834 -1446 -464 642 510 -243
3273 -243 -113 412 709 -514 -617 377 1773 873 -613 -723 671 1464 597 -313 144 1166 624 -46
3291 -46 85 1528 1438 286 -185 90 1595 1632 399 -11 695 1382 685 135 31 1454 1504 334 -669
3310 -669 740 1629 1150 180 168 1401 1107 129 -89 933 1278 926 -673 -888 912 1577 613 -521
3328 -521 -246 560 503 -247 -124 648 1044 -73 -1133 -374 912 754 -714 -1214 -384 545 284 -616 -433
3347 -433 108 25 -1174 -1012 -165 665 -151 -1549 -1700 -453 380 -383 -1400 -1205 17 -817 -1530 -975 240
3366 240 92 -1227 -2318 -1156 269 57 -859 -1527 -1347 -362 -441 -995 -680 155 -438 -1501 -1707 -166
3384 -166 1096 -47 -1663 -1663 -28 430 -504 -493 117 52 -824 -860 -395 727 798 -299 -1239 -767 1196 1316
3404 1316 -295 -642 317 1138 35 -127 822 1601 521 -662 -288 1108 1784 635 -393 -168 852
3421 852 1230 968 533 923 976 458 -406 458 1797 1644 51 -830 345 1585 1578 868 205 775 1134 303
3441 303 -180 953 1926 642 -437 -314 974 1450 669 -463 -341 1001 944 6 -236 514 682 -146
3459 -146 -879 -200 1280 601 -544 -944 68 808 224 -972 -785 83 328 -412 -915 -213 42 -83 -1369
3478 -1369 -1276 -101 515 -629 -1727 -1298 68 -355 -1064 -1180 -416 -135 -862 -1449 -868 15 -252 -1433
3496 -1433 -1274 -297 263 -328 -1726 -885 -39 18 -812 -1333 -486 497 -723 -1531 -933 27 359 -920 -1519
3515 -1519 -205 391 1 -540 -731 174 182 -272 -715 305 1028 277 -1139 -664 648 1342 464 -923 -470
3534 -470 919 885 201 -184 853 910 -421 -442 761 1801 1356 -189 -539 280 1751 1510 326 121
3552 121 694 907 70 143 1587 1922 522 -721 -270 1533 1777 766 -235 79 986 1244 702 646 1031
3571 1031 990 -97 -523 312 2039 1401 -636 -859 274 1009 735 -112 24 402 109 -549 -341 987
3589 987 980 -245 -1394 -925 428 1147 239 -895 -1006 -255 -364 -745 -242 402 43 -1612 -1763 -297 1174
3608 1174 321 -1078 -1824 -1001 -182 -319 -665 -783 -441 -1076 -1509 -1296 -9 694 -869 -2080 -1898 -271
3626 -271 525 -309 -1265 -703 -303 -828 -1265 -290 405 314 -1671 -1901 -155 834 390 -861 -1545 -732 253
3645 253 205 -44 347 503 -7 -1253 -725 908 1239 469 -1327 -700 607 1027 231 19 932 414 -55
3664 -55 -577 687 1355 1209 -330 -753 578 1754 1330 301 143 831 1052 443 367 1529 1575 634 -397
3683 -397 -84 1519 1806 671 -94 253 1009 927 777 393 1117 972 -69 -205 494 1561 1465 -67 -364
3702 -364 -80 1334 749 -199 -127 581 445 -645 -424 859 1284 -187 -1334 -761 380 870 248 -747
3720 -747 -592 297 50 -688 -585 520 238 -1074 -1595 -717 471 3 -697 -1194 -221 -286 -398 -947 -415
3739 -415 414 -129 -1473 -1305 -301 306 -204 -1393 -1320 -259 28 -831 -923 -415 29 -816 -1424 -1191 257
3758 257 223 -953 -1252 -745 89 -28 -821 -917 -338 -106 -661 -1313 -46 467 -56 -1038 -980 412 818 73
3778 73 -542 -160 532 124 -53 -51 895 808 -87 -483 113 1077 1145 85 -151 209 953 411 -1 323 1142
3799 1142 898 36 -310 780 1615 1135 -221 56 1113 1257 371 -2 874 1248 479 -76 512 1465 1478
3818 1478 459 -353 27 1092 1031 437 -163 463 943 204 -229 398 1237 455 -482 -790 186 1122 714
3837 714 -396 -569 -95 88 -132 -237 227 502 83 -1187 -569 211 946 -564 -1478 -842 56 63 -718 -766
3857 -766 50 -235 -953 -1240 -497 494 -50 -1520 -1456 -487 170 -385 -1088 -1140 -203 -204 -972 -861 -120 433 -580
3878 -580 -1576 -892 18 297 -560 -1534 -657 -420 -146 -887 -465 -149 2 -606 -1225 -237 641 -40 -819 -960
3898 -960 -213 305 -101 -627 -202 440 92 -611 -150 738 735 89 -684 -179 442 847 406 -341 176 907 361
3919 361 -262 510 1045 907 -120 -211 704 1397 881 -263 -30 760 1448 496 207 491 1282 659 145 95
3939 95 994 1047 669 -48 151 961 926 450 -124 500 1190 548 -151 512 1008 970 41 -226 249 1258 331
3960 331 -142 -224 633 686 -115 -529 -199 894 221 -371 -181 366 469 -312 -879 -287 586 -53 -1034 -1009 8
3981 8 419 -481 -1068 -472 -35 -185 -687 -805 -54 136 -273 -1543 -917 -78 237 -793 -1534 -642 94 -662
4001 -662 -1311 -733 -117 -336 -1149 -1200 -444 348 -390 -981 -1170 -235 390 -309 -878 -390 155 -220 -968 -356
4021 -356 435 728 -464 -1345 -363 724 822 -379 -726 -642 566 -42 -358 74 578 303 -601 -582 586
4040 586 1374 518 -540 -248 289 898 353 313 618 688 152 -290 585 1523 1074 6 -628 75 1236 1351
4060 1351 577 -286 546 645 332 270 1048 1378 680 -411 -156 1092 1889 711 -295 -168 491 753 385
4079 385 99 698 754 -107 -553 313 1284 1070 -222 -1191 -437 882 434 7 -165 3 147 -569 -332 357
4099 357 975 -97 -1274 -1035 224 843 5 -950 -590 -262 -354 -634 -356 95 -155 -968 -1278 -615 488
4118 488 263 -620 -1366 -750 -153 -332 -850 -637 -103 -780 -1441 -1078 -177 249 -248 -1541 -1337 -372 370 -283
4138 -283 -584 -623 111 -398 -822 -418 696 401 -619 -1189 -497 624 443 -387 -849 -65 234 -4 -305
4157 -305 239 540 346 -429 -554 363 1062 486 -541 -392 478 821 268 -115 415 871 280 -287 467 1110
4177 1110 1054 169 -207 256 1272 713 183 2 795 1272 443 286 697 1370 905 10 -61 852 1405 624
4197 624 -76 66 1006 763 153 -65 898 929 646 -369 92 747 1023 65 -576 87 819 492 -532 -185
4217 -185 297 373 -431 -850 -116 818 244 -557 -844 73 536 -394 -795 -364 201 -392 -1034 -695 40 282
4237 282 19 -1158 -891 -164 -121 -367 -895 -15 -209 -705 -1440 -931 110 96 -852 -1133 -539 -90 -256 -652
4257 -652 -922 -288 -294 -636 -687 -251 217 -232 -1280 -1136 -89 239 -191 -1122 -545 128 184 -509 -371 169 352
4278 352 -267 -944 -264 948 582 -315 -672 -168 578 491 -170 -10 377 470 -592 -500 673 994 291 -638
4298 -638 -365 702 1039 495 78 476 370 252 54 562 1238 1102 167 -338 183 1333 1019 208 -354
4317 -354 510 839 426 174 484 1299 736 -471 -123 841 1078 574 -286 -121 614 530 369 -73 217 547
4337 547 -127 -195 32 1122 630 -634 -733 58 472 339 -311 -372 -212 78 -217 -336 24 353 -227 -1016
4357 -1016 -569 158 487 -188 -909 -656 201 -56 -115 -858 -514 -296 -865 -1222 -485 378 24 -1046 -1341 -598
4377 -598 47 -366 -962 -917 -167 -260 -638 -930 -249 -40 -581 -1038 -1018 -135 369 -459 -1024 -776 209 113 -600
4398 -600 -568 -46 63 -383 -763 -102 309 -14 -461 -901 458 644 67 -570 -68 452 677 -30 -309 354
4418 354 900 401 -300 -185 749 896 -234 -46 385 1121 976 83 135 485 876 354 -76 520 1098 885
4438 885 215 163 734 928 648 -334 235 873 1002 262 -19 505 695 155 52 5 1039 777 -108 -377
4458 -377 320 987 379 -486 -459 212 669 -88 -289 332 469 80 -413 -431 622 789 -329 -789 -600 262
4478 262 256 -304 -452 -104 102 -410 -854 -148 415 3 -715 -1124 -55 550 -24 -860 -1058 -396 -325 -910 -672
4499 -672 -254 -388 -490 -1280 -1021 143 322 -645 -1462 -1025 -87 -58 -290 -562 -440 -206 -656 -837 -284 667
4519 667 -71 -1164 -1330 59 689 -33 -622 -462 -11 -107 -256 -292 354 380 -292 -922 -365 753 996 -56
4539 -56 -670 -119 587 140 84 188 411 173 -445 -256 702 1258 584 -210 -296 698 1151 759 161 455 557
4560 557 290 -127 465 1085 1217 -170 -428 306 1353 938 311 -151 307 501 384 280 584 751 539
4579 539 -77 -353 602 1176 420 -384 -532 136 588 464 47 9 301 -1 -402 30 691 584 -402 -686
4599 -686 -170 395 525 -303 -586 -89 38 -113 -635 35 434 -113 -747 -1028 -4 338 -449 -1061 -734 -307
4619 -307 -202 -309 -507 -262 -242 -418 -936 -246 -45 64 -1009 -949 -515 -83 -120 -770 -1060 -178 140 -715 -725
4640 -725 -219 6 -503 -674 -603 294 225 -305 -874 -163 354 65 -328 -506 45 485 -227 -463 -317 485 142
4661 142 -260 -542 265 665 -373 -206 -106 684 529 76 -151 372 765 365 -87 117 918 590 8 -71
4681 -71 276 946 570 -26 -19 738 904 362 60 396 441 651 -109 124 878 997 232 -58 285 800 806 224
4703 224 266 189 916 524 -142 340 734 570 -182 -340 429 1073 549 -514 -45 285 416 299 -164 -244 478
4724 478 51 -438 -446 398 758 -130 -1081 -511 409 708 -331 -741 -555 -332 -515 -487 -139 141 -47 -873 -1265
4745 -1265 95 388 88 -782 -848 -137 73 -182 -811 -450 -119 -617 -973 -545 213 394 -600 -1206 -734 -64
4765 -64 323 -478 -682 -243 -143 -485 -805 -163 158 -238 -928 -812 125 680 257 -545 -597 44 -8 -61 -285
4786 -285 170 121 -190 -283 -127 994 734 -13 -375 -95 844 768 102 141 678 699 152 11 681 647 504 -195
4808 -195 -376 478 827 653 128 133 608 554 270 133 661 864 65 -84 265 1000 875 -70 -371 164 972
4829 972 440 -41 254 800 342 242 -21 344 505 317 -227 -207 530 532 -139 -365 109 371 148 -411 -138
4850 -138 228 278 -239 -579 -123 213 112 -439 -796 -234 469 -58 -837 -712 196 -58 -406 -686 -340 152
4870 152 -465 -902 -467 211 122 -748 -1183 -538 -187 -367 -759 -776 -97 -239 -395 -811 -686 -27 -410 -881 -591
4891 -591 194 249 -177 -670 -614 -149 180 -672 -406 -45 -88 -387 -757 124 390 -180 -476 -847 -75 733 306
4912 306 -186 -24 110 246 -163 12 495 328 -10 -577 -79 1013 780 119 -445 51 748 396 37 309
4932 309 729 612 126 -284 340 1141 639 -194 -274 347 999 588 147 125 572 319 137 326 913 814 -24
4953 -24 -536 48 955 1137 119 -432 -107 552 334 75 263 906 548 -428 -468 354 1138 128 -623 -783
4973 -783 -92 364 201 -232 -76 -131 -294 -640 -234 227 666 -278 -1209 -640 189 464 -337 -863 -366 -292 -283
4994 -283 -267 -83 221 -86 -944 -660 -140 488 97 -872 -989 -158 -101 -288 -366 35 -398 -664 -846 -475 352
5015 352 273 -867 -1231 -440 241 377 -287 -712 -398 45 -377 -761 209 193 -128 -734 -591 123 763 138
5035 138 -769 -267 68 403 -96 -267 227 375 -100 -402 12 746 669 181 -399 63 655 901 175 -60
5055 -60 551 753 158 248 415 1034 399 -239 -103 689 1025 497 -115 219 656 754 290 -128 659 703 353
5076 353 -242 298 929 453 240 -204 442 766 566 -226 50 574 738 146 -38 34 674 211 -475 -193
5096 -193 583 292 -46 -136 -312 -22 226 -178 -346 80 359 51 -527 -276 180 40 -789 -643 40 184
5116 184 -233 -861 -373 223 -276 -488 -741 -223 18 -440 -758 -332 89 -126 -531 -638 -299 -152 -186 -807
5136 -807 -769 -175 -201 -242 -596 -408 -205 -583 -870 -561 -222 427 -398 -1021 -720 66 205 -349 -693 -268 -327
5157 -327 -186 -463 -79 369 348 -485 -247 26 888 598 -344 -256 565 493 157 28 285 494 -61 71 -161
5178 -161 655 1088 114 -396 81 544 659 183 190 422 525 34 70 205 942 682 54 -351 345 717 678
5199 678 11 103 651 547 265 121 431 641 445 -294 -228 993 988 166 -153 145 590 558 -59 -80 291 362
5221 362 -115 -161 255 826 172 -658 -576 36 795 94 -302 -241 42 28 -21 -99 166 202 -192 -842 -376 -12
5243 -12 466 -311 -970 -453 400 -50 -429 -570 142 -110 -849 -625 -95 169 -342 -892 -748 -281 -14 -613
5263 -613 -806 -325 -147 -281 -504 -560 -272 -95 -509 -818 -419 515 -142 -725 -611 -182 298 62 -298 -437
5283 -437 355 372 -324 -289 -167 286 107 -698 -253 182 406 -52 -362 130 217 173 -162 15 246 391 104
5304 104 -258 259 622 819 -239 -188 598 953 326 154 -53 623 645 267 21 350 458 452 -302 331 1033
5325 1033 773 144 -122 267 613 533 355 190 619 587 -3 281 630 796 133 -258 -118 942 684 381
5345 381 -507 -188 448 286 159 -22 185 449 -322 -812 197 457 222 -521 -623 -114 142 77 -203 -135
5365 -135 -365 -405 -212 -329 -66 225 -554 -798 -568 12 414 -54 -385 -616 32 -229 -168 -238 137 -135 -853
5386 -853 -714 -280 214 -102 -653 -865 -188 37 1 -659 -428 -128 -411 -605 -397 330 483 -352 -1013 -704
5406 -704 384 172 -97 -464 -645 -280 -225 -228 243 412 162 -394 -597 160 393 560 -353 -441 13 292 401
5427 401 126 317 347 120 -237 12 334 1000 485 -616 -150 669 800 217 -118 189 286 351 98 280 1101
5448 1101 420 -249 -340 298 1337 764 261 -58 123 364 319 508 353 512 16 -509 -203 640 816 68
5468 68 -422 -66 358 324 147 -110 102 155 -92 -424 312 739 -211 -260 -547 31 526 83 -358 -499 217
5489 217 -233 -646 -263 -167 103 -636 -833 -488 5 233 -490 -656 -247 45 -29 -505 -522 57 -274 -510 -787
5510 -787 -245 285 -30 -798 -559 -256 132 -326 -671 -735 19 -227 -750 -550 -232 82 -495 -547 -669 -36 305
5531 305 -530 -624 -225 323 -91 -368 -186 455 92 -514 -304 18 439 139 -644 -243 540 476 -231 -262 377
5552 377 746 653 -150 -32 443 643 386 -316 86 807 538 -17 -44 448 852 486 -28 198 656 774 5
5573 5 10 19 690 364 -193 3 673 605 171 -100 294 444 638 -229 -8 516 441 74 120 206 285 597 -135 -157
5597 -157 119 656 42 -432 -248 341 208 -130 -427 12 268 -376 -544 -66 372 269 -367 -471 -293 264
5617 264 -36 -530 -531 -137 113 -273 -518 130 171 -367 -974 -583 39 6 -462 -814 -666 -138 -161 -856 -561 119
5639 119 -33 -510 -806 -355 -33 -9 -719 -838 -151 -71 -95 -347 -289 182 -141 -486 -464 -438 144 -159 -341 -468
5661 -468 106 314 -88 -321 -119 372 233 -183 -473 -73 361 -116 -54 31 765 243 -241 -363 190 655 -23
5682 -23 57 197 482 452 129 10 349 792 177 -249 -2 631 622 -1 -165 543 650 123 353 473 439 597
5704 597 -222 -21 575 828 578 -70 -76 353 544 56 173 76 627 453 190 -31 290 850 61 -154 67
5725 67 528 452 -121 -129 181 477 425 -274 -93 267 297 -357 -275 121 223 23 -606 -307 118 230 -193 -1019
5747 -1019 -228 148 55 -675 -288 -214 -78 -786 -786 -216 224 -292 -476 -758 -337 41 -265 -430 -543 -151 -336
5768 -336 -576 -740 -4 -72 -486 -547 -446 129 246 -377 -667 -363 270 340 -425 -327 236 -137 -592 -513 333 490
5790 490 35 -654 -691 -9 366 228 -508 -240 37 91 -72 128 611 53 143 -292 21 672 701 -16 -245
5811 -245 197 309 435 -49 402 491 200 -268 -18 519 737 534 -98 -175 162 553 361 -27 234 273 47
5832 47 -165 152 556 472 -15 -383 404 805 607 77 -170 472 235 9 -218 176 491 532 -420 -198 307
5853 307 188 292 -412 -153 151 270 361 -305 -239 381 -174 -268 -122 715 96 -361 -478 -301 259 -92 -441
5874 -441 -803 -172 -364 -304 -352 75 161 -280 -960 -597 -89 212 -63 -635 -617 -36 -357 -660 -523 -140 -103 -568
5896 -568 -551 -40 275 250 -499 -896 -242 7 -43 -269 -398 -174 -318 -491 -408 8 163 -184 -443 -458 46 584
5918 584 -170 -420 -131 167 173 128 -132 421 524 -157 -326 68 561 701 116 -256 80 556 270 -2 81
5939 81 456 173 75 162 436 911 255 8 -290 277 645 462 5 406 479 685 24 15 788 418 64 -31
5961 -31 233 772 540 63 161 499 684 381 -161 235 408 557 -83 -311 370 722 -31 -268 -122 282 107
5982 107 -164 70 57 430 -202 -445 -347 -11 213 -402 -588 107 165 -166 -466 -87 21 -234 -401 -626 97
6003 97 188 -69 -648 -541 -106 -44 -188 -350 -304 86 -211 -684 -721 -10 503 -177 -693 -618 135 -98 -565 -821
6025 -821 114 71 -487 -404 -175 -55 -69 -330 -534 -91 95 274 -415 -606 124 -156 -400 -453 -239 137 35
6046 35 -703 -454 360 480 -56 -430 -101 429 282 286 188 341 335 203 -127 147 365 340 -124 -197 726 473 682
6069 682 -41 165 441 466 -44 342 563 543 199 -129 -276 532 807 250 -58 205 508 358 265 131 638
6090 638 444 156 -402 215 588 388 -283 -66 287 305 181 -42 -107 341 143 -353 -254 247 460 151 -593
6111 -593 -442 163 194 -73 -735 170 -68 -135 -186 -266 152 -12 -482 -752 -248 177 -90 -719 -682 -433 -50 -381
6133 -381 -584 -342 -241 -114 -610 -412 78 223 -500 -1046 -500 176 -36 -314 -599 -26 182 -212 -186 -265 -81
6154 -81 -88 -420 -660 -178 246 102 -234 -371 191 -11 -330 -534 37 65 -104 -232 -317 420 364 -385 -574 -68
6176 -68 255 316 -135 -72 406 289 180 -246 -107 460 397 11 -268 426 620 382 -210 -86 507 644 135
6197 135 -149 299 601 446 82 429 704 508 104 -172 404 666 497 -24 -136 425 371 428 10 312 383
6218 383 220 129 108 337 661 61 -446 -38 -37 636 -384 119 219 79 246 -114 -170 288 181 -194 -610
6239 -610 -223 309 23 -424 -444 32 94 -356 -648 23 118 7 -522 -192 274 347 -684 -491 -138 -348 61
6260 61 -235 -263 -51 -237 -266 -451 -240 -140 58 -401 -764 -5 152 -133 -670 -202 -467 -95 -140 -441 146
6281 146 -290 -439 -821 -323 321 249 -135 -421 32 300 43 -432 87 70 395 -404 -277 283 467 496 -435
6302 -435 -423 35 321 95 -290 252 433 -226 94 218 685 523 9 -342 451 424 606 237 -498 282 512
6323 512 204 -135 296 161 624 -49 51 196 648 598 -103 98 378 593 439 82 327 643 138 361
6343 361 -10 679 439 -272 8 -49 332 510 -10 -107 81 147 65 -55 418 402 -98 -463 -263 175 469 120
6365 120 -124 -333 312 341 106 -154 43 159 -157 -396 -458 -133 69 -62 -671 -320 -217 173 -517 -534 -119
6386 -119 45 -108 -481 -252 181 -215 -549 -573 231 -167 -146 -756 -767 -152 -317 -246 -515 -19 -259 -322 -538 -612
6408 -612 -6 45 -61 -239 -347 244 90 -275 -468 413 -119 -138 -261 101 529 58 -125 -370 301 429 240
6429 240 23 104 396 109 -366 19 367 602 371 -450 79 594 459 28 -117 150 626 225 42 79 458
6450 458 444 163 -327 155 488 21 -263 -58 193 650 180 -349 59 507 169 -153 -105 629 577 360 -308
6471 -308 30 380 415 57 -127 226 291 -253 -387 -205 472 229 87 -200 72 254 451 18 -8 69 -159
6492 -159 -210 -110 -22 115 122 -553 -317 179 307 -388 -494 -107 15 -9 -444 -244 -220 176 -420 -538 -147 298
6514 298 -14 -323 -705 -18 -75 -180 -600 -127 -119 -289 -297 -426 197 135 -221 -430 -455 22 -39 -409 -328 -97 -158
6537 -158 -114 -464 -499 356 -83 -504 -205 -91 297 326 -233 -125 133 43 80 -262 423 304 140 -100 63 137
6559 137 267 108 -348 -19 234 473 150 91 23 451 9 -126 161 564 472 26 -299 537 262 515 -74
6580 -74 -312 360 187 223 319 171 650 177 -273 -245 336 455 47 51 -37 496 602 29 -36 672 341 122 -280
6603 -280 70 231 224 163 -346 208 304 56 -95 -26 -281 30 77 -165 -107 210 -331 -162 -424 -11 382 -305
6625 -305 -687 -73 -127 -80 -226 -761 -157 -43 -233 -550 -32 31 -132 -657 -709 103 -58 -259 -546 -660 -124
6646 -124 -234 -355 -416 -106 -78 -183 -394 -388 -43 71 -149 -361 -363 158 100 -298 -259 -41 -172 -276 -420 283 441
6669 441 12 -163 -87 188 391 74 -174 5 262 47 -181 -153 252 287 -110 -340 74 399 54 412 -13
6690 -13 346 241 395 111 -368 576 416 113 -31 380 355 145 -36 -170 254 740 231 -229 286 464 267
6711 267 390 89 376 573 -133 -254 418 549 537 -211 -47 29 459 289 78 -88 439 522 66 67 431 519
6733 519 249 -490 -228 259 158 164 -309 -273 62 -275 -178 -239 -44 -75 -445 -564 -132 268 66 -461 -555 -142
6755 -142 161 -91 -431 -306 94 -461 -571 -345 -46 74 -153 -666 -226 236 112 -221 -567 -318 -226 -516
6775 -516 -367 -240 98 -44 -401 -456 45 269 -143 -231 -485 -181 185 -141 -350 90 -59 10 -297 -502 143
6796 143 255 -76 -592 -127 39 146 -129 -6 147 -18 101 -58 324 290 525 -418 -155 68 434 109
6816 109 -347 262 277 278 283 -21 324 593 11 -94 -294 752 554 40 -53 40 563 308 121 56 151 430 -34
6839 -34 -45 254 485 585 -3 -102 -66 336 207 -49 366 290 360 57 -18 266 480 13 -70 -217 365 583 47
6862 47 -35 -61 152 -351 42 -260 258 -13 -95 -299 -172 172 290 -107 -244 82 83 -257 -425 -52 62 69 -409
6885 -409 -530 -290 43 -66 -579 -153 159 -71 -450 -626 -380 -189 -188 -694 -354 -30 -145 -555 -478 -271 162
6906 162 -157 -194 -311 17 -55 -416 -434 -104 274 -132 -351 -210 8 21 -205 -448 -42 213 87 -268 -246 209
6928 209 276 -334 -518 -64 481 475 -1 -146 156 280 303 -223 114 441 167 -51 148 23 312 217 -42 -55
6950 -55 222 240 99 124 366 506 182 -59 57 298 388 150 29 117 650 595 -68 -89 416 -57 137 270
6972 270 366 176 64 -191 -358 521 342 204 36 -112 186 165 -44 70 144 276 21 103 -256 259 44
6993 44 -480 -153 -21 -42 -87 -235 -417 123 -8 -83 -398 82 93 200 -784 -134 85 227 -125 -206 -413 -115
7015 -115 -113 -227 -333 -74 223 -251 -512 -321 146 102 -407 -628 -176 -64 -267 -279 -236 -161 87 -286 -237 253
7037 253 7 -22 -560 -516 170 111 -52 -206 -181 185 93 -40 -217 -12 259 -186 -279 -92 224 69 -323 -513
7059 -513 -16 210 226 223 -184 207 358 80 -46 250 476 -109 -2 -497 398 516 299 73 232 157 155 51
7081 51 125 498 564 213 27 166 525 362 100 104 203 462 189 171 85 364 314 -14 -53 280 333 239 -185 0
7105 0 317 499 139 -247 323 415 186 -69 -57 224 360 -122 -316 213 372 41 -291 -345 410 174 131 -466
7127 -466 -264 375 -166 -216 -383 111 57 -93 -813 68 32 -161 -173 -163 -87 -43 -364 -386 -221 48 5 -222 -400
7150 -400 -291 134 -241 -499 -476 103 -121 -244 -257 -409 -138 -149 -350 -228 -76 43 -222 -535 -413 -218 178
7171 178 -272 -247 37 139 122 -242 -105 314 -213 43 -42 286 501 243 -423 204 113 447 261 -211 -170 381
7193 381 -51 -178 253 64 250 -15 51 6 462 360 29 152 32 379 142 170 -62 401 144 -238 -35
7214 -35 414 578 211 119 6 479 173 232 -196 488 240 139 183 158 317 292 1 -226 141 534 308 -175
7236 -175 -214 -20 173 -68 135 307 -21 54 -503 -162 46 278 -165 -270 -62 -6 230 -68 -426 -39 -58
7257 -58 -404 -474 -112 -51 -19 -493 -294 -271 122 -169 -244 14 -129 -10 -334 -169 -33 92 -209 -444 -349 257
7279 257 454 -252 -541 -183 -185 -398 -383 -223 -69 -105 -365 -398 -177 252 124 -552 -278 247 -47 -243 -150 -152 116
7302 116 -32 -313 -80 -102 55 -105 -187 -184 372 79 -56 60 138 151 43 -234 9 101 183 60 27 372 249
7325 249 404 -11 142 52 341 -52 -316 224 529 349 130 268 353 646 -54 140 221 630 287 98 -44
7346 -44 461 293 275 -220 13 263 217 -8 140 276 290 -30 -424 67 246 40 -83 -94 191 575 252 -8
7368 -8 -87 72 401 -75 -165 -228 156 -169 -182 -81 169 80 7 -345 -404 351 78 -250 -149 33 231 38 -191
7391 -191 -295 -107 31 -499 -562 -170 12 -61 -139 -250 34 -260 -386 -270 -15 -58 -64 -417 -296 -109 74 -401
7413 -401 -256 -214 63 -154 -339 -150 336 -18 -244 -471 8 335 156 -442 -273 121 273 -18 -180 -232 79
7434 79 -92 -91 -240 267 94 28 -339 -214 214 379 373 -167 24 401 324 335 248 515 114 116 -310 19 735 528
7458 528 100 -211 398 406 415 59 134 416 194 120 -182 368 553 277 -118 32 301 659 119 -57 -4 320
7480 320 216 -335 162 275 125 -206 75 18 274 -58 92 -174 204 248 -124 -245 -353 370 15 -429 -206
7501 -206 101 -70 -252 -152 -163 121 97 -302 -120 74 56 -201 -234 -225 236 -82 -376 -188 -182 -17 -107 -478 -431
7524 -431 88 69 -269 -128 -84 -273 -57 -372 -437 -66 123 -130 -238 -314 305 -44 -413 -261 -109 225 -498
7545 -498 -425 -151 135 -138 -288 -207 144 129 18 -204 -400 128 54 -98 127 7 -40 0 -166 -74 278 93
7567 93 -261 -355 180 592 196 84 -49 335 419 363 4 296 320 73 90 -31 98 298 144 -167 -21 389
7589 389 549 -266 210 -91 -131 609 87 88 484 364 -34 -173 349 408 172 12 -182 260 234 230 -113 183
7611 183 260 420 316 246 51 468 -73 -263 286 308 127 -305 -247 -14 245 -196 -247 -434 95 174 -556 -329
7633 -329 216 481 49 -156 -258 -116 -23 8 -7 -37 209 -66 -620 -192 130 89 -208 -328 -215 -221 54 -344
7655 -344 -403 -328 -21 -112 -368 -368 -19 97 -177 -645 -118 170 -13 -163 -256 -169 -122 -349 -321 -105 362 -248 -367
7678 -367 -381 322 137 -15 -491 -117 -33 147 -38 -42 118 -113 188 -345 -76 286 286 -167 -6 146 89 386
7700 386 -217 -12 430 49 -116 -54 218 106 -73 -155 250 425 433 52 -101 30 120 143 321 176 162 316
7722 316 -63 -35 164 512 109 85 256 586 369 -249 198 295 -35 192 109 -123 343 235 201 -70 146 23
7744 23 -66 20 -269 249 403 -2 -185 -96 267 295 -82 -356 174 151 -337 -293 19 259 39 -497 -171 79
7766 79 98 -151 -480 -25 -90 56 -142 -509 -130 91 -116 -250 -500 -110 -239 -474 -691 -427 -207 229 -355
7787 -355 -477 -110 16 -176 -163 -14 90 215 -353 -384 -90 153 -232 -29 -200 -53 80 -219 -343 38 -30
7808 -30 138 309 -56 380 409 -38 -334 36 177 -67 66 -116 -201 173 127 -176 38 221 84 -21 -106 322
7830 322 175 210 -263 -191 -113 212 242 -165 268 428 145 14 15 352 470 70 2 -57 439 522 257 324 237 198
7854 198 -144 -194 308 467 81 108 -105 241 284 -262 4 244 338 333 -18 -76 313 553 -43 -273 -212 409 159
7877 159 57 -414 -192 203 7 -114 48 -27 -105 -264 -265 127 199 92 -185 -374 162 -177 -228 -279 -105 -91 -172
7900 -172 -212 -58 -41 -30 -217 -241 -101 95 -106 -405 -195 -264 41 -130 -111 -36 -80 -9 -169 -338 -59 -118 -55 -79
7924 -79 -146 -170 68 -413 -426 79 186 -258 -81 -59 52 46 -303 -184 -250 334 13 79 -399 164 165 -21 37 -48
7948 -48 -30 153 73 135 204 357 46 -150 105 361 170 46 -89 294 481 23 46 315 544 304 -322 55
7970 55 258 118 209 79 359 229 452 119 -94 468 248 -161 72 210 173 132 167 -108 104 365 180 -137
7992 -137 -219 111 213 -161 -30 96 113 228 -262 -270 2 169 -178 -140 100 169 49 -279 -341 -127 205 -68
8014 -68 -266 -159 -101 26 -466 -234 -171 -311 -280 -329 -353 33 -104 -592 -354 -307 -37 71 -518 -328 111 18 -295
8037 -295 -620 -205 125 -64 64 -483 216 -51 -414 -492 -210 41 -157 -273 -224 189 88 -38 -10 -59 -27 149
8059 149 63 -142 58 199 33 -104 105 55 -76 116 -47 136 189 206 97 -109 312 183 -125 -124 -75 451
8081 451 380 -44 37 200 430 409 -259 -110 343 369 148 489 214 556 315 109 -105 439 351 147 -341 -12
8103 -12 555 390 150 77 454 11 32 -19 240 606 88 -109 18 303 141 486 -39 -255 146 292 40
8124 40 -243 189 -82 -94 -308 129 50 168 -16 -248 -79 94 21 -142 -265 -48 242 -152 -79 5 160 81
8146 81 -308 -271 198 132 -206 -86 -187 -174 -85 -258 -39 -57 121 -225 -340 -484 -143 -123 -324 -327 256 -316 -275
8169 -275 -178 -149 -12 15 -321 -459 101 140 -71 -247 -29 -67 33 -172 -336 96 177 45 16 -140 -314 62
8191F2
##END NTUPLES=NMR FID
##END=
