##TITLE=1H_Lac-PbMe-C2-recrisf
 CDCl3, 8 sc, 
 26.9.2019
##JCAMPDX= 6.0         $$ Bruker NMR JCAMP-DX V2.0
##DATA TYPE= NMR FID
##DATA CLASS= NTUPLES
##ORIGIN= UXNMR, Bruker Analytische Messtechnik GmbH
##OWNER= root
$$ XWIN-NMR		Version 3.5
$$ Thu Sep 26 15:34:36 2019 Russian Standard Time (UT+4h)  she@DPX200
##.OBSERVE FREQUENCY= 200.1315
##.OBSERVE NUCLEUS= ^1H
##.DELAY= (6, 6)
##.ACQUISITION MODE= SIMULTANEOUS
##.ACQUISITION SCHEME= undefined
##.AVERAGES= 8
##.DIGITISER RES= 18
##SPECTROMETER/DATA SYSTEM= spect
##.PULSE SEQUENCE= zg30
##.SOLVENT NAME= CDCl3
##.SHIFT REFERENCE= (INTERNAL, CDCl3, 0, 15.7039)
##AUDIT TRAIL= $$ (NUMBER, WHEN, WHO, WHERE, WHAT)
$$ ##TITLE= Audit trail, XWIN-NMR		Version 3.5
$$ ##JCAMPDX= 5.01
$$ ##ORIGIN= Bruker BioSpin GmbH
$$ ##OWNER= she
$$ F:/spectra/data/she/nmr/H-F/1/audita.txt
$$ ##AUDIT TRAIL=  $$ (NUMBER, WHEN, WHO, WHERE, WHAT)
(   1,<2019-09-26 15:33:27.65 +0400>,<she>,<DPX200>,
      <created by zg, POWCHK disabled, PULCHK disabled
       configuration hash MD5:
       00 E9 B6 7A A2 85 ED C7 34 08 36 98 17 FE 4E 26
       data hash MD5: 16K
       33 E0 22 5A 09 35 22 B0 94 CC 62 3A E0 12 5D C2>)
$$ ##END=
$$ 
$$ hash MD5
$$ 6E 09 2C 12 5F F9 07 D0 9C 6D EF 0D 3D 68 C5 2A
##$RELAX= 
##$RELAX= 
##$RELAX= 
##$RELAX= 
##$RELAX= 
##$RELAX= 
$$ Bruker specific parameters
$$ --------------------------
##$DU= <F:/spectra>
##$EXPNO= 1
##$NAME= <H-F>
##$PROCNO= 1
##$TYPE= <nmr>
##$USER= <she>
##$AMP= (0..31)
100 100 100 100 100 100 100 100 100 100 100 100 100 100 100 100 100 100 
100 100 100 100 100 100 100 100 100 100 100 100 100 100 
##$AQSEQ= 0
##$AQ_mod= 1
##$AUNM= <au_zg>
##$AUTOPOS= <>
##$BF1= 200.13
##$BF2= 200.13
##$BF3= 200.13
##$BF4= 200.13
##$BF5= 200.13
##$BF6= 200.13
##$BF7= 200.13
##$BF8= 200.13
##$BYTORDA= 1
##$CFDGTYP= 0
##$CFRGTYP= 5
##$CHEMSTR= <none>
##$CNST= (0..31)
1 1 145 1 1 1 1 1 1 1 1 1 1 1 1 1 1 1 1 1 1 1 1 1 1 1 1 1 1 1 1 1 
##$CPDPRG= <>
##$CPDPRG1= <>
##$CPDPRG2= <>
##$CPDPRG3= <>
##$CPDPRG4= <mlev>
##$CPDPRG5= <mlev>
##$CPDPRG6= <mlev>
##$CPDPRG7= <mlev>
##$CPDPRG8= <mlev>
##$CPDPRGB= <>
##$CPDPRGT= <>
##$D= (0..31)
0 1.2 0 0 0 0 0 0 0 0.06 0 0.03 0 0 0 0 0.0002 0 0 0 0 0 0 0 0 0 0 0 0 
0 0 0 
##$DATE= 1569497606
##$DBL= (0..7)
120 120 120 120 120 120 120 120 
##$DBP= (0..7)
150 150 150 150 150 150 150 150 
##$DBP07= 0
##$DBPNAM0= <>
##$DBPNAM1= <>
##$DBPNAM2= <>
##$DBPNAM3= <>
##$DBPNAM4= <>
##$DBPNAM5= <>
##$DBPNAM6= <>
##$DBPNAM7= <>
##$DBPOAL= (0..7)
0.5 0.5 0.5 0.5 0.5 0.5 0.5 0.5 
##$DBPOFFS= (0..7)
0 0 0 0 0 0 0 0 
##$DE= 6
##$DECBNUC= <off>
##$DECIM= 24
##$DECNUC= <off>
##$DECSTAT= 4
##$DIGMOD= 1
##$DIGTYP= 9
##$DL= (0..7)
0 120 120 120 120 120 120 120 
##$DP= (0..7)
150 150 150 150 150 150 150 150 
##$DP07= 0
##$DPNAME0= <>
##$DPNAME1= <>
##$DPNAME2= <>
##$DPNAME3= <>
##$DPNAME4= <>
##$DPNAME5= <>
##$DPNAME6= <>
##$DPNAME7= <>
##$DPOAL= (0..7)
0.5 0.5 0.5 0.5 0.5 0.5 0.5 0.5 
##$DPOFFS= (0..7)
0 0 0 0 0 0 0 0 
##$DQDMODE= 0
##$DR= 18
##$DS= 0
$$ [...]
##$SUBNAM2= <"">
##$SUBNAM3= <"">
##$SUBNAM4= <"">
##$SUBNAM5= <"">
##$SUBNAM6= <"">
##$SUBNAM7= <"">
##$SUBNAM8= <"">
##$SUBNAM9= <"">
##$SW= 24.0689530833862
##$SWIBOX= (0..15)
0 0 2 0 0 0 0 0 0 0 0 0 0 0 0 0 
##$SW_h= 4816.95568400771
##$TD= 16384
##$TD0= 1
##$TE= 0
##$TE2= 300
##$TE3= 300
##$TEG= 300
##$TL= (0..7)
0 120 120 120 120 120 120 120 
##$TP= (0..7)
150 150 150 150 150 150 150 150 
##$TP07= 0
##$TPNAME0= <>
##$TPNAME1= <>
##$TPNAME2= <>
##$TPNAME3= <>
##$TPNAME4= <>
##$TPNAME5= <>
##$TPNAME6= <>
##$TPNAME7= <>
##$TPOAL= (0..7)
0.5 0.5 0.5 0.5 0.5 0.5 0.5 0.5 
##$TPOFFS= (0..7)
0 0 0 0 0 0 0 0 
##$TUNHIN= 0
##$TUNHOUT= 0
##$TUNXOUT= 0
##$USERA1= <user>
##$USERA2= <user>
##$USERA3= <user>
##$USERA4= <user>
##$USERA5= <user>
##$V9= 5
##$VALIST= <valist>
##$VCLIST= <CCCCCCCCCCCCCCC>
##$VD= 0
##$VDLIST= <DDDDDDDDDDDDDDD>
##$VPLIST= <PPPPPPPPPPPPPPP>
##$VTLIST= <TTTTTTTTTTTTTTT>
##$WBST= 1024
##$WBSW= 4
##$XGAIN= (0..3)
0 0 0 0 
##$XL= 0
##$YL= 0
##$YMAX_a= 174277
##$YMIN_a= -298757
##$ZGOPTNS= <>
##$ZL1= 120
##$ZL2= 120
##$ZL3= 120
##$ZL4= 120
##$ABSF1= 10
##$ABSF2= 0
##$ABSG= 5
##$ABSL= 3
##$ALPHA= 0
##$AQORDER= 0
##$ASSFAC= 0
##$ASSFACI= 0
##$ASSFACX= 0
##$ASSWID= 0
##$AUNMP= <proc_1d>
##$AZFE= 0.1
##$AZFW= 0.1
##$BCFW= 1
##$BC_mod= 2
##$BYTORDP= 1
##$COROFFS= 0
##$CY= 11.3945322036743
##$DATMOD= 1
##$DC= 2
##$DFILT= <>
##$DTYPP= 0
##$F1P= 20.1720416913024
##$F2P= 0.152960286110954
##$FCOR= 0.5
##$FTSIZE= 0
##$FT_mod= 4
##$GAMMA= 1
##$GB= 0.15
##$INTBC= 1
##$INTSCL= 1
##$ISEN= 128
##$LB= 0.24
##$LEV0= 0
##$LPBIN= 0
##$MAXI= 10000
##$MC2= 0
##$MEAN= 0
##$ME_mod= 0
##$MI= 1.114404
##$NCOEF= 0
##$NC_proc= 0
##$NLEV= 6
##$NOISF1= 3.799351
##$NOISF2= 2.8
##$NSP= 1
##$NTH_PI= 0
##$NZP= 0
##$OFFSET= 15.70392
##$PC= 1
##$PHC0= -9572.171
##$PHC1= 18.00095
##$PH_mod= 1
##$PKNL= yes
##$PPARMOD= 0
##$PSCAL= 0
##$PSIGN= 0
##$REVERSE= no
##$SF= 200.130013532006
##$SI= 16384
##$SIGF1= 3
##$SIGF2= 2
##$SINO= 400
##$SIOLD= 16384
##$SREGLST= <1H.CDCl3>
##$SSB= 0
##$STSI= 0
##$STSR= 0
##$SW_p= 3612.71676300578
##$SYMM= 0
##$S_DEV= 0
##$TDeff= 0
##$TDoff= 0
##$TI= <>
##$TILT= no
##$TM1= 0
##$TM2= 0
##$TOPLEV= 0
##$USERP1= <user>
##$USERP2= <user>
##$USERP3= <user>
##$USERP4= <user>
##$USERP5= <user>
##$WDW= 1
##$XDIM= 8192
##$YMAX_p= 0
##$YMIN_p= 0
$$ End of Bruker specific parameters
$$ ---------------------------------
##NTUPLES= NMR FID
##VAR_NAME=  TIME,          FID/REAL,        FID/IMAG
##SYMBOL=    X,             R,               I
##VAR_TYPE=  INDEPENDENT,   DEPENDENT,       DEPENDENT
##VAR_FORM=  AFFN,          ASDF,            ASDF
##VAR_DIM=   8192,          8192,            8192
##UNITS=     SECONDS,       ARBITRARY UNITS, ARBITRARY UNITS
##FACTOR=    0.0002076,     1,               1
##FIRST=     0,             0,               0
##LAST=      1.7004516,     0,               0
##MIN=       0,             -298757,         0
##MAX=       1.7004516,     174277,          0
$$ Real data points
##PAGE= N=1
##DATA TABLE= (X++(R..R)), XYDATA
0 0 0 0 0 0 0 0 0 -8 8 -8 16 -16 24 -32 32 -40 50 -62 72 -85 98 -117 134 -154 178 -205 233 -264 300 -339
30 -339 382 -430 480 -539 603 -668 746 -828 919 -1019 1128 -1249 1383 -1530 1696 -1881
46 -1881 2089 -2327 2599 -2914 3287 -3734 4279 -4966 5856 -7071 8827 -11612 16713 -29113
60 -29113 120937 45447 -255750 -73569 120147 75597 -54796 18602 58631 -40920 -102077
71 -102077 18626 81109 4940 -54521 -10573 -15180 -54552 -6111 92406 59276 -56059 -83634
83 -83634 -12625 27076 33180 49892 37682 -34029 -58343 10464 61632 16745 -24163 5964
95 5964 23907 -28334 -48601 23897 77861 11400 -87347 -84970 -371 52893 34875 -7857 -36030
108 -36030 -41732 -26577 -1984 15554 21056 12943 -14510 -39065 -16432 39197 51644 143 -39759
121 -39759 -23377 4808 12527 27756 42632 6156 -58678 -58394 10266 45955 9870 -24874 -14978
134 -14978 -2552 -16343 -24045 -4221 15342 7233 -23043 -37114 -5950 42901 41902 -16567 -49700
147 -49700 -13511 28764 22854 6925 17362 14823 -13791 -15718 17851 21641 -11540 -14602 18647
160 18647 21277 -10416 -14314 7536 1279 -21538 -9251 14719 1007 -18406 3330 26872 815
173 815 -30256 -11899 17463 10733 697 17783 22524 -5165 -13163 16236 24429 -7473 -13878
186 -13878 23717 35966 -2132 -20899 5911 17882 -7244 -17086 4704 8404 -10345 -6721 14863
199 14863 6591 -19411 -16615 -1134 -7700 -9873 20158 35190 -1860 -33868 -14467 15138 14990
212 14990 12245 16482 -3459 -26470 474 43836 25681 -27012 -29566 4534 4815 -9462 12730
225 12730 29613 -9365 -49215 -28220 7450 5111 -926 11338 -1189 -37326 -29746 19488 30728
238 30728 -6771 -24461 -7475 84 -263 20822 33064 627 -31932 -20171 3600 6819 16109
251 16109 33261 9711 -44429 -48903 6443 38115 10229 -21341 -23400 -18348 -12121 10379 26382
264 26382 1907 -33399 -32217 -6346 11252 21581 29886 11747 -28695 -38745 49 36646
276 36646 32183 9417 -4855 -15822 -17296 9566 38161 21205 -23696 -34899 -4845 15105
288 15105 11024 10856 11309 -14567 -42964 -25523 19763 33923 12889 -4750 -12659 -21749 -11393
301 -11393 26331 42445 7376 -27583 -13588 17415 23795 19464 17943 -584 -28694 -21077 18494
314 18494 34878 15804 -1049 -8696 -25319 -27810 9019 37704 11781 -26661 -22573 764 3940
327 3940 4947 16451 5802 -26426 -25427 14867 33717 13765 -35 1597 -10920 -22903 3417
340 3417 36234 23745 -10292 -14422 -3339 -7119 -4795 16324 13954 -24144 -34736 3839 25742
353 25742 -849 -20016 -6895 -3502 -20489 -12376 19093 19199 -11136 -16682 3694 3033 -12799
366 -12799 -2170 19711 9578 -13447 -6216 12039 4637 -9075 -510 5487 -10408 -15073 6882
379 6882 15275 -6013 -17120 -2678 -2363 -18980 -11912 14859 12377 -15201 -16667 5605 7233 -9234
393 -9234 -6435 6113 1019 -4288 12675 19200 -5100 -20438 1454 21144 7687 -7638 -785
406 -785 5029 75 4631 13191 -1597 -23734 -15351 11714 16594 2973 -2214 -4371 -14763 -13196
420 -13196 8513 19511 4550 -8328 -3423 1604 2185 12574 19398 1145 -19454 -7295 18888
433 18888 21791 8603 5201 1110 -13605 -14881 8951 23988 10157 -6794 -6797 -7377 -11585 1126
447 1126 21021 11514 -19562 -24723 -30 16135 11870 8527 3295 -17634 -27711 1276 35971
460 35971 27747 -5005 -14835 -6070 -5774 -1667 20896 27887 -5345 -32712 -14847 16117 15863 1607
474 1607 -1297 -10782 -29691 -20746 17548 32059 2853 -22528 -20360 -16327 -12261 14891 36420
487 36420 9838 -34403 -31536 7167 23058 13398 7916 -3362 -28694 -26887 18646 46526 13129
500 13129 -29503 -29293 -9499 -1441 9153 22916 8291 -26173 -31665 -5244 9679 5548 5931
513 5931 3491 -17362 -27618 -572 28076 18275 -6273 -13720 -11758 -11088 6167 32367 27337 -9988
527 -9988 -29172 -12807 7330 13273 16746 13580 -9874 -28810 -13199 16920 21374 3971 -9619
540 -9619 -16631 -19458 -2349 27380 30007 -4553 -30771 -18373 6987 16823 18608 15604 -2518
553 -2518 -21566 -11231 18673 25528 6057 -6458 -3171 -2593 -2716 10497 20306 5529 -16390 -14539
567 -14539 -811 3650 7298 15550 7694 -17551 -24305 -226 18981 10777 -1849 -2488 -4632 -8860
581 -8860 2161 19233 12508 -9485 -13502 865 8486 7077 9535 6556 -8080 -14585 -1792 7696
595 7696 2215 -280 5706 -481 -16284 -12476 6993 10044 -5899 -11787 -3174 594 -3646 1143
609 1143 6442 -2906 -13030 -6137 6206 5311 -679 1297 1519 -5509 -5715 3068 3471 -4871 -2964 6379
625 6379 2870 -9722 -7803 3776 1353 -9231 -6584 4521 1046 -9439 -5419 4284 434 -7531
639 -7531 -3435 1703 -4150 -4617 8285 11635 -3492 -12275 -3042 5638 3631 5152 9406 -1274 -13857
654 -13857 -3972 14201 9657 -7016 -6076 2641 -2954 -7294 8089 15819 -2971 -18428 -7073 6579
668 6579 2032 1729 12450 7481 -14115 -16050 7222 17199 6564 901 2408 -5785 -9829 9478
682 9478 25115 9285 -14232 -11304 3236 5305 5863 14762 9960 -14288 -22612 -848 17113 10755
696 10755 434 -2212 -8486 -13891 -768 19027 15698 -6175 -15769 -6856 3651 9828 16071 10247
710 10247 -10055 -20401 -5306 14715 16386 5567 -2349 -8117 -13586 -5922 11356 15564 616
723 616 -13608 -13447 -6521 1664 11026 11624 -4809 -21700 -16784 2921 14484 11715 3381 -9205
737 -9205 -19831 -12782 10120 22065 8373 -9986 -14359 -9044 -1123 11161 16249 1057 -20213
750 -20213 -18928 103 11584 9177 3132 -7143 -19190 -16387 4788 17408 5671 -8616 -8421
763 -8421 -7021 -8122 1848 16505 9813 -12483 -16410 653 9955 5211 5284 5747 -7638 -18257 -2880
778 -2880 18142 14326 -3088 -8168 -5218 -7166 -2638 12765 14534 -5284 -16534 -3986 7143
791 7143 3068 2881 8354 367 -15456 -8467 14444 17953 -176 -7087 107 -263 -4306 5388 16691
806 16691 6483 -9671 -6827 5019 4481 1275 6403 5969 -7595 -10960 4900 13639 2224 -5973
820 -5973 -402 259 -5570 586 12607 6797 -9355 -7769 6490 7111 -2239 -1030 5238 737 -4632
835 -4632 2717 8673 -502 -7355 447 6481 405 -3761 1399 1519 -4900 -2460 5537 1893 -8880
850 -8880 -6816 3822 4573 -1121 -2060 -1448 -6113 -5488 3917 6990 -2065 -7649 -1671 2069 -1933 -1495
866 -1495 3066 1170 -5382 -4190 1212 10 -2288 1952 3414 -6071 -11602 -2859 7414 4607 -2543
881 -2543 -3688 -5523 -8992 -2764 9914 8517 -6196 -12389 -3725 2781 1963 4447 6503 -3813 -15197
896 -15197 -7614 10945 14452 1853 -6439 -6369 -6522 -2869 10074 14840 -65 -14458 -9435 3081
910 3081 6277 5029 6354 601 -12528 -11976 6366 16055 6864 -3159 -4913 -6975 -6752 6649 20292
925 20292 10346 -11536 -15201 -113 9170 9075 8914 4100 -9596 -13882 1938 16271 10818 -851
939 -851 -4350 -7067 -8487 2239 17261 13089 -6357 -13687 -4845 2618 5490 11075 9945 -6459
953 -6459 -17189 -4921 12232 12460 2792 -692 -4810 -11612 -5871 12480 18430 2178 -13412 -12539
967 -12539 -3384 5412 12788 11033 -4448 -18386 -10983 6335 12449 6555 -315 -7643 -14034 -7190
981 -7190 10332 15489 1128 -11253 -9284 -3465 -1177 5883 11740 2593 -14417 -14668 511 9789
995 9789 5527 634 -3397 -9768 -10096 1268 10457 5312 -4238 -6607 -7238 -6935 1310 13099 8209
1010 8209 -10612 -15907 -3038 6366 4386 3491 2643 -6450 -14266 -3423 12298 10268 -3971 -8349
1024 -8349 -3352 -2343 -1119 6105 8626 -787 -9389 -5297 1971 4152 5453 5659 -2186 -10833 -4818
1039 -4818 8765 9369 -369 -4282 -46 -726 -2850 2706 8583 3226 -5549 -3936 2693 3248 714
1054 714 3198 4666 -1175 -5358 -536 6283 5187 825 -601 -1056 -1420 1691 5850 3577 -2218 -1598
1070 -1598 3190 2109 -1888 969 5606 2489 -3483 -1630 2902 1093 -1317 2382 4309 -1660 -4966
1085 -4966 436 4007 144 -974 2464 776 -4746 -2586 4601 3704 -1852 -1167 997 -3174 -5101
1100 -5101 2967 8053 -148 -7335 -2325 1861 -2073 -1996 5661 3592 -8000 -9363 1344 6082 421
1115 421 -1713 -469 -5195 -8993 19 9240 3656 -6464 -5993 -2005 -2823 -753 6642 5806 -6303
1130 -6303 -10514 -1825 4216 1795 1763 3089 -3977 -11856 -4654 9147 9647 -1783 -8493 -5932 -3287
1145 -3287 0 6848 7435 -3039 -10492 -5809 2510 3614 3462 3954 -1117 -9399 -7009 5690 11368
1160 11368 4372 -2677 -4344 -5584 -3530 6976 14406 5173 -9939 -11534 -475 7288 7588 5405
1174 5405 -25 -8912 -8827 3059 11466 6935 -934 -4487 -6027 -4365 5110 14276 7932 -6929 -10354
1189 -10354 -979 5488 6440 7611 4947 -5175 -10147 -1171 9755 8599 885 -2628 -4014 -5251
1203 -5251 -701 8756 9579 -1156 -8464 -6278 -1386 3058 7978 8004 -3100 -12391 -7188 5924 9624
1218 9624 4242 -689 -4126 -6842 -3447 6217 11074 2411 -7987 -8208 -2303 2455 5708 6161 -1118
1233 -1118 -10497 -9748 924 7412 3503 -1581 -4598 -6456 -5827 1899 7152 2159 -6125 -6217 -1753 -835
1249 -835 851 5637 4438 -6056 -10569 -1787 6595 4225 -576 -621 -3593 -7167 -2294 6258 4687
1264 4687 -4242 -5902 -870 -114 -2209 1601 3392 -2808 -7124 -1056 3734 256 -1067 3378 1602
1279 1602 -5828 -4457 5024 5871 -1189 -1809 3419 1467 -4253 -377 6279 2844 -3967 -1449 3217
1294 3217 929 -1307 2222 2922 -3233 -4586 2295 4774 -561 -1761 2017 2113 -1418 -830 2728 1270
1310 1270 -1459 2538 6407 1488 -4631 -1338 5504 3769 -244 954 2313 -922 -1474 3548 5797
1325 5797 -28 -4405 -1836 1412 1634 2201 3497 -83 -5908 -5261 2326 5620 2401 -905 -1773 -3207
1341 -3207 -1688 3774 6547 1174 -4662 -3151 955 1110 2252 4612 1743 -5559 -7499 -786 4219
1356 4219 3304 957 -1003 -5962 -8156 -1818 6654 5047 -3876 -7883 -4958 -1492 2629 5807 2617
1371 2617 -5750 -8819 -2802 3590 4887 4239 1146 -5391 -9505 -2357 8093 7441 -1162 -5258 -4429
1386 -4429 -4094 -1207 4999 6664 -2613 -10926 -7729 1408 5351 4366 1319 -5024 -10491 -5767 5601
1401 5601 9778 3980 -3170 -5492 -5208 -1219 7456 10975 1667 -8804 -7203 2025 6363 5111 3948
1416 3948 -160 -8002 -8672 2003 11075 6851 -2243 -5481 -5552 -4151 2700 10186 6438 -4809 -8802
1431 -8802 -1342 4562 5533 5690 3648 -4419 -8061 382 10152 9022 1716 -1931 -3779 -5387 -519
1446 -519 9812 10386 -1371 -8922 -4809 1206 3399 4508 4234 -3301 -9453 -4020 6643 7909 1354
1461 1354 -2700 -3938 -4821 -1604 7087 9372 1767 -5324 -4351 -1096 1246 4625 5991 410 -7069
1476 -7069 -5301 2177 4697 1877 -944 -3149 -6013 -4653 2662 6025 824 -4840 -5573 -3513 -1739
1491 -1739 854 4841 1954 -4870 -6035 -997 2413 1807 805 -89 -3159 -4261 623 5077 1993
1506 1993 -3105 -3373 -1575 -1585 -828 2793 2987 -2607 -5375 -1630 623 -1068 -1870 1117 477 -3766 -2999
1523 -2999 2118 2544 -2828 -2785 1484 1824 -2076 -107 4250 2549 -2156 -1509 1733 580 -1159 1893
1539 1893 4309 189 -3227 -340 1324 -1265 -1042 2376 2000 -2704 -2350 2876 1813 -2032 -818 3088
1555 3088 447 -3498 17 5904 4183 -1107 -949 1266 226 -7 4549 6267 1004 -3064 -1015
1570 -1015 903 991 2814 4000 -540 -5194 -2379 4018 3598 -399 -1445 -1234 -3684 -2995 3567 7214
1586 7214 1734 -5203 -3932 -65 1218 2483 5458 2798 -3721 -5260 989 5158 3685 906 -1692
1601 -1692 -4836 -4452 2712 7559 2497 -5494 -6668 -3408 -1590 1401 5145 2529 -6299 -9636 -2261
1616 -2261 4445 2741 28 -733 -3621 -6055 -739 7436 6329 -1968 -6518 -4270 -809 1990 6084
1631 6084 4888 -3536 -9021 -4912 1463 3067 1855 1100 -3465 -8846 -5006 4057 6081 -99 -5093
1646 -5093 -4810 -3486 -648 5813 8204 94 -8618 -7102 1596 6375 6063 3513 -1394 -6346 -4804
1661 -4804 3373 7927 4045 -2389 -4538 -3404 -853 4050 6175 1355 -6163 -6885 -1097 3733 4670
1676 4670 3924 1033 -4418 -6245 80 7171 6461 886 -1934 -1687 -1087 2282 6811 5851 -1495 -5481
1692 -5481 -1922 3515 4752 4220 1973 -3312 -6610 -2369 4374 5551 506 -1737 -2001 -2806 -1488 3603
1708 3603 5316 -641 -4626 -1669 2234 2110 2260 3070 -21 -5064 -3048 3804 5271 1188 -101 32
1724 32 -2829 -3732 1044 4626 919 -3715 -2269 107 -939 -1224 1199 -111 -4667 -4009 856 2409
1740 2409 -720 -1366 -22 -1911 -3869 -194 3536 836 -2653 -641 1975 -582 -2939 -329 1941
1755 1941 -501 -2149 246 1090 -1993 -2722 -254 323 -2048 -2600 -267 -240 -1641 -269 1105 -1255
1771 -1255 -3732 -1808 1716 991 -585 1109 1976 -1317 -3030 643 3869 1451 -1140 354 1222 -796
1787 -796 -798 2893 2947 -1982 -4075 -593 1563 1884 2089 1412 -2978 -5322 -1200 4289 4095 406 -517 -1282
1805 -1282 -2281 -71 4836 5534 -407 -3494 -661 3233 3853 3729 3277 -748 -4816 -2553 3927 6486
1821 6486 3064 -591 -3343 -4443 -1670 3827 5591 804 -4454 -4121 -1063 1258 4016 4169 -730
1836 -730 -6472 -4525 2839 6855 4271 711 -2018 -4532 -3507 3116 7758 4467 -3052 -5669 -2831
1851 -2831 388 3156 4541 504 -6408 -7363 -1122 4406 3592 574 -2905 -6494 -6876 214 7221 5189
1867 5189 -2615 -5997 -3606 -971 1588 5423 4669 -3004 -8044 -3085 4291 5350 1692 -1620 -5139
1882 -5139 -7311 -2397 5930 6169 -1403 -6274 -5777 -4029 -178 4961 5428 -2458 -8512 -4476 2540 3954
1898 3954 1975 1325 -1135 -5463 -3714 4675 8494 2494 -3729 -4212 -2412 323 3978 6226 1430
1913 1430 -5394 -5883 -487 2720 2794 2176 -1059 -5141 -4296 2321 5941 2291 -1996 -2794 -2002 -1064 3046
1930 3046 6663 4230 -2198 -4704 -530 2914 4328 3653 1847 -1919 -3428 201 4570 3700 -168
1945 -168 -2016 -2054 -1576 883 4102 2996 -1923 -4229 -1968 1063 1583 1886 2046 -59 -2841 -1340 2220
1962 2220 2905 41 -653 375 -343 -345 1971 3654 277 -2864 -1681 1461 795 137 1005 487 -2486
1979 -2486 -3162 -205 893 -1232 -1726 -252 -336 -1784 -442 918 -1444 -2868 -524 2024 -151 -1764
1995 -1764 -57 1211 -1074 -2000 522 1319 -1738 -2078 1087 2480 -653 -2686 -1377 -1159 -2125 -187
2011 -187 2162 -280 -3810 -3050 115 258 -589 508 136 -2925 -2904 1778 4030 519 -1833 -1092 -541
2028 -541 -880 1249 4741 3139 -2540 -4428 -71 2145 1438 1465 1123 -1918 -4258 -1214 3716 3414 -678
2045 -678 -3062 -2833 -2213 1355 5047 4014 -1871 -4620 -1724 1549 2904 4260 3825 -775 -4347 -976
2061 -976 4910 5802 1396 -1178 -1181 -1621 -109 4225 5420 23 -5291 -4819 183 3097 4193 2784 -1600
2078 -1600 -5333 -3793 1682 4656 3442 -52 -2768 -3874 -992 5224 6564 1599 -4246 -4353 -211
2093 -211 2689 4501 4212 283 -5093 -6190 -116 4947 4077 -148 -3679 -4783 -3093 1052 3527 1923
2109 1923 -2291 -4619 -3872 -776 3482 4413 1164 -4629 -5874 -1506 3336 4111 1949 -944 -3382 -4468
2125 -4468 -642 3904 4461 -737 -5087 -4027 -935 1752 2426 996 -2750 -5662 -3867 1473 3629
2140 3629 2302 -1113 -3691 -4664 -1989 3431 4438 510 -3560 -2581 -223 959 2516 3256 -146 -4042
2156 -4042 -2816 1349 3535 2158 354 -1175 -3349 -2993 1311 3973 1767 -1863 -2074 -766 -806 988
2172 988 2958 1527 -2160 -2448 1226 2661 1253 1178 584 -529 -1434 1649 4036 2236 -482 -157 493
2189 493 19 166 2246 2035 -548 -1366 767 1315 -223 -294 594 354 -921 55 1961 1082 -624 -356
2207 -356 933 208 -280 455 1529 -51 339 1059 1643 -365 -1359 566 1028 324 276 710 -415 -2120
2225 -2120 -1048 1572 868 -1524 -1497 -728 -870 -550 931 1138 -1934 -3898 -1400 1383 1592 834 170
2242 170 -1548 -3047 -1386 2361 2687 103 -2004 -1808 -1327 -291 2185 1975 -1508 -4209 -2726 122
2258 122 1766 936 486 -2003 -4967 -3527 1585 3903 1296 -2154 -3359 -2551 -733 2239 3564 1259
2274 1259 -3211 -3904 -376 3016 3408 2097 -833 -4346 -3552 1557 4769 2877 -1063 -3178 -3634 -1713
2290 -1713 1426 4665 2725 -3218 -5406 -2082 2746 4011 2755 242 -2984 -4189 -364 4855 6150
2305 6150 1486 -2365 -3337 -1468 2192 5596 4975 -231 -4517 -3024 1088 3270 3661 2326 -2029 -5295
2321 -5295 -2540 3839 5511 2152 -1827 -3404 -2700 -128 4479 5852 1290 -4353 -3904 107 2746
2336 2746 4211 3525 -370 -4350 -3673 2375 5313 2897 -888 -2548 -3823 -1475 2654 5336 1552
2351 1552 -3804 -4772 -1993 1152 2700 3106 -47 -4091 -5050 -395 3913 2973 -48 -2129 -3490 -2577
2367 -2577 1023 4387 2827 -2299 -4609 -2877 176 2125 2638 991 -2552 -4849 -1981 1622 2183
2382 2183 252 -1434 -2848 -3397 -888 2774 2621 -900 -3522 -2707 -271 777 2018 2248 -1111 -3571
2398 -3571 -2404 1273 2530 1339 -301 -1061 -1566 -1089 1259 2543 347 -1945 -1583 -641 782 1318
2414 1318 1536 111 -2320 -1403 433 1715 728 247 201 -467 -680 811 2245 939 -807 -304 1084
2431 1084 1587 318 845 1034 -174 -267 1174 1396 337 -27 395 665 359 128 408 -151 -556 871
2449 871 1840 471 -613 -435 180 256 214 1482 1188 -909 -1746 319 2156 1257 -9 223 172 -953
2467 -953 -171 2204 2143 -360 -2353 -1517 -296 720 1661 897 -1922 -3204 -1063 1438 1341 117 -445
2484 -445 -1830 -2869 -1044 2776 3149 -640 -3227 -1888 -114 646 2163 2028 -1012 -4099 -3126 693
2500 693 2311 1304 -364 -2125 -3895 -1964 2163 3123 -47 -2848 -3159 -1825 -398 2235 3101 -352
2516 -352 -4322 -4438 209 2931 2247 612 -1485 -3128 -2844 1219 4283 2525 -1403 -3545 -2670 198
2532 198 2724 3662 967 -3494 -4133 -952 2396 2965 1912 -781 -3296 -3380 361 4567 3479 68
2548 68 -2386 -2616 -623 2460 3983 2788 -1249 -3495 -1814 1636 4063 3322 548 -2776 -3241 -594
2564 -594 3427 4223 1466 -1604 -2667 -1521 873 3827 3278 -98 -3225 -2404 783 3545 3467 1573
2580 1573 -1033 -2989 -1268 2244 3759 2089 -725 -2193 -1600 -40 2837 3557 636 -2713 -2732 -587
2596 -587 1619 2067 1566 -766 -3288 -2537 660 2828 1399 -547 -1910 -1942 -1097 719 2499 1293 -1824
2613 -1824 -3065 -749 531 1189 1366 -233 -2012 -2194 -189 1179 979 -507 -1104 -1590 -1476 -563 1216
2630 1216 1187 -1306 -2517 -943 -41 -78 33 298 -646 -1826 -825 704 731 -687 -730 -536 -517 -563 462
2649 462 963 -426 -906 410 515 -274 -642 282 380 -705 -268 834 523 -987 -1124 630 1401 -190
2667 -190 -90 320 -477 -488 1051 1536 326 -969 -147 395 774 1103 1342 404 -1477 -711 1490 2191 1087
2686 1087 96 -14 -632 -380 1677 2430 927 -1059 -1361 243 982 2057 1883 295 -2269 -1648 1374
2703 1374 2863 1949 125 -424 -1906 -1067 1562 3548 2200 -1255 -2753 -1198 872 2181 2121 884
2719 884 -2216 -2971 -586 2278 2701 838 -1392 -2923 -1986 488 3122 2295 -1083 -3251 -2521 -452
2735 -452 1565 2535 1271 -1900 -4309 -1955 1667 2885 1217 -1319 -2598 -3083 -761 2294 3536 285
2751 285 -3203 -3973 -1340 1121 2315 2370 -1184 -4149 -3312 479 3021 2017 -703 -2511 -4031 -2090
2767 -2090 1856 4361 1420 -2690 -3883 -2155 711 2391 2946 684 -3482 -3890 -605 2885 3013 1056
2783 1056 -1589 -3212 -2788 584 4128 3053 -1012 -2973 -2261 -143 2475 3376 1757 -1846 -3871 -1088
2799 -1088 2443 3163 1781 -147 -2006 -2439 -396 3483 3546 688 -2169 -2061 -286 1559 3128 2532
2815 2532 -49 -2721 -1687 1316 3086 2510 712 -1181 -2413 -702 2397 3470 1281 -1008 -1687
2830 -1687 -1111 630 1990 2690 622 -2161 -2529 -82 2292 1929 827 -873 -1720 -1305 558 1979
2846 1979 1433 -464 -1470 -1253 -852 995 1966 735 -1729 -2022 -241 1029 654 276 -139 -1343 -1743
2863 -1743 -259 1084 782 -387 -937 -1131 -527 -103 343 304 -811 -1212 -498 -52 -248 -168 -130 -767 -838 -679
2883 -679 204 -82 -730 -442 -143 -199 -829 -182 -79 -335 -444 -292 -24 -553 -767 -378 328 -46 -234 3
2903 3 -837 -715 -271 975 598 -454 -960 -292 116 452 693 902 -88 -1357 -667 634 1599 974 288
2922 288 -500 -1408 -387 1709 2221 545 -802 -712 -468 197 1532 2086 380 -1493 -1356 641 1739
2939 1739 1575 1164 -276 -1418 -830 1263 2654 1750 -385 -1391 -1243 -121 1791 2829 1296 -1725
2955 -1725 -1991 -359 1324 2050 1664 -130 -2061 -2097 522 2675 2249 36 -1596 -2073 -973 1234 2793
2972 2793 1509 -1300 -2699 -1595 769 1841 2054 215 -2044 -3107 -929 2199 2348 438 -1356
2987 -1356 -2722 -2518 101 2477 2260 -889 -3062 -2675 -508 1206 1636 737 -1599 -3300 -2343 1141
3003 1141 2601 1074 -1208 -2592 -2418 -919 1549 2189 39 -2228 -2854 -1476 420 1888 1477 -735
3019 -735 -2867 -2369 158 1849 1478 123 -1651 -1825 -1919 1197 2782 1260 -1402 -2540 -1433 550
3035 550 1853 1819 655 -1562 -2308 -322 1594 1973 1242 -556 -1754 -1524 620 2374 1903 -764 -1802
3052 -1802 -1136 421 1314 1866 1275 -454 -1915 -853 1687 1974 1225 53 -989 -730 421 1431 1845
3069 1845 620 -483 -591 -63 412 1368 1502 156 -1189 -489 873 1092 622 157 3 -286 -562 531
3087 531 1168 432 -668 -214 211 119 227 535 279 -637 -301 472 465 10 -261 211 -133 -570 -52 679 -352
3108 -352 -954 -122 474 -192 -850 -516 -114 -667 105 229 -220 -904 -1282 -364 318 -112 -362 -258 -861 -814
3128 -814 150 861 -21 -854 -1374 -865 -302 170 769 25 -1685 -1841 -520 536 847 152 -489 -1498 -1614
3147 -1614 -125 1180 949 -447 -1548 -1379 -399 1172 1651 1289 -972 -2047 -873 813 1655 1107 238
3164 238 -1277 -1692 -502 1996 2186 275 -1161 -1577 -581 837 1892 1814 -44 -2279 -1647 494 2448
3181 2448 2202 680 -938 -1894 -885 1738 2759 1494 -496 -1653 -1255 531 2245 2751 764 -1979
3197 -1979 -2303 71 2128 2650 1311 -368 -2089 -1841 641 3169 2704 -102 -2015 -2120 -514 1826
3213 1826 2781 1252 -1308 -2548 -900 1218 2170 2066 185 -1744 -2744 -470 2780 2629 438 -1894
3229 -1894 -2193 -1182 501 2191 1688 -666 -3267 -2307 -620 1622 2160 267 -2240 -3187 -1287 1256
3245 1256 2207 1043 -1194 -2175 -2311 -496 1639 2206 313 -2612 -2490 -576 893 1603 849 -626 -2498
3262 -2498 -1957 -121 1487 1274 -537 -1961 -2347 -989 920 1862 626 -1594 -1922 -1124 417 1438
3278 1438 1198 220 -1843 -1963 -283 1899 1793 504 -981 -1707 -957 504 1473 1490 -64 -1323 -970
3295 -970 -288 794 1600 669 -914 -1357 -501 872 1150 808 456 -727 -833 290 1165 1314 558 -381
3313 -381 -588 135 716 1077 1079 699 -525 -204 153 749 939 556 -16 -346 -182 401 935 244 378 -134
3333 -134 94 13 281 597 346 -84 -119 241 89 23 340 224 -9 -491 -363 -113 -12 -269 302 293 -306 -259
3355 -259 -455 309 245 149 13 -620 -1007 -739 377 363 -231 -915 -900 -780 -347 313 979 -135 -1102 -1403 -455
3376 -455 180 630 554 -386 -1430 -1571 196 597 561 -391 -742 -1539 -1140 198 1194 693 -1067 -1658 -1007
3395 -1007 -189 383 952 477 -1372 -2024 -885 766 1390 676 -511 -1563 -1567 163 1801 1292 -259 -1066
3413 -1066 -1150 -643 834 1948 1327 -979 -1964 -680 923 1774 887 127 -1110 -1517 -55 1757 2034
3430 2034 922 -1035 -1306 -476 1203 2374 1788 -74 -1283 -1023 635 1874 1721 1340 -618 -1674
3446 -1674 -1088 1547 2499 1222 -619 -1588 -910 190 1658 2299 912 -1271 -1921 -426 1260 1762 1168
3463 1168 35 -1567 -1471 436 2285 1649 -33 -881 -1126 -657 825 1911 1575 -961 -2303 -1080 429
3480 429 1225 722 154 -1580 -1763 -876 1103 1549 120 -1124 -1508 -1309 17 1432 1000 -324 -1864
3497 -1864 -1347 50 709 1051 402 -1252 -1789 -1264 420 1346 549 -689 -1460 -1213 -418 542 1181 -143
3515 -143 -1363 -1262 -629 224 595 568 -419 -1276 -1223 133 769 578 -326 -686 -786 -670 241 816 623 -670
3535 -670 -835 -313 516 364 184 509 -461 -867 -321 709 115 -200 -24 136 -68 188 200 676 316 113
3555 113 393 325 329 300 690 417 -71 -2 761 357 -26 274 821 613 127 48 323 139 228 409 608 -233
3577 -233 3 400 28 389 729 543 -383 -679 56 871 746 208 -229 -182 -34 -14 995 821 236 -662
3597 -662 -658 161 836 891 711 -665 -1169 -560 629 1170 557 -180 -1416 -1702 -430 796 1231 264 -1008
3616 -1008 -1546 -785 576 900 746 -173 -1439 -1535 -15 1303 1219 -250 -1246 -1682 -1078 476 1058 600
3634 600 -919 -1607 -1354 -141 878 1200 -133 -1689 -2197 -193 1050 1181 100 -966 -1688 -1367 62
3651 62 1447 1474 25 -1680 -1573 -215 1010 1770 680 -1270 -1947 -803 789 1742 1164 66 -1672
3668 -1672 -1746 -617 1320 1972 770 -1292 -1595 -636 892 1840 1317 -117 -1664 -1690 371 1914 1972 811
3686 811 -736 -1659 -758 1211 2587 1548 -660 -1592 -1363 324 1880 1843 758 -1028 -1311 -262 1217
3703 1217 2128 1065 -447 -1469 -1341 785 2138 1606 -14 -1010 -1167 -241 1041 1977 1146 -450 -1612
3720 -1612 -728 863 1373 1226 64 -1189 -1537 -111 1271 1478 350 -815 -1255 -1160 199 1154 1013
3737 1013 -324 -1274 -1309 -17 974 635 477 -982 -1731 -855 532 851 516 -502 -1033 -1528 -269 575
3755 575 1031 -297 -1182 -1231 -415 334 141 518 -218 -830 -1060 -342 384 359 -239 -1016 -783 -276 -199 827
3775 827 237 -285 -697 -299 -82 280 580 284 -449 -692 -222 172 627 -230 93 -16 -137 -260 134 359
3795 359 385 -243 -394 173 81 318 -116 249 416 240 234 -184 18 837 1053 26 -79 138 -4 -100 219
3816 219 631 562 -277 -429 215 670 909 118 -116 -214 -114 355 846 700 414 -55 -531 -518 820 885 648
3837 648 -96 -475 -496 373 1049 613 537 -710 -740 -178 666 1265 206 -548 -959 -670 -12 861 931 -315
3857 -315 -1158 -1015 -203 630 1133 689 -479 -1573 -1010 510 1046 672 -447 -968 -1145 -545 1108 1509
3875 1509 89 -1079 -1748 -787 203 1069 850 -400 -1856 -1624 -176 779 801 16 -1099 -1760 -1025 366
3893 366 1186 646 -974 -1497 -1262 -172 977 1161 93 -1409 -1524 -557 1069 1291 649 -920 -1274 -881
3911 -881 14 1560 1433 -102 -1520 -1223 -346 925 1481 640 -613 -1209 -960 432 1417 960 -51 -848
3929 -848 -1150 102 1300 1850 678 -712 -894 -363 770 1369 1367 157 -938 -1068 -105 1339 1557 657
3947 657 -588 -954 -389 605 1340 924 -8 -1029 -417 -49 919 1168 689 -668 -911 -512 1017 1376 614
3966 614 -194 -401 -950 -156 965 1154 355 -658 -789 -155 780 812 222 -571 -694 -580 352 515 224 -56
3986 -56 -571 -716 -278 309 666 -16 -659 -804 -84 -178 358 -97 -156 -588 -575 -327 57 -281 -22 -396 -793
4007 -793 -294 302 172 -468 -719 -459 -155 -385 -282 -292 -164 -341 -260 3 -352 23 -377 -444 20 -64 27 -229
4029 -229 -205 -329 195 331 -51 -106 -47 -488 28 333 158 -63 -418 -478 -92 582 645 19 -352 -650 -365 334
4051 334 520 704 -230 -326 -497 17 919 1026 781 -321 -571 -255 700 1425 1048 -12 -970 -558 313 1011
4071 1011 1069 252 -540 -718 19 905 1650 729 -230 -783 -684 652 1136 1204 427 -756 -936 -179 992 1249
4091 1249 941 -530 -1358 -583 511 1356 1144 -204 -1264 -1031 -166 1104 962 480 -873 -1649 -1001 650
4109 650 1461 1183 -400 -1645 -1501 -520 1353 1465 108 -1362 -1410 -868 442 860 835 -593 -1712 -1628
4127 -1628 -54 1433 976 -366 -1416 -1639 -1035 601 1318 717 -1055 -1893 -1475 -73 992 863 104
4144 104 -1593 -1563 -277 753 1101 438 -725 -1445 -977 7 1358 1002 -280 -1445 -1204 -460 796 787
4162 787 749 -961 -1209 -1032 421 1321 1078 -218 -1189 -1351 92 1162 1345 113 -497 -1073 -516 522
4180 522 1446 1178 -160 -1214 -727 368 1058 1077 235 -477 -559 -262 793 996 594 32 -794 -583 155
4199 155 920 1246 640 -989 -529 -61 669 722 684 88 -626 -535 244 930 533 -29 -427 -145 181 729 1000
4220 1000 464 -395 -374 -468 418 585 460 88 -766 -514 -472 557 331 -354 -287 -348 -329 -144 52 257 -314
4241 -314 -480 -359 -255 73 -75 -66 -282 -191 -576 -189 96 -358 -284 -152 -157 -182 -609 -276 -361 -330 -359 -196 -423
4264 -423 -500 -360 68 103 -380 -434 -190 -376 -509 105 456 -250 -497 -588 -31 116 139 432 -424 -958 -609 59
4286 59 605 567 12 -479 -482 -314 506 867 326 -428 -381 -336 349 657 767 104 -424 -670 -32 704 1036 376
4308 376 -336 -1015 -450 806 1477 1127 -183 -745 -638 102 993 1251 587 -481 -927 -291 1095 1475 796
4327 796 -79 -824 -874 439 1251 1255 463 -781 -991 -77 645 1382 825 -611 -773 -636 461 1349 1269 274
4347 274 -916 -1311 -524 799 1392 495 -456 -1370 -665 225 1258 566 -140 -1347 -1129 -342 786 1102
4365 1102 584 -834 -1660 -730 390 1288 550 -419 -936 -1273 -310 682 1111 175 -1250 -1454 -833 196
4383 196 747 284 -465 -1510 -1382 -241 652 884 -330 -1106 -1503 -406 486 578 556 -565 -1447 -792 -183
4402 -183 672 622 366 -1256 -1158 -347 441 1190 214 -910 -937 -701 41 1037 1002 -229 -719 -582 6 788
4422 788 839 670 -319 -762 -210 724 857 581 322 -460 -387 -73 424 619 501 -150 -167 -37 656 424 371
4443 371 49 -256 -235 580 749 519 236 -447 -231 247 193 411 43 65 111 100 629 255 120 125 180 -116 34
4466 34 268 401 66 -428 215 32 126 215 -40 -26 -2 -6 159 -7 34 -273 -233 190 163 53 -474 -556 -226 237
4490 237 109 -241 -297 -548 -718 -208 292 261 -338 -351 -645 -103 302 256 -112 -610 -913 -259 161 392 128
4511 128 -185 -942 -982 -277 346 419 -204 -762 -815 -672 254 661 325 -623 -1296 -957 -110 815 705 -174 -949
4532 -949 -1321 -86 476 633 261 -682 -1153 -781 260 916 684 -277 -1158 -791 83 738 1047 368 -535
4551 -535 -941 -738 65 1409 799 -260 -896 -817 469 1359 1106 427 -515 -677 -201 811 1100 743 -230
4570 -230 -805 -885 459 1516 970 323 -450 -588 -28 1137 1410 529 -260 -788 -574 491 864 1334 117
4589 117 -1105 -809 -141 1008 1028 495 -634 -1204 -760 411 1250 876 -72 -1190 -1079 -148 795 1106 413
4608 413 -443 -1258 -516 525 1262 487 -311 -1006 -1104 35 679 1093 -42 -1189 -1294 -594 356 707 493
4627 493 -223 -1620 -982 -31 646 399 -135 -999 -979 -645 583 705 270 -938 -758 -486 150 435 181
4646 181 -313 -879 -914 -336 557 523 129 -543 -805 -610 370 617 422 -270 -861 -545 -60 439 491 339 -202
4667 -202 -508 135 249 76 271 119 -535 -204 4 225 240 351 47 203 -113 214 327 648 282 36
4687 36 -25 423 253 725 24 241 233 191 119 328 617 177 179 55 137 126 -40 252 61 -174 530 130 74 97
4711 97 347 462 184 -31 157 66 -94 185 571 133 -192 -247 226 218 328 -59 -359 -412 39 278 323 490
4733 490 100 -202 -573 -103 193 266 269 -610 -548 -328 216 336 47 -151 -558 -576 -342 155 494 245 -921
4754 -921 -1092 -439 309 467 309 -287 -915 -946 -292 263 352 -57 -826 -1146 -770 51 473 274 -354 -859 -933
4775 -933 -148 588 605 368 -734 -1318 -507 561 932 -198 -932 -784 -732 158 969 743 -281 -1052 -980 54
4795 54 793 1128 515 -465 -1149 -379 373 1016 971 -53 -908 -604 -247 1049 853 534 -576 -1148 -131
4814 -131 478 950 555 117 -437 -610 164 948 1083 297 -497 -471 60 801 1233 478 -105 -545 -388 248
4834 248 767 832 119 -560 -841 -181 776 806 456 -245 -600 -345 158 818 739 6 -900 -758 44 660 722
4855 722 193 -149 -743 -465 251 761 408 -579 -587 -651 87 507 325 197 -512 -791 -360 351 450 -28 -488
4876 -488 -676 -526 -76 195 349 -218 -739 -750 -290 -21 190 75 -452 -773 -316 1 155 65 -260 -573 -431
4897 -431 -142 118 -127 201 -355 -204 -125 131 22 77 0 -323 -48 16 185 59 -469 -451 -192 14 -345 -102
4919 -102 -90 47 -152 55 99 149 -72 -256 -96 -45 235 47 -244 -196 -26 -30 157 244 27 75 -8 305 565
4942 565 761 66 -248 246 196 344 604 -33 -60 -145 206 697 753 466 75 -309 -36 187 594 668 88 -98
4964 -98 -259 91 520 767 465 -110 -454 -254 260 640 78 83 -559 -368 -52 368 839 119 -671 -203 -352
4985 -352 141 590 250 -281 -776 -733 30 704 427 -47 -572 -601 -573 129 852 244 -787 -1107 -873 132
5005 132 840 444 15 -764 -1113 -271 156 592 259 -770 -1131 -736 -145 573 517 -269 -1050 -1147 -266 517
5025 517 941 273 -545 -1125 -305 565 891 562 -274 -922 -1030 -131 397 901 434 -893 -657 -615 445 804
5045 804 507 -241 -813 -743 165 778 789 50 -521 -641 -386 692 861 626 13 -837 -552 383 518 914
5065 914 112 -487 -850 -396 880 1078 515 -531 -416 -740 410 768 519 -77 -656 -255 131 574 989
5084 989 368 -336 -829 -167 661 658 465 -58 -504 -438 318 355 526 591 10 -495 -281 308 645 414 -317 -449
5106 -449 -288 30 340 -7 142 -191 -517 -482 384 140 132 -24 -533 -166 308 435 -6 25 -250 -496 -279
5127 -279 -178 343 1 -317 -484 -480 26 -209 54 -368 -293 -177 -136 -187 -43 -253 -373 -130 -255 -135 120 -247
5149 -247 -290 -80 -194 -171 -232 -202 -250 52 -171 -53 -7 -53 -118 -349 -35 -52 62 -344 -370 -82 134 531 8
5172 8 -310 -498 -138 128 174 138 246 -14 -206 -180 274 565 -2 -356 -186 18 231 435 437 32 -335 -166
5194 -166 209 387 566 55 -148 -425 -76 117 722 621 -43 -489 -66 548 622 944 254 29 -264 -98
5214 -98 447 654 185 -290 -410 -269 70 817 684 29 -388 -305 -67 553 713 477 -295 -704 -261 219 816
5235 816 298 -60 -624 -790 -76 737 646 -41 -470 -805 -150 -6 708 361 -363 -767 -925 -17 642 364
5255 364 -234 -398 -925 -660 305 845 360 -663 -842 -648 -68 725 743 -563 -811 -452 -255 57 529 310
5275 310 -508 -700 -565 -33 588 361 199 -605 -961 -233 364 514 400 -403 -557 -245 450 663 173 -94
5295 -94 -753 -617 -62 729 658 207 -242 -403 -457 409 559 435 91 -277 -91 -22 512 411 223 -405 -186
5316 -186 -14 539 413 296 -47 -383 -125 45 714 482 98 -266 -295 302 367 454 261 -35 -140 11 0
5337 0 286 463 -4 -408 -162 -2 289 154 398 -179 157 -116 197 346 -59 -293 -70 -44 28 4 119 262
5359 262 -393 138 100 -60 45 127 -43 -213 -40 -251 -4 -26 -111 -196 -392 -286 44 -212 -542 -319 110 2
5381 2 -150 -420 -148 -417 106 -24 -148 -140 -78 -448 31 -161 331 -324 -375 -235 13 78 323 41 -372 -311 -141
5404 -141 200 28 149 -371 -229 -525 134 375 368 78 -433 -247 -352 167 572 -79 -112 -459 -173 -3 138
5425 138 258 157 -691 -523 -68 308 493 249 -424 -452 -135 124 605 792 328 -393 -557 -210 538 1031
5445 1031 535 -202 -351 -200 465 676 642 252 -112 -438 330 467 1142 358 -85 -705 -183 385 946 405
5465 405 121 -231 -235 -69 696 447 166 -525 -681 36 545 567 512 -273 -471 -534 -68 329 746 294 -412 -583
5487 -583 -247 473 625 212 -320 -629 -536 -53 458 596 180 -574 -778 -714 273 688 424 -413 -875 -734 -38
5508 -38 590 380 -49 -488 -596 -244 274 533 197 -752 -488 -664 -87 477 181 -26 -718 -618 -117 292
5528 292 191 248 -856 -571 26 120 314 230 -240 -530 -607 63 386 111 174 -327 -401 -58 108 225 182 118
5550 118 -222 -375 -210 481 487 3 -162 -104 -129 316 377 216 -160 -443 -320 388 362 364 -88 -158 -235 128 562
5573 562 382 360 -106 -369 -224 414 388 -32 59 -30 20 136 127 218 -189 -20 -46 130 -95 176 90 81 -320 -14
5597 -14 150 -63 244 200 89 30 150 -83 165 44 483 186 321 -208 -181 41 -242 -94 -92 170 -174 -243
5619 -243 -20 33 235 -60 -44 -654 -204 -93 -83 -6 -406 -247 -384 -413 -153 -26 186 -522 -423 -250 -148 -165
5641 -165 23 -197 -780 -384 -436 47 313 18 -4 -221 -367 471 447 177 -172 -396 -403 -10 182 123 -156 21
5663 21 -228 -462 -41 224 486 65 -407 -247 119 357 607 -10 -103 -346 -127 -59 472 527 218 -615 -320
5684 -320 100 529 646 363 -474 -88 16 242 413 401 -170 -227 -349 -70 657 622 143 -140 -61 -250 272
5705 272 701 497 -99 -499 -101 51 797 472 -130 -510 -168 349 384 639 263 -319 -210 51 455 724
5725 724 641 -122 -69 -725 -1 465 532 -155 -152 -215 -336 -17 437 473 134 -465 -307 100 620 281 -270 -553
5747 -553 -606 -1 -41 276 -75 -315 -567 -346 -581 318 559 22 -582 -728 -198 -52 400 124 -156 -479 -515
5768 -515 119 241 159 -228 -392 -594 -63 26 222 -92 -233 -566 -106 148 309 27 -205 -167 -258 -14 23 317
5790 317 -105 -369 -78 -371 175 98 130 -146 -182 128 188 121 149 -293 -147 -233 -60 273 -68 62 189 -225
5812 -225 -76 349 193 252 3 177 150 170 -122 72 -72 188 256 333 209 164 105 328 235 247 -157 200 83
5835 83 192 169 -42 99 202 368 48 -51 -47 179 57 19 -274 1 91 417 -11 61 -222 -22 284 221 319
5858 319 215 -374 -522 -147 -41 -20 -5 -83 -397 -92 169 -101 438 132 -400 -315 -365 249 246 116 -299 -412
5880 -412 -271 -179 460 232 -165 -555 -594 -94 430 105 137 -601 -377 -446 -16 329 213 -235 -735 -460 -131
5901 -131 510 297 -311 -358 -621 -241 0 50 107 -251 -566 -107 133 279 484 56 -350 -878 -245 213 398
5922 398 144 -121 -336 -337 95 402 320 -68 -600 -439 -417 472 655 539 -289 -329 -93 3 473 509 114 -412
5944 -412 -377 310 545 411 113 203 -435 -468 525 475 716 116 -541 -324 191 469 611 79 -143 -240 -283 109
5966 109 303 352 -17 -400 -198 -92 637 558 242 -251 -425 -327 79 536 37 133 -236 -317 -36 123 443 -230
5988 -230 -378 -545 37 -192 541 5 -142 -532 -198 -235 167 526 59 -57 -551 -323 -296 324 75 -34 -408
6009 -408 -505 -41 131 10 18 -542 -632 -206 -33 292 308 -235 -488 -593 -184 14 -102 -149 -261 -42 -118 286
6031 286 58 159 -458 -214 173 -361 -112 -77 52 -430 -522 -30 -88 -89 142 -273 -32 -150 -95 259 92 -205
6053 -205 5 -67 -61 -310 -117 243 87 31 -330 204 236 -62 184 101 300 39 163 -133 152 241 -164 265
6075 265 67 -64 155 165 -17 149 -58 -100 -2 112 329 247 163 -297 33 84 252 142 87 36 69 -52 413
6098 413 490 -149 72 -261 -74 51 524 305 147 -234 -490 -53 23 437 379 170 -142 -197 -214 214 233 -216
6120 -216 -128 -261 -414 144 462 40 -136 -533 -195 38 -24 314 -206 -143 -252 -251 173 135 207 -486 -108 -374
6142 -374 -403 283 6 -84 -644 -665 -219 98 77 150 -298 -835 -316 -15 64 311 161 -526 -445 -230 168 515
6164 515 -195 -143 -433 -244 13 372 305 -8 -255 -444 -181 499 -24 -104 -94 -455 -320 363 221 433 -97
6185 -97 -248 -300 56 288 518 114 -388 -363 -62 484 456 512 143 -339 -145 57 482 296 247 114 -343 -114
6207 -114 173 605 279 -105 -156 -236 398 188 346 -182 39 -336 41 251 375 472 7 -387 11 410 299
6228 299 208 322 -586 -119 295 56 213 -38 -28 -379 -229 141 251 170 -225 -449 -371 21 6 20 -44 -61 -118
6251 -118 -102 206 1 -100 -119 -275 -136 236 -240 -31 -143 -55 -303 -254 -212 42 -79 -217 -2 119 -47 249
6273 249 5 -152 0 -151 -226 -42 -188 -38 -209 -412 -238 -453 -88 -34 -200 -113 -199 -119 -9 -198 -105 209
6295 209 103 10 23 4 75 346 118 -222 112 -173 48 -11 322 289 72 51 -202 61 51 108 316 -157 -286
6318 -286 -299 34 72 374 136 177 -353 76 393 122 -36 -55 -289 -269 391 152 387 100 -211 -184 -71 282
6340 282 242 334 -93 39 -36 89 509 345 102 -120 -120 84 -28 205 314 -74 -14 -222 -32 212 175 82 -441
6363 -441 -393 -128 60 50 -236 -269 -355 -206 89 336 471 147 -383 -562 -88 356 145 227 -3 -294 -156 220
6385 220 164 59 -116 -283 -746 -129 322 281 -269 -371 -524 -356 -119 147 448 -143 -460 -502 -146 197 451
6406 451 -394 -597 -297 -404 -27 307 151 -124 -539 -612 -183 264 361 -21 -240 -609 -169 488 543 -196 -395
6427 -395 -373 -134 -181 29 308 95 -390 -195 -186 365 238 298 274 -538 -334 197 403 208 -125 -80 1 -58 447
6450 447 354 227 30 -161 -26 442 135 191 56 -90 43 -170 419 425 60 -177 -29 206 259 542 322 252
6472 252 -114 190 209 146 586 -41 141 -55 -58 268 173 160 92 46 -234 -115 1 128 321 103 -230 -80 429
6495 429 167 345 205 -91 -110 86 -100 192 111 -381 -234 -99 -330 -177 -96 -54 -198 -391 22 -89 99
6516 99 -288 -124 170 -172 -206 69 -119 -178 -244 -16 -226 -391 -276 -24 37 -95 -92 -213 -148 -112 59 201 8
6539 8 27 -263 69 116 -131 -189 111 -17 -337 217 183 168 28 -136 -78 366 121 251 103 -29 -180 242 273
6562 273 37 243 -271 130 -158 -354 462 787 311 -126 -216 -110 410 41 161 204 -461 -177 -44 11 672
6583 672 102 48 -255 -96 49 326 51 184 -211 -346 355 285 644 80 -102 -271 -105 0 161 313 -260
6604 -260 -428 -53 76 244 202 63 -441 -348 -13 181 478 212 -42 -384 -325 156 16 81 -103 -400 -349 -103
6626 -103 -82 203 -20 -194 -210 -383 -22 64 60 20 -136 -374 -338 -24 427 -100 -247 -278 -146 239 193 301 -23
6649 -23 -263 63 -96 -181 22 42 -158 -191 -246 121 31 6 -53 39 -257 79 13 127 -122 -215 -133 94 77 228
6673 228 7 -64 -342 -212 98 143 60 -82 -107 -161 -209 -224 259 63 77 -345 -24 55 144 25 58 34 -33 -27 185
6698 185 231 210 115 -33 393 416 204 294 164 44 208 105 742 253 193 -103 353 178 282 139 -195 313
6720 313 151 199 72 277 284 270 175 24 9 108 156 71 -78 129 -94 116 -113 -133 -8 -6 -83 -74 165 -57 -424
6745 -424 -234 234 42 -108 -268 133 -269 -248 267 162 -94 -278 16 -35 37 0 -185 -251 -318 -20 88 -70
6767 -70 336 -335 -276 -362 -72 72 127 32 -534 -107 149 137 -4 -155 -437 -319 -151 -131 -39 212 -194 -429 -229
6790 -229 -155 56 318 132 -394 -442 -328 56 100 288 16 -275 -247 52 139 -49 -44 -174 -23 -113 486 352 114
6813 114 -70 125 -196 108 391 281 98 -312 -320 -142 220 469 118 -34 -468 -313 95 556 369 -196 -329
6834 -329 -202 -214 398 102 354 -377 -169 -3 476 423 248 -181 -174 -219 13 412 283 459 -296 -251 -119 273
6856 273 369 464 -149 -419 -211 169 340 355 -89 -186 -182 -206 431 413 146 -304 -98 -509 128 106 209 -101 -284
6879 -284 -88 -162 299 257 98 -245 -477 -180 -20 530 -109 -148 -273 -235 -380 -29 383 58 -125 -445 -359 -5
6901 -5 135 170 -126 -544 -512 165 -135 -41 -136 -18 -149 -298 -147 -190 31 -89 -216 -395 -185 197 35 72 -61
6924 -61 -121 -113 163 377 40 -80 -74 -167 -108 114 247 251 11 28 -61 387 183 -9 57 69 221 -66 311 437 -213
6949 -213 -215 -73 -89 22 73 78 -8 -26 327 258 140 257 43 152 224 -71 86 48 95 253 27 -133 -41 -165
6973 -165 -112 245 -77 94 275 105 177 186 62 -150 -70 -247 47 149 -152 -177 143 -130 13 24 23 -62 140
6996 140 7 -123 -237 -185 357 139 215 -163 -266 154 269 -94 -80 39 -104 -186 -30 -247 92 -89 -341
7017 -341 -517 280 243 76 265 -77 -240 -483 -232 217 407 -75 -79 -383 145 -47 53 -15 -324 -426 -430 -114
7039 -114 -105 181 57 -4 -389 -50 148 327 88 -159 -155 -144 -77 69 150 -95 -330 -300 43 131 81 371 -164 -56
7063 -56 -30 -57 421 286 -71 58 132 344 598 204 249 -69 -137 -51 181 195 465 -7 -152 215 355 232 224
7086 224 233 -138 47 -182 279 620 264 -80 -68 -303 -20 509 139 336 -355 -394 -163 172 -99 188 -259
7107 -259 37 -45 17 506 444 143 -360 -129 -34 -90 39 -32 170 82 -275 186 170 381 177 -186 -325 9 178
7130 178 -82 27 -143 -242 56 -86 -223 -176 -142 121 -281 -184 117 90 -318 -136 -241 24 140 93 156 -131
7152 -131 -271 12 113 287 -152 179 27 -317 74 -27 -116 -322 23 -283 -161 55 -35 18 43 -429 -312
7173 -312 -135 -37 -148 2 -180 -154 188 42 54 197 217 124 -274 106 -252 -52 -181 151 56 264 221 -311
7195 -311 -29 -168 37 35 154 145 255 -85 -113 82 258 15 -66 -55 333 187 -92 176 -108 171 90 -27 184
7218 184 -17 213 -38 94 -31 344 -66 -33 -109 -121 80 18 98 404 137 -414 -188 80 295 317 225 -311
7240 -311 -210 -33 104 264 -21 -92 -306 -78 135 346 260 -194 -268 -263 -426 223 298 -4 -409 -303 26 -89
7262 -89 135 -161 -64 -226 -447 -125 185 122 -274 -154 -378 -360 -291 117 -4 -91 -273 72 -20 226 114 -188
7284 -188 -59 -25 -198 -8 256 0 -232 -284 -232 -288 210 14 95 -97 -311 -109 16 224 -71 -129 -212 122
7306 122 321 -18 -133 53 -320 -241 -20 109 242 235 -38 -32 -134 15 340 429 163 128 46 5 -17 589 32
7329 32 -158 -130 123 177 286 212 20 -52 -282 -75 235 378 242 -193 76 219 -161 86 379 -183 -110 -84
7351 -84 78 538 170 163 -184 -335 -50 218 470 203 -165 75 30 -277 -67 32 2 -145 -34 138 143 -155 7
7374 7 127 -118 -242 -217 164 -243 221 165 232 -73 12 139 -344 -177 -124 -267 144 63 178 -263 -35 46 -60
7397 -60 49 66 19 -104 -54 -63 98 -148 -12 147 -36 -114 -57 -24 -482 25 -33 36 -126 -3 -39 116 117 -41 -212
7422 -212 -341 -256 -172 309 34 -34 288 -276 -164 -134 172 164 127 -127 -74 -262 186 257 -36 53 -124 -350 8
7445 8 33 330 218 117 -41 185 228 93 272 180 373 103 233 -158 600 331 -33 -52 -1 118 271 93
7467 93 -162 -67 -189 -12 499 335 103 158 -308 102 129 74 252 16 -145 -21 -57 44 128 -99 -115 -334 -194
7490 -194 -83 196 185 185 151 -386 -125 -65 115 9 -129 -414 -50 -14 112 -66 -106 -266 -324 -182 100 306 -122
7513 -122 -525 -316 46 -40 295 -64 -123 -286 -22 54 95 71 -463 -227 -48 240 -152 139 62 -350 -441 185
7535 185 -32 116 -29 -117 46 -272 69 88 98 -204 -288 -294 -351 223 -56 -284 -170 -142 57 -242 248 271 5
7558 5 -212 -6 -294 241 37 80 -90 -37 -346 40 370 112 175 24 -161 -71 -79 7 159 -249 -212 -61 14 282
7582 282 -104 -122 213 108 126 74 263 85 292 -193 26 224 63 274 148 253 61 49 3 141 202 -44
7604 -44 -59 72 86 511 115 -60 123 193 -117 -245 210 -222 -87 84 -110 -27 160 -57 -53 -282 -138 377
7626 377 60 -110 -31 77 109 -26 120 68 48 -1 -324 -132 -269 -233 206 -284 -14 -25 241 97 -82 -143 -451
7649 -451 -430 -237 19 1 86 197 -277 62 -26 17 1 -242 -184 100 46 96 207 -256 6 26 271 -133 -245
7672 -245 -187 48 112 37 39 8 -184 342 -177 -9 -82 -38 64 90 71 153 61 317 192 -383 62 -158 149 16
7696 16 -100 200 -86 -26 317 298 162 55 115 43 75 168 252 124 -387 77 59 283 131 97 181 -165 -65 199
7720 199 91 134 -336 -245 -173 241 439 211 -16 -303 180 -366 210 223 279 -45 146 -220 105 279 184 207
7742 207 -230 1 463 144 144 292 -367 -310 -248 89 41 58 -140 -322 -216 -290 319 84 -87 -489 -263 -391
7764 -391 -41 167 42 154 -357 -479 -376 11 274 -118 -328 -573 -33 -71 93 259 -159 -231 -340 -25 214
7785 214 -84 30 -281 -257 147 157 52 -183 -122 -239 -116 -311 16 258 46 -134 -217 202 134 -19 38 207
7807 207 -15 279 48 221 39 391 -251 -75 2 16 176 243 228 -97 -58 124 287 81 -15 40 -75 72
7829 72 133 -28 303 98 -40 87 174 187 -97 -137 -1 -546 98 91 61 181 -158 -365 174 163 248 471 130
7852 130 -84 4 -36 320 123 89 107 35 -108 -15 161 34 -33 158 4 72 66 -17 -312 -188 -35 5 -166 -201
7876 -201 58 -38 -186 -101 -82 90 22 39 -19 73 -205 -171 -16 -252 4 312 122 42 200 -211 -228 179 -187
7899 -187 -195 -318 -86 -234 10 -25 -112 -136 -112 -294 109 147 -208 126 -38 -88 -238 -107 40 281 45 -313 149
7922 149 34 106 111 -322 24 -439 136 -33 125 -184 -177 -197 401 65 422 217 -291 -291 -27 207 138 331 164
7945 164 31 285 115 -46 -71 -343 -17 -196 44 -16 76 29 64 -279 -107 518 255 275 -256 146 150 141 268
7968 268 38 -187 -93 71 154 -104 2 313 164 229 4 179 102 -55 175 -263 19 196 158 145 275 145
7990 145 -60 -63 -105 229 -40 241 123 -66 -183 1 78 236 149 -170 -158 -166 -65 299 -85 28 -13 -44 161
8013 161 221 -204 -300 -186 2 -365 117 -22 169 -251 -529 -112 -59 42 -282 21 -195 -158 -3 222 133 -67
8035 -67 44 137 -97 -65 -107 -30 -114 -302 -161 256 198 387 -175 -35 -6 111 10 156 -89 -6 -286 -54 145
8058 145 -33 47 48 -1 -224 236 102 145 78 -87 -269 337 -24 15 133 77 -175 -116 -16 339 11 140 -37
8081 -37 154 326 112 -29 -71 -20 -114 -79 -14 420 -42 -55 -173 -108 16 -183 110 -130 -48 -109 163 -1 202
8104 202 269 45 268 251 62 391 26 1 269 -16 53 -216 28 -147 39 -145 207 -172 -134 49 23 54
8126 54 66 192 -288 -70 -56 -126 -50 87 -127 -356 -8 -1 159 36 -191 -240 -76 -26 17 62 -161 121 -166 -353
8150 -353 -50 -369 12 9 -65 -1 -84 -188 331 37 -71 -52 -298 193 117 123 120 -95 21 99 58 -104 -53 119 -177
8175 -177 -287 -35 158 399 -220 -182 -44 88 213 -58 -165 79 -69 -325 233 -153
8191a53
$$ Imaginary data points
##PAGE= N=2
##DATA TABLE= (X++(I..I)), XYDATA
0 0 0 0 0 0 0 0 0 0 0 2 -8 8 -8 8 -12 16 -16 20 -24 28 -32 39 -44 52 -59 67 -76 84 -98 108 -123 136 -154
33 -154 170 -190 211 -235 259 -290 320 -352 391 -431 479 -531 590 -657 735 -823 929 -1053
51 -1053 1206 -1399 1648 -1982 2460 -3192 4448 -7010 14294 -74755 -298757 -68475 174277
64 174277 83181 -87753 -33893 38317 -45425 -92549 27534 89224 -9411 -76197 -16447 14264
76 14264 -16946 15003 83921 33541 -80431 -78934 23092 66336 37384 19214 -114 -51169
88 -51169 -56035 18525 60002 1371 -49072 -15979 12004 -26724 -41468 22244 55854 -20352
100 -20352 -99034 -58569 43344 76203 23252 -32485 -43559 -23682 5498 28234 33121 20805
112 20805 2733 -17290 -24527 4730 47025 39429 -19787 -50251 -15607 24030 23658 15389 11965
125 11965 -21492 -63208 -39534 34832 55960 2459 -37065 -17333 6830 -1604 -7714 11549
137 11549 25368 10064 -14862 -15004 18902 51146 31675 -26387 -44270 6021 48934 29908
149 29908 -2379 720 3298 -17733 -16658 15653 19063 -14572 -18465 14293 16556 -16889 -21301
162 -21301 5635 5431 -14883 -3947 20939 8952 -12641 5465 25626 513 -26643 -2264
174 -2264 30350 19417 -839 8494 13134 -11315 -18421 10574 18739 -11916 -19180 14937 22453
187 22453 -17489 -35104 -2992 13048 -12329 -22841 1377 9293 -9917 -10022 9386 2707 -21229
200 -21229 -14713 8491 7142 444 18858 24126 -13075 -38065 -7545 26854 18622 405 -1123
213 -1123 -11764 -25315 -123 32347 7263 -43580 -36859 8816 13835 -8338 1293 12914 -20619
226 -20619 -48898 -15085 27775 19832 -1224 3068 -2243 -26250 -13019 33400 35148 -10096 -26565
239 -26565 1489 16460 9908 16022 18016 -13171 -37679 -13865 18806 17846 9629 11492 -10535
252 -10535 -48018 -34957 25442 46127 3314 -32043 -20230 930 9135 20740 24246 -3022
264 -3022 -29734 -14958 20754 33929 25846 16804 -3641 -30558 -24297 20730 47478 23639 -11386
277 -11386 -21584 -16498 -6725 14543 29356 3942 -35869 -33208 8115 27836 12061 -1250 -2839
290 -2839 -17871 -29584 -2397 39739 38780 2372 -18510 -14034 -7084 6379 32453 33406 -7224
303 -7224 -35451 -10278 25045 22747 2379 -6483 -17008 -29893 -13231 24651 29082 -3959 -25002
316 -25002 -22453 -20711 -12861 18452 34466 639 -36040 -21034 12251 15059 4857 7170 -505
329 -505 -22824 -14385 24677 34225 1050 -19763 -11453 -10646 -14359 8022 30566 8052 -29264 -27549
343 -27549 -3962 -1430 -3915 8727 4435 -26099 -28670 11876 29713 -3402 -25835 -6967 6235
356 6235 -5757 -764 24453 19170 -14075 -18257 7212 10588 -5598 571 18896 6687 -17186
369 -17186 -8793 11417 4105 -12543 -4758 5109 -6467 -10989 8415 14997 -7983 -18343 -371
382 -371 6379 -6463 -1477 21058 15665 -12820 -12448 13439 15697 -3527 -2790 12149 9301 342
396 342 10018 14302 -7972 -19110 4736 23269 5062 -13295 -4181 6356 1365 -411 5142 -5764
410 -5764 -20320 -6093 20972 19392 -2773 -9872 -4950 -6328 -2005 16612 21726 1878 -11708
423 -11708 -2215 7815 6479 9113 10100 -6026 -19944 -3377 21600 17236 -5329 -11679 -9386 -14348
437 -14348 -10655 11089 19846 -1112 -19687 -14297 -4753 -4501 4497 15882 3543 -22734 -20092 10605
451 10605 23516 8629 -3800 -7414 -16541 -15617 12917 36258 15317 -23010 -27329 -5851 2311
464 2311 2496 13552 12097 -18760 -37295 -9566 22736 14013 -10513 -14531 -13089 -18446 -5258 26321
478 26321 28553 -8890 -31752 -16307 2285 8534 22047 28036 -2732 -38463 -22513 22806 32182
491 32182 6346 -8367 -12482 -21888 -11537 27117 39189 -4730 -44001 -27670 7068 16204 13669
504 13669 14482 -2410 -29219 -23071 11339 25181 10553 1483 -425 -11661 -13135 13754 34262
517 34262 14561 -15863 -16460 -2147 5415 15531 27665 12148 -23491 -32075 -2674 20751 17519
530 17519 7315 -744 -17279 -24679 -1664 26162 20674 -5999 -17367 -12127 -3242 12359 29628
543 29628 19459 -16281 -32355 -6585 23135 24596 11392 1203 -11893 -20876 -4049 22478
555 22478 21141 -5985 -18147 -8172 -196 82 7454 10433 -5978 -23106 -14139 6192 9816 5456
569 5456 5073 -2772 -20422 -18995 9300 24464 7778 -10545 -8234 -3120 -3732 4703 15049 4607
583 4607 -16929 -15897 3833 11272 3275 -770 -4007 -13739 -15047 -32 10037 883 -5989 -1839
597 -1839 -4273 -14725 -8302 10517 11119 -7474 -12419 582 5789 127 989 5082 -2633 -10472 -1303
612 -1303 10908 7493 -2469 -2134 -292 -4762 -4329 4176 4628 -3993 -3619 4775 1683 -9405 -6537 5926
628 5926 4455 -6570 -3505 7575 4616 -6028 -2147 8204 4124 -4370 -102 6849 2914 694
642 694 9601 10588 -4262 -11054 1912 12156 6475 2487 3422 -3450 -11790 -688 15781 8227 -10141
657 -10141 -8434 4380 2404 -2973 7462 12276 -5769 -17753 -1409 14754 8142 1281 7161
670 7161 3181 -13273 -10385 13436 20288 2464 -7650 -2722 -3843 -4845 9384 18638 -958 -22402
684 -22402 -12962 7879 8909 2377 4177 -1462 -19125 -19124 6404 21271 7432 -9340 -9136 -7657
698 -7657 -7037 5566 18654 8942 -14402 -18543 -1091 10760 10655 6791 -2119 -17091 -18486 1223
712 1223 18600 10939 -6505 -13340 -12029 -9379 -115 12532 10171 -8575 -19369 -10949 1853 8258
726 8258 9881 4006 -10977 -19890 -6950 14689 18719 6104 -6760 -13445 -13816 -1137 18100 20154
740 20154 -620 -18665 -14485 -1049 7919 12300 8953 -7351 -21546 -12162 10899 17595 6268
753 6268 -4950 -10540 -12920 -4538 15121 20972 2934 -12796 -8207 917 3131 8346 15799 5424
767 5424 -14394 -13131 8557 16196 5598 -508 -197 -7244 -11849 4553 21298 10978 -10839 -13035
781 -13035 -2517 1196 3865 12716 10377 -9135 -16370 778 13860 7151 601 3426 -1401 -11534
795 -11534 -2607 17799 16114 -5594 -13121 -1155 3785 -709 4984 12096 284 -14959 -8268 6748
809 6748 6437 -1316 289 390 -8833 -9172 6194 12488 -1588 -10651 -2999 1779 -2668 855 9572
824 9572 2750 -12235 -8831 7034 7501 -4580 -4432 2829 -627 -6204 -373 5166 -3444 -9824 -1309
839 -1309 5544 -1480 -6324 -1319 658 -4937 -3641 3738 251 -8717 -5777 5776 5265 -2961 -4919
854 -4919 -1756 -2512 -1878 5307 5953 -3772 -8520 -866 4109 -54 -1721 2213 780 -5350 -2940 3315
870 3315 2483 -1428 786 1509 -5188 -7857 2310 10826 4571 -4924 -4868 -1991 -1796 3440 11591 6847
886 6847 -7764 -10947 1922 9708 5710 3065 2885 -4053 -10656 -176 15923 13704 -3337 -10895
900 -10895 -5183 561 4420 11381 10453 -5070 -15639 -5229 10279 10646 3050 879 -2343 -9925
914 -9925 -5420 11928 17431 2148 -9897 -6762 -1667 1047 10089 16071 2709 -17347 -14056 6117
928 6117 14412 6764 640 -3491 -11564 -9912 6823 17154 5489 -9972 -10105 -4917 -2024 6094
942 6094 14202 5169 -13642 -15987 -640 8871 7030 4743 752 -11430 -15739 185 15740 9801
956 9801 -5304 -9086 -6949 -7585 -459 12987 12203 -7538 -19550 -10655 4073 9712 9146 1687 -11952
971 -11952 -18329 -4929 12863 12717 73 -8483 -10341 -9008 93 13398 12213 -5687 -16120 -7653
985 -7653 3062 5200 6060 6404 -3394 -15740 -10155 7667 13845 3424 -5016 -6167 -6540 -3321 6788
1000 6788 12404 2780 -8140 -7558 -2079 323 6555 12116 3812 -12843 -12922 4317 13274 6218 -429
1015 -429 -1126 -5720 -8339 3075 15846 9042 -7733 -9466 410 4404 3322 6588 6276 -3508 -8997
1030 -8997 -1731 7384 6685 3553 1634 -3957 -8113 81 11647 9066 -3709 -7110 -30 2494 374
1045 374 3447 7091 660 -7670 -3634 4648 4632 229 859 1988 -2473 -5264 771 6738 3383 -2803
1061 -2803 -3338 -1494 -825 1764 3918 902 -4379 -3496 1818 1004 -2725 -632 2737 -225 -5741 -3230
1077 -3230 2321 398 -2686 -99 1699 -3081 -5427 78 3943 -877 -3334 -144 -384 -4732 -2470
1092 -2470 4373 2549 -4110 -4023 -136 -1943 -3659 2692 6251 -2955 -9450 -2592 3828 -342 -2324
1107 -2324 3049 1627 -8429 -7658 4243 7825 -614 -4278 -1770 -3222 -4288 3483 9806 2043 -8420
1122 -8420 -6022 1953 2298 1796 5751 3275 -7093 -8570 2521 8416 3084 -791 141 -3561 -7084
1137 -7084 1017 12592 8536 -5653 -9886 -2413 3372 5127 7203 4939 -4668 -9338 -826 8718
1151 8718 7514 2590 1054 -2456 -6762 -1732 9716 11443 855 -6924 -5028 -1273 2158 8509
1165 8509 10807 -861 -13406 -9156 5330 11347 5598 -471 -4764 -8119 -4078 7636 12468 2911
1179 2911 -6773 -6676 -2833 1334 7743 10769 1561 -11730 -10701 2627 8849 5208 1519 -2085 -8464
1194 -8464 -8847 1535 10609 5127 -5387 -7952 -4496 -2677 2133 7795 4718 -6880 -11336 -4194
1208 -4194 3415 5731 5418 1445 -7467 -12338 -2810 9642 9477 -1008 -7015 -6581 -4750 48 7017
1223 7017 7096 -3634 -11975 -7632 1963 5725 4124 605 -5695 -10753 -5976 5783 9048 1545 -5437
1238 -5437 -5575 -3344 -602 4714 7244 467 -7058 -4505 2150 3570 2555 3823 1363 -6684 -8083
1253 -8083 2730 9448 3811 -3394 -3207 -2201 -3668 1027 7836 4430 -5150 -5731 1912 3687 856
1268 856 2438 3755 -1933 -4840 1922 6952 2869 -844 2671 1969 -4074 -1924 6861 6948 -1692 -3174
1284 -3174 2863 2111 -3159 181 5872 2068 -4827 -1668 3918 1804 -1734 1089 2117 -2898 -3433
1299 -3433 3312 5454 -384 -3255 1421 2519 -1209 -1032 2736 1447 -1590 1579 4452 -527 -5776
1314 -5776 -1414 4965 2548 -3230 -2193 547 -1521 -2724 1739 2610 -2841 -6569 -2384 2582 1676
1329 1676 -114 182 -2862 -6217 -3321 4050 5624 -23 -4036 -3284 -1988 -49 3624 4131 -2145 -6804
1345 -6804 -3397 2180 1976 340 793 -1863 -7109 -6479 1698 5849 1825 -3050 -4279 -5607 -4749 2063
1361 2063 8040 3161 -6097 -7690 -1234 3507 5244 4273 -21 -6509 -6077 1597 7773 5573 552
1376 552 -2783 -6296 -5907 2293 9785 5759 -4768 -7976 -2912 549 2667 5573 4055 -4598 -9492
1391 -9492 -2332 8041 8902 3274 -1716 -5298 -5541 1431 10693 10654 742 -6122 -4819 -202 3971 8946
1407 8946 7891 -2656 -10697 -4649 6748 8526 2685 -1339 -4024 -7140 -4306 6446 11798 3492
1421 3492 -7178 -7771 -1902 1822 5940 9322 2806 -7780 -8247 2359 8436 5549 1426 -1317 -5656
1436 -5656 -6303 3251 10452 5021 -4993 -7435 -4444 -2326 1838 8362 4907 -7262 -12061 -3681 4713
1451 4713 4504 1403 -535 -5791 -8006 -447 8825 6601 -2676 -6416 -4196 -1584 1808 6612 5497
1466 5497 -3805 -9112 -4302 1382 2886 2872 1920 -4385 -8857 -4264 3786 4750 -1302 -4541 -4223 -4061
1482 -4061 -1058 4595 5758 -1258 -6699 -4521 169 2240 3277 4046 223 -5478 -4586 2276 5344
1497 5344 2032 -1000 -1116 -2584 -1977 2391 4814 878 -4395 -3996 260 842 1158 2427 1730 -2801
1513 -2801 -4483 516 3534 1323 -431 2279 2036 -1482 -706 4235 3995 -1241 -1987 3221 3683 -366
1529 -366 513 4535 1748 -2770 -1662 2475 1518 -997 1774 3294 -758 -3810 -374 2393 -106 -672
1545 -672 2618 2197 -2417 -1465 3351 2866 -1661 -731 3563 1459 -2619 889 5993 2553 -3510 -2082
1561 -2082 1249 740 150 2922 3467 -2481 -5846 -2094 1233 761 704 785 -3056 -6000 -1817 4122 2843
1578 2843 -3177 -3817 -1662 -1795 -593 4141 5629 -1527 -7235 -3838 2143 3030 1586 1911 -687 -5837
1594 -5837 -5138 1882 5053 855 -3553 -4746 -4518 -2395 3268 5292 -999 -8434 -6996 1 2757
1609 2757 2835 3606 169 -7301 -7075 2042 8064 3861 -1849 -2127 -2151 -2465 2437 7926 4023 -5199 -7441
1626 -7441 -1603 3398 4148 4075 1258 -6265 -8589 -1260 5802 4800 829 -1371 -3862 -5280 -306 7357
1642 7357 7174 -1385 -5421 -2089 1783 4232 7285 6106 -2565 -8619 -3445 6616 8914 3857 -943
1657 -943 -4196 -5225 -1685 5795 7592 543 -5617 -5223 -581 2858 4640 4231 -1639 -6916 -4176 3453
1673 3453 6943 4367 922 -1688 -4116 -3216 3743 8562 4618 -2539 -4218 -1450 1101 2720 4516
1688 4516 1126 -5212 -6708 -670 4388 3438 -110 -3291 -5151 -5453 -273 5619 4163 -2374 -4801
1703 -4801 -2701 -1048 255 3629 3146 -2391 -5447 -1044 3518 2314 392 -202 -2286 -5155 -1938
1718 -1938 4587 4210 -1639 -3875 -2292 -2550 -3015 1241 3434 -1158 -5570 -2832 917 -24 -1047 173
1734 173 -427 -3320 -2280 3054 3608 -618 -2464 -236 -313 -1558 1289 4186 674 -3157 -766 1840
1750 1840 -217 -2885 -8 2232 -188 -2224 511 1409 -1423 -2314 555 1667 -1076 -919 1364 1648
1766 1648 346 410 1617 93 -1847 709 4064 2729 170 1250 2172 -1064 -1956 1936 4933 982
1782 982 -1757 -345 1199 -455 -305 2195 1779 -2610 -3752 996 3458 2165 488 -289 -2921 -3528
1798 -3528 1674 6206 4414 -1211 -2133 -532 -345 1521 4900 3590 -2214 -4945 -217 4368 2985
1813 2985 698 -1005 -3795 -5163 -1380 4823 4547 -966 -4716 -4750 -2992 556 4311 3713 -2325 -5899
1829 -5899 -2827 1503 3324 3058 1227 -3112 -6289 -1772 5716 6663 730 -4117 -5002 -4057 -1222 4137
1845 4137 5803 -444 -7218 -6959 -1197 2613 2844 1326 -3117 -7165 -5230 2540 6234 2616 -2802
1860 -2802 -4563 -4554 -1955 4686 8182 3036 -5654 -6707 -886 2930 3587 4158 1174 -5070 -7110 -452
1876 -452 6167 4996 -1103 -4468 -4945 -3704 1968 7410 4855 -4134 -7472 -3242 1570 3836 5841
1891 5841 4156 -3334 -6853 -690 7089 6134 1168 -804 -1470 -3115 -154 6625 7788 -623 -6598
1906 -6598 -4287 678 2992 4893 4044 -1830 -6744 -4090 2521 5276 2800 164 -1930 -3499 -1205
1921 -1205 5177 6764 1004 -4030 -2683 263 2230 4195 5058 1220 -4609 -4947 890 4716 3162
1936 3162 455 -1649 -3522 -3504 791 4161 1609 -3092 -3710 -1881 -410 1561 2588 577 -4065 -5201
1952 -5201 -886 2990 2314 297 138 -1385 -2925 -1144 2837 2449 -991 -2190 -524 9 -936 812
1968 812 940 -1926 -4176 -1867 1160 893 -1154 -880 -869 -2890 -2389 126 1537 -641 -1765 200 -93
1985 -93 -1222 -304 1087 -285 -1680 791 2707 533 -1489 -147 1448 -727 -1637 794 1636 -1424
2001 -1424 -2161 1253 2004 -1544 -3210 -797 393 -218 800 2186 23 -2949 -1566 2262 2343 457
2017 457 669 906 -936 -294 3250 4339 444 -2407 -413 1469 1130 2186 3684 1468 -4066 -3926
2033 -3926 1294 3927 1767 -54 -247 -1973 -2850 992 4776 2913 -2227 -2929 -1161 1430 3211 4445
2049 4445 2277 -3076 -4110 320 4264 3543 2203 546 -2955 -4366 407 5552 3881 -2180 -4037
2064 -4037 -2321 -750 824 2968 2228 -3017 -6858 -3373 2526 4186 2224 -947 -3797 -5160 -1186
2079 -1186 4319 5232 1390 -2544 -3710 -2456 1151 5254 4086 -2436 -6676 -4013 1447 3825 2510
2094 2510 -53 -3858 -6850 -4423 1932 5664 1947 -3690 -5377 -3331 -423 3154 3394 271 -3816
2109 -3816 -4363 -838 2824 4126 2846 -1305 -5256 -4207 2006 5431 3450 -951 -3278 -3520 -2280
2124 -2280 1334 4602 2479 -3229 -5760 -2325 2274 3562 1994 -488 -3535 -3884 90 4796 4774 474
2140 474 -2052 -2938 -1597 2067 5511 4320 -622 -3548 -1091 2289 2681 2566 1829 -1004 -3562 -1112
2156 -1112 3604 4106 620 -1798 -1935 -1712 -526 3198 4034 612 -3167 -1887 331 1445 2296 2619
2172 2619 623 -2052 -1376 2426 3438 928 -384 -67 -578 -341 1513 3097 511 -2002 -1340 -63
2188 -63 -53 -109 976 462 -1701 -1923 64 1089 -448 -1029 160 -180 -1418 -245 1637 540 -1560
2205 -1560 -777 944 61 -843 -134 800 -632 -970 -33 515 -1769 -2115 136 566 -525 -1018 -685 -1604
2223 -1604 -2485 -875 1365 79 -2108 -2170 -109 19 -103 530 541 -1809 -2867 133 2890 2019 -584
2240 -584 -837 -1845 -1885 10 2877 2608 -1095 -2840 -1474 152 751 1389 888 -2412 -3743 -1108 2420
2257 2420 2486 468 -653 -2303 -2937 -277 4149 4670 263 -2819 -2252 284 2244 3767 3060 -205
2273 -205 -3470 -2133 2080 4353 2694 -151 -2557 -3665 -865 3515 5002 1356 -3438 -3589 -1549
2288 -1549 1005 3626 4051 1017 -4215 -4024 931 5205 4198 704 -1485 -2819 -1979 2652 5968 3853
2304 3853 -1291 -4613 -2920 521 3579 4684 1713 -3894 -5569 -1742 3110 3653 1410 -1312 -3857
2319 -3857 -4325 -220 4995 4598 -1146 -4785 -3459 -631 2445 4629 3642 -1983 -5963 -3161 1998 3795
2335 3795 2576 -6 -3512 -5475 -2023 3658 4386 -136 -4262 -4532 -2842 191 3534 3663 -1176 -5922
2351 -5922 -4844 343 3121 2679 1179 -1604 -4484 -3121 2052 5036 2109 -2240 -3224 -2425 -410 2645
2367 2645 3939 1225 -4067 -4825 -731 2229 2637 1364 -1207 -3673 -3821 348 3646 2530 -524 -2150
2383 -2150 -2091 -867 1711 3693 2359 -2195 -3361 -492 2014 2748 2266 1006 -1097 -2705 -242 3091
2399 3091 3395 636 -1133 -1147 -659 655 2289 2481 -133 -2208 -1103 1205 1869 1356 1280 -477 -1732
2416 -1732 -327 2093 2422 761 -315 -64 -97 36 1131 2158 814 -1055 -126 1196 934 -62 123
2433 123 417 -595 -451 482 636 -332 -910 -53 211 -362 -406 -351 -608 -640 328 931 -150 -1560 -421 492
2453 492 -246 121 635 457 -1314 -2039 115 1671 96 -1651 -1252 -761 -983 317 1386 58 -2176
2470 -2176 -3025 -1134 341 1033 456 -846 -2673 -2802 59 2125 1120 -801 -1811 -1363 -1478 438
2486 438 2854 1904 -2117 -3904 -992 1538 1908 1323 231 -2132 -3739 -1575 2499 2735 514 -1825
2502 -1825 -2496 -2342 104 3388 2845 -1320 -3490 -1730 937 1927 2696 2357 -971 -4202 -1648 2903
2518 2903 4801 1733 -900 -2185 -2184 124 3050 4392 1023 -2779 -3143 -679 2489 3870 2694 -753
2534 -753 -3800 -2690 1733 4003 2743 296 -1911 -2885 -1027 2752 4785 2372 -1610 -3294 -1380
2549 -1380 1776 3889 3294 350 -3109 -3563 -7 3488 3571 1316 -1711 -3580 -2165 1329 3902 2766
2565 2766 -1137 -3723 -2769 128 1931 2984 1376 -2373 -4218 -1384 2448 3174 1213 -1324 -2795
2580 -2795 -2861 -227 2992 3252 -170 -3006 -3008 -1602 1022 2083 1522 -1488 -3631 -2571 484 1898 1076
2597 1076 -157 -2374 -3113 -1333 1607 3016 590 -2381 -2730 -1212 -228 1184 1763 -233 -2540 -2596
2613 -2596 250 1666 1258 155 -1280 -1767 -1711 781 2043 811 -1299 -1343 -1030 -335 308 2058 1118
2630 1118 -1380 -1932 -107 1101 468 150 347 -232 -995 253 1438 1417 -224 -670 421 484 524 1475
2648 1475 1039 -29 -395 500 1587 100 73 659 553 -231 196 1322 754 -581 -119 1579 1207 36
2666 36 -294 408 307 470 1302 1642 -216 -831 191 1258 909 522 236 -74 -1263 -232 2023 1925 -353
2685 -353 -1478 -754 -341 -33 1184 1482 -272 -2403 -1792 514 1405 1224 272 -1716 -2100 -966 1439
2702 1439 2569 251 -1726 -1866 -1511 -415 1858 2554 -375 -3214 -2899 -166 1462 1415 690 -1369 -3180
2719 -3180 -2681 486 2920 1853 -1251 -2991 -2778 -1093 1500 2917 759 -2658 -3736 -1273 1355
2734 1355 2269 1515 -547 -2992 -3454 -707 3227 2885 -344 -2822 -2870 -1363 884 3293 2447 -1400 -3944
2751 -3944 -2594 917 3120 2632 723 -2441 -3857 -1359 2890 4117 1119 -1786 -2401 -1884 678 3860
2767 3860 3589 240 -3804 -2907 553 3050 3250 1760 -1027 -3552 -2256 2044 4562 2651 -1102 -2484
2783 -2484 -2218 -544 2831 4123 1599 -2185 -3059 -789 1976 3401 3033 -150 -3026 -3016 668 3797
2799 3797 3058 -8 -1824 -2257 -1459 1322 3353 2416 -1528 -3430 -1223 1203 2292 2175 355 -2199
2815 -2199 -2701 -1190 2315 2579 532 -1671 -2225 -1831 458 2982 2264 -639 -2838 -2103 67 1181
2831 1181 1517 910 -982 -3248 -2064 1079 2131 957 -875 -2235 -2241 -1043 1357 1516 -24 -2028
2847 -2028 -2182 -1172 81 1118 1076 -565 -2247 -1832 280 1483 276 -678 -620 -1350 -1243 196 1222
2864 1222 482 -1084 -1299 -591 484 425 368 153 -798 -916 91 551 56 -35 -168 -284 -818 -86 534 373
2884 373 -489 -180 585 336 -40 114 702 170 -201 542 669 -91 -3 340 905 582 294 63 313 120
2904 120 737 1382 980 -113 -623 355 756 665 1098 954 -242 -937 -60 1655 1700 339 -183 -444 -623
2923 -623 610 1926 1668 -202 -1066 -840 535 1300 1634 1128 -887 -1676 -703 1584 1894 757 -664
2940 -664 -1073 -1624 -442 1932 2124 269 -1780 -1836 -636 430 1513 1566 -764 -2877 -2132 345 1835
2957 1835 1249 69 -1815 -2858 -1256 1343 2359 806 -1884 -2628 -1720 240 1703 2071 0 -2686
2973 -2686 -3033 -646 1288 1733 300 -1522 -2713 -2303 442 2353 1558 -1116 -2690 -2251 -843 1291
2989 1291 2441 650 -1977 -3175 -1104 1295 2184 1337 -463 -1999 -2523 -342 2337 2577 468 -2103
3005 -2103 -1996 -663 1071 2674 2013 -750 -2516 -1556 739 2205 2303 677 -1634 -2626 -623 1939
3021 1939 3179 976 -827 -1558 -1115 261 2192 2646 597 -2056 -1942 526 2277 2314 1111 -565
3037 -565 -1845 -1259 1087 2365 1922 91 -1213 -1575 -273 1830 2871 838 -1599 -1609 56 1478
3053 1478 1551 1186 459 -1462 -1703 45 2056 1847 -64 -1157 -1004 -766 402 1497 980 -569 -1420
3070 -1420 -873 261 712 900 52 -1096 -1678 -385 1490 799 -516 -960 -460 -793 -360 542 651 -118
3088 -118 -1139 -720 2 257 -99 -419 -478 -1070 -617 208 -152 -705 -609 -124 -420 -780 -276 287 -675 -824
3108 -824 -101 148 -508 -1164 -770 -97 -32 -144 85 -124 -1037 -576 236 830 -416 -314 -296 -783 -558 272
3128 272 1185 159 -963 -718 201 352 536 777 -65 -1320 -1177 816 1385 719 -64 -873 -830 -342 1230
3147 1230 2213 1014 -1017 -1194 -114 1158 2064 1640 443 -1355 -1295 424 2174 2131 725 -391 -1349
3164 -1349 -856 895 2431 1740 -697 -2072 -984 681 2010 1793 576 -1189 -1772 -311 1971 2546
3180 2546 1305 -664 -1898 -1504 264 2273 2291 329 -2059 -1791 -457 1627 2287 1498 -869 -2712
3196 -2712 -1932 711 2420 1322 -748 -2215 -2290 -961 1408 2341 858 -1994 -2962 -1402 566 2256
3212 2256 1951 -700 -2668 -2302 -38 1743 1478 240 -1518 -2880 -1805 792 2605 1382 -1574 -3080
3228 -3080 -2088 -267 1373 1773 444 -1999 -3184 -1424 1156 2137 1090 -904 -2725 -2456 103 2311
3244 2311 1993 -347 -2043 -2029 -843 1277 2062 1501 -897 -2915 -1684 1120 2196 1391 -203 -1703
3260 -1703 -2028 -706 1570 2167 563 -1110 -1775 -900 546 2122 1949 -157 -1537 -1251 675 1747
3276 1747 1649 1014 -589 -1175 -796 1228 2551 1024 -484 -1357 -816 136 1210 2029 750 -1124 -1387
3293 -1387 -217 790 1850 1440 159 -849 -1052 516 1759 1163 305 75 -757 -376 797 1573 867
3310 867 -558 -777 -551 551 620 886 350 -390 -865 -178 509 350 48 -282 -660 -535 91 202 320 -499
3330 -499 -698 -541 -416 -201 36 96 -356 -568 -456 -108 91 -122 -254 -105 -381 -864 -211 -352 -359 -394 -198
3351 -198 180 -551 -700 -529 13 -259 -498 -343 -1071 -740 -462 384 488 -551 -741 -352 -107 -8 486 642
3371 642 -138 -1213 -566 215 666 357 265 -685 -934 -700 501 1274 52 -575 -847 -1050 -231 1064 1544
3390 1544 18 -1623 -1309 54 1062 1466 877 212 -927 -1045 934 2009 1719 -12 -885 -908 98
3407 98 1403 2203 901 -995 -1305 -466 851 1811 1634 709 -1191 -1733 152 1635 1856 567 -960
3424 -960 -1414 -718 680 2273 1847 -278 -1553 -1089 497 1950 2126 1049 -1424 -1962 -615 1442 1765
3441 1765 754 -615 -1840 -2164 -437 2065 2336 -183 -1983 -1713 -288 684 1042 730 -886 -2293
3457 -2293 -1543 424 1812 1176 -40 -1671 -1928 -1188 1068 1832 183 -1678 -1823 -916 -289 1056 1099
3474 1099 -405 -2105 -2461 -335 1316 991 -194 -1006 -1818 -1553 243 1364 1034 -662 -1808 -1307 -85
3491 -85 845 1255 676 -1155 -1951 -700 993 1230 656 -455 -1142 -1413 -189 1114 1216 207 -1190 -1307
3509 -1307 -215 324 1234 852 -349 -1450 -1084 723 1098 1030 534 -535 -642 -256 1110 1586 633 -313
3527 -313 -550 -205 410 480 1105 929 -373 -482 605 1017 509 318 42 -1 -134 379 1013 798 -97 20
3547 20 367 433 285 623 594 -48 -65 256 354 264 -59 302 276 27 264 673 202 -607 54 389 285 -199
3569 -199 -318 258 84 -386 -94 11 -531 -587 -137 190 478 218 -126 -700 -660 -69 791 242 -665 -867 -485
3590 -485 -194 34 559 455 -621 -1397 -560 229 912 185 -471 -1434 -1205 57 347 443 -73 -917 -1269 -909
3610 -909 12 953 1014 -1048 -1460 -1266 196 900 696 -170 -972 -1604 -835 660 1637 877 -669 -1577 -1299
3629 -1299 55 1145 1233 109 -1251 -1420 -49 801 1429 827 -640 -1998 -994 1095 2071 1274 92
3646 92 -1035 -1252 -173 1461 2373 977 -680 -1633 -712 1220 1813 1504 -229 -1291 -1299 304 1680 1721
3664 1721 587 -874 -1478 -748 1358 2489 1505 -30 -1397 -1223 384 1883 2041 485 -903 -1793
3680 -1793 -407 1547 2503 873 -563 -1459 -1192 177 1747 2036 324 -1696 -1662 -81 1053 1900 1021
3697 1021 -690 -2076 -1552 581 1972 1228 -79 -1530 -1655 -355 1157 1701 668 -1554 -2134 -1054
3713 -1054 506 1198 1096 -35 -1696 -1889 -282 1306 1299 -104 -1112 -1930 -1509 49 1388 547 -609
3730 -609 -1768 -1516 -376 541 694 295 -1264 -1822 -765 757 945 480 -307 -1123 -1129 -134 1172 963 115
3749 115 -865 -866 -466 368 970 554 -511 -1396 -916 220 561 369 137 -415 -771 -696 481 1118 559 -160
3769 -160 -547 -106 518 912 539 252 -30 -380 162 263 907 668 435 -450 -50 311 908 585 -38 -68
3789 -68 262 131 229 624 537 338 357 52 118 224 247 402 271 329 246 134 -31 431 531 583 -162 -385 8
3812 8 92 304 216 600 123 -549 -570 357 685 506 -203 -700 -462 -182 323 339 493 -576 -564 -390 -79 231
3834 231 789 -37 -913 -856 -243 379 727 42 -407 -737 -875 -90 802 632 -521 -1274 -1296 -627 367 673
3854 673 12 -986 -1614 -1098 194 857 525 -242 -1292 -1205 -388 971 1096 -47 -1060 -1145 -753 322 1017
3873 1017 755 -355 -1755 -1201 -29 1015 926 -98 -663 -1123 -790 491 1587 811 -670 -1286 -628
3890 -628 274 1506 1613 384 -943 -1515 -531 1517 1626 1165 -113 -1383 -1138 335 1568 1603 -225
3907 -225 -613 -957 -102 1143 1727 1200 -447 -1287 -755 1073 1546 1270 288 -973 -1248 71 1429 1761
3925 1761 740 -538 -656 -550 470 1760 1450 -506 -1151 -1198 401 1328 908 277 -550 -934 -534 549
3943 549 1443 862 -621 -1337 -912 233 1119 853 173 -937 -987 -258 737 692 466 -413 -1197 -1224 -256 1044
3963 1044 430 -290 -1364 -525 -231 620 716 -35 -654 -1455 -1028 116 546 283 -449 -1092 -1127 -345 385 444
3983 444 -228 -832 -590 -611 -142 662 474 -201 -972 -615 -411 384 258 -136 -317 -711 -467 102 76 -105 -64
4004 -64 -434 -576 -269 205 297 -91 -469 -181 -187 164 -63 197 275 255 348 -139 88 270 99 -129 279 390
4026 390 -77 133 -115 345 361 688 196 -482 55 466 523 474 507 -247 -305 -116 250 541 863 139 -44 -193
4048 -193 318 861 1117 469 -39 -193 -272 652 940 597 -261 -640 -318 262 972 861 73 -788 -793 -166 716
4069 716 1036 524 -419 -1104 -575 -124 575 809 -218 -1006 -1096 -171 843 961 521 -698 -1345 -776 206
4088 206 988 596 -279 -1312 -1589 -545 714 1063 319 -1060 -1770 -938 546 948 335 -616 -1437 -1208
4106 -1208 -390 1006 1108 -190 -1356 -1651 -742 733 1148 602 -818 -1766 -908 201 1042 1195 95
4123 95 -1095 -1929 -689 1065 1628 627 -1003 -1459 -941 148 1498 1421 -428 -1209 -1324 -82 932
4140 932 1728 771 -1010 -1456 -1010 539 1420 1305 64 -991 -811 27 1249 1889 942 -906 -1285 -518
4158 -518 919 1723 1103 170 -852 -949 178 1399 1333 546 -539 -1010 -245 934 1620 982 -561 -1049
4176 -1049 -936 487 1098 1516 614 -623 -1090 -413 1282 1301 496 -562 -634 -433 184 1036 626 -187 -880
4195 -880 -957 -329 419 808 564 -210 -1032 -913 264 920 652 -96 -593 -676 -441 268 937 415 -475 -1150
4215 -1150 -489 583 159 109 -246 -919 -572 -194 82 41 83 -528 -823 -605 -90 212 107 -523 -549 -184 -104
4236 -104 92 -23 -153 -336 -458 -205 237 -163 -302 181 -339 -268 -268 300 237 -30 22 -120 -89 1 -136 15
4258 15 39 31 198 70 -218 -374 323 841 428 -11 -341 -50 176 418 498 524 -79 -281 -87 214 673 325
4280 325 492 23 -86 128 564 872 -51 -134 -628 -508 104 1053 923 -78 -644 -148 525 877 739 153
4300 153 -307 -537 -336 412 1155 1089 -105 -795 -305 297 1277 1119 208 -618 -605 184 900 787 386 -466
4320 -466 -1187 -828 415 837 666 -62 -1212 -1201 -157 647 905 853 -496 -1263 -782 343 1049 1183 -410
4339 -410 -1338 -1067 -642 642 867 356 -795 -1519 -1109 42 1059 637 -556 -1406 -1025 -446 442 798
4357 798 150 -601 -1447 -1042 195 1029 793 -295 -1291 -1006 18 1118 708 35 -690 -1192 -800 439
4375 439 990 517 -449 -1419 -1148 227 1148 919 64 -1020 -1151 -368 564 1135 483 -435 -893 -504 267
4394 267 1197 1018 52 -533 -928 101 946 1174 432 -389 -587 -600 517 1092 779 -106 -620 -532 335 1016
4414 1016 776 943 -561 -531 -315 607 776 589 -67 -615 -564 310 776 997 134 -333 -278 233 237 591 744
4435 744 -141 -651 -99 474 800 665 -343 -414 -395 9 392 878 150 -299 -632 -261 -11 174 176 94 -441
4456 -441 -393 -409 -175 96 135 -321 -142 -274 171 50 -276 -656 -353 99 -116 -581 -174 -391 -422 -308 -71
4477 -71 -67 -195 -235 -187 104 249 -17 -371 -536 -206 98 -67 291 64 -416 -407 -161 -31 553 336 -298 -709
4499 -709 -409 258 159 383 -402 -788 -291 155 652 367 223 -603 -558 -139 419 1000 386 -199 -651 -175 157
4520 157 514 612 213 -305 -635 115 1178 1127 572 -215 -908 -285 600 1190 548 -261 -630 -732 63 727
4540 727 1375 371 -629 -800 -364 759 1462 814 -198 -822 -565 203 1041 1260 94 -593 -1127 -101
4558 -101 1088 1315 531 -321 -1135 -418 471 1189 1027 -241 -833 -891 -426 765 1376 617 -598 -1179 -645
4577 -645 428 974 659 88 -1143 -1363 -186 951 882 316 -1029 -903 -865 493 969 697 -659 -1500
4595 -1500 -1060 -153 565 1025 143 -1457 -1556 -716 526 912 415 -454 -1332 -951 -75 999 903 -367 -1169
4614 -1169 -1242 -498 414 791 115 -390 -1172 -957 85 719 442 203 -921 -1118 -324 915 921 352 -475 -747
4634 -747 -643 172 823 277 -12 -811 -911 -157 986 908 42 -144 -674 -118 587 1013 495 -26 -599 -255
4654 -255 247 567 795 337 -322 -565 -111 418 578 495 296 -471 -213 340 461 606 -154 -274 -160 217
4674 217 264 391 500 -84 -115 -91 94 351 503 154 -296 -312 11 403 312 -19 4 34 -93 -83 216 132 -278
4697 -278 -15 -59 -178 67 -119 -374 -170 62 -422 -84 -360 -192 120 15 25 -309 -311 180 -245 -15 -68 -310
4719 -310 -309 -490 -549 -278 87 111 -229 -387 -405 -341 5 258 -229 -513 -534 -365 -181 59 -3 -182 -683 -716 -119
4742 -119 360 255 -149 -552 -374 -466 106 888 206 -306 -826 -649 231 850 392 -19 -539 -854 -382 420
4762 420 821 375 -245 -760 -480 -100 943 693 -29 -436 -754 -84 540 1037 554 -308 -889 -507 634
4781 634 1159 741 207 -783 -650 171 954 918 480 -526 -811 -504 391 1116 1058 -200 -886 -576 374 1095
4801 1095 1215 276 -513 -400 -450 809 1334 849 -110 -931 -669 288 1004 904 502 -841 -697 -148 579
4820 579 1016 724 -665 -864 -748 368 945 895 -74 -676 -1024 -130 477 982 82 -103 -937 -765 193 675
4840 675 691 -18 -1106 -719 -235 452 561 98 -856 -1357 -402 394 800 336 -395 -953 -414 -308 678 470
4860 470 112 -590 -829 -585 77 438 160 -374 -795 -475 -103 114 321 -233 -584 -725 -358 161 838 278
4880 278 -410 -910 -140 274 581 138 -198 -351 -271 69 517 686 304 -168 -292 -205 290 549 210 -69 -136
4901 -136 -38 79 249 374 206 89 171 148 253 342 128 70 266 120 137 285 126 92 194 -73 370 239
4923 239 28 317 108 445 610 552 411 -199 218 73 261 162 -40 95 183 112 360 508 170 -199 -576
4944 -576 -92 361 350 325 -246 -298 -329 -18 503 363 -93 -683 -524 -142 431 330 122 -665 -389 -317 333 296
4966 296 470 -326 -486 -515 -152 461 259 -139 -715 -861 -404 180 377 244 -435 -1061 -943 -356 584 519 -143
4987 -143 -416 -1175 -422 476 733 170 -968 -1038 -721 74 540 545 157 -799 -823 -368 395 894 268 -469 -824
5008 -824 -489 348 1151 733 -190 -914 -746 -64 643 1008 88 -852 -875 -42 440 943 535 176 -951 -709
5028 -709 -10 849 1158 245 -575 -679 -312 787 1010 539 -290 -1151 -555 147 834 1196 394 -495 -433 -64
5048 -64 796 707 587 37 -488 -490 168 779 768 221 -562 -750 21 1008 765 543 -382 -1119 -243 405 887 851
5070 851 61 -936 -623 149 748 472 0 -486 -785 -305 518 480 417 -35 -594 -736 -190 554 373 60 -765
5091 -765 -501 -309 145 513 -118 -338 -762 -600 -202 452 329 -74 -941 -958 -204 297 292 435 -426 -448 -681
5112 -681 -51 172 164 -141 -674 -657 -388 347 366 -139 -320 -413 -504 179 325 52 -138 -394 -483 -60 48 217
5134 217 -213 -489 -333 170 -117 -185 -43 378 52 -41 -31 226 -72 95 155 43 -34 -44 -154 30 286 -14
5156 -14 87 229 -62 273 296 130 42 635 177 -97 199 300 305 138 162 -208 322 169 531 538 -170 -32 -248
5179 -248 137 354 238 88 75 -104 -209 107 643 561 186 -1 -325 73 503 598 -37 -147 -320 -489 408
5200 408 179 639 96 -363 -508 -227 294 589 407 -152 -588 -221 168 193 103 104 -326 -661 -409 500 446 -363
5222 -363 -465 -885 -373 6 645 372 -337 -786 -654 -196 403 338 -37 -493 -652 -573 183 577 289 -691 -900
5243 -900 -736 87 447 775 18 -599 -891 -510 336 446 365 -286 -659 -625 173 579 722 -116 -485 -553 -324
5264 -324 375 610 317 -370 -933 -458 334 418 634 -232 -283 -526 -312 315 1008 516 -451 -489 -238 545 607
5285 607 455 26 -610 -365 103 604 971 421 -370 -516 -154 376 567 515 -353 -461 -395 119 510 358 169
5306 169 -291 -462 343 597 951 267 -507 -480 -577 251 570 437 0 -349 -190 60 209 561 359 -89 -476
5327 -476 -293 414 258 260 -420 -422 -473 -524 144 254 -235 -242 -212 -327 133 -21 -40 -257 -342 -217 55 58 -180 103
5351 103 -309 -230 -319 -236 173 217 -191 -254 -294 -197 -199 -209 -150 -102 19 -278 -246 -188 -91 -247 -129 -35 7 66 -139 -241
5377 -241 -116 -193 175 -146 -437 -137 173 -100 27 -21 -325 -429 -62 293 94 -76 -331 -297 -208 186 276 431
5399 431 215 -587 -254 174 283 635 244 16 -105 -40 571 542 256 -320 149 -21 169 545 305 -17 -235
5420 -235 -279 459 341 476 414 -299 -351 -434 249 790 650 -2 -409 -455 41 121 637 581 -246 -370 -352 238 400
5443 400 196 51 -277 -544 34 621 709 408 -329 -554 -274 12 784 488 -472 -738 -562 -16 391 693
5463 693 -107 -291 -852 -408 284 514 202 -397 -1212 -512 52 777 502 -74 -531 -735 -91 176 550 351
5483 351 -455 -1174 -935 143 601 518 -213 -808 -733 -457 196 819 268 -379 -1133 -309 -74 644 338 137
5503 137 -809 -783 -193 330 511 191 -377 -498 -408 140 362 488 75 -630 -343 -41 898 658 249 -245 -438
5524 -438 -170 472 707 493 -9 -318 -294 -88 406 652 199 -244 -386 42 739 572 225 -221 -257 -148 221
5545 221 600 424 131 -139 -94 263 208 788 346 -78 -169 -301 265 454 313 232 -11 -136 75 423 278
5566 278 278 -18 44 -13 73 208 578 45 -44 -202 -95 322 274 176 165 -255 -10 -50 30 132 -100 18 -393 -35
5590 -35 188 -60 -63 -283 -164 -68 -20 -90 -188 -243 -32 -109 -202 148 -411 -201 -29 -321 -30 -416 -327 -220 -250 -48
5614 -48 -83 -128 -273 -268 -328 -105 -34 -197 -84 -398 -237 -35 -51 -171 -60 -574 -245 -217 173 244 -13 -136 -196 72
5638 72 68 182 299 -548 -282 -54 255 503 335 232 -391 -416 -7 174 374 170 -199 -441 -246 414 362 598
5660 598 27 -99 -31 168 603 262 98 -233 -320 -188 511 646 744 -51 -163 -160 188 391 495 250 -319 -379
5682 -379 -100 410 536 525 -229 -208 -54 425 517 399 32 -244 -474 -145 569 660 73 -275 -663 -548 66
5703 66 199 285 38 -511 -430 -215 322 551 136 -419 -827 -160 -285 660 466 -328 -769 -511 -237 -30 247
5724 247 82 -446 -719 -153 -241 732 121 -471 -591 -82 96 294 284 -26 -362 -762 -192 -101 303 -102 -310
5745 -310 -689 -623 -12 49 70 -223 -504 -879 -137 110 482 -37 -97 -412 -56 254 378 201 53 -447 -380 0
5767 0 -68 78 81 -72 -461 -148 262 292 298 101 -275 -340 100 673 435 -112 -304 -342 -24 45 78 433 256 -6
5791 -6 -120 227 96 411 95 -110 70 185 317 134 58 138 46 76 271 239 530 218 -32 50 130 87 191
5814 191 268 -27 54 202 -163 123 167 -36 167 146 378 60 132 -335 -37 7 34 34 -174 -207 -87 -4 -310 -85
5838 -85 -252 -150 -247 4 -102 243 -214 -211 196 -320 -131 -26 -285 -128 -502 -225 84 184 113 28 -631 -354
5860 -354 -96 -90 113 -196 -392 -430 -372 -87 99 -334 94 -442 -301 125 264 444 -169 -514 -165 -37 453
5881 453 301 110 -11 -506 -198 37 441 272 -170 -342 -511 47 357 521 202 -467 -271 -156 465 95
5901 95 366 41 -181 -72 209 324 622 184 -101 -195 -54 317 282 600 -68 -286 131 -106 585 664 68
5922 68 -140 -204 -55 378 336 355 -75 -361 -49 124 287 535 170 -289 -273 -54 458 458 352 -321 -466 -401 348
5945 348 352 319 -148 -519 -315 87 601 298 229 -497 -561 -657 349 511 418 5 -738 -753 -148 417 392 -75 -445
5968 -445 -702 -161 80 438 343 -218 -409 -379 -98 400 235 -17 -383 -510 -358 184 37 348 -182 -441 -228
5989 -228 -334 -88 176 -87 -378 -570 -402 -25 126 217 -491 -549 -302 -68 296 36 -170 -500 -368 -234 17
6010 17 200 209 -239 -248 -80 96 428 -203 -102 -90 -299 -71 411 250 -208 -60 -168 97 -29 147 313 259
6032 259 -74 183 347 178 104 -104 101 238 -3 104 334 224 4 2 -173 197 245 254 281 248 -138 48 -88
6055 -88 78 171 241 244 -15 181 82 112 59 67 -8 127 -62 21 -107 209 -34 76 129 174 -127 119 14 -52 -104
6080 -104 -5 101 181 -325 298 5 -140 -196 -188 520 31 8 -294 -222 -216 -141 -238 198 -328 -234 -601 44 -63 373
6104 373 175 -109 -425 -356 -125 332 276 -69 -355 -300 -253 -30 407 -5 -288 -635 -408 -88 251 0 -55 -614
6126 -614 -422 -320 158 150 -99 -65 -269 -283 133 94 271 -253 -364 -112 55 131 351 10 -296 -455 -132 121
6148 121 431 272 -188 -163 -602 -37 223 261 199 -259 -148 -185 243 401 554 12 -319 -228 14 511 566 376
6170 376 -344 -461 -19 315 512 222 35 -216 -149 64 536 157 165 -157 -260 269 230 531 370 117 -58
6191 -58 -147 -259 204 245 184 -71 -425 -168 122 278 179 -481 -322 43 221 615 198 54 -274 -557 -24 431
6213 431 89 -50 -59 6 -126 -86 112 8 -114 -420 -623 178 160 78 28 -399 -329 -194 -2 507 -41 -333 -395
6236 -395 -260 -29 148 -184 -131 -360 29 -60 86 257 -45 -133 -101 -197 -244 -310 -13 -220 -27 -47 -73 210 153
6259 153 -12 -30 -71 165 307 130 134 -77 7 86 94 -1 -22 -209 -47 164 336 117 208 293 56 -42 280 159
6283 159 168 88 302 1 124 392 -194 232 273 151 245 153 -35 181 31 355 208 185 274 -33 -147 106 359
6306 359 189 107 297 74 -95 39 120 242 211 -90 -80 95 376 459 363 -80 -445 -306 -28 286 154 183
6328 183 -19 -246 47 118 451 176 -51 -380 -295 -52 159 362 -79 -350 -458 -101 86 433 120 -308 -685
6349 -685 -483 -48 341 14 -286 -272 -406 -448 -39 -16 -123 -231 -559 -618 -462 228 395 -344 -245 -292 -455 272
6371 272 204 -21 -576 -539 -5 126 170 -60 -53 -476 -508 -228 321 150 -74 -273 -447 -332 434 435 159 65 -531
6394 -531 -327 -198 330 531 296 -133 -252 117 107 500 -68 59 -231 -117 140 420 452 59 -19 -341 -128
6415 -128 497 396 501 -227 -296 -132 286 253 446 177 -124 -45 -274 415 393 61 -177 56 -56 249 174 409
6437 409 -2 -190 -168 0 140 405 49 -55 -610 -43 189 256 317 361 -390 -446 -190 45 209 29 -226 -227
6459 -227 -311 -72 407 -77 203 -329 -233 2 227 162 -49 -106 -358 -307 -17 7 223 20 -388 -471 -147 221
6481 221 -38 -30 -269 -215 -235 18 357 -127 -243 -49 -396 -16 -145 -36 -180 -103 -236 -171 -378 -19 103 -46
6503 -46 -39 -92 -181 -54 -160 -43 114 127 -102 -183 -130 -2 167 -150 323 -99 -135 69 264 -135 -34 137 -288
6526 -288 -135 151 200 87 354 295 11 -126 109 268 -127 -40 -62 218 266 210 -175 154 -121 54 40 24 243
6549 243 -53 150 -167 35 313 -44 539 -84 -269 -152 -5 251 362 83 104 -103 -52 192 228 141 -156
6570 -156 -252 -343 226 388 157 50 63 -150 -113 22 232 217 26 -683 -52 -169 242 98 218 -173 -519 -347
6592 -347 -41 366 131 -215 -533 -504 137 117 251 78 -604 -34 -208 2 113 142 -118 -553 -480 -425 73 102
6614 102 46 -329 -191 -212 205 -44 -71 -359 -445 -156 189 202 219 99 -688 -325 -65 65 156 198 -119 -444 -160
6637 -160 69 463 102 97 -651 -107 -25 106 112 48 -494 -258 -35 96 382 150 10 -203 86 58 106 57 235
6660 235 -317 -78 -177 233 570 113 -16 5 -254 44 360 298 406 174 -2 -176 215 388 305 39 -135
6681 -135 -222 303 397 418 27 -72 -4 14 -14 325 145 96 -86 200 107 355 228 99 24 -11 184 332 -18 112
6705 112 97 -82 -57 -219 -8 -24 -227 -262 -80 -2 42 108 79 28 -121 106 164 265 62 32 -91 33 168 391
6729 391 -197 -112 -392 173 -304 -180 72 58 -186 -54 81 -175 -70 -129 -76 -120 -168 -319 -246 143 -8 -164
6751 -164 -59 219 103 44 -103 -129 142 258 57 -155 203 -291 -28 115 -49 -73 139 -52 -43 41 14 284
6773 284 -2 -191 78 190 104 -62 35 -438 -77 267 358 499 234 72 -556 -168 256 236 127 8 -78 -190
6795 -190 197 434 360 144 -119 -309 90 171 151 205 83 34 -357 228 540 275 -164 22 -278 291 -93 219
6817 219 126 -210 -80 151 4 489 316 -153 -254 -258 409 223 186 144 -190 -211 -214 -30 418 46 -125 -424 -88
6840 -88 -263 297 161 -77 -268 -329 -153 385 166 24 -21 -482 -342 -101 159 245 -260 32 -379 -98 231
6861 231 369 -158 -141 -304 -141 -309 330 202 -453 -96 -561 -93 84 128 -34 196 -2 -17 56 503 45
6882 45 -129 -422 -528 -137 227 271 -309 -193 -411 -5 -69 224 333 -157 -217 -220 -48 138 241 318 -111 12
6904 12 144 199 282 173 -156 -50 -258 81 165 405 137 6 -283 -69 91 -268 219 168 105 231 132 327
6926 327 474 476 -28 -10 -5 314 280 -101 119 -158 144 395 126 105 -133 98 -46 3 577 373 129 -51 115
6949 115 134 114 339 -257 -54 -172 -67 -6 -103 176 -16 -342 -55 121 -96 37 -45 -16 -290 -66 -139 -241
6971 -241 -145 -50 -425 -286 -286 -319 -120 -265 -79 -154 -55 -128 -241 -128 -19 -11 -97 -141 -259 -5 -120 84 298 82
6995 82 -355 -245 -340 129 -59 -16 -194 -497 15 -340 -138 -71 -334 -240 -480 -169 165 210 167 -489 -363 -126
7017 -126 -14 51 197 354 -40 -180 80 205 59 231 -157 58 -157 -180 131 43 173 77 -71 -191 131
7038 131 365 183 -352 -250 95 -228 226 426 70 -247 -12 -203 -22 169 -91 109 -243 8 49 121 -16
7059 -16 30 -384 71 -30 264 43 328 -180 -123 77 159 359 295 51 -190 -243 299 189 186 181 -320 -309 -153 -97
7083 -97 -47 202 18 -314 -460 -280 11 62 12 -533 -325 -454 -7 357 180 85 -220 -348 -207 271 60 -138
7105 -138 -162 -398 -186 -32 20 -284 -146 -473 -207 -54 186 249 -82 -230 -130 111 -150 158 -4 -299 -248
7126 -248 -193 156 -139 148 41 -299 -208 -136 94 261 -62 -60 -154 -24 -64 153 45 22 -200 -40 105 22 15 -372
7150 -372 -116 59 38 -60 369 2 41 -245 15 417 332 347 -175 -119 -171 -52 287 158 -273 167 -162 182
7172 182 171 149 400 -136 44 68 42 191 182 -12 -149 -93 213 203 6 -246 166 10 93 166 141 -15 -274 -23
7196 -23 158 -31 19 78 -9 -109 99 121 80 197 -122 -24 222 114 123 -89 -169 -155 -1 16 151 -227 -280 -83
7220 -83 -105 27 -38 -51 -77 78 -190 -98 2 186 -279 -504 -63 -69 276 327 283 31 -330 -296 -184 280 -100 -242
7244 -242 -115 -139 -110 191 85 42 -395 -515 -78 36 84 346 -134 -201 -364 172 51 254 -29 -78 -154 -258
7266 -258 106 223 114 -201 -260 -85 -40 106 254 -23 92 -239 -242 -25 19 -66 -130 -160 -9 -46 402 347 7
7289 7 -105 -129 -76 311 191 236 81 -106 -144 97 173 177 -20 -418 -18 -44 176 318 227 -234 -92 295 250 241 45
7314 45 -84 -96 -279 -69 245 300 86 -98 -319 -119 -108 347 99 121 -21 -45 203 276 259 -74 -134 121 -239
7337 -239 294 187 83 -47 -19 -170 -66 187 117 194 -432 -132 -140 49 311 82 -294 -286 -107 13 99 81 -162
7360 -162 -470 -39 -26 207 146 -82 -177 -544 -116 179 -12 -167 73 -113 -88 30 64 60 86 36 -78 -322 192
7383 192 -52 -168 98 89 -125 40 -114 -106 -278 -544 -195 578 19 -47 143 5 54 56 104 19 183 204 -23 -91
7407 -91 51 -2 110 8 -36 -33 145 41 -232 -73 370 79 -175 259 -72 -18 -105 117 106 28 -82 180 -62
7430 -62 338 116 261 -65 -4 -194 -157 265 145 21 -118 202 -245 246 275 6 -17 -6 13 119 -13 311
7452 311 255 -22 -251 -15 19 168 106 302 -67 -166 213 -150 103 67 -267 -190 44 47 63 73 -178 -191 197 197
7476 197 -18 96 45 -157 -310 -135 51 214 -164 -309 -238 -80 -32 -129 187 -83 46 39 5 244 109 9
7498 9 -270 -228 -155 28 180 265 -10 -417 -280 -36 -122 201 -114 -267 -244 -339 129 19 73 12 -45 -441 -171 370
7522 370 65 59 -57 -460 -151 254 416 -7 -129 -175 -116 -20 533 360 216 -32 -232 3 315 455 373 -107
7544 -107 -5 218 -68 599 241 -237 -225 166 -67 60 157 155 -302 -73 -46 24 265 264 -110 -129 -118 18 104 -158
7568 -158 68 -198 -181 -245 -37 201 124 -284 125 3 39 124 154 81 -175 -309 -150 21 -65 189 -143 -244 -419
7591 -419 25 219 -144 68 -181 -224 -144 -12 44 7 122 -320 -256 -136 -4 109 -160 -20 10 -233 -213 245
7613 245 -165 -10 -347 -216 -46 37 -232 -254 -11 -332 242 -111 -110 129 172 -93 -61 78 -340 -251 -113 -89 -13
7636 -13 218 -19 155 230 133 -160 75 227 -241 -331 5 275 -95 181 93 -9 131 194 -361 90 18 58 -189
7659 -189 207 40 161 219 -339 -231 39 424 176 278 -299 140 143 34 56 431 -39 -288 -146 -69 76 98
7681 98 271 16 -125 -164 269 27 172 -160 33 -17 -32 9 302 251 -148 -18 40 150 327 -217 174 -36
7703 -36 -177 -154 141 84 293 83 -206 -128 205 456 220 -211 -421 -87 383 142 -9 152 -368 -170 -63
7724 -63 -11 173 101 -304 -267 -170 -151 -6 210 -265 -276 -24 -359 85 235 26 -174 -347 -289 7 -120 205 -219
7747 -219 -458 -263 -64 -217 64 146 -92 -219 229 270 274 104 -20 -106 -99 -48 33 201 -62 -213 -248 -340 -206 242
7771 242 59 -216 -123 -263 -70 309 -17 56 -23 -120 -17 -24 299 153 -109 -221 -347 227 143 110 74 -84 -433
7794 -433 -68 129 551 -93 -242 7 150 26 114 114 127 -79 86 227 148 362 260 -211 55 -6 280 92
7816 92 -8 -31 -273 -297 318 135 229 122 212 -184 -3 104 205 241 -84 -89 -14 20 29 51 300 -55 -379 10
7840 10 -307 0 -25 -135 425 -119 248 -60 -247 -98 66 -416 -167 -116 -116 -242 -61 -259 -10 -153 -193 -102
7862 -102 -82 -118 -76 -273 -124 144 -55 -188 154 112 -299 27 2 -200 91 100 -33 -167 92 -119 -245 14
7884 14 -170 -56 -364 105 64 110 -180 164 -84 -233 -306 -147 103 -149 -240 -41 48 126 -176 6 94 -247 189
7907 189 -50 65 125 198 -262 -167 19 206 428 127 -64 -29 64 93 232 159 -80 -14 -281 22 276 321 277
7930 277 -74 -79 -71 -98 -138 192 394 -153 -114 -11 215 109 -86 -197 -91 177 219 460 158 -40 -50 -247 -83
7953 -83 120 104 -96 -191 -82 13 96 147 327 -398 45 69 -110 239 44 -108 -23 -328 52 -271 135 346 -164
7976 -164 -413 -87 106 226 -41 -289 -112 -75 -76 -127 141 43 -322 -129 -434 -123 -23 200 -385 -400 -287 -282 114
7999 114 248 -124 -152 77 47 97 232 -53 28 -367 -325 -10 85 -3 110 -369 -201 -89 -236 440 -80 295
8021 295 -91 -28 -34 77 166 489 -95 -177 -8 -2 375 296 86 -188 -15 157 284 261 -33 124 -66 158 160 165
8045 165 -54 18 -55 135 153 22 107 206 158 18 362 19 -20 -67 -129 160 46 376 216 -88 8 353 99
8068 99 -142 119 270 -44 -23 193 37 275 -54 227 -139 -28 129 -43 -5 -264 111 -22 -130 -241 -13
8089 -13 98 -296 557 -74 133 -59 -5 75 -52 -247 209 53 60 -166 -81 69 -241 63 144 139 -370 124 -227
8112 -227 135 26 -266 426 133 -278 -192 -44 -68 122 81 -285 -83 204 26 -141 -450 -188 -118 111 -25
8133 -25 -68 -82 -160 -297 -43 -90 104 42 56 101 318 20 -30 -184 -190 192 64 290 36 145 -41 -176 -85 67
8157 67 -221 84 -282 -259 -55 157 307 143 -4 -133 11 93 86 28 224 -384 30 -58 -230 384 -21 -230
8179 -230 0 -6 62 243 330 20 28 -263 -148 171 24 56
8191E6
##END NTUPLES=NMR FID
##END=
