##TITLE=1H_LacDMe-C19-B-3
 CDCl3, 8 sc, 
 11.11.2019
##JCAMPDX= 6.0         $$ Bruker NMR JCAMP-DX V2.0
##DATA TYPE= NMR FID
##DATA CLASS= NTUPLES
##ORIGIN= UXNMR, Bruker Analytische Messtechnik GmbH
##OWNER= root
$$ XWIN-NMR		Version 3.5
$$ Mon Nov 11 14:20:28 2019 Russian Standard Time (UT+4h)  she@DPX200
##.OBSERVE FREQUENCY= 200.1315
##.OBSERVE NUCLEUS= ^1H
##.DELAY= (6, 6)
##.ACQUISITION MODE= SIMULTANEOUS
##.ACQUISITION SCHEME= undefined
##.AVERAGES= 8
##.DIGITISER RES= 18
##SPECTROMETER/DATA SYSTEM= spect
##.PULSE SEQUENCE= zg30
##.SOLVENT NAME= CDCl3
##.SHIFT REFERENCE= (INTERNAL, CDCl3, 0, 15.7039)
##AUDIT TRAIL= $$ (NUMBER, WHEN, WHO, WHERE, WHAT)
$$ ##TITLE= Audit trail, XWIN-NMR		Version 3.5
$$ ##JCAMPDX= 5.01
$$ ##ORIGIN= Bruker BioSpin GmbH
$$ ##OWNER= she
$$ F:/spectra/data/she/nmr/H-F/1/audita.txt
$$ ##AUDIT TRAIL=  $$ (NUMBER, WHEN, WHO, WHERE, WHAT)
(   1,<2019-11-11 14:19:20.65 +0400>,<she>,<DPX200>,
      <created by zg, POWCHK disabled, PULCHK disabled
       configuration hash MD5:
       00 E9 B6 7A A2 85 ED C7 34 08 36 98 17 FE 4E 26
       data hash MD5: 16K
       ED 0A C4 F8 6D AC 02 48 87 EA B5 2D A6 C8 0F 8F>)
$$ ##END=
$$ 
$$ hash MD5
$$ A9 A7 C6 8C 84 28 19 26 F6 44 F4 82 75 7B 35 48
##$RELAX= 
##$RELAX= 
##$RELAX= 
##$RELAX= 
##$RELAX= 
##$RELAX= 
$$ Bruker specific parameters
$$ --------------------------
##$DU= <F:/spectra>
##$EXPNO= 1
##$NAME= <H-F>
##$PROCNO= 1
##$TYPE= <nmr>
##$USER= <she>
##$AMP= (0..31)
100 100 100 100 100 100 100 100 100 100 100 100 100 100 100 100 100 100 
100 100 100 100 100 100 100 100 100 100 100 100 100 100 
##$AQSEQ= 0
##$AQ_mod= 1
##$AUNM= <au_zg>
##$AUTOPOS= <>
##$BF1= 200.13
##$BF2= 200.13
##$BF3= 200.13
##$BF4= 200.13
##$BF5= 200.13
##$BF6= 200.13
##$BF7= 200.13
##$BF8= 200.13
##$BYTORDA= 1
##$CFDGTYP= 0
##$CFRGTYP= 5
##$CHEMSTR= <none>
##$CNST= (0..31)
1 1 145 1 1 1 1 1 1 1 1 1 1 1 1 1 1 1 1 1 1 1 1 1 1 1 1 1 1 1 1 1 
##$CPDPRG= <>
##$CPDPRG1= <>
##$CPDPRG2= <>
##$CPDPRG3= <>
##$CPDPRG4= <mlev>
##$CPDPRG5= <mlev>
##$CPDPRG6= <mlev>
##$CPDPRG7= <mlev>
##$CPDPRG8= <mlev>
##$CPDPRGB= <>
##$CPDPRGT= <>
##$D= (0..31)
0 1.2 0 0 0 0 0 0 0 0.06 0 0.03 0 0 0 0 0.0002 0 0 0 0 0 0 0 0 0 0 0 0 
0 0 0 
##$DATE= 1573467560
##$DBL= (0..7)
120 120 120 120 120 120 120 120 
##$DBP= (0..7)
150 150 150 150 150 150 150 150 
##$DBP07= 0
##$DBPNAM0= <>
##$DBPNAM1= <>
##$DBPNAM2= <>
##$DBPNAM3= <>
##$DBPNAM4= <>
##$DBPNAM5= <>
##$DBPNAM6= <>
##$DBPNAM7= <>
##$DBPOAL= (0..7)
0.5 0.5 0.5 0.5 0.5 0.5 0.5 0.5 
##$DBPOFFS= (0..7)
0 0 0 0 0 0 0 0 
##$DE= 6
##$DECBNUC= <off>
##$DECIM= 24
##$DECNUC= <off>
##$DECSTAT= 4
##$DIGMOD= 1
##$DIGTYP= 9
##$DL= (0..7)
0 120 120 120 120 120 120 120 
##$DP= (0..7)
150 150 150 150 150 150 150 150 
##$DP07= 0
##$DPNAME0= <>
##$DPNAME1= <>
##$DPNAME2= <>
##$DPNAME3= <>
##$DPNAME4= <>
##$DPNAME5= <>
##$DPNAME6= <>
##$DPNAME7= <>
##$DPOAL= (0..7)
0.5 0.5 0.5 0.5 0.5 0.5 0.5 0.5 
##$DPOFFS= (0..7)
0 0 0 0 0 0 0 0 
##$DQDMODE= 0
##$DR= 18
##$DS= 0
##$DSLIST= <SSSSSSSSSSSSSSS>
$$ [...]
##$SUBNAM2= <"">
##$SUBNAM3= <"">
##$SUBNAM4= <"">
##$SUBNAM5= <"">
##$SUBNAM6= <"">
##$SUBNAM7= <"">
##$SUBNAM8= <"">
##$SUBNAM9= <"">
##$SW= 24.0689530833862
##$SWIBOX= (0..15)
0 0 2 0 0 0 0 0 0 0 0 0 0 0 0 0 
##$SW_h= 4816.95568400771
##$TD= 16384
##$TD0= 1
##$TE= 0
##$TE2= 300
##$TE3= 300
##$TEG= 300
##$TL= (0..7)
0 120 120 120 120 120 120 120 
##$TP= (0..7)
150 150 150 150 150 150 150 150 
##$TP07= 0
##$TPNAME0= <>
##$TPNAME1= <>
##$TPNAME2= <>
##$TPNAME3= <>
##$TPNAME4= <>
##$TPNAME5= <>
##$TPNAME6= <>
##$TPNAME7= <>
##$TPOAL= (0..7)
0.5 0.5 0.5 0.5 0.5 0.5 0.5 0.5 
##$TPOFFS= (0..7)
0 0 0 0 0 0 0 0 
##$TUNHIN= 0
##$TUNHOUT= 0
##$TUNXOUT= 0
##$USERA1= <user>
##$USERA2= <user>
##$USERA3= <user>
##$USERA4= <user>
##$USERA5= <user>
##$V9= 5
##$VALIST= <valist>
##$VCLIST= <CCCCCCCCCCCCCCC>
##$VD= 0
##$VDLIST= <DDDDDDDDDDDDDDD>
##$VPLIST= <PPPPPPPPPPPPPPP>
##$VTLIST= <TTTTTTTTTTTTTTT>
##$WBST= 1024
##$WBSW= 4
##$XGAIN= (0..3)
0 0 0 0 
##$XL= 0
##$YL= 0
##$YMAX_a= 495335
##$YMIN_a= -429344
##$ZGOPTNS= <>
##$ZL1= 120
##$ZL2= 120
##$ZL3= 120
##$ZL4= 120
##$ABSF1= 10
##$ABSF2= 0
##$ABSG= 5
##$ABSL= 3
##$ALPHA= 0
##$AQORDER= 0
##$ASSFAC= 0
##$ASSFACI= 0
##$ASSFACX= 0
##$ASSWID= 0
##$AUNMP= <proc_1d>
##$AZFE= 0.1
##$AZFW= 0.1
##$BCFW= 1
##$BC_mod= 2
##$BYTORDP= 1
##$COROFFS= 0
##$CY= 11.3945322036743
##$DATMOD= 1
##$DC= 2
##$DFILT= <>
##$DTYPP= 0
##$F1P= 19.5091578491511
##$F2P= -0.509923556040331
##$FCOR= 0.5
##$FTSIZE= 0
##$FT_mod= 4
##$GAMMA= 1
##$GB= 0.15
##$INTBC= 1
##$INTSCL= 1
##$ISEN= 128
##$LB= 0.24
##$LEV0= 0
##$LPBIN= 0
##$MAXI= 10000
##$MC2= 0
##$MEAN= 0
##$ME_mod= 0
##$MI= 1.114404
##$NCOEF= 0
##$NC_proc= 0
##$NLEV= 6
##$NOISF1= 3.799351
##$NOISF2= 2.8
##$NSP= 1
##$NTH_PI= 0
##$NZP= 0
##$OFFSET= 15.70392
##$PC= 1
##$PHC0= -9459.436
##$PHC1= 20.40088
##$PH_mod= 1
##$PKNL= yes
##$PPARMOD= 0
##$PSCAL= 0
##$PSIGN= 0
##$REVERSE= no
##$SF= 200.130013532006
##$SI= 16384
##$SIGF1= 3
##$SIGF2= 2
##$SINO= 400
##$SIOLD= 16384
##$SREGLST= <1H.CDCl3>
##$SSB= 0
##$STSI= 0
##$STSR= 0
##$SW_p= 3612.71676300578
##$SYMM= 0
##$S_DEV= 0
##$TDeff= 0
##$TDoff= 0
##$TI= <>
##$TILT= no
##$TM1= 0
##$TM2= 0
##$TOPLEV= 0
##$USERP1= <user>
##$USERP2= <user>
##$USERP3= <user>
##$USERP4= <user>
##$USERP5= <user>
##$WDW= 1
##$XDIM= 8192
##$YMAX_p= 0
##$YMIN_p= 0
$$ End of Bruker specific parameters
$$ ---------------------------------
##NTUPLES= NMR FID
##VAR_NAME=  TIME,          FID/REAL,        FID/IMAG
##SYMBOL=    X,             R,               I
##VAR_TYPE=  INDEPENDENT,   DEPENDENT,       DEPENDENT
##VAR_FORM=  AFFN,          ASDF,            ASDF
##VAR_DIM=   8192,          8192,            8192
##UNITS=     SECONDS,       ARBITRARY UNITS, ARBITRARY UNITS
##FACTOR=    0.0002076,     1,               1
##FIRST=     0,             0,               0
##LAST=      1.7004516,     0,               0
##MIN=       0,             -429344,         0
##MAX=       1.7004516,     495335,          0
$$ Real data points
##PAGE= N=1
##DATA TABLE= (X++(R..R)), XYDATA
0@%%%%%%%%%%%%oJ4j6J6k0K8l2L6m3N3o6P4q2R8j14J28j49J72j96K21k47K80l16
35a67L52l91M38m89N44o04O70p43Q20r06J003j109J225j355J503j668J853k066
53a090K307k580K881l183L386l046k97M3335M53622k02684n91349R3176L71585
66A66063j00245k46057K21945K33959k58658k76128K11245K42982j45761j59238
76a09893J42025O6013j97676n8506K35278R8270j92783j11858J15268M5906r1192
87e9148L0518J50108k9718j94563l1788J76792Q3989r9462o5498M3061J141m8931
99d3499M6218R4681l5013j17717j0590P3942P643k5933M5959K8110r4958q0500
111a11657P8450J03645l0361o5803K0574J3417n8089J430J01330L4244q9810n4753
$$ y = [0, 0, 0, 0, 0, 0, 0, 0, 0, 0, 0, 0, 0, -6, 8, -8, 8, -12, 16, -16, 20, -23, 30, -36, 38, -44, 54, -60, 68, -81, 91, -105, 116, -131, 149, -167, 185, -206, 232, -257, 287, -317, 353, -390, 430, -476, 527, -582, 643, -712, 791, -877, 976, -1090, 1217, -1363, 1518, -1665, 1721, -1325, -1622, 41713, 495335, 292651, -298698, -205522, 166063, 65818, -180239, 41706, 275665, 17007, -259121, -47876, 195106, 49345, -109893, 32132, 98145, -99531, -158037, 77241, 175511, -17272, -129130, -13862, 32044, -59148, -28630, 121478, 91760, -102803, -134591, 42201, 126190, 26728, -38770, 4291, 5432, -43499, 2719, 97400, 62387, -55330, -65920, 8022, 15665, -10268, 35691, 63801, -31157, -111657, -33207, 70438, 40077, -25726, -5152, 8265, -49824, -48394, 52936, 87180, -2630, -57383]
123e7383M0784K2732j2356L9061M3104o4094r2725L1685R6530P27o4266p59L6331
136A9371k6402m2375L4501N5530k2063n4084N112L4728l921j2889K5598J5904
148B9010m5340m0359M3853O6272j7098o5023k746M4062j074l0943J7184L4613
160C2411k6042m6066J7742M4651j0926l5776J2585K7883j8109k5616J9401K2565
172A4703j7462j1802K1997M094k9856j292L7799Q498l4582j4154K2879J0960j0455
185A327R00J0553r817j9405M071J7452K535m060M835l838k0043n039K3376J4027
199A6874j3210r202J3228K717k2892q649K8548K3825j9952l0752P973K7292j906
212A3894j7700L459R662j2347j2187J7935J9099j0022j6221N08j744q671J5764
$$ y = [-57383, -16599, 6133, -6223, 32838, 75942, 11848, -80877, -49192, 47338, 48065, -16201, -16960, 19371, -7031, -49406, -14905, 40625, 18562, -35522, -30410, 4318, 397, -12492, 13106, 29010, -16330, -56689, -12836, 53436, 36338, -28685, -31431, 12631, 11557, -19386, -2202, 32411, 6369, -39697, -21955, 22696, 11770, -24006, -11421, 16462, -1647, -27263, -7862, 14703, -2759, -14561, 7436, 11530, -18326, -19618, 18181, 26679, -7903, -22057, 822, 11782, 1327, 2227, 12780, 2963, -16442, -12371, 5081, 7616, 3556, 8391, 4553, -15490, -20529, 2847, 16874, 3664, -5538, 7690, 10407, -12485, -21134, 7414, 31239, 11287, -19465, -11492, 15800, 13894, -3806, -347, 9315, -3032, -15219, 2716, 21815, 11793, -4428, -3920, -5664, -14335, 1429]
225A429L1541p207m4083j0716L4795J5077k0010p87J9053j3185l2225J0885L9831
238B4398L565k9425j3297M449J451Q709K0197k140k9131j1404J8918P469p848
251d089J2691J6963k5605l8042J5458M8518Q703l1601j8350L936K245O283J7206
264A4316O044j6235j6663m637N72J1700K4085M204l2528k8133J7622L2421J651
277A4419j5011m074k749j0248N048K4591J1383j7091k1694l796J1289J6582J0496
290A9145n205j7791j2380J773J1411R680M537m345j3787j3194J544J7897J5566
303A4851l134k0639j4675J0235K1589O432j0305o984j680m481J551J6744J3594
316B3098r295j9197q448M436J2372J4930K807j8825k0040L377J6822O755k310
$$ y = [1429, 32970, 25763, -18320, -29036, 5759, 20836, 826, 39, 19092, 5907, -26318, -15433, 24398, 27963, -1462, -14759, -10310, -8859, -150, 20047, 17907, -11224, -22628, -3710, 3759, -4089, 8602, 25565, -40, -38082, -22624, 25894, 34597, 2996, -15354, -11418, -9173, -2890, 14316, 20360, 4125, -12538, -17175, -16603, -4903, 19182, 23386, -9142, -37275, -19653, 12768, 14419, -592, -4666, -7415, -17663, -12615, 11976, 23359, 6268, -15426, -19222, -7933, 8649, 19145, 13940, -3851, -16231, -14458, -3047, 6633, 11170, 6825, -6962, -20156, -18612, -715, 14851, 11717, -8922, -23597, -13362, 8227, 14659, 4354, -2630, -4310, -8791, -7240, 9504, 23098, 13803, -5394, -13842, -9406, 2966, 17896, 20703, 1878, -18162, -14785, 2037, 8792, 6482]
329F482k76o149j5948j602K3313J6321j5102j9901K875J4013L821j374K129o03
343G999q082n779N653J2927M869r132j4220m370R021J2091J647j1155j1645R22
357i254R692N357m173n824J809K858l039j380P892M842j0277q170J0178J2634
371A3145m567r962J149K825m081n34Q229L575o918p280j489N91K789P401K98j2706
387g535q635J1465J3673o586j3755K583R415l200n686R359J3233p606k1110l892
401a8277J8742J4761m784j0133m369m887k255J1137J3958m611j8040o163O088
414h833M903N328J0593l991k5412j2407K5198K6589r225k0955P42M587j0384L714
428i553K9158R246l1686k4938J3467K2669O812j92n587k1056j5866J7645K9208
$$ y = [6482, 6206, 57, -15891, -17493, 5820, 22141, 7039, -12862, -9987, 4026, 7847, 6473, 8602, 7999, -83, -5862, -209, 12718, 17587, 8455, -5765, -10135, -1114, 10977, 12624, 1469, -10176, -9254, 438, 5795, 1622, -4202, -2393, 465, -2574, -3954, 3938, 8780, -1497, -9667, 511, 13145, 8578, -1384, -235, 2590, -1491, -2025, 6204, 9779, 2861, -4419, -5908, -5317, -2528, 4873, 5171, -7535, -16170, -4705, 8968, 2382, -11373, -8790, 625, -2575, -8261, 1098, 14331, 6725, -14385, -18277, 465, 15226, 10442, 309, -4060, -8947, -11202, -65, 13893, 9282, -8758, -14921, -8833, -3930, 1398, 11991, 8000, -17412, -29819, -4621, 21968, 12743, -8212, -7470, -2883, -13267, -9553, 19605, 28851, -2835, -27773, -14306, 8363, 15175, 14983, 9396, -11660, -27526, -9881, 19327]
441A9327R03j8875p186l245j1194Q311L4736J1611l6524l1302J5912L0275M372
454A7121p976j574q137j6291J539K6449J7556j1329k2911j1054L708J2884J7680
467A7665M685j6439j9731j479J1966R452L674K966m674j8026j3727J5389L0873
480B2594N547k7092k1502Q211J4799N225N646M787j5582k6306J563L0109J8867
493B6866j0244j8230j2570p225Q822K8810J4992k4541k9982L942J8911L131K209
506D891J1898o757l0025q331K9533K2723j1359j6670k840m071m727J6275K2792
519B3332o774k9044r806J2724R498L431R976m80k3726j6826J6711K3355M35j0952
533A854l710n290r214Q175K2944L771k3045j4389J1411J1303j906K324N831j1614
$$ y = [19327, 20230, 1355, -5831, -9076, -20270, -11959, 22777, 34388, -2136, -33438, -17526, 12749, 17121, 9145, 7571, -566, -16857, -15318, 11131, 28687, 17358, -5553, -16607, -12899, -15, 17665, 22350, 5911, -13820, -15299, -3333, 6119, 9793, 12759, 8085, -9941, -23668, -8279, 22594, 28141, 1049, -20453, -12242, 2557, 7782, 13428, 18215, 2633, -23673, -22110, 7999, 26866, 16622, -1608, -14178, -21403, -12581, 16229, 31221, 6680, -23302, -19360, -449, 2682, 4891, 16789, 10032, -19993, -28324, 1209, 23932, 12573, -4097, -6937, -11008, -15735, 540, 23332, 16558, -12486, -22292, -9568, -70, 3361, 13337, 12857, -10869, -27695, -10984, 12371, 12806, 1854, -1856, -7146, -16360, -8185, 14759, 18530, -4515, -18904, -7493, 3810, 1904, 4228, 10059, -1555]
547a555j8179O537K1442L122j1648j626J827j0709l734J9757J4382j6434j8264
560a5082Q475J2054o815k976J5926K981k1415j0819J6357J2197m324j486J172
573F245j1604r667J3875J4931p854j0376P368J689j6503l25K6364P893k6903j4269
587a9136J9629J4002j2762n715J2144J387j4166l348R160M260Q14N576n683j9180
601a3018k849K2132J3217j5592j2660Q747M440j2457j266J9010Q274j8335j6289
614a6646P517J6107N260n157p715o962M4R022P190j532l763m08n884j1314L795
629a0446K3086J0249k0421k2315N519J6268J643l535N340J350j6353j2255J3962
642g908K1806J507j5131j1819m046O068J6626J2453j1003k0908k617J0880L879
$$ y = [-1555, -19734, -13197, 8245, 11367, -281, -1907, -80, -10789, -14523, 5234, 19616, 3182, -15082, -6607, 5447, -1368, -4344, 11582, 14563, -6852, -17671, -1314, 10883, 6559, 5073, 6245, -5359, -15026, -1151, 13780, 5926, -4450, 2918, 4607, -11896, -12221, 14143, 22036, -4867, -19136, 493, 14495, 1733, -3982, 8162, 9549, -4617, -7965, 1195, 5455, 6269, 11845, 6162, -13018, -15867, 6265, 19482, 3890, -8770, -23, 4417, -8040, -9306, 9704, 17978, -357, -16646, -9129, 6978, 12238, 7081, -634, -7596, -7552, 1470, 8660, 7128, 3365, 2957, -2927, -14241, -10446, 12640, 22889, 2468, -19847, -14328, 1940, 3583, 48, 5388, 6738, -9615, -21870, -7908, 13898, 15405, 274, -11545, -15591, -9523, 7103, 19556, 8553, -12355, -14972, -4092, -213]
655b13K924J0943k26k4424j7839J6975K8392K392j8609j1443j947P03Q660J6632
669A2920K685j6625j5141O01R775J3017J0901m996k2164j4500J1651K2040Q040
682A8204p450j1464j0414m155R296J7420P477j0723j6806r083M152J7042J6066
695A9562k541k1396j4794N016J4458J1689N051o962j8839j1930J1575K2741Q633
708B2263j1532j5789q354K352J3295J6815J184j9273j8055K422J5648J2552L708
721A7236p888j8102j1584R928K0683Q395q166j1713r320m450Q368K0290R149j5994
735F832k0134j267J2415Q890M510J530j0285j6567r53J6856J2594l576r361p460
749e976p253J678J6850J4337j0643k1925l111J3328P362n97K947q06j4297r513
$$ y = [-213, 2711, 13654, 13428, -10996, -28835, -11860, 16532, 18924, 315, -11128, -13075, -12372, -3712, 12920, 15605, -1020, -16161, -15560, -5785, 7232, 18133, 13137, -9027, -23527, -11876, 10164, 18204, 10754, -710, -11124, -15279, -5983, 11437, 18914, 8191, -8615, -17698, -13546, 3496, 19562, 17021, -4375, -19169, -14153, 305, 11994, 17045, 10083, -8756, -20686, -9111, 13630, 22263, 10731, -5058, -13412, -11060, 2235, 19050, 20234, 961, -17094, -14672, 976, 13528, 17236, 9348, -8754, -20338, -10410, 10273, 18668, 10502, -1211, -10531, -14981, -6613, 13677, 22826, 6832, -13302, -14569, -2154, 6736, 11246, 12776, 2491, -14076, -15029, 1827, 14421, 10845, 1484, -5976, -13229, -11551, 5299, 19636, 8993, -12932, -16043, -2715, 4647, 4050, 6997, 6191, -8106, -17619]
763a7619J1806J8069J596j2522j0299l284M488J2400R796p784j6699m178J0803
776c427O517j430L129K569j2183j4499P287K1731O163j3800j2618Q47O364L984
790F34K905J563l933n783k494K489O272N263j351j0072p000O317J2173J086r862
805a793o338M548O338o18l636J021L255k633n649K592R719J206j0294o025O529
820a778Q831j501n390k079J315J233J34L82M78R67J02l133m007L996P792j877
836E465r264r78Q574K809o352k869L915K281l152j342L026K258l250l696Q30M977
852C232L194l308o160k435M562N875J528l428m780l098J384M744L160O74p58m943
868e57p726K69J1953Q017o922r843j615L241K286M461L756m690r735j171P177
$$ y = [-17619, -5813, 12256, 13852, 1330, -8969, -12253, -7765, 4635, 14431, 6647, -10052, -14230, -3427, 3090, 1660, 4789, 7358, -4825, -19324, -12037, 9694, 15857, 2057, -10561, -9714, -3350, 634, 3539, 5102, 1169, -4614, -7108, -4619, 1653, 6916, 5565, -4507, -11507, -5190, 6983, 8069, -1793, -8131, -3583, 2755, 2137, -1499, -478, 2777, 144, -5505, -2913, 6806, 8012, -2282, -8307, -1778, 7053, 5552, 162, -1917, -602, 631, 765, 1147, 1625, 2592, 2694, -439, -4446, -450, 7342, 5465, -3799, -4777, 3797, 6606, 254, -2615, 1300, 3581, 429, -913, 2113, 4371, 1121, -2575, -1745, 3232, 6426, 3118, -3042, -5477, -915, 4960, 6488, 3060, -1720, -4818, -3434, 1310, 4470, 5144, 4386, -557, -8283, -8014, 3939, 11956, 5034, -4809, -6424, -3183, -897, 3564, 7320, 2630, -7105, -8276, -1099]
883a099M716J57K0n041q304O80J2678N932r200p180L863J373m592M717J0402k892
899F230j5492l784J1568R221k751n759k405l119q60O366P589j228p511m622r26
914g483K209P746P771m433j3972n290R062J0688J019n237m381k910k025M361R372
929F497K744q352q492K3O034N913K189l603o493k387M297M300k45R23N94n258
945a316o875M021J2253K698j1527o687M807O137n70q37J002k283l213Q26K699
960A135J142K507l27o223m626N345R348j799q526j513N147O59k928K090M319l532
976B218n910J036M625K314r43k797l110k00M966K908m222k960J929J887k659m56
992a374M193J536n311m470M029O333o39n810l077K243M641J202l301k645J037
$$ y = [-1099, 3617, 3774, 3794, -1247, -9551, -8871, 3807, 9739, 539, -6641, -2778, -1405, -5997, -1280, 9122, 6230, -9262, -13046, -1478, 7743, 4992, -767, -3172, -6291, -7151, -785, 6804, 5576, -1935, -6557, -7483, -5274, 2472, 10243, 5810, -8162, -13452, -4390, 6298, 7317, 2080, -2301, -5211, -7236, -2875, 6497, 9241, 889, -7603, -7580, -1546, 4367, 6556, 2953, -3540, -5927, -1630, 2670, 2425, 3348, 3942, -1316, -8191, -4170, 8083, 10781, -746, -7433, -2626, 3511, 2941, 2104, 3106, 823, -2390, -1564, 1135, 2277, 4784, 4457, -1766, -6392, -1047, 8301, 6502, -2024, -3537, 1610, 2269, -659, 1431, 5750, 2218, -3692, -2656, 1969, 4283, 3340, 543, -2567, -2767, 2199, 5107, 885, -2075, -146, 1741, -918, -1374, 2819, 4355, -956, -5426, -1397, 4936, 4297, -1513, -4590, -2347, 2294, 3496, 195, -2450, -1413]
1007a413J733j764m57L584J797m548m863J481N642L491k174o130l334M098N514
1022B657k80l194j82R14m227k967P868R135n355j3665p78J0320M634k956j684
1037B40p44m998j527O331O457j501o250l142j115J490Q247O827o714j2695K3J0068
1053I97L568l217J529J438q496p255P959J3656k44j0410o154N01L086N812O540
1068I310k761j0982n214O568P031J203N31r40q397q259P090J5033L526j1647r471
1083g379J179M781L230N204K777o801j1594j700J0715J0050m3p157q865m703O164
1098d142J1891M733p863r575j774L077L450O405N241n386j4669m891J1783J2979
1112A1259o95r043n430k823P76P241P794o11r117o869J39M501Q176M467m187j1707
$$ y = [-1413, 320, -1444, -1901, 1683, 3480, -1068, -5931, -4450, 1192, 4683, 2509, -3621, -6955, -2857, 2657, 2377, -817, -999, -85, -4312, -7279, 589, 9724, 4369, -9296, -10074, 246, 4880, 1924, 240, -504, -5502, -7029, -698, 5759, 4258, -1992, -5134, -6249, -4759, 3488, 10315, 3601, -9094, -9071, 997, 4565, 1348, 2877, 4315, -4181, -11436, -3477, 10179, 9935, -475, -6629, -6128, -3042, 2770, 9310, 6549, -4433, -9647, -3079, 3952, 5155, 5686, 4746, -3651, -11910, -4820, 10213, 13739, 2092, -7379, -6200, -1419, 1811, 7015, 9792, 2991, -8603, -10303, 412, 10462, 10419, 3262, -5603, -10306, -4142, 7749, 12482, 4619, -4956, -6730, -3653, -203, 6202, 11443, 6057, -8612, -13503, -1720, 11259, 10564, 1521, -3909, -6732, -5956, 1285, 9079, 8468, -649, -7518, -7379, -2878, 5298, 9765, 5578, -6129]
1128f129n599O825J0237K290l736m761n152l095N921J0618K367p917j0067k113
1142a0311O097R229M379o191r458k757M657N106K312J383j617p354p025M491J2942
1157E883M623q121r485j491M756O269L043k176n273l612P25K731L913M128o91
1172E222q970p690N488J1908J591p922l070K917j933l671N934R094k993j0886
1186d981l134O856N279J61j707k705l961J437O419N97m885J86L910l503o675N226
1202a480J0992l074j1690m70Q847P15n490J299M547j588m755O65L514q04R49K403
1218D580l136o222K830Q111j057p192Q55N165l474n153M832P709l799q132k19
1233d302N279J649j516P51m13k171j858K307J558M98J378l91m609l299L315N086
$$ y = [-6129, -11728, -4903, 5334, 7624, 3888, -873, -6025, -9120, -3199, 7419, 9786, 1869, -8198, -10311, -4214, 5015, 9394, 3203, -6255, -9012, -4355, 751, 3063, 4446, 2829, -4525, -11550, -7059, 5883, 10506, 2385, -7100, -8591, -3835, 2434, 5477, 3301, -1972, -5584, -4859, -2128, 1785, 5913, 5222, -3748, -11438, -5950, 5958, 7549, -373, -3443, -526, -2459, -6130, -196, 8898, 5905, -4981, -8115, -1259, 4020, 4181, 2474, -231, -4192, -2755, 3664, 4261, -624, -438, 3472, -31, -6706, -1480, 9512, 6438, -5252, -5722, 3125, 3840, -1650, -351, 4196, 2608, -2147, -1482, 2032, 1228, 2177, 4580, 1444, -4778, -1948, 6163, 5106, -2086, -1231, 3934, 460, -4693, 139, 7848, 4049, -4083, -4302, 977, 2626, 1110, 1861, 1448, -723, -2581, -274, 1284, 1782, 3160, 2769, -1840, -5139, -1824, 3262]
1249C262J058k544k887j830q34K278M009K064k937n089k320K580N259J564j617
1264B016m065k083P45K626K922L84j962l388j271J254L522L658n84o351m929L365
1280d141O453J419k708j413k505l099R81P008M398l745o884l184K665N681M025
1295D951q41n119m250l37L930M671L888j801r472o906N930J1771K807o365n811
1310b954k062k43K770O896L159m383o810l584K739O636N348j060q417n484M203
1325c246P382J321k821j368j238l804L10P096M922l652p833l265K932N970M080
1340F786j091n694m778K32M786L753R23p93m389o044l82R566Q798m535j1606l604
1356h072O491N134K94M80m58m847n901J402Q875M927l066o691n542P27O919O594
$$ y = [3262, 4320, 1776, -1111, -2941, -3775, -1497, 2512, 4576, 1639, -3450, -5770, -3190, 2069, 3633, 2016, -2049, -4132, -3387, -761, 2161, 2545, 583, -2805, -4076, -2822, 700, 4358, 3774, -2577, -7506, -4141, 2312, 3731, 1023, -390, -2895, -5994, -5013, 1995, 6393, 2648, -4236, -7420, -4755, 926, 4951, 4110, -1009, -5259, -5596, -1666, 3005, 6893, 5092, -4380, -11286, -5356, 6415, 9222, 2857, -2954, -5016, -5259, -2489, 4407, 7566, 3183, -3627, -7211, -4472, 2164, 7512, 6452, -1965, -7449, -3246, 4136, 5457, 2636, 1268, 30, -3774, -3464, 3632, 8554, 4902, -2931, -6196, -3264, 2706, 6786, 5695, 1, -4777, -4545, 241, 3994, 4917, 4124, -265, -6309, -6691, 2875, 11673, 7138, -4468, -8072, -1581, 3553, 3847, 4327, 3869, -978, -6879, -5477, 3398, 8325, 5259, -1432, -6974, -6247, 672, 7266]
1372G266k313o870k823K236R39J282L820J780n383p058O57P815N651k608p153
1387b762l795L297N279J027k723j460N06k271k295M488O876j819q481l994M146
1402c981N260K521q88l960m281P07L946J510m41J706p3o577l106P331P707m486
1418B895p991J082M936j317j317L854J218n473l240M160L369j074o25O49l313
1433b187l005M753N940k764o559J561M676j431l496L552L775m442m841L501N013
1448D046q56l563o56J011n91Q10L320k92m613j561L557K222k284m4K066j165l857
1465b450J047M810M22m846j024M170P48l123q49L336k31l487J1M595R99m388k370
1482b630J985J349M69J412n13l411j806K445K866o25j464J367j109l674R51O110
$$ y = [7266, 4953, -1917, -4740, -2504, -1565, -283, 3537, 5317, -66, -7124, -6467, 1348, 6999, 4391, -2762, -6557, -3260, 2019, 3046, 323, -1137, -631, -2902, -5197, -709, 6167, 4348, -4133, -8127, -3981, 1279, 3800, 2912, -1048, -5329, -4622, -676, 834, 393, 2099, 2026, -4551, -7657, -326, 7381, 2895, -5096, -4014, 922, -395, -1712, 2142, 3360, -2113, -5353, -1193, 2176, 1102, 477, 1126, -2187, -5192, -439, 5501, 2737, -3822, -2261, 2415, 984, -2512, 1040, 4815, 373, -4468, -967, 4046, 3190, -373, -1029, -18, -609, 201, 3521, 3229, -1384, -2945, 612, 2834, 550, 506, 2572, 1407, -2450, -1403, 3407, 3829, -1017, -2041, 2129, 2877, -246, -1095, 2241, 2010, -1477, -1466, 3129, 4128, -260, -2630, -645, 704, 1173, 2585, 2072, -1339, -3145, -700, 2166, 1541, 77, 1444, 335, -3339, -2388, 3722]
1498C722J360o260l516L305L351j110j396J221o43k839O3K938K455j173j881k778
1514c181n20K615L967P50m700l197J859K698%j3P63q45l638j270M012M185m72
1531C013n357l333K208M169K026j104k949j465l82Q69J918K950J137l902m964
1546e166K17N539M273j684m646j553J388J543Q2J485J147k452m236RM590M013
1562D549r80n236l290K241M698J547j794j917q23o34J53K802L114O7m923l860
1578d286K127M893K229k125l670j077J271J643Q83l71L85r51l125q70M637L413
1594E006k128n323r30L931L064j494j896N40L73j704q71K046K981o97l558j923
1610b583J990L055k16k334p74P13k5J04l14M09K5l41q23p69K435K646k724m478
$$ y = [3722, 5082, -1178, -4694, -1389, 1962, 852, -544, 677, 34, -2805, -2742, 196, 2651, 1478, -403, -3181, -3701, -1086, 2881, 3631, -1069, -4266, -2407, 291, 291, 278, 1041, 196, -3442, -4712, -700, 3485, 3013, -2344, -5677, -3469, 700, 2726, 1622, -1327, -2792, -3174, -2305, -387, 2563, 3700, -202, -5166, -4949, 590, 4863, 3179, -1467, -3020, -1632, -89, -7, 1478, 2625, 173, -4063, -4054, 536, 4549, 3569, -1667, -4957, -2716, 1982, 3529, 1735, -182, -1005, -1639, -1486, 1316, 4430, 4497, -426, -4286, -2159, 2734, 4963, 2838, -832, -1909, -638, 1005, 1888, 1517, 1902, 951, -2174, -3044, 1593, 5006, 2878, -2445, -3375, 556, 3620, 2126, 230, 770, 1143, -561, -1432, 614, 3595, 2898, -660, -2583, -593, 2462, 2246, -88, -862, -149, -174, -70, -384, 25, 50, -291, -1114, -1883, 552, 3198, 474, -4004]
1628d004J176M793N47l164m87J593o50j842J320K561j112k661L69J570j27k67
1644c85J054j947l116L057N166k166n447J07L920n27k103K113L013k650m692J762
1660b841M162J029j982r78j323r73K498L320j363l276n68J186m69N9M156J457
1676D094n493m832K515O399J700l222k977q66N25J329K877J482j471l521k305
1691c766J117M627L826j732o003k820L157M323J251k101j930j126r17L32L185
1706A423L617j849n083k839K281N632K313j955m351k497J000K612K655J135m78
1721C616l977l724J37N939M816k471o551k084K482L206J631N91k155m076j908
1736d528L065M255K574j485n668m758K087P428M319l594o010j375J838P11K021
$$ y = [-4004, -2828, 1965, 2512, -652, -1139, 454, -196, -2038, -718, 1843, 731, -1930, -1561, 9, -118, -385, 669, -1278, -4394, -1337, 3829, 1663, -3784, -3677, 243, -284, -2387, -274, 2739, 89, -4603, -2841, 1321, 2350, 368, -610, -1933, -2906, -408, 2912, 1549, -1727, -2295, -1109, -1578, -1519, 2637, 4094, -1399, -6231, -3716, 2683, 4383, 1161, -1816, -2682, -2157, -828, 2049, 3531, 2060, -1461, -3766, -2649, 1978, 5804, 4072, -1931, -4751, -1594, 2729, 3980, 1879, -51, -1177, -2094, -1762, 1423, 5040, 3191, -1892, -4731, -2450, 3182, 5495, 3540, -811, -3308, -2308, 304, 2959, 4094, 3616, -361, -4085, -3948, 1991, 6807, 4336, -2215, -4299, -1817, 1389, 3020, 3611, 1456, -2620, -4528, -1463, 2792, 5366, 3881, -1787, -6545, -4458, 2970, 7289, 3695, -2315, -3690, -1852, -1141, 880]
1751H80L756o37o158m275L499N571J847k285m276k307P24L797L129q06k989k439
1767b969q16Q94L397M125o45o623m518L091O059K137k833k631j321r92O38L566
1783E59L612j779n346k348K815L818J522n47l528k912R63M205J206j528m87k56
1799c1k460j995M099N745j333o639k511M152K428k77K44j25k489k495K080L207
1815A600J227n74k165k670n71L611L836j431l758o50J676M58p28J755J635k628
1831F23l313P93L592J164j302j618j460O1K184J078n89n16K41j273j758J268L320
1848B495Q56k568k152J177J432j73p95K25M57l64m99m94P17R71r2j928j409J635
1866e09K246n88j767q7P96m30j630P51L117O41k888k014J043J407N86n9j05O5
$$ y = [880, 4636, 3999, -2159, -6434, -2935, 2636, 4483, 2198, -2078, -4385, -3661, 136, 3265, 2459, -530, -2969, -3785, -2891, 506, 4631, 3986, -2637, -7155, -4064, 1995, 4132, 1299, -1332, -2653, -3645, -3007, 559, 4171, 2392, -2954, -5302, -2487, 1331, 2853, 2306, -1222, -4134, -3171, 1034, 2240, 712, 225, -31, -2491, -4486, -387, 5358, 4025, -2614, -5125, -973, 1455, 1178, 1422, 1297, -1192, -3687, -1607, 1600, 2827, 2253, 88, -2582, -3153, 458, 4294, 2863, -895, -1545, 131, 589, -139, 1616, 3251, 623, -2690, -1897, 1695, 2859, 1557, -61, -1521, -1460, 724, 1802, 1213, 697, 938, -335, -2093, -825, 2495, 3351, 783, -1369, -192, 1240, 1067, 272, 497, 954, 590, 91, -403, 314, 1285, 1193, -735, -2144, -509, 1737, 1149, -618, -705, 91, -339, -1969, -1218, 1899, 2540, -348, -2362, -1319, 88, 674, 615, 510, 575]
1884E75o74q62o59J053K014j7k514k417J318L291M79k723j234J047P46j250O79
1901a148L329l95l897k195J990L398J498j255k441j494Q04J809P88k54N9j5k905
1918b324j883L192M910o38n630k630K996L162k03o47p0n92j883j92K231K991P44
1935C534l048l858r4M814L819j988m485q53J689O88m0K376J008l157m050n0M208
1952E13L504k93l690l542Q05L356K794j005j984j030m05o20J517M520P85m960
1968B65m976J825N414K351j746l085j434p63Q38K697J809q7l086l127l88K725
1984g68M051J223l935l910M93L435J507q38m62Kk714j335L436M332p35m938k718
2001c874J587K733J256Q72j732l393j568K947K711j86o51o37k949j373L425M972
$$ y = [575, -99, -961, -1620, -567, 1447, 1430, -1084, -3501, -2183, 1108, 1587, -1136, -2370, -1323, -577, -1827, -1148, 2181, 1786, -2111, -4306, -2316, 1082, 2580, 1325, -1116, -2610, -1806, 3, 791, 537, 596, 581, -2324, -4207, -1015, 3895, 3257, -2373, -5003, -2007, 1155, 952, 305, 235, -357, -2240, -2432, -201, 2790, 3534, 486, -3372, -3466, 1348, 5167, 3179, -1306, -2159, -470, 218, 178, 2554, 3562, 405, -3645, -3695, 513, 4017, 3724, 34, -3508, -2703, 653, 3447, 2442, 458, -572, -977, -1597, -80, 4440, 5225, 265, -4711, -2886, 2528, 4879, 3133, 48, -1386, -2149, -1311, 1386, 3195, 3108, 22, -3105, -3493, -768, 3283, 4506, 571, -3339, -2846, 589, 2096, 1258, 796, 798, -1916, -3251, 185, 4517, 3782, -1156, -3874, -2287, 446, 1702, 2574, 842, -2551, -4119, -1172, 1539, 1353, 702, 65, -2884, -4257, -832, 4140]
2017D140j145n467j488K488J563K30J071J017l567l786J885M630J372j826k138
2032a021j697p92K234L908n39l462j144J484K5j75K022K160k947m009R99M663
2048A709J000k731j554R93J59l20R92J086k95k133r93J331J807R08j001j917j887
2065b846J344L096Q66j936j635J041J06o96R66K241L19l603j788K179L111m18
2081B347k494l45N62J07J66L21N76l16o06r27Q5J194K020q73l173o5K174K049
2099B802j346k458R3K004K89j449K51J075m63j967n81K408K464j661l289j016
2115b844K301K328k16j663m84k7j49l6N59J729O11k237k354M73L438J461k275
2132F15k836N76K492n36r05K82R29j231j960P98K200J128j782k518K9K533J634
$$ y = [4140, 2995, -2472, -3960, -1472, 91, 321, 1392, 2409, -1158, -4944, -3059, 1571, 2943, 1117, -1021, -2718, -3510, -1276, 2632, 2093, -1369, -2513, -1029, -1004, -1179, 843, 3003, 56, -3953, -2954, 1709, 2709, -22, -1576, -583, -424, -744, 248, 1334, 1039, -1094, -2087, -756, 1051, 1959, 958, -959, -2846, -1502, 1594, 2460, 524, -1111, -70, 36, -660, 306, 2547, 2866, -737, -2525, -346, 2765, 2347, -147, -492, 70, 177, 343, 664, 1240, 924, 318, -609, -524, 670, 2690, 1817, -1356, -1421, 753, 2802, 1456, -1002, -909, 1095, 1384, -65, 186, 1261, 798, -1169, -1750, 658, 3122, 1461, -1828, -2844, -543, 1785, 1569, -94, -578, -605, -754, -790, -231, 1498, 2109, -128, -2482, -2009, 1429, 2890, 615, -2221, -1645, 847, 311, -594, -312, 617, -614, -2574, -1776, 424, 1552, -230, -2748, -2719, -186, 1448]
2149A448o78k245j75N96N69J40N47J216q74k184j663K600K871N11l409k071N33
2166b268K539O31o12l65O16k082j683J503L893N11l216k272P64J785J665N44j067
2183H86j439l93R88K74L04R04K7k012k062K501K993q81l141n33J981j73j93R83
2201A014M72j444j635J56J894J713K38j399k849j14K756K064q63k417L74R23n12
2218C71q24J984J047j597k482j0K354J330q68j910l58N06J089j39l56M86r0r51
2236d18p99R49J799L10j803j610R66J768k44p18p77Q06M29r30r10J405P13j214
2254b78j553N14K145Q8j518j070N01J056N16q70q77P29P38k11o86J56J161J49
2272F90j844q26J893J305q82k182M06J619N66o67r08l30O68k53q5M11J039m97
$$ y = [1448, 770, -1475, -1650, -1054, -485, -345, 202, 1418, 544, -1640, -3303, -703, 2168, 2679, -730, -2801, -2268, 271, 902, 290, -75, 541, -1541, -3224, -1721, 2172, 2683, -533, -2805, -2041, -256, 1409, 1953, 886, -553, -946, 42, 316, 620, 1524, 1551, -461, -2523, -22, 2971, 2090, -1051, -1584, 397, 224, 31, 1014, 1486, 42, -1593, -1437, 457, 2170, 2408, 1009, -1840, -1954, 802, 2866, 2003, -414, -40, 883, 371, -453, 1531, 2578, 981, -1501, -1511, 843, 2173, 1305, -605, -963, -457, 632, 493, 137, 623, 533, -418, -1217, -268, 1531, 1841, 38, -1572, -606, 1162, 918, 200, -577, 229, 658, -272, -1182, 223, 936, -278, -1831, -1317, 828, 916, -602, -1672, -1171, -115, 401, -469, -1346, -617, 121, -90, -776, -620, 541, 690, -1154, -1980, -87, 1218, 336, -1846, -1440, 179, 745, 78, -830, -1160, -492, -745, -830, -419, 620, 123]
2290A23j868p22J399K507M74k542j278J097J552l15k24L27j27j576l19J421J777
2307A706M9j905k068N28K275J185n49j653p02O30K21P5J094J574j481l215m62
2324b698L709K296j561k508o02J025N27J255O74m84j897j082M00J347K271K94
2340B966k676l093P55L464J655j694j440K60p48j253J668L556m02l480k452J193
2356a721L044J526o48k122j962j55K247J483k00o36r15j951r44K924L710r48l832
2373a100k560J799K822Q21n70p47j116j705N78K396J747j42k602k926K69L140
2389A04K566n35k696j881K14J481J228Q56q6j917k213k84L444K505r65l279j953
2406c411J172K662J593q37j191p88r34o43K060K493K98l190k478N23L269K073
$$ y = [123, -1745, -2467, -1068, 1439, 1913, -629, -1907, -810, 742, 427, 203, 530, 403, -1173, -1492, -71, 1706, 1755, -150, -2218, -1690, 585, 1770, 1221, -432, -1134, -504, -283, -208, 886, 2460, 979, -2236, -2698, 1011, 3307, 1746, -762, -1364, -339, 188, 1443, 2117, 1633, -264, -1346, -946, 401, 2672, 2966, 290, -2803, -2048, 1416, 3071, 1377, -63, 197, -551, -1804, -136, 3420, 3018, -462, -2914, -1721, 1323, 2849, 2201, 79, -1883, -2038, 209, 1692, 1492, 856, -59, -2010, -2954, -30, 3680, 2732, -1100, -3660, -1861, 961, 1782, 1212, 465, -651, -2356, -1778, 618, 2365, 2223, -379, -3305, -3036, 104, 2670, 2135, -561, -2442, -2228, -747, 481, 1337, 1251, -666, -2879, -3163, 281, 2786, 1821, -1458, -3411, -2239, 423, 2016, 1179, -12, -800, -1734, -2377, -317, 2176, 2474, -716, -3194, -2671, 598, 2671]
2422B671j076k681p01K20J133Q55J446p5k011k344K79K696K510p39k829j514R53
2439a207J883Q98o04J34q36j504n14J606K590J29k611k353J446J828Q39n02j252
2456c0p89L11O34M38R54Q04j395k243p54K691K929j463l137j13J631L64p53N70
2474F49P19r69j259m4J375J303k37j401j495J37J904J109j289j149M91Q96j093
2491c53n30J661J006j306k360P33K322L04k012n97P23P61m78l81M9M11J48j81
2509h0j111n3J419J130j657j300J045J769j125j451M54J790k91j511k89J200M02
2526C41n94p53N18N47k96m42n73Q50J031j00k092m18J828J370j238r89L14K93
2544d03l37j15Q63J428j154j339p42J211J695L37j129j719N45P66P45q11M75M36
$$ y = [2671, 1595, -1086, -1787, -1567, -434, 421, 1867, 1792, -219, -2563, -2284, 412, 2922, 2183, -646, -2160, -1207, 676, 1574, 970, 1104, 268, -1236, -1750, -144, 2446, 2575, -36, -2389, -943, 885, 1724, 1222, -30, -819, -508, 126, 564, 1518, 2322, 927, -1316, -2070, 621, 3550, 2087, -1050, -1163, 468, 832, 79, 649, 1368, 399, -860, -904, 471, 1774, 1537, 136, -1359, -1222, 682, 1791, 502, -647, -156, 740, -353, -883, 778, 1784, 478, -1882, -1149, 1173, 1477, -535, -1132, -409, 352, -126, -507, -458, -47, 101, -80, -1191, -1244, 175, 1305, -352, -1652, -607, 1162, 37, -1414, -960, 830, 539, -972, -1261, -61, 341, -253, -1006, -488, 59, -237, -679, -1252, -402, 629, 529, -1563, -1981, -153, 1217, -21, -1010, -696, -403, -740, -855, 8, 1436, 282, -1057, -1799, -588, 1107, 1444, 315, -1404, -859, -93, 652, -159, 316, 752]
2562G52r56j523Q20K408P18j767j813L01J242J014J0m62n96k94j20L32R23J155
2580B144p72k261p81J540K395k23k138n44L73K77N68L89P25q41j597o88J279K227
2598B072L53j887k366L19J553J340J77o84r64l92o54R43J814Q47j612k512m34
2615b087J975K061p0j765j516L81L53N42J109N22j187j894p46J988K084Q3j840
2632gk104K54J655J193p7q48n45o37m03M01K387O86k014k648l0K340K041k97k124
2651g77r47M07P46J81P61R72j266j842q86K090K741k79k263j885R30J272N58O4
2669E77m04k70j185l06J109J691O59j850k112M04J751J724m20k360k34R04L29
2686Gm38P84J021j153j853Q8K120J491p19j731r24P82J034Q34p02m85m7J9o04
$$ y = [752, -204, -1727, -907, 1501, 2219, 452, -1361, -1060, 182, 1196, 1206, 744, 148, -146, -266, 66, 989, 2144, 1372, -889, -1670, -130, 2265, 2042, -96, -640, -267, 10, 578, 967, 1692, 851, -746, -1434, -155, 2072, 2425, 538, -1828, -1509, 44, 1384, 1561, 877, -87, -479, -1133, -190, 1624, 2471, 859, -1653, -2087, -112, 1949, 1879, 114, -1402, -1021, -668, -126, 983, 1505, 318, -1576, -2322, -334, 1750, 1833, -7, -2111, -1857, -202, 991, 914, 66, -479, -1116, -1519, -1118, 1269, 1955, -59, -2707, -2737, -397, 1644, 1347, -777, -1724, -1317, -571, -390, 371, 1343, 77, -1765, -2651, -561, 2180, 1901, -362, -2247, -1317, -45, 513, 577, 173, -97, -1282, -1588, -479, 1212, 1871, 21, -2091, -1687, 64, 1788, 1368, -992, -1226, -322, 7, -431, 353, 1374, 221, -1632, -1544, 576, 2067, 1348, -383, -1307, -525, 509, 1343, 641, 156, 109, 128, -476]
2705d76J90J766Q22j828k201P47K522Q69k261r60Q14P04o43K18J050j99r16j258
2723a040J002R13O80l39j677q29J298J623k01j645k93J170m00r20N29J739l58
2740A252k408p55J624J904n13j826m01O10O16J21J7L6l18o98l59O89R65N80r85
2759A51j596j81K009J200j166j591K38Q32j50p05J163P34j126k160P84K066R75
2776A477j010j876k35J041M69O14R8n98q78J2k4O54J309J56j573k080J584J611
2794G51N91j385j180R54K37m93P9J378N4j260j153Q20J353L31o34j088l00N74
2812c71J325k54r77N1N12l94n06P31J921m99k578o78J866J733n12j595k80K30
2830b75O88l03L64Q05n15j178q18O86J894N56j120j040q63J506O88m68k78N00
$$ y = [-476, -286, 1480, 2302, 474, -1727, -980, 1542, 2411, 150, -810, 4, 708, 65, 283, 1333, 1134, 218, -1040, -38, 875, 1555, 1216, -461, -1290, 8, 1631, 1430, -215, -508, 662, 262, -658, -129, 1610, 1252, -1156, -1911, -287, 1617, 1104, -722, -1123, -513, 103, 224, 241, 277, -41, -739, -1098, -409, 556, 1136, 151, -1445, -1626, 383, 1583, 417, -1174, -936, -104, -254, -959, 204, 938, -188, -2348, -1564, 502, 1477, 467, -1409, -1644, -603, -134, 480, 578, -20, -898, -886, -910, -256, 1053, 1209, -364, -2444, -860, 751, 1342, -43, -1223, -269, -32, -525, -446, 932, 986, -274, -1427, -607, 746, 1077, 443, -645, -945, -371, 954, 700, -277, -226, 286, -108, -614, 117, 2038, 1539, -1039, -1717, 149, 1882, 1370, -225, -505, -275, 413, 110, 474, 1279, 764, -414, -1232, -546, 1348, 1904, 784, -256, -1119, 387, 1075, 607, 329, 829]
2848H29k95j092k25J156J506p75j955m93J599R54n48j239L33M24j78m75P77N8
2866C61O2o50q16R21J205R1j290j062N80J394l1j448K8Q42l19j135M99J004J040
2885A276j306j691L30J332J055r06j134M73O44q4p72J75Q37J43j004l75N12J081
2903E86l37r62k69P80J088r69q28QJ042J48o12m54R36K23q44o77K57J425K94j595
2923g60l54O80R61j44o58j42N44k1n44L04O58K11o79j224L36J652N35j252j141
2942a038M97J155K19j133m8R43k58j095K25J193N90q92j217Q7R03J055q7j019
2960H0n63L88M61J27L4M99N9j235j438J325J774K45j688r15L64O43P38j27J34
2979I05p51k67k64o3J618M89r52k030k8J541J401o63j189k92L00l02K34Q55O11
$$ y = [829, 534, -558, -783, 373, 1879, 1104, -851, -1344, 255, 1209, 661, -578, -245, 179, 1, -474, 303, 361, 423, -227, -1043, -122, 1083, 1174, -116, -1178, -598, 796, 765, -683, -655, 187, -132, -1267, -768, 236, 1276, -30, -1721, -1391, -59, 996, 90, -1044, -571, 73, -11, -783, -608, 229, 372, -632, -1007, -495, 586, 249, -713, -982, -202, 886, -83, -911, -903, 139, 287, -325, -779, 157, 380, -464, -1141, -884, 541, 835, -760, -1114, -434, 527, 383, -275, -417, 127, 106, -438, -134, 524, 735, 56, -1168, -832, 820, 1355, 103, -1038, -541, 614, 833, -300, -348, 595, 337, -758, -533, 660, 1250, 358, -859, -772, 131, 1186, 1099, 80, -483, -95, 366, 493, 527, 1026, 1085, -150, -1588, -263, 1511, 1756, 68, -847, -483, 160, 898, 771, 905, 154, -113, -377, -440, 1178, 1667, 715, -1315, -1343, 198, 1599, 936, -253, -545, -245, -547, -313, 542, 1153]
2998A153o35j573o89J247J704K74j255j772K93J556K37k40k84j01m54r77Q98K016
3016A398J58j566k107N17J483R14l67n65o72j53Q8L03J155L31p73j698o18J384
3034g88K286r5k042j258N29J467L6J12j7j35j329n19J503J876K72k192j531K67
3052a558J637J016k94p93o31j29K71K95R37J063r97j941r29K348J911o91j637
3069a22j100O53M97N32L19M84p46j179o27J367J515L25j574j666M78J520Q49n77
3087I48q20J65j86m78J58J353P78j145j919L6J435J415q00j026m61P81k51K12
3105A95K59N44j96j422n72J111J468j24j335j090N51J033L19m78k84J65q9q43
3123g88L30R34Q31j248j498K02J579L57n72r47J62N24j65n4M64L60j4j409k63
$$ y = [1153, 518, -1055, -1744, -497, 1207, 1481, 226, -1546, -1253, 303, 540, 300, 16, -85, -539, -1516, -618, 1398, 1556, -10, -2117, -1600, -117, 797, 430, -135, -807, -960, -872, -569, 586, 917, 144, -1554, -2172, -788, 1498, 1403, -639, -1897, -1368, 99, 135, 247, 230, 95, -1234, -1753, -250, 1626, 1898, -294, -1825, -1558, 79, 1095, 801, 8, -623, -752, -481, -186, 751, 1814, 817, -1124, -2053, 295, 2206, 1515, -122, -1222, -569, -72, 460, 779, 1263, 517, -662, -1289, 78, 1593, 1918, 344, -1322, -844, 676, 1525, 948, 128, 293, 107, -371, -213, 1140, 1918, 773, -1146, -1110, 325, 1740, 940, -86, -547, 234, -17, 195, 454, 998, 802, -620, -1192, -81, 1387, 1263, -72, -1162, -611, 422, 741, 263, -21, 144, 55, -788, -458, 476, 1307, 59, -1439, -1237, 342, 699, 127, -820, -658, -134, -299, -353, 111, 471, 457, -952, -1215]
3142a215J023Q84k86j262k36P59Q26j93p84n7Q17j73p62k9P54L22n46j006M88
3161f76J013J6q44l41P39N60p55n17N48N60l00m22J16L99N03m34o86J48O29M43
3181F99q31q57R95Q11r5j203j45Q55L79o61k00P29L01q78n70K50R63O68o31r07
3201c28j60R76K81l95k33j3L67o42l95Q57J219j66j809p27J043J150k6q07q81
3220f89Q01j60J12K69M82K68j056r63N6J935O87j085j408q7J095R0m85M49K11
3239E22j51j109m14J696R19q38j711l55J448P39K76p94o93jL23k07K99Q86m7j456
3259f68j148Q28K071L28j330j478N13R40k2r8L37Q4j182o66K97J409R28q41j702
3278a400n79J263J475k96n51n00K64l31l67J215Q65m87j564j037J463J340N8q41
$$ y = [-1215, -192, 692, 406, -856, -1092, -333, 493, 300, -484, -541, 276, 103, -659, -688, 66, 388, -158, -1164, -676, 337, 353, -491, -832, -93, 467, -288, -805, -257, 303, 3, -419, -303, 96, 599, 165, -521, -373, 256, 699, -132, -989, 6, 817, 722, -481, -626, 229, 608, -53, -253, 476, 777, -101, -671, -421, 542, 1210, 579, -328, -488, 488, 769, 374, 141, 128, 495, -147, -542, 315, 1534, 1368, -441, -1168, -125, 1025, 999, 192, -689, 112, -48, 64, 333, 815, 1083, 27, -936, -880, 1055, 1742, 657, -751, -838, 257, 347, -138, 311, 522, 371, -738, -1152, 544, 1463, 625, -1086, -1441, 7, 746, 1022, 228, -465, -466, -143, -350, -51, 835, 788, -668, -1816, -988, 1083, 1411, 81, -1397, -884, 56, 34, -64, 273, 357, -825, -1491, -1194, 215, 1143, 302, -1400, -1979, -716, 759, 463, -88, -588, -324, -655, -1022, 193, 1058, 571, -993, -2030, -567, 773, 831, -10]
3296a0r17J92N91K46l40L24L36p51o98K21J443O38q44j590rJ423P43k98o99K37
3316B38n30M7l8Q79O18j87j848k63J167R96J28j107o91M97J65J48N6L23P1n45
3336A24q14K15J436R5o93r93J69J082L97r15j34L81J75n10n45R99M87o15r98p9
3356g36J254O04p59o87n89R34N09j07m17M69k84n20j24K86R52L94j586r83P31
3375f59J397k90r64K65K63k41n69p5J136L44r03o74m6R02K28j90p82j45J103M77
3395E77n80p89P04M64o36o09O13Q30l47j585N11Q89Q49r54p52k7P89J09m58P8
3415c24L42K5l64o06L51J303J50j147p95M83P34N28n87p18J177m29m79k18J113
3434E39K52r21q73N70R06N92q74p35j0R32L60o18N7J15J5k93l45O38R87l88q80
$$ y = [-10, -927, -735, -144, 102, -238, 86, 422, -329, -1027, -806, 637, 1275, 431, -1159, -1168, 255, 998, 700, 1, 238, -292, -245, -283, 596, 1214, 1027, -821, -1084, 83, 1079, 1207, 100, -591, -94, 71, 219, 275, 598, 669, 124, -690, -475, 961, 1056, 363, -630, -461, 621, 1018, 103, -31, 350, 525, 15, -530, 469, 956, 341, -657, -736, 518, 1122, 363, -324, -913, 21, 530, 423, 6, 475, 191, -329, -453, -167, 785, 1179, -407, -1390, -659, 738, 448, -516, -251, 12, -229, -798, -873, 263, 607, -296, -970, -1016, -114, 114, -76, -858, -1003, 100, 577, -3, -792, -88, 376, -260, -869, -256, 574, 227, -1358, -847, 42, 891, -63, -815, -842, -53, 56, -402, -324, 18, 43, -321, -927, -576, 727, 877, -270, -1065, -582, 152, 680, 93, -625, 552, 123, -356, -574, 539, 791, -130, -1003, -433, 473, 1065, 191, -544, -554, 378, 738, 120, 177, 292, 307, 14, -331, 307, 1294, 906, 26]
3455B6j002R67J009j87p05J64K13l74n32L76J310j17j334n94N77J150Q9q09l10
3474h3l11P43J35j3l85L26J96r03k54P45J200o63j616j58J256O48p26p37N36L74
3494C10o32k83P67O89l80j063m81Q20N76N56q02r55J44R76K43o11J14M93j5j400
3514i34p0J280O91q98j278J92J116K2n27L50j25nj35k51M32M06m42k50o84Q01
3534c09N50M04j325k48O74O32l50n39P5J171q21j006Q08Q44j09p18p25N76P64
3553C48k7k24n20L34N97k21n72L08N65k86n66j70O95O36m79p86j18J028M37o50
3573C29m48L75M33m62n39R0R66l09p39q4M29J109l26j052k81J153K35l58m96j12
3593h7P62k37q66j12J405r5p93m01L54O92N9o22k57K63K54n7l86O7P12n71o83
$$ y = [26, -976, -9, 1000, 813, 108, 272, 485, 111, -421, -45, 1265, 1148, -186, -780, -203, 947, 1036, 227, -83, -394, 349, 484, 471, 86, 412, 608, -295, -549, 196, 1396, 733, -883, -1041, 215, 863, 137, -600, -64, 310, -322, -605, 162, 851, 471, -592, -1073, -253, 323, 879, 77, -878, -734, 242, 485, -126, -12, 481, 466, -934, -1004, 276, 967, 69, -1209, -1017, 99, 121, -406, -56, -181, -186, -321, -572, -140, 266, -176, -426, -1110, -309, 241, 645, -680, -928, -254, 378, 28, -511, -436, 735, -86, -1092, -284, 560, 451, -267, -992, -416, 348, 321, 97, -423, -89, 508, 287, -285, 23, 588, 302, -264, -434, 261, 897, 418, -368, -486, 542, 979, 329, -119, 256, 689, 227, -312, -222, 744, 435, -304, -388, 41, 1150, 824, -228, -509, 644, 879, 521, 25, -87, 675, 438, -428, -540, 865, 770, -23, -424, -70, 622, 681, 59, -198, 65, 319, 262, -124, -57, 655, 84, -599]
3614e99J73P80N04n09j063k9R10N44l81r07M70J21j55l02M45N28K37j254k14k1
3634g22J337Qq26n84J20P61l42O7N29j6n27r44J7J429O41q33j135M7P37L62O8
3655A94k33j50j05l96K70L44N13J06j366l53R57J036j2j216l31N07O87p48K84
3674a2O04j64j034l99L88J495J69j004r62J28Q91L37J33m63K31n46k61l4R79R44
3694A420q56j155l96J234R27l03r39p6J36K61k31K41O17k03q67p00R33J115P5
3713A233p71j226L62Q66J77k39n2N6n03r8o3P19O44n23j153m23J301N34k49q18
3733b26j9Q85q39k78Q00P73l21j222o41O72J139J7r56m47L80L54K39l88j92N43
3753B73k72p29J66J068N7o05q83J3J143K16q24j75O82j63k51m61K98P01k54m75
$$ y = [-599, -426, 354, 858, 349, -714, -743, 167, 711, 330, -577, -107, 14, -141, -443, 2, 530, 767, -487, -701, -722, 615, 623, -203, -787, -667, 94, -248, -181, 348, 332, -195, -1139, -1122, 307, 948, 115, -1020, -973, -236, 126, 194, -39, -189, -294, -690, -420, -76, 437, 543, -823, -1176, -219, 817, 805, -411, -742, -235, 452, -296, -12, 592, 428, -606, -1005, -617, 878, 1047, 43, -919, -791, 100, 437, 570, 107, 338, -208, -469, -503, 476, 1420, 564, -591, -987, 247, 1174, 871, -68, -144, -8, 253, 22, 263, 880, 677, -190, -890, 43, 1158, 1233, 462, -764, -402, 464, 641, 402, 350, 406, -97, -195, -258, 461, 1105, 582, -571, -994, 307, 841, 592, -226, -245, 640, -199, -477, 323, 1096, 775, -447, -1088, -416, 723, 740, -216, -663, -283, 71, 310, -78, -270, 273, 1, -728, -562, 506, 563, -42, -925, -912, 231, 447, -377, -552, 130, -33, -284, -745, -447, 254, 0, -475]
3773d75m88M29P38L07p88o95O13N28n11k03N56L69k88j145O72P89R3o31l85L66
3793a49N72k93n11N3L03M49n41n08L21P40K36r51n57O13P78k33q49L85O94J40
3813F92o09m56N65J11J24o11q4Q41O3o94k38N50P38n87q83JJ416n7r56k68J60
3834a82P40k49k11M39J65k14n61J10L49P13m80q51k00N47O11l90j67m25M87J61
3854C92o47j20J226j68p54o71N42O14L61n01m62k17M36k72J23J83M5o2o90l16
3874i58J235M95n48r46P3P17N30m76j19l71L24p42KP17N60j7j050m34J08J240
3894C40N62r82m34p1O34l32p0L85M23n97r27K82Q08R82p32r94p2L76N33p6%q6
3916d8km97m54Q25P52P6j056p90M99J385J27o54m37L16M1l56J99M57K67p81p84
$$ y = [-475, -963, -534, 204, 511, -277, -972, -359, 169, -342, -545, 11, 380, 92, -1053, -381, 408, 501, -130, -515, -149, 423, 130, -381, -328, -25, 424, -117, -625, -304, 436, 672, -279, -836, -223, 555, 322, -527, -142, 552, 692, 83, -373, 192, 303, 427, -184, -268, 573, 636, -58, -296, 254, 992, 405, -478, -477, 939, 882, -74, -342, -182, 558, 309, 98, 537, 702, 488, -73, 37, 386, 1099, 619, -232, -432, 115, 726, 336, 169, -256, 231, 392, -255, -375, 851, 683, -71, -742, -200, 414, 775, 274, -188, -405, 31, -241, -118, 65, 110, 48, -642, -958, 277, 772, 224, -722, -649, 68, 598, 122, 3, -368, -44, -786, -784, -67, 493, 476, -574, -1008, -900, 340, 902, -80, -514, -585, 49, -283, -353, 32, 455, -142, -1069, -787, 21, 1003, 271, -723, -795, -419, 114, 38, 38, -48, -50, -547, -1001, -176, 576, 652, -404, -1194, -695, 690, 817, 163, -274, 42, 83, -273, -74, 383, 650, -131, -915]
3937i15M52J070L63p86p97k5N98M66r6m0M82n96j69n50M92J072k41p82p66P93
3957B5Q28k55n43L6K02R9n35MR99J36j047m65N41P67J60n22r26j2P67L40k99M9
3979C49M3j09n23l57Q34P62n25j059k36R10M49j07p72M06q0r3n53M80O60k04l71
4000i6p73M37Q50K53p25n38L21K14J86m50K19N61j54j033L2O67M31l20r18J73
4020f63Q01j4k85k26J9L36j33k39O6L79L71r80n44R18L23L08j074P1O13M82o59
4041a30N7q1P94q40m04K35N61M32n80m90M10L0M12l74n82N02L53N0p14K0P42J88
4063E91r43R9P20K33p02p08M14R39O4n25n01L28M12m15j50N91N7L7o48j2N48J75
4085F04mo45p64R78N22j59o82N32K25o43m80L0O93K94n00l85N39K59N5n18j28
$$ y = [-915, -463, 607, 970, 184, -613, -638, -40, 426, 330, 290, 772, 176, 7, -543, -51, 1021, 780, -2, -768, 25, 853, 598, 55, 91, 293, 392, -143, -139, 860, 996, -51, -516, 25, 792, 952, 430, -496, -508, 259, 599, 300, 349, 392, 283, -240, -597, 237, 999, 474, -585, -821, 89, 538, 431, -341, 65, -15, -108, -661, -181, 479, 275, -96, -869, -432, 418, 671, -54, -592, -271, -57, 129, -321, -102, 459, 305, -728, -696, -29, 402, 82, -836, -663, 138, 124, -161, -387, -368, -32, -165, -404, -338, 41, 412, -568, -1112, -194, 129, 437, -637, -566, 47, 529, -130, -73, -154, 640, -200, -604, -369, 192, 624, 44, -446, -36, -6, 406, 32, -550, -48, 305, 355, -359, -339, 403, 591, -352, -253, 467, 700, -2, -710, -296, 643, 707, 182, -319, 9, 421, 6, -144, 447, 504, 541, -107, -119, 429, 604, 600, -45, -809, 169, 691, 532, -150, 382, 607, -36, -516, -486, 207, 501, 1, -384, 155, 414, 469, -49, -177]
4106a77R8M08l36j01j08P51l24o31j48O33Q60n37j122J03R37L69n77o17M00K22
4126A03k38m52O27K11j04l67n07M05P78p6p55l08J91J96K37k92M93O1j63q67j72
4147i99J249L92m30p84j23R96j47m01k1K00l8q6l22N36K21j58k94m38N45K67L46
4168E11j009K4M80J82k61j88N11K2n01m40O30J43N59p41p53Q00M12p1k29l26L96
4189A51N2j14r0J35M01J43p42l35P31K23m87l09o8N33L10o18j83Q06Q1n93l40
4210c13M32Q48l84m64m51N30L84j01l30n90L36M72k31k34M15j84P6p19N3J006
4230E51M67j269j83O59K09j2o40Q8K71K26l28j70K4O05l06q54J73M59M68k82o63
4251e07J97M88j41K3k79O7L33n36k54N89K93M5j184q9N54O28k40l31J87M8J48
$$ y = [-177, -79, 329, -7, -108, -216, 535, 211, -420, -568, 65, 925, 388, -734, -631, 306, 675, 98, -519, -119, 103, -135, -587, 40, 251, 147, -220, -727, -322, 456, 380, -375, -683, -492, -296, -59, -351, 142, 203, 40, -827, -999, 250, 642, 212, -572, -695, 301, 154, -247, -268, -68, -106, -192, -514, 22, 243, 85, -209, -647, -102, 165, 511, -498, -474, 6, 188, -73, -261, 250, 272, -229, -669, -39, 104, 663, -78, -831, -31, 381, 310, 81, -245, 151, 203, 89, -1, 134, 535, 678, -64, -399, 332, 555, 68, -241, -309, 224, 534, -84, -267, 539, 620, 27, -313, 119, 967, 583, 119, -332, 198, 582, 481, 151, -439, -103, 369, 138, -96, 319, 135, 211, -508, -455, 551, 1018, -251, -434, 225, 434, 422, -218, -130, 141, 367, 39, -131, -107, 498, 192, -662, -489, -30, 438, 156, -507, -310, 178, 37, 60, -219, -152, 181, -355, -609, -20, 273, 318, -866, -955, -401, 227, -13, -344, -157, -109, 39]
4272C9m97L6M22N05j015j64%P00N39l84p95j8L34M11l23L13J97j36p04l27J067
4293B00J40M0j256K74N92L28J56q13N8L10j21k4k1P40K6q02o34N06J052Ro87l45
4315b72l15N04M42l20J44L05m79o23K09J194K34m91q12k64M88R30m05o95N51j43
4335A82R7l50K68L58j70j75r77P80P88k48p47k46N78K73l13k70M19%k7p88J28
4356d40Q73L39l01q91l56R73M29n75j28K18j22j96j70L59N51k59n71m04L48O85
4376C62J67p96o4M63m8j27j63J02L21k60p71K32J064L33r95k14j13N01j63l1m52
4397f52P37L43r82m3M54N00M2p68l06O03M08j60l16k48O51N1q09K53M72K76p43
4418b37l73L35N47K47m55m25L44J93J53p95K51N08K3o12j68O46M07l02m84k1M52
$$ y = [39, -458, -422, 0, 505, -510, -674, -674, 26, 565, 181, -614, -632, -298, 113, -210, 103, 300, 164, -540, -867, 200, 340, 380, -876, -602, -10, 318, 474, -339, -281, 29, -92, -116, -137, 603, 629, -173, -807, -301, 751, 760, 73, -272, -587, -83, 359, 39, 183, 488, 9, -614, -405, 789, 1023, 532, -280, -544, -56, 874, 469, -226, 325, 182, 279, -71, 197, 555, 385, 210, -767, 13, 801, 553, -194, -440, 138, 411, 98, -172, 247, 247, 220, -568, -440, 433, 772, 471, -420, -776, 197, 626, 51, -77, 141, 19, -177, -347, 12, 563, 304, -267, -671, -323, 362, 529, -267, -331, 132, 84, -43, -206, -104, 217, -43, -814, -582, 482, 815, -180, -394, -507, -6, -169, -200, -652, 85, 428, -554, -597, -143, 357, 399, -369, -675, -72, 336, 176, -140, -388, 263, 314, -495, -242, 230, 506, -237, -610, -275, 272, 519, 64, -361, -17, 176, 329, -466, -215, 293, 316, -296, -464, 182, 589, 287, -197, -218, 234]
4439B34L32o14j2K06M16j45m94j03M48K38m35k13p2O55J8n36PO74m5o62r7L39
4461A39M42J34p86k59N05L45m09j68K4O50l29o10j3P69K22m43o15J68P52k85K7
4482B60o95K34J78J96n57P6N99K9n54m14L97N92N7o62m7J61J24K35m41K63K88
4503C19j14r81K43P86M00l91r71L09L36J44j33k46L93q6n56J1K88Q04j93p29n00
4524h67M51P46j63n19l4K06K97n92n7N40N22m84n90j87J130K61q95n26M60Q8K61
4545D8J86J78n8m35o42L3R41L82J74j062l99L95J027k05l14l91K73l65j92M51
4565B5Q76j13p92p31K51J204J53n69l01l15L27M38l65M58P5m04m79k72P66P72
4585A004k02j312J73M0R78q2n68k3K53m78l6M12P05j44o31p41L42J004K5n71m14
$$ y = [234, 566, -48, -60, 146, 562, 417, -77, -180, 268, 506, 71, -142, -214, 441, 459, -77, -70, 604, 559, -103, -200, 139, 581, 715, -71, -330, 175, 520, 111, -57, -33, 617, 288, -322, -335, 434, 656, 213, -402, -234, 518, 233, 260, -435, -201, -23, 173, -384, -308, 291, 320, -234, -648, -251, 341, 398, -264, -311, -150, -26, 209, -232, 31, 319, 205, -776, -533, 253, 653, 262, -709, -400, -64, 80, -53, -299, 94, 8, -548, -537, -249, 555, 362, -367, -867, -416, 330, 167, -352, -386, -180, 117, -475, -532, 8, 530, 46, -544, -731, 399, 660, -235, -761, -301, -213, 48, 234, 412, 354, -81, -723, -690, 251, 633, 807, -255, -654, -259, 768, 563, 249, -142, 131, -234, -426, 25, 901, 788, -4, -735, -484, 720, 873, 304, 3, -312, 15, 453, 88, 546, 621, 217, -262, -534, 232, 1004, 802, -510, -337, -297, 681, 599, 31, 8, 261, -217, -253, 159, 864, 720, 89, -652, -310, 694, 719, 148, -266]
4606b66J92j40L06k82P78O8o46p45K09N86P37l56q45Q7M9O59o39K86j05j99n5
4627c21j61J44O48K43q62k02J04M44N19n71j43O2N8o79M64J10N61m63r32K32Q50
4648A05O31n41q35L07J73K42l86J27Q8K67n08r0M75L45L5p63j79K40N28r9n40
4669c78Q6M67p9m33j4N03K99o72l79J25Q29J20j58o85M12Q5K49m55K02K78J6n48
4691a30QK42L11j33m12k95N01M57n93K5K29L28k22k31l57N21L98l53o61N74K61
4712D68j15m27j09m7Q30n6p31j19M29N0K7k72J33M04l25n68K17M63J34o51j16
4733c81O05J30l7n35P3k55M84K30n75J99M49l77m13j52N55N07m17r02O28K49K44
4754C09p39P3L31P7o22L28R2L81q0p47L74PM02J04n87nK39Q0j02j66J53M85l13
$$ y = [-266, -74, -214, 92, -190, 588, 656, 10, -735, -526, 60, 797, 441, -404, -317, -268, 391, -248, 38, -67, -266, -321, -482, -338, 310, 553, -309, -511, -407, 37, 556, -15, -158, -96, -38, -717, -253, -143, 418, -45, -977, -745, 105, 736, 195, -640, -333, -160, 82, -304, -177, -89, 178, -330, -420, 55, 400, 435, -328, -507, -267, 261, 162, -378, -292, 175, 96, -337, -351, 152, 451, -221, -600, -475, 354, 474, 316, -369, 43, 128, 377, -78, 124, 402, 418, -130, -122, 120, 431, 298, -114, -409, 92, 549, -44, -19, 210, 538, 316, 85, -272, 249, 647, 294, -367, 207, 468, 353, -74, -183, -230, 600, 544, -187, -306, 123, 173, 200, -72, 61, 465, 140, -428, -211, 252, 386, -265, -381, 224, 354, 317, -218, -145, -400, 84, 314, -261, -62, 387, 10, -403, -555, 0, 507, 90, -812, -184, 65, 309, -430, -357, -26, 51, -571, -243, -151, 230, 150, -597, -223, -216, 186, 290, -297, -302, -63, 17, -85, -251, -98, 387, 74]
4777G4p77K76O98r9k27o28M04O16l37j10p3K24Q6m27j86N23M11k21n14k64M22
4798a29P85n50k93j4m7M46j65n15O03L33m15n46L73O92k03o42q1N16M99m52j33
4819F2k04J72J06n74J40P10Q2j29o10J67L33L49J00o95P4K85j41r8m15O01J21
4840D36n34j20K02M71M1p22j04O14K7j55l03J75m9K39j75m43N93J7j53l16p5O33
4862B99K13n21k56L16L29l64m74J68L51O5m73n6N92Q3n00l10K17M68J59n53k10
4883d57K4L51J97k82j99N95k75j16n57J54R35r0o80l27N86P09n22k85L11J22k61
4904f7m77M21L24P5n50k25K06O16M4k84m86Q7J79K73j25K1K57l80l92k14P46R37
4926I86r56m35O5N60J56k71l58Q16k83k70n24P22J76J33m68n52r7J298m0o23l67
$$ y = [74, -703, -427, 271, 172, -55, -683, -279, 337, 0, -110, -183, 41, 127, -300, -486, 37, 448, 227, -287, -551, -129, 656, 106, -187, -201, -248, 198, 33, -482, 121, 454, 39, -507, -134, 558, 355, -287, -368, 148, 647, 195, 62, -142, 30, 136, -438, -298, 412, 494, 365, -245, -78, 255, 604, 704, 9, 83, 368, 227, 129, -286, 315, 436, -98, -218, -16, 455, 496, -226, -330, 284, 311, 156, -147, 28, -21, 218, 43, -400, 193, 210, 57, -259, -334, 299, 512, -9, -265, 51, 380, 16, -458, -290, 61, 126, -347, -403, 189, 272, -228, -538, -321, 147, 306, -247, -457, -433, -82, 115, -167, -366, 229, -46, -162, -719, -565, 370, 280, -400, -727, -141, 568, 46, -239, 72, 194, -67, -544, -123, 201, 276, -274, -499, -293, 323, 367, 83, -403, -316, -137, 136, 11, 32, 289, -91, -483, -697, 49, 986, 30, -405, -340, 220, 376, 105, -253, 563, 280, 10, -514, 208, 384, 517, 49, -503, -600, 698, 658, 35, -332]
4947c32L87K00n6P0R1L8k46p49L4Q08L03K7p82Q3R4N50l70J20k8N7l31n75R01
4970B94L88k92p86k26L51O65n2k03j86J99o9l16R8O71L7o57m00qP93K28l83l25
4992a79j55M99j10j12k0J60j50m37o4L00Q70k12r21k53O60J86k0l11J5K85l88
5013c57K5M1O06P3p42n72M74O62J22o96J51j9K45J13k58l4N84l83o06j31O25L22
5035B45j30n62M19j04r6O62n22L7oj46j01J75K75L80n90l51J91N22J99k27m21
5056a51j16N73m34J64L50J14l54n87j07M88M96l64J9l67M49R4j21n6K42n9m3n06
5078b76M05L66M7m37k73J3N23j4m58R1J36K32n32o1K69M39r3n84j86Q59j5l00
5100A51J25J43j70Ko67J09M96J04l35o44L06P81o8l52K6j1L63j05n81M40K13n24
$$ y = [-332, 55, 255, 199, 269, 360, 398, 152, -597, -563, 245, 548, 575, -207, -124, -30, 520, 150, 270, 242, 299, -32, -607, 294, 682, 390, -396, -622, -271, 394, 342, 139, -47, 152, 83, -233, -135, 536, 573, -84, -484, -492, 301, 529, 146, -179, -334, 165, 55, -57, -77, 83, -67, -504, -568, -268, 602, 390, -531, -784, -124, 62, 42, -269, -254, 31, -357, -332, -291, 315, 388, -354, -926, -452, 210, 332, -364, -213, -232, 13, 126, -132, -166, 418, 35, -571, -702, -77, 245, 115, -447, -28, -132, -228, 434, -88, -51, -57, -203, -304, -129, 146, 526, -64, -415, -224, 298, 497, 270, -151, -267, 306, -128, 36, 386, 500, 146, -441, -548, -60, 436, 72, 91, -276, 173, 267, 146, 90, 332, 273, 230, -276, 129, 495, 542, 105, -168, -155, 368, 354, -104, -13, 123, 355, -177, -238, 31, 470, 377, -207, -393, 466, 451, 151, 276, 419, 249, 251, -416, -307, 189, 293, -42, -686, -380, 401, 333, -19, 7, -4, 359, 254, -327, 113, 326, -198]
5122a98j4k45J78N56J94n05l46K06K49j18j11L54Kj93o06J36O71L97p32n97L47
5143c75M41J13k05j15l5J73j39l59O51J98k73p00K59M23jP2q5m03L86K7l07K2
5165b32M34J63m42m59K79N76M3k06n80J74K15J19j24N11k2k88m48o23P87P15m88
5186A04m97q6N69K41J48k44R5j3o28j78K38R94j66n84o56O31L09L37n59l32K47
5207c0K07k37K15J27L62l99n42q2O57N93n44j4q10K86N56K09k75K82q03P7k21
5228c86L10P37j74p63k58K46N88J62m18k25J58P3j26J33J42J43m86o50J83R79
5248C68L22k14o02j35L78j08o5j70M05j55n33J38L00M74J40r43k02J12P57m7k06
5269A4r2n5O1r4j93J56L79k38m13K25J87N78m56P6m46JN77m68J91K83q1p20J52
$$ y = [-198, -212, -457, -279, 277, 471, -34, -380, -174, 75, -43, -154, 200, 202, 9, -597, -461, 210, 607, -125, -722, -375, 66, 179, -26, -141, -176, -3, -142, -501, 150, 348, 75, -625, -366, 57, 56, 128, 43, -360, 26, 53, -254, -232, 202, 365, -77, -536, -257, 319, 362, 156, -424, -250, -35, 84, -40, 471, 449, 161, -287, -910, -123, 592, 104, -393, -479, 90, 331, 479, 235, 330, 317, -311, -489, -251, 743, 577, -7, -663, -32, 277, 614, 55, -277, -30, 177, -60, 155, 282, 644, 245, -297, -379, 278, 871, 327, 313, -497, -211, 345, 554, 279, 561, -242, -165, -386, -76, 661, 487, -276, -534, -288, 300, 462, 44, -181, -23, 50, -76, 57, 199, 342, -144, -794, -611, 368, 690, 476, -126, -261, 117, 9, -56, -226, 179, 24, -509, -371, -71, 403, 543, -400, -602, -490, 267, 220, 14, -78, -133, -72, -166, -359, -203, 176, -62, -475, -250, -63, 515, 59, 135, -311, -310, 267, -201, -10, 273, 192, -528, -376]
5292c76J04L11nk46j24J34N21l17k71M06K21k71k12k44M64L72m65m41L32L44L87
5313F24o35L1J14J32l09k35N39p5l9j60j02J84N68l99m23j35M84J05l01L22j36
5334A54q2k19j04l5O15k50j32N7j19N57j00n27O3L67Q2j67m81M21K05j71k86j88
5356c40N20j80j3l78L73J17q7k55N7K3M79m02j19K54n9Lj47J73K3j64J63l27K03
5379h3J19J65n34n2L53K36j89j73k09L07K56m02p9N3N53k90r4k46K99J63m7l64
5401b58N4M67l32k59k0L63O1j56j65n7M56J55m75rK47m2R9k81N7N2M65o77p8L19
5425a4M46j70k48K0O3J50j39j68J23K78k81j32j61K18L27l43j43q7P03j62l87
5446a07k21N42K53o10J16K80K24p9m46j94N61r1K98p02K80J6L42q32L38K0J63
$$ y = [-376, -272, 39, 34, -212, -336, -202, 319, 2, -269, 137, 358, 87, -125, -369, 95, 467, 2, -439, -107, 237, 624, -11, 20, 134, 266, -43, -278, 261, 186, 147, -13, -115, 69, 637, 238, -185, -320, 164, 269, -32, 290, 154, 72, -147, -251, -286, 329, 79, -53, 4, -115, 442, 342, -185, -122, 245, 327, 160, -321, 100, 305, 134, -152, -340, 180, 0, -13, -391, -18, 99, 12, -243, -186, -163, 316, -86, -205, 49, -10, -7, -154, 19, 42, -122, 41, -286, -83, 36, 201, -333, -385, -32, 204, 15, -158, -367, -60, 196, -206, -285, -232, 321, 31, -63, -309, -10, 153, 106, -258, -204, 263, -69, -328, -348, 15, 76, -80, -245, -302, 154, 309, -166, -175, 72, 30, 129, -152, -95, -43, 422, -255, -333, -14, 432, 262, 14, 34, 97, 247, 108, -60, 63, 341, 60, -72, -233, -15, 312, -31, -174, -261, 442, 280, -107, -328, 214, 467, -143, -27, 253, 477, 398, -48, -242, 319, 228, 526, -176, 104, 120, 462, -370, -32, -12, 151]
5467A51j30k28L1L70K71l98j66M45N9pp78J84L81N1j82r9j60L08J0j17j02j80
5489b86Q48n91k23o8N70j85k85O9q1L59j34o07M53K26O0l64p0L49J39m28j07L92
5511C6M1k46L7j09K94J04k80P9j92L73j72l7k70J68M69m37J22l20J57M61l99m3
5533a64L31L2j58m11L54M24q8l39l85K62J63J96j01l70L74J04n36K11R2O9l2k37
5555b09n8M72O5k53l97J09L64l7L5J23r5m8q8p1L18k2j16l6k26N8N96k20Q4m26
5579g8L9J19J57k82J80OJ51n08j2M13L07l09j07l04J34J53q2K71k48J39l62L6
5601a87Q6P05k79l23k03m6O63P7o92K22M59n74k72J94L81L01q56j15q3N39M12
5622D09m93J3l36j15K84M74j49R8q8n58J66M12J55R5n35m75M64M64l79K3j1Q8
$$ y = [151, 21, -207, -176, 194, 465, 67, -99, 346, 405, 398, -380, -196, 185, 236, 54, -45, -205, 103, 113, -4, -106, -286, 562, -29, -252, -320, 250, 65, -220, -151, -232, 127, -7, -614, -161, 65, 125, -239, -309, 40, 179, -249, -356, 36, 77, -169, -132, -241, 53, 157, -123, -44, -236, 137, -35, -72, -342, -174, 295, -142, -20, -340, -183, 278, -121, -164, 167, 199, 41, -370, -16, 408, 320, -19, -404, -142, 21, 217, 116, -254, 120, 224, -312, -101, -9, 60, 28, -209, -267, 205, 270, 17, -380, -271, 93, 56, 91, 214, 119, 71, -17, -88, 230, 208, 92, 56, -170, -112, 484, 264, 348, -78, -39, 80, 237, -45, 135, 141, 292, -216, -228, 185, 492, 183, 76, -228, -94, 59, -23, 248, 0, 139, -223, -187, -101, 604, 325, 2, -201, -247, 416, 493, -199, 23, 482, -92, -364, -170, 211, 512, -344, -459, -542, -3, 409, -84, -71, -407, -522, -238, 236, 87, 185, 97, -461, -295, 117, 272, 367, -168, -643, -179, 285, -94, -71, -82, 6]
5644FM1k78J78K83J91n12l57K9L36M87j17o00Q7L2l3J62J85J95n55P1k09L05M05
5667C32j87O7p72N48L03k79J88j17J59m12k50K60M74M9l78l91J06O13q4j03o0
5688F6Q5k67O5k1L51J66l95l12j19O20K98k73k90l4l9J16P9M4L33l19l45l40M47
5711h4L80R0l37l46K52L51k30k13K80P2Q2m41r2Q25j4m04r6k01J32L85n21J58
5733B8J09l1k99O1o5L88K08n29k01K98K06m8j85k62K72J15k36K26K47%j52m52
5755c02j05M01N28l60m06J66j34L74l88J42M73l73J15o78m3P60J0l26l44L95K7
5776f8k15K63K84n27j47L09j54L02L02j23o58K46R1K36Jm46J43L17j00l54N45
5797B47K22j69m50j73P7N23jk54k23K15L2n6m3K9N43m87j12j31L92N6l4l66L17
$$ y = [6, 47, -231, -53, 230, 421, -91, -448, -419, -83, 404, 287, -313, -226, -194, -227, -65, 120, 315, -240, -169, -378, -73, 332, 145, 212, -560, -12, 291, 12, 200, 83, 242, -170, -420, -160, 314, 363, -15, -406, -300, 313, 229, 126, 66, 151, -116, -51, -72, 279, 445, 50, -262, -381, 239, 537, 264, -26, -60, -99, 17, 96, 140, 473, 154, -191, -531, -84, 296, 386, 49, -297, -45, 306, 76, -137, 143, 215, 297, -144, -236, 589, 575, 171, 75, -126, 6, 391, -130, 28, 137, 106, -193, -132, -197, 191, 399, -130, -331, -33, 173, 125, -60, -322, -50, 65, -171, 55, 302, 302, 150, -302, -407, -6, 522, 162, -244, -78, -212, 162, -226, -84, 389, 16, 131, -547, -590, 170, 180, -146, -490, -95, -68, -283, -20, 264, -263, -410, -101, -255, 47, 349, 226, -432, -186, -95, 141, 142, -304, -161, 156, 56, -298, 247, 469, 300, -150, -323, -246, 277, 276, 22, -201, 14, 46, -10, -53, -24, 519, 32, -80, -211, 181, 237, 203, -163, 154]
5820A54k61L02M43m55R0k43Jj45R9K86K35j20r54M13L57%K6k43n0Qk26J74K77
5843A68Q3j32k52o2J25L03L9k70Ol41M56Mk41K76j53j97J84j87L81o7j07l26M43
5866A33O6l4l94N04m50J16k61N8N43j22k32l47L3N58J88k19m97K18M96o05j42
5887c90M61J43Jm34k91N68M55l65n41j20K41J50j22J98j17K83k88J4J91K17J25
5908C79m63k41Q0N8N45k65j31j81K62j94k10M39M7N1l24j92R5N62m02j00p2L59
5930A02l77K86m6J60J83m10q0k7N30K9k23j70j26P2R2P5k83K61K87l18j99K84
5952A02J8K3j83l4K07K50q3l79L11j74m7Q5k03K07J93j84m40L19J12Q8k9k21j8
5975h0L90k39j07L69m2k08r0K34k76m7L26k46M6L03n3m18K3J07J3l53P5M83j35
$$ y = [154, -107, 195, 638, 183, 273, 30, 31, -114, -15, 271, 506, 386, -568, -155, 202, 202, 228, -15, -65, -57, -283, -109, 168, 251, 119, -133, -195, -70, 233, 272, 2, 8, -333, 123, 127, -114, 162, 9, -188, -4, -191, 190, 123, 16, -310, 133, 199, 165, -229, 275, -175, -59, -320, -262, 281, 159, -73, -420, -387, 171, 359, 140, -357, -139, 357, -248, -390, 71, 214, 215, -219, -510, 58, 513, 148, -393, -513, -272, -122, -244, -46, -163, 120, -168, -154, 37, 254, 379, -84, -325, -245, -187, 358, 93, -38, -219, 43, -151, -361, 78, 125, 176, -148, -340, -245, 317, -85, -185, -257, 102, -275, 11, -35, 125, 308, -102, -182, -209, 321, 350, 127, -43, -169, -97, -5, 70, -213, 48, 335, 17, -182, 102, 120, 143, -40, -74, 133, 383, 300, -79, 232, 58, 11, 96, -107, 100, 293, 109, -331, -12, 100, 188, 159, -62, -80, 310, 71, -36, 333, 291, 83, -7, 227, -49, -96, 230, -16, 30, 333, 280, -138, -115, -8, 5, -348, -273, 210, 75]
5998G5L6k76j35J20K45R2l02k31N00j25r5n0k55N21jj74j51J44K08m45J40QJ27
6021b4J31m56M9L76J14j24r7k35N16k70j53L3J41j26J60l55K55j32o6J21J2L24
6043A94k96M7j92K51J97M78n21j46k8J02L38n08l31M57J20m8l83M90O1l44J60
6064I8m10N15j4J23m42l9R0J51J3r3j4L32m61K82k22M05J1l35l16M24J41m52K8
6087a85J82J80o7N9k07J43Jr2j20r0L85r0N8l29j10J61M23p0l94K93N1k89k76
6110c83K13K69Pl18q0K31M39n54J3j19L75m09J86k31L94O1j98l05J41K32J26L7
6132A27l48K53N2K2l49L07J47n9j75n72M21L51n58K95k20L3L91m0l94M31j77J57
6154I5l38J63N58j23m01N4n53O74K75m97R4L5J50m82J78J85K26Ol17QP9P8j92
$$ y = [75, 111, -165, -300, -180, 65, 157, -145, -376, 124, -1, -96, -146, -401, 120, 119, -55, -206, -62, 146, -299, -159, -151, -24, 107, -349, -300, 76, 190, 66, -31, -266, 250, -20, -173, -140, 1, -125, 35, -320, -65, -197, -263, -142, -130, 194, -102, -55, -247, 4, 201, 679, 158, 12, -16, 86, 424, -84, -415, 42, 162, 114, -269, 221, 282, -62, 98, -312, 203, 189, 312, -130, -169, -79, 72, 85, -8, -22, 310, -151, 131, -91, 314, 325, -10, -326, 98, 239, -213, -185, -3, 177, 110, 169, -38, 105, 106, 14, -106, -196, 189, 99, 157, -172, -282, -121, 302, 232, -162, 131, 182, -107, -383, -170, 99, 106, -212, -292, -61, 378, -176, -163, -282, 93, -316, -130, -361, 33, 94, -104, -409, -268, -36, 90, 127, -221, 32, 84, 106, -243, 64, 211, 152, -23, -595, -174, 177, -381, -86, -306, -273, 118, 78, -316, 115, -62, 95, -243, -80, 478, 355, -46, 8, -545, 129, 404, -93, 1, 36, 186, -296, -118, 67, 293, 299, -18, -10, 69, 147, -45]
6177d5k27R9N9ML20l14L53K1j29j04j88M07k04j57m24N99j97Q1R2j75M97m86J95
6200G7j79L12J39k59m40J8K64K08J14l34K34j69j13L64k20K31J4o33J95L17R5
6221B35k0k55R7k27K70O0j01P2R8j09m47L7L82N68m83l17k27K51J76m0Jj88J61
6244fL3m35rM97L44n39n52L01M02J70k82j51M66j35k39M1K11k3j47j26k08P9P01
6267C93l2n14M2K5Q0K23l03K2K78l95o4J69K14L2l01K00q6K24j50L8q2K5j16j83
6291b61K20J37J12j31n4k73K53L14o4k03m72K91K68l45L17l5K14p76J4N18J27
6312A71O0j20k35k5J64j9L0R3l37L95o27K98N93m61P8l08P2R1K40K78k2n52M2
6335a01L28m65O9K09M03q16J96k5L51n2l51K56P1J14j02O2qk8r8o5j78M14M3k29
$$ y = [-45, -272, -173, -114, -110, 210, -104, 249, 270, 141, 37, -151, 256, 52, -105, -529, 70, -127, -46, 46, -129, 368, -118, 77, -102, 210, 349, 90, -350, -332, -68, 140, 254, -80, 154, -15, -128, 236, 16, 247, 261, -372, -177, 140, 235, 215, -40, 57, -170, 100, 160, 59, 131, 229, 120, -327, -290, 92, 660, 177, -140, -367, -116, 60, 20, 21, -167, -6, 27, -408, -417, 80, 424, -115, -667, -366, 36, 206, -76, -227, 239, 104, -135, -94, 117, 94, -53, -179, -387, -308, 393, 361, -153, -111, -86, -6, 217, -86, -64, 214, -181, -245, -76, 138, 170, -131, 69, -17, 207, 57, 95, 13, 38, -78, -261, -41, 96, 208, 77, 23, -250, 3, 317, 253, 50, -422, -131, 137, -208, 109, 74, 288, -488, -474, 44, 171, 231, 111, -124, -149, 15, -4, 26, 119, -218, 177, -450, -152, 441, -20, 58, -250, -178, -87, 153, 431, 409, -143, -101, 227, -238, -169, 40, 443, -373, -177, -202, 149, 97, -254, 2, 73, 187, 85, 147, 139, 111, 13, -52, -230, 184, 227, -2]
6359bOj91J9K40O9k34O4j47j53L48o1K03m4o53L07K71K6O4l59K08J93k49l38L47
6383f6K69l97m0J72k5O3N31q38M2QK83L03j90k04PQ8k47O3N4K02k0j68j90M31
6407A31n6N4k64K81k62K95k58k63K51J77J71o26R3N70jk10j0P5j36j44N1n1L44
6430B12j32R9l65M86k4l99N2J89j19K8k31K13K60K8k89K9j64M27K60o82L69l87
6452a40J23P3r7J88k12K19m09L82P1k40M29l50k52N6K10J70l86J2L13r5k23j17
6474b75K98K33j88l42J97J82K20m80kK89k53M7j51L14j23j7k04k32N51J32j08
6495H8J36l69Q8K25k02j7K23P9m88L15k9K86m03L5j35j09M50j07k0k64J83k38
6517b73K14k78L50j06k3N5J3J0J76k19N3j06L70l10j3J9O9L52o26k9J98J36r4
$$ y = [-2, 4, -187, -168, 72, 141, -93, -29, -176, -329, 19, -42, 161, 117, -536, -229, 42, 68, 132, -227, -19, 174, -75, -413, -66, 203, -194, -234, -62, -87, -24, 507, -331, -289, -281, 2, 305, 115, -89, -82, 6, -241, -178, -124, 78, 58, -110, -300, 131, 75, 129, -135, 146, -116, 179, -79, -342, -91, 86, 257, -369, -276, 294, 293, 83, 73, 148, 12, -132, -81, -132, 212, 80, 179, -186, 300, 276, -123, -71, 118, -1, 27, -204, 9, 269, 297, 8, 37, -127, 300, 560, -122, 247, -140, -17, 56, -41, 147, -65, 154, -255, 127, 198, -42, 387, 37, -215, -159, 51, 221, -165, -153, 160, 65, -158, -275, 23, 256, 68, -274, -77, 105, 325, -155, -157, 132, -121, -74, -225, 89, -34, -51, -255, -487, 64, 196, 88, 224, -145, -57, 168, -34, -51, 172, 251, -237, 78, 49, 335, -68, -33, -168, -277, 173, 66, 46, -218, -35, -273, -59, -337, 13, -93, -116, -61, -48, -38, 138, -81, -28, -134, 236, -74, -87, -68, 1, 353, -273, -302, -104, 32, -62]
6540f2K94n71L27R7p5J14j52K9L11n46J95kO1O2k08K39J27J93l34k56K85Q5l54
6563a41q0M03J60o3k90l07K78K93k77k4l41K88K89o4k67N8L37j21o5j29K78J5
6585B30k1j32k63K01J66m20J99K38l33J60j00K17k72K71l24j89M20j41J65j43
6605g1l61M76J58j14p3k01R6n7J23P9q3K56l70q5L82k56p1J61q1K28k0q4n3P6
6629E5j73L4P8k70J41J87J45l20j42M71L0l51o5J22R8l64K42j05P6L4k01J41j3
6652a50M8L07m51L20j94L83R3p32N30J37j72k10n8J40J30k6m17K25K81o8k34L2
6674h6k32L77j01k07O0M65k60Kp8p4M35m87k03K64p9J81J65k33L70k31k17L11
6696A42j2j00N7J61m73O9J71K04k66J58J06j70j19Jj08K90l1l68K45j17L28k37
$$ y = [-62, 232, -339, -12, 85, 10, 124, -28, 1, 312, -234, -39, -41, 20, 82, -126, 113, 240, 433, 99, -157, 128, 213, -141, -221, 182, 342, 279, -11, -318, -40, 253, -24, -48, -389, -101, 188, 124, -143, -85, 252, 131, 66, -63, 215, 230, 209, 77, -186, 15, 181, -239, -40, 198, -135, 25, -75, 142, -130, 141, -183, -372, 48, -93, 72, -71, -432, 44, 202, 88, 15, -186, -90, -147, -24, 55, -28, 228, -142, -227, 155, -101, -172, -11, -92, 136, 116, 32, -21, 55, -118, -84, -6, -276, -135, 52, 197, -123, -265, 206, 236, -115, -180, -58, 40, -324, -82, -187, -111, -77, -278, -137, -150, -102, 205, -246, 74, -120, 263, 356, -376, 154, 291, 119, -91, -149, -9, 121, 95, -322, -97, 184, 116, -118, -86, -318, 59, -42, -249, -189, 276, 16, 18, -60, -134, 301, -186, -389, -125, -204, -23, 142, -91, 279, 48, -169, 142, 130, 30, 87, 248, -225, -156, 15, 219, -47, 111, 217, 47, -72, -71, -179, 111, 80, -288, -43, -160, 168, -69]
6718f9L4j30J1J57J8J6J07J32m25M5R0K0P0L9p5o1J51n9OK16n34M18k16R7J18
6743A76j95P5j57j08L61j40K22k10J92j64J44o08L54K51m8k08k22J08J00J96m23
6764c04M6M49l81J51q6R9K24n03p9J64K99J78k67k51M5J41R0k86J86K00j89k77
6786c51J43J31K12j70m2k81L64L5L4j84R1J00o1k34P6M84l0k55k11m5K90J66j7
6809B45m36K78jk7J2k84K49Q7M0k41J01J73O1m27j59J35L29j32o8j32L38j37j91
6832a87r1L78M6Kj99j89K79O9J40l03J6K65j34j82K08j08J88n25o1J74M14j54
6854D6l13R5K47l8k26K00K55j78j02k23R7L53J54l99J3j15K41j05O7K7K57l12
6876D1k4k4l31L41P7j58j09K90k56J87o2k59K7K05k49K25K04K21o41j27j4K72
$$ y = [-69, -35, -165, -154, 3, 21, 37, 144, 276, -149, -104, -14, 6, 76, 115, 40, -21, 130, 71, 77, 293, -241, 177, -39, 58, 176, -19, 56, -101, -209, 152, 12, 234, 24, 216, 52, 196, -412, -58, 193, 145, -63, -285, -177, -77, 119, -304, -258, 191, -190, -39, -125, -26, 198, -305, -384, -220, 79, 257, -10, -261, -216, -75, 15, -271, -85, 115, -74, -351, -208, -77, 135, -35, -77, -358, 6, 41, 75, -109, -18, 82, 21, -213, -137, 347, 317, 62, -149, -194, 96, 262, 245, -191, 87, 86, 59, 71, -213, 36, 123, 163, -78, 23, 196, 257, -170, -329, -194, 135, 3, -65, -197, 141, 4, -187, -278, 100, 146, 148, -51, -240, 39, 108, 248, -55, -39, 226, 92, -90, 118, 10, 198, -327, -388, -214, 200, 46, -267, -172, 75, 37, -189, 11, 266, 88, -14, -237, -140, 213, 367, -32, -19, -134, 107, 2, 69, 96, 353, 41, 17, -7, -338, 3, 80, -78, -187, 103, -153, 34, -28, -287, -260, -55, -304, -79, 125, 346, -295, -422, -436, -164]
6898a64K81m2m46K47m0q0L00j24L28l95J28l31K15J89J57k93j94K50MQ0k05K99
6920A64j78O6k09qL90o1j65j84j26M60J47k12k07j78M14k6j16L5L73j32k19k16
6942a88Q4M15k15Jj13K8j41P3k7Q0K39m2m04L05Q9q4K25n08K74k44M64m24j83
6965b96L17Kj16K22j74M47k72k40O0P0J52Pk15Kj23O3K09N2m8q1k62NL41M1L32
6990D95n50R9j98m4L13l26K59N5j07l34l5M68M8o3r0j39J92l2M5j13p6J07Lj38
7014a61J50R3L72p14L09j77P4J68l04L49k74J69r1j13J92J1j12J02k43J88K33
7035B21j64o4l26K58M2J54q4J1K06q8k84O9J09M32n78j60J30J14l2j12J27L45
7057C26k22J46m28K00M35o21J78M1J71M9j52p9l09L09K83l32J4J66K42n52R6o8
$$ y = [-164, 117, 75, -371, -124, -164, -244, 56, -68, 260, -135, -7, -338, -123, 66, 223, -70, -264, -14, -10, 70, -135, 164, -14, 52, -157, -165, 225, 164, -1, -185, -311, 149, 296, 84, -123, -301, 113, 87, -29, 6, 379, 247, 28, -188, -104, 311, 96, 97, -16, 12, -129, -56, -83, -3, 236, 194, -210, 95, 184, 100, 325, -183, 91, -153, 311, -113, -296, 21, 23, -93, 129, -45, 402, 130, -110, -50, 20, 172, 179, -36, -34, -157, -94, 115, 167, 119, 38, -224, -219, 122, 163, 495, -55, 44, -154, -198, 115, -211, 48, 103, -4, -338, -373, 95, 143, 80, -10, -149, 43, 11, 56, -57, -133, -26, -23, -161, -11, 82, 454, -260, 49, -128, -54, 114, -190, 159, -115, 54, -37, -150, 42, 53, -59, 43, -200, -12, 221, 57, -7, -333, -75, -33, 121, 37, 48, 254, 166, -118, -49, 60, 492, -86, -246, -116, -2, -34, -146, -19, 326, 104, 250, -178, 22, 457, -164, 14, 55, 226, 275, 123, 44, -265, 44, 327, -5, 9, 175, 417, -135, -39, -107]
7079a07L08j40M33o63K04J03l22r2M35l3j40o2j96M31j9j74K4k91M46o7j53j38
7101b13K11K07n45L54n0J23K7k03l4L4n4M7J41j87k5M2k4J79j36M27j70m17J69
7124i7J09L04l46m69K00J3J22j60Q5N49n07M19m03J75r2n8J33l00K93P9Q7k10
7146g4j5M09k06l41l8K64J01N6j96j32K65L0k52j04J50J76j72J52J58k87q9J87
7168D2j02J65K72m17j13K11o8L34j1j69k30K64q6j95j87M04R6j19k41K74j10J48
7190A62j64j67J40P4l59N82k88K86l66j35K42M9j3J25l0Lj26K01l83r9Q1Q6j40
7213b39j5Q6K80J70l65R5l76N28l21P1L2J77j83R4p4j42L02q7j18j93J20L56q3
7236A15k04Q1M7J45k13l60M44q9q8k0N0oJ97q2K03j19o0l14jJ55jL41j88J40J74
$$ y = [-107, 201, 61, 494, -169, 35, 138, -184, -276, 159, 126, -14, -76, -272, 159, 140, -34, -10, -301, 145, 78, -75, -213, -2, 205, -340, 14, -36, 87, 114, -89, -123, -89, -143, -96, 45, -142, -167, -125, -149, 30, -106, 321, 151, -266, -97, 12, 316, -30, -499, -299, -286, -164, -324, -239, 310, -197, 222, -181, -6, -98, -156, -23, -323, -30, 49, 136, -74, -89, 320, 114, -227, -265, -1, 100, 156, -40, -172, 93, 123, -129, -233, -83, 93, -79, 73, 231, -56, -145, 42, -60, 105, 377, -40, -153, 58, -10, 324, 313, 144, -86, 178, 92, -103, -290, 114, 210, 91, -150, 124, 14, 162, -2, -169, -29, 45, -314, 268, -20, 266, -100, -235, 7, 56, 43, 168, 138, 141, 15, 216, -167, -266, -185, -99, -239, -254, -168, 112, 282, -83, 12, -364, 164, -157, -86, -54, 123, -60, 34, -40, -182, 120, 33, -85, -278, -158, 198, 115, -89, -8, 39, 184, -29, -389, 55, -34, -122, -142, -92, -98, 99, 17, 220, 101, 41, -273, -274, -119, -120, 221, 33, 173, 347]
7261C47o99L64r2N9j0j43P6k30K30J89k09J78l02J89K32l54P1j5K62o0j77O7j97
7284b24N09k37m6J03k29q3Q2M2K78l39K41J5l05K73R4k41j55M19J24l6j55j02
7306B8J32j12O3k06J13J45j8k4k10K73k50L00k44k47M53j91k7R4L98l41L8p6j79
7329h8K28k38P3m25M34K50j00k57k63O39k3n07J15R7J36J53m65R2Q8RJ34N2l52
7352b18j1M44j17K2rN0j78K18k15j92MJ54k47R8R7k34M53j17J24l00p5k16P16
7375B51n7qm56J63J7qn8J7J62J23j62k77J5M96J5p45K7K07L97L2m59o1K37n1J38
7400d5j39M11p8j93j96k29P48k68j52K23n3j75j49K69J16k48J55j2Jj38K95R8
7422B41l50O5j27L65j16j6L7k78j38L62j36J95K35o7m57m8M99J12Jk24l96L29
$$ y = [347, -352, 12, -80, -21, -31, -174, -98, -328, -98, 91, -118, 60, -242, -53, 179, -175, -104, -119, 143, 83, -94, -27, -224, 285, 48, 2, 105, -124, -207, -125, -83, 195, -144, 97, 112, -193, 80, 174, -67, -222, 197, 321, 285, 130, 28, 160, 48, 111, -95, 18, 163, 145, 121, -89, 184, -66, 234, -10, -257, 196, 5, -22, 72, 470, 129, 167, 91, -88, 140, -98, -25, -450, -16, 234, 134, -123, -386, 253, 230, -277, -162, -65, 71, 224, -241, -149, -61, -52, 82, 134, -218, -229, 215, 98, 120, 111, 161, -17, 201, -14, -206, -202, -48, -295, -197, -100, -334, 119, 2, 126, -174, -249, -465, 251, 194, 186, -270, -107, -90, -98, -156, -139, 23, 146, -16, -293, -278, 218, 233, -512, -485, -278, 119, 151, -308, -369, -132, -183, -45, -184, 227, 149, -44, -240, -469, 279, 11, -141, 82, 29, -146, -295, -26, 90, -158, -3, -15, -14, -152, 143, 241, -109, -44, -171, 194, 78, 62, 99, -179, -317, 45, -91, 104, 339, 272, -185, -233, 266, 378, 379, 155, -241, 88]
7444H8P5l58K76qj77j40J15J19j4K2k1q0K65N7k3m82J96K34j54J6j91K89j12O9
7468F1l17K75mQ1j56J13j20j94M06L9r5o5Q6o0l08M19k2P0m48n4K81j04J58l8
7492Dj23J12p3l15K70M92l84J80l33J90N6L2k98K05K14l56j39M48k3J75j76k32
7514g4P6k56L53j56J15m1l14M97m02M1N95j79l35l37K64K37L34n97l44M87l4j46
7536b16L55r0n5q7j19N04k71o6M5J88k24J22lO1J6j29K21l83K56J62k65L10m48
7559a16j47M23m74N33j87j5j49L48j3m03K80l5L43l99J91l0M3k7k3j50r6K9J75
7582A01n0k23J63o2j41J01K76L33n83l17L59O9o6J63o3j86l4J37o4O1M41j27m66
7605a78k23M65J82M3l72oL4k61j98M35J40J73m04j61J81J39J56n6j49J01O5k86
$$ y = [88, 163, -195, 81, 73, -104, -244, -129, -10, -24, -2, -23, -103, 162, 219, 196, -286, -90, 144, -10, 6, -185, 104, -8, 61, -256, 19, 15, 96, -60, 53, -67, -261, 145, 184, 89, 24, 110, 50, -258, 161, 139, 209, -239, -293, -12, -116, 42, 4, -119, -7, -80, -395, -125, 367, -17, 163, -170, 20, 76, 108, -190, 15, 229, -127, -266, 182, 159, 334, 158, -74, 2, -254, 99, -57, 58, 17, -297, 200, -202, -161, 434, 255, -80, -417, -153, 84, 418, -179, -523, -36, -70, -216, 139, 49, -6, -93, -212, 292, 21, -45, 0, 188, -36, 86, 83, 144, 160, 31, 252, -131, 125, 287, 22, 332, -116, -263, 160, -314, 219, 32, 17, -132, 216, 203, -200, 80, 45, 388, -11, 180, 150, 193, 166, 143, -7, -103, -74, 101, 51, -172, -9, -71, -212, -111, 165, 498, -85, -402, -43, 26, -40, 123, 60, -126, -160, -23, -87, -26, 415, 288, -178, -401, 64, 246, 289, -83, -89, -55, -316, -514, -79, 61, 234, -170, -331, -150, -11, 145, 89, -60, 41, 106, -180]
7627a80j47N66j57j47l7O2j37K71j13k96L49k45L76L3l22K80ol84j17N22k19j26
7649a74M7K40m4m8L39n33J36Mk21L10N8L8r7k76K69k46M26k50L30k11M5j43o2
7672f3P5KO0J41N7l90L58j30J97l13j64J88P2m22K50M04j63j70R6k48J36k7o3
7695a17k25N36j69M8k81K13k74j4L47k86j0L52l52M3K77m6K62j15l67Q8k7L2L13
7718B28r1k02j90N74n02j12M44L7k99K02L0j83K51j84j50R9L39l8n21L30Q8j26
7740B4l27L18L2j20J56j18K01j85K40K5m72J11r6J42j74l1L84p8k3rJ18j32J26
7763A12k67j07J98j14K59k23P3J02NJ22k3j39q8K07o5k92L53O4j71N6O7p6Jn3
7787Ao5Q2oj73N7J98Ml70J90m1J50k1J42ojm5n5l32K27O9J87j42k6q9L8j19j22
$$ y = [-180, -327, 239, 82, -65, -102, -40, -177, 94, -19, -315, 34, -211, 165, 198, -124, 156, 150, -234, -351, 171, -48, -174, -127, 113, 69, 21, 360, -173, -37, -33, -254, 56, 114, 152, 55, -221, 48, -198, 228, -22, 308, 97, 142, -1, -63, 12, 14, 74, 215, 272, -118, 240, 110, 307, -6, -170, 18, 90, -332, -82, 322, 159, -11, 85, -163, -27, -54, -117, -342, 194, 25, 73, -208, 5, -269, -283, 64, -222, -232, 120, -232, -189, 88, 42, 304, 189, -178, -90, -117, -85, 228, 137, -65, -255, 319, -183, -295, 149, 186, -113, 89, 119, -64, 187, 3, -147, -48, 291, 253, -268, 62, 150, 24, -303, 15, 47, -73, 83, -35, 166, -19, 221, 246, -226, -115, -211, -69, -243, -274, 110, 32, 9, 0, 118, -14, 112, -155, -262, -64, -178, 81, -142, -69, 33, 38, 160, 137, -2, -90, 117, 52, -240, 113, 177, 6, 62, 129, 53, 54, 1, -64, 18, 12, -161, -104, 94, 98, -272, -82, -123, 27, 6, 148, 142, 141, 96, 41, -291, -64, 5, 192, 50, 24, -65, -27, -146, -268]
7814b68O0Q0M03l15j65N1Q8K10l09JJ60J24k75J03k2J73k32J47J73k25K58k97
7836g7J82J0LJ71l64k43L44L9k7p1p1K33J6m2l47K67J9j83k5o9L14J32k54L8r8
7861a03J48K11j24j90K30o1m36K17j46M42m05K98q5L32m95K68l41m00M78J0L91
7882B39l07J6P6r0P2j43K51q5J72R7k04j05R0j44R3j21K79m03O4L49k68M50n41
7905a63J47j64Q2K87k34K19k46L58o39K29J81J40j84j00J92P9O5n7m93O49j07
7926B41l37Q5k5L97j89m06J98Q7m0Q9k04L9O6o1J91k24K28L1k19l14M54l60N95
7949C22l19R0j30R8J23j84Q2j31L23l90nM21j53l04K0K5J30J03n0l4p6Q3n6j97
7973b09M8N46l83J51j96l4K82m38L80l86K96j72l9r5j7p6M11j54K98m68L9M24
$$ y = [-268, -208, -128, 275, -40, -205, -154, -66, 144, -165, -164, -4, 120, -155, -52, -74, 99, -133, 14, 187, -38, 220, -77, 105, 115, 118, 289, -75, -318, 26, 65, 38, -33, -104, 129, 145, 103, -244, 23, 42, -141, -166, -235, 79, 211, -43, -5, -103, 45, 256, 132, -58, 172, 111, -325, -108, -254, 188, -217, 81, -4, 328, -167, 101, -240, -640, -162, -152, 239, -68, -52, 24, -66, 6, -137, 114, 29, 201, 298, 94, -11, 79, -65, 28, -93, 186, -217, -153, 196, -72, 378, -163, -16, -180, -98, 189, -45, 174, -72, 286, -353, -124, 57, 197, 13, -87, 105, 184, 249, 192, -301, 348, 241, -96, -11, -36, 361, 172, -234, -36, 51, 11, 100, -104, -65, 1, -60, 131, -93, 135, 166, -53, -367, 87, -273, 322, 3, 93, -37, 61, 184, 0, 82, -49, 274, -116, -121, 300, 147, -157, -137, -112, 18, 121, 71, 37, -39, 44, -12, -209, -161, 385, 2, 153, -43, -77, 205, -233, 147, -239, 57, -115, -154, -249, -266, -342, 69, -85, 213, -255, -216, 208]
7995B08m23l4K1N3j12K56n3M8N1j94Q1R7lo5q9q0L50J53m01o7J43J12j02P4j48
8020a24L29k41k0J88r0j56K08k84L18m0k05r3L35j91J10Q9j08J86rL7k47J06Q6
8043A84j5j82J69kl4j33K0j93M08k33J49l94j03L72r9J95k24r4K81R4k10J25J20
8066B01J85k44p5J47j70P9k22nN09n84K44n1j57K37j42j73K11p1J55J85k61K22
8088B20m6P1l75K75j31o8M3K7L63k58k48n3K8K48J30q3l99K07j7k4J34l33J11
8111a78K56m5k99L29kj28K10k05k35J34J19N8k51L64J23k13n0K10%l01l9J27J69
8134A53m75K92n84L29L95l02J39L8K93q3l47j15J49K35J95l23J22P6j14r3o7K39
8156A52J3l02K96k7j21J37l27J92J6m98P29j66k75N28k29n4m0l97N68j95J55j71
$$ y = [208, -215, -249, -228, -175, -287, -31, -84, -36, 15, -179, -98, -1, -4, -69, -158, -238, 112, 265, -136, -203, -60, 52, -50, 24, -124, 205, -36, -56, 132, 42, -114, 94, -190, 128, 88, -117, -210, 125, -66, 44, 133, 25, 211, 202, 239, -8, 98, 184, 169, -13, 156, 154, 120, -13, 7, -186, 222, -11, 138, -256, -359, 13, -86, 109, -115, -209, 72, 166, -44, 81, 201, 386, 142, 67, 214, 44, 123, -99, -104, 405, -179, 65, 14, -143, 94, -48, -221, -10, -81, 74, 259, -2, 220, 174, 245, -130, 145, 14, -54, -11, 16, 379, 121, -127, -180, -152, 96, 226, 143, -256, -49, -66, -90, 44, -289, -178, 78, 33, -266, 63, 61, -67, 143, -62, -297, -163, -44, 14, -237, 127, 250, 37, -13, 197, 197, -104, -143, -16, 153, -322, -30, -614, -285, 110, -192, -53, -15, 278, 195, -152, -267, -118, 117, 312, -11, 111, 187, 73, -20, -87, 152, 165, -137, 159, 132, 11, 148, -179, 13, 29, -469, 260, 94, -181, 347, 118, 64, 24, -373, 195, 0, 155, -16]
8178a6kJ72l2M3R1J69m19K06l49L93R4J39o27
$$ y = [-16, -18, 154, 122, 165, 256, 425, 6, 212, -137, 256, 350, 489, -138]
8191a38
$$ Imaginary data points
##PAGE= N=2
##DATA TABLE= (X++(I..I)), XYDATA
0@%%%qJ6j6J6k4L2m0N6p2Q8j04J28j60J92k24K64l12L68m32N00n80O72p68Q72
27D64r94J130j280J443j621J821k038K276k539K827l143L488l866M284m744N250
43B758n813O440p139P926q822R846j1027J2411j4064J6076j8581K1806k6138L2300
57A7979m1831N8665r7057L33993K4101p25194J92694M39602m3474l21109J82739
68B1108K05912k39500k74265K53684K58097j65671k15826J41723R9852j59757
78g4643n6687K30502P2643k18317j17837J57400Q5251q8220l579J17940m3181
89F1272j76613L29J96986O2690j40646q5974O4890L3300l8186K6733O9499m9541
101B4739j13931R946J02035J7048m6050J5696J8641p5588n2027R5544J00216n2336
$$ y = [0, 0, 0, 0, -8, 8, -8, 8, -16, 16, -24, 32, -40, 48, -56, 72, -88, 104, -120, 144, -168, 200, -232, 268, -312, 360, -408, 464, -530, 600, -680, 763, -858, 963, -1075, 1201, -1338, 1489, -1654, 1834, -2032, 2252, -2492, 2758, -3055, 3385, -3754, 4172, -4650, 5196, -5831, 6580, -7484, 8592, -9989, 11817, -14321, 17979, -23852, 34813, -62244, 271749, 295850, -429344, -236650, 202952, 159478, -161631, 21108, 227020, -12480, -286745, -33061, 225036, 59365, -156461, -14738, 85114, -74643, -131330, 99172, 171815, -46502, -164339, -6939, 78312, -9908, -13487, 104453, 61272, -115341, -115012, 81974, 144664, 4018, -81956, -17066, 16234, -21952, 4781, 74280, 24739, -89192, -79246, 22789, 39837, -6213, 9483, 28124, -47464, -99491, -3947, 96269, 43933]
113D3933q9896J8862L7507l4095J163Q3915J3308j03664n0394O5679M5627k0922
125A1023P907K0829o0357p1014N2058J00918j2543q2658n590M7104j2364l5372
137d0059L4614N0829k9879n6582J3507M6754q73k2202J3342J1222l6988k6130
149d2445M7971N5605l2701o9824M172N4956L282l5726Q749L0598k3664m1131K2854
162a7304M7363j2744m0144J0754L1937j5038k5929J9378K5745j7673j7693J9346
174G998P635k5549j599L4701M412l8291j2319K9516J3999j6349o397R165p554
187f32j4820P969K0143O59j1180o41k355j2632J291K4187J0893j8304j2952J1079
201B705M713j6997m277K7018J6047k5730k8713J3877K9274l949k2607O60J3034
$$ y = [43933, -45963, -27101, 10406, -23689, -22526, 61389, 74697, -28967, -79361, -13682, 31945, 11023, 18930, 39759, -20598, -91612, -39554, 61364, 48821, -33837, -39427, 7677, -4687, -40059, -5445, 45384, 15505, -41077, -27570, 19184, 18311, -3891, 9451, 20673, -16315, -42445, 5526, 61131, 28430, -41394, -37222, 17734, 21016, -14710, -5961, 24637, 973, -40158, -17304, 30059, 17315, -22829, -12075, 19862, 4824, -21105, -1727, 24018, 6345, -11348, 7998, 15633, -9916, -11515, 23186, 27598, -10693, -23012, 6504, 20503, 4154, -2243, 6922, -632, -15452, -7483, 12660, 13319, 2139, 1498, -857, -13489, -12198, 11989, 22882, 4578, -8374, 2705, 7418, -9579, -13856, 13162, 29209, 3479, -25234, -11357, 17917, 13968, -8639, -7979, 5055]
214E055p556r553J6406J5826j5358j9746M169Q198j622J1244J9625j4803m1021
227b9136k178M2046J5388k6881r571J7073q242k4841J4189L7629m573l7185j0985
240b7267J7247J0482M310R796p180k7574m858K6041J2056j1331J759J0168k1211
253g562k7812K3201M6645l558m3492j6592J7251J2024M291R256k211k0309j3780
266b2648O078J1524J1921J2554o220l1041j7006K8050L3407o631k5378m635N188
279d837j928O758J9527K142k4245j8820P395J9064J2373m68j3587j8046m805J1535
293g942J4940N735m270r412j0922m236J0013J8723P995j1784k0192n449J7593
306G92K0162l90j7511r072L471K151L471J2032N109j6002j8933o37J3522J2856
$$ y = [5055, -2501, -12054, 4352, 20178, 4820, -14926, -10757, -2559, -4181, 7063, 26688, 11885, -29136, -31314, 10732, 26120, -761, -10332, 6741, -1501, -26342, -12153, 25476, 20903, -16282, -27267, -10020, 462, 4772, 14568, 7388, -20186, -25044, 997, 13053, 1722, 3481, 13649, -7562, -35374, -12173, 34472, 30914, -12578, -29170, -11919, 105, 4396, 13652, 11441, -8868, -22648, -16570, -5046, 6875, 19429, 13209, -17832, -34838, -6788, 26619, 19988, -5390, -10025, -4837, -6765, -7, 19520, 21662, -2583, -21403, -14008, 5056, 17429, 16961, 3374, -14672, -19477, -7942, 6998, 12733, 8463, -949, -11871, -16107, -6094, 12629, 20624, 8840, -11352, -16801, 792, 20954, 20564, 3053, -6019, -2548, -397, 3074, 15106, 20215, 4213, -14720, -15357, -1835, 11021]
320A1021N945p091k0225j2658J1864K1090L823r373n217m007p005M250K1943R684
334B4044k0289j9819Q973J7699K116p387j923j935n870k147P596R420j050j3541
348d113j1295K683J2940R432m549j3095p030O202J1738L874o943n825K713M366
362A098j428j120N668K466r328o690J0727J0982q261j2349J677O128k063j539
376d032O055J492q986o265K712M891L107L558j529j0502m087J3366J2157q836
390C101j4220M450J2341j287p181O526Q986j0571j7616K648K1588J0300j2810
403F255j4748j346K523K652R386Q571r663j7470j067J3387P416J142K410o650
417B798j8927k780K7881K1630j7557k5952K820J2919l031J993K0189L69l3332
$$ y = [11021, 16966, 9875, -10350, -23008, -11144, 9946, 13769, 4396, -821, -4828, -11833, -7583, 14360, 24044, 3755, -16064, -7091, 10608, 12724, 5337, 3414, 1479, -4391, -6538, 1058, 10478, 9428, -4113, -15408, -12725, 215, 9647, 5098, -7997, -15027, -8825, 2913, 6787, -156, -5981, -3268, 1098, -330, -1450, 4218, 6684, -2644, -9334, 1393, 12375, 4114, -8235, -6558, -430, -2493, -4032, 2023, 3515, -5471, -11736, -9024, -4133, -1026, 2532, 1003, -9499, -13586, -220, 11937, 3101, -11119, -6669, 5672, 4385, -2796, 3730, 12716, 2145, -15471, -12823, 8765, 19065, 6255, -8493, -9839, -7316, -4664, 4722, 13293, 3630, -13840, -14907, -1520, 5896, 7038, 9448, 2798, -16129, -18909, 8972, 30602, 13045, -12907, -10087, 2832, -199, 1794, 21983, 22352, -10980]
430a0980j8479K3857K6865j968j3298r796j1980m847K2661K4753q276k6792p017
443a5297P159R47R306K4468L8l9130k2882K8106L4039l953j9962o347k925o683
457a3116P927K3540P577k1899k3370j169J4838J6090Q378n940k0341j4757Q354
470a3888J8190Q086l670m969o721j2131l014J9953K3842n683l2194j5784J8363
483i620K0965Q24n270k833j3794j6234J1213L1744R404k2649k2633k299P200J4018
497C6K0904K632l0706k5000J4664K7406K809q051K450p450k2106O06L2751J7565
511B8510k1961k2432K192P105J500J2330J3676j3691k8640k530K3045J2581k702
524H983o66m877j9226p446K2771K2632p392j8661m808J883j159R118J7140l417
$$ y = [-10980, -29459, -5602, 21263, 19295, 5997, -3799, -15779, -20626, 2035, 26788, 18512, -8280, -15297, -8138, -7191, 2115, 26583, 26621, -12509, -35391, -7285, 26754, 22801, 2839, -3508, -6433, -13116, -5189, 18351, 25928, 4029, -19341, -20510, -5672, 10418, 18796, 12856, -7485, -22242, -13888, 4302, 12388, 8718, 3749, -2972, -15103, -18117, 1836, 25678, 19995, -12199, -27983, -9620, 11345, 12169, 6899, 4066, -9728, -25962, -14749, 16995, 26399, 3750, -18883, -21182, -13982, 36, 20940, 23572, -7134, -32134, -17470, 9936, 12745, 4694, 7144, -306, -22412, -21806, 10945, 28510, 6549, -15883, -13691, -6586, -5086, 7244, 20920, 7229, -21411, -23941, -896, 11685, 8983, 8317, 3440, -15786, -23232, -461, 22171, 14779, -3882, -8690, -6807, -7966, 1152, 18292, 14875]
538A4875k4710j0027J7899J4240n530m482K282q690j1914J0628K1747q89j7920
551b491l880N631l357j117J6759R118j9573j7831J1961J6736o308p144J0647J288
565A0439j9785o886K0067J3200j0389q244J304o291m575J4102J3373j0571j3842
578h098O277N156j0418N55K2005L699k7959j1772K3629J5061j5500r594J0926
591C967K272j3439k122J2607M346m131q83n423j2585K564K2530Q630j9863j4339
605a5869J0959Q654q930k054J6377M494k0379j2682J4078J8010j023j1583q138
618h086j782M982R172M560n621p359j045j816m475O916J8636K476k4301j7859
632b5602J3898K0944J23r520O05K29j1518n032J7317J8445o953k0627q470O236
$$ y = [14875, -9835, -19862, -1963, 12277, 6747, 2265, 4547, -4143, -16057, -5429, 16318, 15429, -2491, -6371, -740, -4097, -5214, 11545, 20663, 1090, -16741, -4780, 11956, 5648, -1496, 9151, 10439, -9346, -16232, 3835, 17035, 6646, -1598, -294, -6585, -11160, 2942, 16315, 5744, -8098, -1821, 3335, -7083, -6528, 15477, 19176, -8783, -20555, 3074, 18135, 2635, -6959, 3967, 6239, -7200, -9322, 3285, 7631, 3500, 2617, -2806, -15391, -12827, 9703, 18333, -1530, -15869, -4910, 3744, -5186, -7240, 9137, 13631, -6748, -19430, -5352, 12658, 11635, 52, -8086, -9868, -4886, 4286, 8846, 3225, -4134, -5179, -6995, -11470, -4554, 14082, 16558, -7743, -25602, -11704, 9240, 9363, -157, 448, 677, -10841, -15873, 1444, 19889, 12936, -7691, -16161, -9925]
646i925J1369J1904L443j6156j8626L262J7576N961l148K049l630j9519q720K3586
660e74K5870p342k5950r183Q225Q030Q423R203m309j9509j0341J0097J5729P809
674A6178K22j1853j8995n389J9865K0960j401j7143j2324l070M385J2908J2934
687A7277j937j7140j4581R89J3282J5935O490j1720k1404p383J5413J7594N220
700A8035o440j2155j3731j838J7405K0168j911j9797j4797Q74J1085J3371P770
713A8039p845k1043j0851J1770J9804P035o775j3542j3199j527J6981J8567j83
726A7231j6490j3165j653N423J1644J3815m99k0971j7121P403J9153P512m179
739H103n825r943r576N769J9196Q017j1471j2974l502J325P171J3973N940j5486
$$ y = [-9925, 1444, 13348, 16791, 635, -17991, -14729, 2847, 8808, 5660, 7709, 4079, -15440, -24160, -574, 25296, 17954, -7996, -17179, -8954, -924, 7499, 16702, 12393, -7116, -17457, -7360, 8369, 16178, 16400, 4547, -14448, -19837, 28, 20988, 19587, 2444, -9880, -12950, -8565, 4343, 17277, 15340, -1800, -16381, -15392, -2110, 13825, 20315, 8595, -12809, -20192, -4779, 12815, 18035, 11595, -560, -14291, -16129, 1276, 21444, 19533, -264, -15061, -14187, -3102, 10269, 18039, 10194, -10849, -21700, -9930, 9874, 16909, 10134, -3408, -16607, -18134, -1153, 17414, 17231, 741, -12424, -14077, -8654, 2990, 16805, 16306, -4665, -21786, -14383, 4770, 12282, 8103, 2278, -7665, -17241, -11472, 7724, 15741, 4270, -8704, -12206, -10881, -3710, 10263, 16203, 717]
753G17j9748L332J9149P790o490l375k193r601l239J4553J5858o000j7468p551
767a4266M906R316R654K510j2014j5108J792J5474P001n011k493j76q853p248
781a4516J1495J9509o72j9226j1112P373J0420L585j063k305m404m337R59N180
795H86N284J185m463q410k948R024J0529k631j2030l912P434O595k210m927M12
810a82L395k194l978K901Q046j421j0344m051R425P803m234p322j479L333K222
825A920M6l77j16k75j57k457j697M163N567k847r038K62R218K195p634l330N375
842H18K797l974j781L105J685l513l379K170N055P22m383n217M25O310M652j644
858C848n837l968N5L828M804J614k562l235l620l410M196J0430L876j0398j0033
$$ y = [717, -19031, -15699, 3450, 11240, 4750, 1375, -818, -10419, -13658, 895, 16753, 10753, -6715, -14266, -9360, -44, 9610, 12120, 106, -15002, -13210, 2264, 9265, 4254, 1761, 1585, -7268, -14516, -3021, 16488, 15816, -3410, -14522, -7149, 3271, 6856, 5793, 3488, -916, -5253, -4294, 886, 6170, 7355, 2892, -5518, -8466, 558, 11087, 8456, -3574, -7486, -52, 6543, 4333, -594, -182, 3213, 1019, -2959, -58, 7988, 6567, -3777, -7828, 1597, 9400, 5166, -2156, -3635, -302, 1920, 1966, 1589, 1473, 1198, 1041, -1416, -3113, 1050, 6617, 3770, -5268, -5006, 4212, 6407, -1227, -4557, 818, 3615, -359, -2140, 965, 2650, -863, -4242, -2072, 2983, 3705, -678, -5895, -5470, 840, 5492, 3848, -1989, -5957, -5902, -2074, 2730, 4344, 1782, -1453, -5073, -8483, -4287, 6143, 10019, -379, -10412]
873a0412K418P514L046Q96N1n674p179J908R296M082l237l791l374m141L476J1474
889F353L527j2037p348O205M760k966K240O753m272j3735n67J4987P687p758q880
904e051n62J709J791N772M476m468q643k344M371M512N212K553p557j1817l5J2972
920B891R058l642r355m037R88J959N396O327j423j0089o460L817Q914L402j515
935F231n647n793L52O709L992j786k196o27l520l625N738J0187o24j3007n455
950i071P941P628j960m075O11j488k423J873L866N84r71j418m849k058O726P670
966H586m118r858p18P034K017m002P14L100l423m819K029O227Q67l550l025j325
982d264J510M513J725n010l019L003K734k389j085L269M54m578l068N354N448
$$ y = [-10412, -7994, -480, 2566, 3462, 3513, -2161, -9340, -7432, 1864, 5946, 2709, -1082, -4456, -8597, -5121, 6353, 9880, -2157, -9505, -3300, 1460, -1506, 734, 7487, 3215, -10520, -11087, 3900, 11587, 3829, -5051, -5613, -3904, -2113, 3659, 8135, 3667, -4976, -7320, -2949, 1563, 6775, 9328, 1771, -10046, -10081, 2891, 11949, 8307, -1048, -5085, -4097, -2138, 3258, 9585, 8162, -1927, -8387, -4570, 4344, 7746, 6231, 584, -5209, -4857, 1852, 5844, 4058, 1862, 1235, -2285, -5910, -172, 10015, 9391, -3616, -9071, -1130, 6498, 4538, 463, 1074, -414, -2837, -964, 2902, 3486, 2515, 1097, -3752, -5810, 916, 8586, 4468, -5390, -6108, 926, 2943, -1059, -345, 2755, -668, -5487, -3458, 2769, 3636, 86, -2939, -4264, -2754, 1759, 3484, -1526, -4545, -1542, 1192, -1197, -2282, 987, 1441, -3137, -6205, -851, 4597]
997D597k401o707j393M512M175m28l852k532J834K440j239n86K529P69m355l146
1013e783L353N719J501m781n464n80O151M830k089n071rJ501j695j147O613O025
1029I074p291j2099K187J2926L551o617m129L58j313M11O087N482n233p372j250
1044e228K770L917N379K391q953j0316L405J2513L132o654k370J537n335l770
1058g582R295J0897m342j3012m014N720N964L458J912n666r474j815J0098P407
1072H846k567m299k271m794l303Q935J2479j874j4811q228O619Q392K581L18j500
1087D523p250q004L187J2676P019o193j0353n670J782R268R478p89j1485r081
1101a0892L383P434M172J986K06p511j1288J012J4826R960o870j2088m086L139
$$ y = [4597, 2196, -4511, -5904, -1392, 2783, 2355, -1497, -4029, -2195, 245, -994, -1580, 949, 1718, -2637, -5783, -2430, 3289, 4790, 9, -5455, -6035, 116, 4946, 2857, -2214, -2223, -722, -2417, -3564, 3049, 9074, 1783, -10316, -8129, 4797, 8348, 1731, -2398, -2040, -3353, -2942, 3145, 8627, 3394, -3978, -5228, -2458, 1459, 6838, 9229, 276, -10040, -6635, 5878, 9010, 2356, -14, 1523, -3812, -7582, 1713, 12610, 8268, -4744, -8758, -3038, 2926, 6384, 8296, 2630, -6844, -8659, 1439, 8846, 6279, 1980, -291, -5085, -8388, 547, 13026, 11152, -3659, -11887, -5268, 3124, 5705, 6023, 4523, -2727, -10731, -7544, 5132, 12151, 5958, -4395, -10065, -8283, 985, 10463, 9674, -1811, -10892, -7509, -75, 4097, 6083, 6289, -1222, -12510, -11498, 3328, 13288, 6418, -5670, -9756, -6617]
1115f617M716O071L972n273r588l752N201P500M576l60p370r271k36J0021R524
1130I114j948q129n210j261J706P277P477k182j1027p080L507R386P103j264r082
1145a613p818J609Q285N411p56k715l602m602k243P328J0485M33j1451q217L292
1160f174Q012M993p88m472n750r54L580M416K286O78l786p561l249Q384J0664
1175A0279j662j0215l754M775P99j814M535O126m830j0979l99R721M974l195m028
1190C33k005j732L109N635n82n556j274M002j571m872N035R098n120j1720J044
1205f176J0767Q99o660n78N121k010m905J401M379n03j255J126j959m628L082
1220a899P098j664p949M01O124j807m588L721O728m652q233J370P079J738l534
$$ y = [-6617, -1901, 4170, 8142, 2869, -6719, -10471, -5270, 2230, 6806, 6446, -924, -10195, -10431, -410, 9114, 7166, -963, -6173, -7434, -5728, 1549, 9026, 6844, -4183, -11263, -7756, 1630, 8733, 7469, -1613, -9431, -7822, 463, 5874, 5118, 2403, -1199, -5801, -8044, -716, 9769, 10202, -1249, -9466, -6174, 1838, 6831, 6043, 1571, -4179, -5133, -1553, 2863, 5149, 5827, 2041, -5520, -8769, -385, 10279, 8617, -1598, -5352, -577, 222, -1592, 2943, 9069, 4239, -6740, -7139, 2582, 7556, 4361, 333, -1672, -3404, -295, 5340, 4758, -798, -2072, 1930, 359, -4513, 522, 9620, 4500, -7220, -6176, 4591, 5490, -1170, -1748, 3373, 1363, -3542, -2141, 2238, 1735, 480, 1606, -353, -4981, -1899, 5199, 3535, -4414, -4013, 2111, 304, -4284, -563, 6165, 1513, -6720, -5350, 1729, 3467, -67]
1235f7r03N66j831r41K956J806o66l40r52l341j491M561M726j451m679k118J81
1252c984J372K967K567j53m445l846R0M739M621m11l972l513Q5K523K810J563
1268C013j108l261k243O60K977K772J436k740n588k430N195O769q30m740k573
1283b691m18l58K724N921J274n656o436Q9N828N087J488m072n940j856L126N080
1299C190K732l2m578p911j875Q825J0270j401j0237n535J925L268L441M595M0
1314F717o633o321N65N950N970J655m817p324k639O614P428j143n780k063J39
1329a682q08J395N943K594o527p431R3O156N722K11l994n648k881L622O334K138
1345E237k432l355l068k608K314R345N105q734j1435P64R606N134k321l032j204
$$ y = [-67, -970, -404, -2235, -3176, -220, 1586, 920, 580, -372, -3713, -5204, -643, 4083, 2632, -2047, -4165, -3984, -2612, 355, 2922, 2769, -1676, -5522, -5432, -693, 3928, 3517, -455, -3968, -3883, -1360, 1450, 3013, 1905, -1356, -3599, -2939, 38, 2810, 4246, 1506, -4082, -6512, -1317, 5452, 4622, -118, -2691, -3109, -3467, -743, 5178, 6452, 796, -5640, -5551, 277, 5364, 6852, 2780, -3160, -5016, -1890, 3190, 5922, 5890, 1312, -6599, -8474, 351, 10621, 9220, -1017, -6552, -4627, -1359, 2082, 6677, 6717, 84, -6237, -5672, 278, 6248, 7903, 3086, -4238, -6877, -263, 7165, 6022, 242, -1821, -1682, -2490, -1095, 4848, 7442, 915, -6516, -6423, -267, 5455, 5666, 1672, -3976, -6857, -3235, 3099, 5237, 2805, -550, -3618, -6226, -3912, 5433, 10538, 1804, -9631, -8867, 739, 5873, 3552, 520, -684]
1360f84l329l110L984Q251K039o593p117j547M625P267L374n316q046n50M867
1375a885K810P02J346o35n548m907L960Q371K988n933p366n77N479N382o14m365
1391g92k344J378j45r18M325M187l188q257j352O497N907k33l671m075k315K882
1407b114N010Q10k149m47m05m315q47P379N787o398q372K703O562p32k984K469
1423A957R71n062k243N817L647k895k219L44j433j195M222N038m474o391J938
1438a978N358p15m299K975L068m460m106M271M762k083m595K6K174J61K77J980
1454B816j150m180n39M488J868k720j264J573l41l347J483M561m03n052n45M381
1470A629O23l249j257L303Ll528O13M107K52m585j431K746J944k15m23n31l007
$$ y = [-684, -4013, -7123, -3139, 5112, 7151, 558, -6559, -8106, -3481, 3786, 7160, 1844, -6202, -6752, -1885, 925, 1627, 2973, 2338, -3210, -8117, -4157, 4214, 7202, 1269, -6097, -6674, -1195, 4187, 3573, -792, -3136, -1758, -1903, -2821, 1504, 5691, 2503, -5754, -7106, -609, 5298, 5065, 1394, -2681, -4996, -2114, 2896, 3706, 1557, 1110, 705, -3610, -4457, 2922, 8709, 2311, -6061, -3358, 3204, 2472, -512, 1957, 2928, -2134, -4377, 1440, 5087, 2192, -27, 317, -1116, -2311, 1911, 6949, 2475, -3916, -1978, 3380, 2665, -1634, 1341, 4409, -51, -4157, 114, 4876, 2793, -1802, -1776, 398, 559, 836, 2816, 1666, -2514, -3053, 1435, 3303, 583, -681, 892, 551, -2796, -1313, 3248, 2845, -2207, -2752, 1629, 2252, -997, -2254, 1049, 1052, -2476, -1863, 2244, 2496, -2089, -3520, -774, 1170, 955, 532, 1, -3006]
1487c006m06L555K049j628k351Q74k52j915J413M761K2o102k896N292L343k218
1503E35k138P69k72j782R17L553R73k513k524q93J350K998K442r53n011k200L306
1520a443L606o22j281k11o14k360K28M585K626k837n178q23L843M362L3k989k998
1537b073j73J189J738K000P12o84m216k993K409O358J587l981m585k26L290J596
1553A948j52qO4k335k512J162M765K417k909n222j500M176M629o9l870k362M02
1570a376J007R99K023J417j860m610k098L905N093J01m427l145M07K261J548J47
1586A392j152J6r20j832M75L906K391l608m801J124M282K113k409k531N40J137
1602A23q03q48K189J585j680l422r44L304K505j131k979m86K001J50j88k87J87
$$ y = [-3006, -3412, 143, 2192, 564, -1787, -913, -1165, -3080, -1667, 3094, 3116, -2986, -5882, -590, 2753, 535, -1603, -834, -1106, -2888, -1971, 1582, 2555, 42, -2482, -3375, -2025, 973, 3415, 2462, -2549, -4749, -1443, 2163, 1541, 260, 49, -565, -2925, -2697, 1888, 4514, 1677, -3501, -4324, -481, 3881, 3914, 925, -2073, -2246, -1057, 681, 2681, 3393, 2709, -1507, -4500, -2091, 4267, 5854, 1873, -2712, -2938, 352, 1948, 1796, 1788, 1852, -483, -2995, -1833, 2932, 5349, 2440, -2782, -4282, -106, 4523, 4454, 584, -1778, -1376, -369, 630, 2653, 4070, 2210, -2400, -4498, -593, 4500, 4601, 174, -2971, -2564, -303, 1245, 1392, 240, 256, -664, -2496, -2021, 1885, 4276, 668, -4133, -3009, 1273, 3386, 977, -1554, -1014, 123, -680, -1528, 661, 2246, 566, -2856, -3800, -496, 2009, 878, -2101, -2587, -586, -436, -624, -911, -724]
1619g24K82l12n83M8J947J260k975k898J594N139l70m250p58K176N43k073J140
1636h14K361j213l048R24K250k04j197O50j127j687L033M086k307n911J058M783
1652A637P24l157Q07K950k817l747K000M962J00l368j504L5J66K485K411k326
1668A358l754J62K644N80j25K229j30n212l212M503O272J32n166l418J403K148
1684D14J605J356k10k643k908q0K569M003J135l568n580r11N032M394q21l644
1700A43k004K58N06J112K812J116l019m815l81M377M649K74m262m194n00K824
1716a104L496R90r47k132l391j867K670N501K865n040o540R0M721L760p09j284
1732A079k352k988K58M249L398L64m017m986j399M264P385J130o324n811M90M259
$$ y = [-724, -442, -754, -1337, -1289, 658, 1918, -1057, -3955, -2361, 2778, 2408, -1842, -2600, -424, 119, -1954, -814, 1547, 334, -2714, -1790, 460, 256, -941, -291, -1418, -3105, -72, 4014, 1707, -4204, -3146, 1637, 2361, -796, 11, 2961, 144, -3603, -1603, 3359, 3459, 91, -1413, -1378, -1212, 1273, 3684, 1358, -2396, -2234, 410, 990, 865, 3094, 2964, -2248, -5460, -957, 5315, 5447, 281, -3137, -1734, 414, 2019, 3375, 3165, 522, -2386, -2466, 103, 4106, 5241, 1673, -3907, -4818, 214, 4608, 3787, 143, -1861, -1603, -1097, 15, 2827, 3943, 924, -3891, -4272, 105, 4754, 5028, 766, -3428, -3928, -1104, 2392, 3382, 2435, 303, -3088, -4955, -2285, 3216, 6081, 1041, -5499, -5409, -688, 3072, 2363, 1079, -1273, -4261, -4003, 246, 3644, 4008, -9, -4995, -6394, -2130, 5255, 6385, 61, -5750, -5260, -1001]
1748a001K011M25J579k217n766j426N228N642p77m283l452m16K788M027J510k934
1764I38l436j169J189K299K620K108k919n882k244N189O232j56m740k864K59J008
1780a568J416K881J510l144n134j75M712L575m76k835l177q16K410M163N24l032
1796H34j426k02o29l07L664M012k987p056m85N494L199j858j429l85j929r73K831
1813C68L627m60k713j870j063R20L638K392k847m365K46L070O65j234O59J038
1829B071k588k528K208L390J26k511k180R4R69K121R28j285j131j84k03n31Q41
1846c93K770N9l270j712J429J940m94r32R8L63k98r82K70M67J106p75j460n13
1864b327J632K282j282j995K71J374o21n88P54K282j22k854j844J730K530l26
$$ y = [-1001, 1010, 1435, 3014, 797, -4969, -6395, -1167, 4475, 3698, -585, -4037, -4453, -1665, 2362, 3872, 938, -2498, -3667, -2478, -179, 2441, 4549, 1630, -4252, -6496, -1307, 4925, 4769, 29, -2835, -2576, -1568, -152, 2729, 4239, 1095, -4039, -4214, 498, 4073, 3597, 762, -2415, -3231, -821, 3342, 3866, 834, -592, -794, -1423, -1730, 1934, 5946, 2959, -4097, -4582, 912, 4111, 2253, 824, 439, -1490, -2463, 368, 3995, 3535, 822, -1048, -2111, -1191, 2447, 4839, 1992, -2373, -2127, 943, 1608, 374, 1033, 2071, -517, -3045, -837, 2553, 2679, 168, -2012, -1918, -949, 1172, 2100, 815, -316, -500, -703, -1234, -393, 2377, 2436, -834, -2546, -1117, 823, 329, -603, -505, -142, -440, -1422, -1152, -685, 421, -354, -1814, -2327, -695, 1587, 305, -1690, -1419, -45, -666, -1254, -500, 1782, 1660, -1194, -3038, -1308, 1222, 896]
1880H96r28m22m65k37j53K23P68J491n46k512j460K237L113j12l164j279K367
1897a83J097j202O10J714m32l656j094L180L239r8k862k368M9J821J867n7j182
1914D43n48k77j089p82K864L955j961o044r29M671L568j330k253l16ro97N25K324
1932B115J790j107l600k405J531N158J766l536m623K49L208P64n30J040l3k800
1948a013l044K126M463K194k450m361j768K415M073J447k583k844k79O60O55J529
1964A220K458r52n296k636L538N652K03l847l191m81R28J900K517M54j560l388
1980b481j582J689L516K536j208m379k829K556M130N92k402j465J7p66l68L311
1996H67K688k292m979j573L508L506Q2q22k330k463L30L727K395j428j838j021
$$ y = [896, -32, -454, -919, -1156, -1309, -1086, -318, 1173, 627, -1885, -3345, -1108, 2005, 1893, -1271, -2550, -183, 914, -288, 322, 2036, 1604, -2052, -3146, 34, 3273, 3175, 313, -2055, -2006, -185, 1682, 1625, 443, -105, -382, -1471, -2253, 611, 4566, 2605, -3439, -4368, 303, 3871, 2541, 288, -28, -37, -734, -209, 2115, 3905, 2798, -802, -3207, -1676, 3482, 5248, 1712, -2911, -2662, 546, 1310, 780, 1820, 1787, -1013, -4057, -1931, 2532, 4726, 2276, -2085, -3853, -1438, 2635, 4082, 1499, -1345, -1624, -964, -309, 1220, 3678, 2726, -2570, -5206, -1668, 3984, 4187, 340, -2851, -3332, -2404, -504, 2013, 2467, 907, -2481, -4063, -2374, 1142, 3678, 2470, -1909, -4738, -2182, 1948, 2540, 138, -1327, -1310, -2076, -2444, 867, 3555, 1263, -3716, -5289, -1781, 1725, 1807, 985, -1345, -3808, -3478, 249, 2644, 1216, -622, -1643]
2012a643p86j86L696L525k672n641m49M461K135j430j7L5k985k369L547M355m36
2029C140l348k084J60O49K155K854j524l585p07K220Q33m35J386Q80k865k709
2045b980J624M769K40l866j774K163R69p50L88J118j040k041K12J956J435l56
2061B067j412j847n10J894K729k18k807j465J515O83l10M27J566o17l029j221
2077b555K926K651j431k506q05J660M83k23P3M10n37p01m63P05J217O42r07k521
$$ y = [-1643, -2429, -2615, 1081, 4606, 1934, -3707, -4156, 305, 2440, 1010, 993, 1028, -1957, -4326, -779, 3576, 3140, -208, -2292, -2132, -1483, 672, 3526, 2002, -1583, -2290, -70, 763, 328, 1714, 2594, -271, -2980, -1356, 3413, 3653, -213, -1987, 176, 1145, 395, 783, 1901, 861, -1180, -968, 988, 2423, 2067, 655, -1192, -1702, 192, 2921, 2703, -104, -1569, -54, 629, 319, 746, 2312, 1695, -1334, -2555, 371, 3022, 1591, -915, -1720, -60, 423, 200, 273, 683, 146, -555, -1018, -313, 904, 1546, 639, -1882]
$$ [...]
8191b21
##END NTUPLES=NMR FID
##END=
