##TITLE=1H_Lac-DMe-B1-f5
 CDCl3, 8 sc, 
 22.11.2019
##JCAMPDX= 6.0         $$ Bruker NMR JCAMP-DX V2.0
##DATA TYPE= NMR FID
##DATA CLASS= NTUPLES
##ORIGIN= UXNMR, Bruker Analytische Messtechnik GmbH
##OWNER= root
$$ XWIN-NMR		Version 3.5
$$ Fri Nov 22 16:48:34 2019 Russian Standard Time (UT+4h)  she@DPX200
##.OBSERVE FREQUENCY= 200.1315
##.OBSERVE NUCLEUS= ^1H
##.DELAY= (6, 6)
##.ACQUISITION MODE= SIMULTANEOUS
##.ACQUISITION SCHEME= undefined
##.AVERAGES= 8
##.DIGITISER RES= 18
##SPECTROMETER/DATA SYSTEM= spect
##.PULSE SEQUENCE= zg30
##.SOLVENT NAME= CDCl3
##.SHIFT REFERENCE= (INTERNAL, CDCl3, 0, 15.7039)
##AUDIT TRAIL= $$ (NUMBER, WHEN, WHO, WHERE, WHAT)
$$ ##TITLE= Audit trail, XWIN-NMR		Version 3.5
$$ ##JCAMPDX= 5.01
$$ ##ORIGIN= Bruker BioSpin GmbH
$$ ##OWNER= she
$$ F:/spectra/data/she/nmr/H-F/1/audita.txt
$$ ##AUDIT TRAIL=  $$ (NUMBER, WHEN, WHO, WHERE, WHAT)
(   1,<2019-11-22 16:47:45.79 +0400>,<she>,<DPX200>,
      <created by zg, POWCHK disabled, PULCHK disabled
       configuration hash MD5:
       00 E9 B6 7A A2 85 ED C7 34 08 36 98 17 FE 4E 26
       data hash MD5: 16K
       86 54 F2 16 44 B8 6B 8A FE 4E 25 F6 95 2B 89 F0>)
$$ ##END=
$$ 
$$ hash MD5
$$ FB 9C E3 F1 39 4F D7 7D 1C CA 0D 0B 80 73 23 E2
##$RELAX= 
##$RELAX= 
##$RELAX= 
##$RELAX= 
##$RELAX= 
##$RELAX= 
$$ Bruker specific parameters
$$ --------------------------
##$DU= <F:/spectra>
##$EXPNO= 1
##$NAME= <H-F>
##$PROCNO= 1
##$TYPE= <nmr>
##$USER= <she>
##$AMP= (0..31)
100 100 100 100 100 100 100 100 100 100 100 100 100 100 100 100 100 100 
100 100 100 100 100 100 100 100 100 100 100 100 100 100 
##$AQSEQ= 0
##$AQ_mod= 1
##$AUNM= <au_zg>
##$AUTOPOS= <>
##$BF1= 200.13
##$BF2= 200.13
##$BF3= 200.13
##$BF4= 200.13
##$BF5= 200.13
##$BF6= 200.13
##$BF7= 200.13
##$BF8= 200.13
##$BYTORDA= 1
##$CFDGTYP= 0
##$CFRGTYP= 5
##$CHEMSTR= <none>
##$CNST= (0..31)
1 1 145 1 1 1 1 1 1 1 1 1 1 1 1 1 1 1 1 1 1 1 1 1 1 1 1 1 1 1 1 1 
##$CPDPRG= <>
##$CPDPRG1= <>
##$CPDPRG2= <>
##$CPDPRG3= <>
##$CPDPRG4= <mlev>
##$CPDPRG5= <mlev>
##$CPDPRG6= <mlev>
##$CPDPRG7= <mlev>
##$CPDPRG8= <mlev>
##$CPDPRGB= <>
##$CPDPRGT= <>
##$D= (0..31)
0 1.2 0 0 0 0 0 0 0 0.06 0 0.03 0 0 0 0 0.0002 0 0 0 0 0 0 0 0 0 0 0 0 
0 0 0 
##$DATE= 1574426864
##$DBL= (0..7)
120 120 120 120 120 120 120 120 
##$DBP= (0..7)
150 150 150 150 150 150 150 150 
##$DBP07= 0
##$DBPNAM0= <>
##$DBPNAM1= <>
##$DBPNAM2= <>
##$DBPNAM3= <>
##$DBPNAM4= <>
##$DBPNAM5= <>
##$DBPNAM6= <>
##$DBPNAM7= <>
##$DBPOAL= (0..7)
0.5 0.5 0.5 0.5 0.5 0.5 0.5 0.5 
##$DBPOFFS= (0..7)
0 0 0 0 0 0 0 0 
##$DE= 6
##$DECBNUC= <off>
##$DECIM= 24
##$DECNUC= <off>
##$DECSTAT= 4
##$DIGMOD= 1
##$DIGTYP= 9
##$DL= (0..7)
0 120 120 120 120 120 120 120 
##$DP= (0..7)
150 150 150 150 150 150 150 150 
##$DP07= 0
##$DPNAME0= <>
##$DPNAME1= <>
##$DPNAME2= <>
##$DPNAME3= <>
##$DPNAME4= <>
##$DPNAME5= <>
##$DPNAME6= <>
##$DPNAME7= <>
##$DPOAL= (0..7)
0.5 0.5 0.5 0.5 0.5 0.5 0.5 0.5 
##$DPOFFS= (0..7)
0 0 0 0 0 0 0 0 
##$DQDMODE= 0
##$DR= 18
##$DS= 0
##$DSLIST= <SSSSSSSSSSSSSSS>
$$ [...]
##$SUBNAM2= <"">
##$SUBNAM3= <"">
##$SUBNAM4= <"">
##$SUBNAM5= <"">
##$SUBNAM6= <"">
##$SUBNAM7= <"">
##$SUBNAM8= <"">
##$SUBNAM9= <"">
##$SW= 24.9337058887773
##$SWIBOX= (0..15)
0 0 2 0 0 0 0 0 0 0 0 0 0 0 0 0 
##$SW_h= 4990.01996007984
##$TD= 16384
##$TD0= 1
##$TE= 0
##$TE2= 300
##$TE3= 300
##$TEG= 300
##$TL= (0..7)
0 120 120 120 120 120 120 120 
##$TP= (0..7)
150 150 150 150 150 150 150 150 
##$TP07= 0
##$TPNAME0= <>
##$TPNAME1= <>
##$TPNAME2= <>
##$TPNAME3= <>
##$TPNAME4= <>
##$TPNAME5= <>
##$TPNAME6= <>
##$TPNAME7= <>
##$TPOAL= (0..7)
0.5 0.5 0.5 0.5 0.5 0.5 0.5 0.5 
##$TPOFFS= (0..7)
0 0 0 0 0 0 0 0 
##$TUNHIN= 0
##$TUNHOUT= 0
##$TUNXOUT= 0
##$USERA1= <user>
##$USERA2= <user>
##$USERA3= <user>
##$USERA4= <user>
##$USERA5= <user>
##$V9= 5
##$VALIST= <valist>
##$VCLIST= <CCCCCCCCCCCCCCC>
##$VD= 0
##$VDLIST= <DDDDDDDDDDDDDDD>
##$VPLIST= <PPPPPPPPPPPPPPP>
##$VTLIST= <TTTTTTTTTTTTTTT>
##$WBST= 1024
##$WBSW= 4
##$XGAIN= (0..3)
0 0 0 0 
##$XL= 0
##$YL= 0
##$YMAX_a= 10071
##$YMIN_a= -8760
##$ZGOPTNS= <>
##$ZL1= 120
##$ZL2= 120
##$ZL3= 120
##$ZL4= 120
##$ABSF1= 10
##$ABSF2= 0
##$ABSG= 5
##$ABSL= 3
##$ALPHA= 0
##$AQORDER= 0
##$ASSFAC= 0
##$ASSFACI= 0
##$ASSFACX= 0
##$ASSWID= 0
##$AUNMP= <proc_1d>
##$AZFE= 0.1
##$AZFW= 0.1
##$BCFW= 1
##$BC_mod= 2
##$BYTORDP= 1
##$COROFFS= 0
##$CY= 11.3945322036743
##$DATMOD= 1
##$DC= 2
##$DFILT= <>
##$DTYPP= 0
##$F1P= 16.9975609425685
##$F2P= -3.02152046262296
##$FCOR= 0.5
##$FTSIZE= 0
##$FT_mod= 4
##$GAMMA= 1
##$GB= 0.15
##$INTBC= 1
##$INTSCL= 1
##$ISEN= 128
##$LB= 0.24
##$LEV0= 0
##$LPBIN= 0
##$MAXI= 10000
##$MC2= 0
##$MEAN= 0
##$ME_mod= 0
##$MI= 1.114404
##$NCOEF= 0
##$NC_proc= 0
##$NLEV= 6
##$NOISF1= 3.799351
##$NOISF2= 2.8
##$NSP= 1
##$NTH_PI= 0
##$NZP= 0
##$OFFSET= 15.70392
##$PC= 1
##$PHC0= -9876.309
##$PHC1= 30.20086
##$PH_mod= 1
##$PKNL= yes
##$PPARMOD= 0
##$PSCAL= 0
##$PSIGN= 0
##$REVERSE= no
##$SF= 200.130013532006
##$SI= 16384
##$SIGF1= 3
##$SIGF2= 2
##$SINO= 400
##$SIOLD= 16384
##$SREGLST= <1H.CDCl3>
##$SSB= 0
##$STSI= 0
##$STSR= 0
##$SW_p= 3612.71676300578
##$SYMM= 0
##$S_DEV= 0
##$TDeff= 0
##$TDoff= 0
##$TI= <>
##$TILT= no
##$TM1= 0
##$TM2= 0
##$TOPLEV= 0
##$USERP1= <user>
##$USERP2= <user>
##$USERP3= <user>
##$USERP4= <user>
##$USERP5= <user>
##$WDW= 1
##$XDIM= 8192
##$YMAX_p= 0
##$YMIN_p= 0
$$ End of Bruker specific parameters
$$ ---------------------------------
##NTUPLES= NMR FID
##VAR_NAME=  TIME,          FID/REAL,        FID/IMAG
##SYMBOL=    X,             R,               I
##VAR_TYPE=  INDEPENDENT,   DEPENDENT,       DEPENDENT
##VAR_FORM=  AFFN,          ASDF,            ASDF
##VAR_DIM=   8192,          8192,            8192
##UNITS=     SECONDS,       ARBITRARY UNITS, ARBITRARY UNITS
##FACTOR=    0.0002004,     1,               1
##FIRST=     0,             0,               0
##LAST=      1.6414764,     0,               0
##MIN=       0,             -8760,           0
##MAX=       1.6414764,     10071,           0
$$ Real data points
##PAGE= N=1
##DATA TABLE= (X++(R..R)), XYDATA
$$ plain form
0 0 0 0 0 0 0 0 0 0 0 0 0 0 0 0 0 0 0 0 0 0 0 0 0 -4 8 -8 8 -8 8 -8 8 -8 14 -16 16 -16 17 -24 24 -24 30 -32 34 -40
44 -40 43 -48 54 -60 66 -75 84 -97 111 -131 156 -189 240 -323 486 -917 4307 10071 -2865 -7016
64 -7016 1554 6559 -1041 -4237 3106 6800 -1335 -6001 932 6716 1320 -3793 442 4576 -237
79 -237 -4181 1166 6565 1838 -4605 -1796 4397 2896 -2121 -641 4007 2094 -3150 -1679 4380 4244
95 4244 -1599 -2947 1692 3351 -5 -972 2222 2526 -1331 -2127 1842 3334 112 -1341 1310 1941
111 1941 -1080 -1497 2324 3514 -379 -2652 192 2576 939 -461 1023 1414 -870 -1336 1403 2429
127 2429 34 -1067 925 1471 -906 -1398 1563 2617 -430 -2334 81 2214 463 -1438 37 1612
143 1612 -56 -1830 -197 2009 853 -1410 -859 920 407 -937 -80 1294 39 -1767 -501 1758
$$ packed form
0@%%%%%%%%%%%%%%%%%%%%%%%mJ2j6J6j6J6j6J6j6K2l0L2l2L3m1M8m8N4o2O6p4
44d0Q3r1J02j14J26j41J59j81K08k42K87l45M29n63Q09j403N224N764j2936m151
64g016Q570N005p600l196P343L694q135m666O933N784n396n113M235M134m813
79b37l944N347N399m727o443K809O193j501n017J480M648j913n244J471O059j36
95D244n843j348M639J659l356r67L194L04l857p96L969J492l222j453K651O31
111A941l021m17L821J190l893k273K844K384j637j400J484L91k284m66K739J026
127B429k395j101J992N46k377m92K961J054l047j904K415K133j751j901J475J575
143A612j668j774J633K206j156k263N51J779n13j344Q57J374j255j806J266K259
$$ plain form
159 1758 805 -1740 -1223 1241 899 -1564 -1328 1303 1390 -1333 -2087 183 1222 -352 -1166 36 358
176 358 -985 -1164 439 802 -756 -1354 -116 362 -726 -926 366 567 -976 -1602 -225 680 -289 -1080
194 -1080 -347 239 -670 -1360 -425 507 -195 -1235 -861 -16 -286 -905 -454 168 -531 -1481 -816 483 139
213 139 -1180 -1122 86 76 -1136 -1109 165 347 -947 -1353 -293 221 -541 -852 -247 -266 -1082 -952 224
232 224 375 -872 -1384 -428 145 -519 -917 -193 196 -624 -1282 -596 348 139 -708 -890 -398 -167 -417 -424 -34
253 -34 48 -525 -1004 -628 110 255 -242 -580 -506 -476 -425 -34 303 -123 -808 -679 43 189 -254 -229 197 -41
275 -41 -754 -621 430 797 -66 -727 -325 239 142 -52 233 378 -154 -564 -62 681 630 -33 -277 1 157
296 157 110 322 649 445 -219 -363 281 791 567 193 254 251 -28 68 801 1109 368 -365 -34 650 662 400
$$ packed form
159A758r53k545N17K464l42k463K36K631Q7k723p54K270J039j574q14J202L22
176C58j343j79J603L63j558n98J238M78j088k00J292K01j543o26J377R05r69p91
194a080P33N86r09o90R35R32p02j040L74Q45k70o19M51O22o99r50O65J299l44
213A39j319N8J208j0j212K7J274J82j294m06J060N14p62l11O05j9q16J30J176
232B24J51j247n12R56N73o64l98P24L89q20o58O86R44k09q47j82M92K31k50pL90
253c4Q2n73m79L76P38J45m97l38P4L0N1L91L37m26o85J29P22J46m43K5M26k38
275d1p13J33J051L67q63o61M02N64r7j94K85J45n32m10N02P43n1o63k44K78J56
296A57m7K12L27k04o64j44O44N10k24l74O1lk79R6P33L08p41p33L31O84J2k62
$$ plain form
318 400 628 725 63 -374 346 1262 971 75 -13 523 498 215 594 1147 714 -234 -190 736 1107 639 358 515
340 515 375 21 348 1127 1117 249 -152 366 776 561 508 841 650 -105 -207 727 1275 634 -59 174 559
361 559 307 151 742 1094 339 -475 -34 874 870 276 202 417 113 -187 343 1030 674 -213 -328 277 463
382 463 200 303 591 178 -518 -311 615 801 60 -316 55 181 -208 -109 620 669 -317 -870 -100 686 335
403 335 -263 -74 202 -305 -628 90 781 191 -742 -551 158 81 -290 28 395 -267 -1008 -434 563 361 -524
424 -524 -510 27 -211 -756 -228 640 198 -986 -982 99 347 -380 -522 27 -87 -883 -813 202 470 -409 -953
445 -953 -485 -92 -388 -459 51 90 -718 -1070 -331 291 -106 -643 -409 -145 -591 -833 -121 495 -183 -1126 -832
466 -832 92 53 -575 -435 111 -269 -1079 -773 300 362 -626 -910 -282 -104 -584 -464 213 63 -876 -1005 -108
$$ packed form
318D00K28R7o62m37P20R16k91q96q8N36k5k83L79N53m33r48M4R26L71m68k81J57
340E15j40l54L27P79j0q68m01N18M10k15n3L33j91p55j02R34N48o41o93K33L85
361E59k52j56N91L52p55q14M41R08mn94p4K15l04l00N30O87l56q87j15O05J86
382D63k63J03K88m13o96K07R26J86p41l76L71J26l89R9P29M9r86n53P70P86l51
403C35n98J89K76n07l23P18O91n90r33J91P09p7l71L18L67o62p41N74R97k02q85
424e24J4N37k38n45N28Q68m42j184MJ081K48p27j42N49j14p96P0J015K68q79n44
445i53M68L93k96p1N10L9q08l52P39O22l97n37K34K64m46k42P12O16o78r43K94
466h32R24l9o28J40N46l80q10L06J073O2r88k84O28J78m80J20O77j50r39j29Q97
$$ plain form
487 -108 288 -305 -573 -133 -147 -783 -757 170 456 -411 -978 -430 81 -265 -509 -15 179 -534 -997 -339 434
508 434 123 -590 -504 -76 -251 -557 -139 437 79 -734 -685 81 299 -139 -248 51 -85 -526 -316 398 454
529 454 -250 -510 -45 149 -161 -98 415 348 -428 -624 187 688 161 -335 1 352 -29 -273 268 714 228
550 228 -411 -172 447 468 116 177 347 89 -181 188 696 492 -37 -26 360 317 84 323 698 407 -233 -120
572 -120 614 809 295 31 333 451 143 143 628 772 278 -65 270 626 500 338 481 514 193 57 472
593 472 816 544 112 165 465 451 310 416 594 400 91 154 521 625 374 198 303 330 243 355 597 496
615 496 73 -37 350 620 356 106 277 428 129 -68 296 706 397 -176 -161 312 445 209 140 243 102
636 102 -119 8 348 361 95 43 98 -36 -128 199 544 225 -371 -330 245 387 -13 -180 117 178 -223 -367
$$ packed form
487a08L96n93k68M40j4o36K6R27K86q67n67N48N11l46k44M94J94p13m63O58P73
508D34l11p13Q6M28j75l06M18N76l58q13M9P66K18m38j09K99j36m41K10P14N6
529D54p04k60M65J94l10O3N13o7p76j96Q11N01n27m96L36L51l81k44N41M46m86
550B28o39K39O19K1l52O1J70k58k70L69N08k04n29J1L86m3k33K39L75k91o40J13
572a20P34J95n14k64L02J18l08%M85J44m94l43L35L56j26j62J43L3l21j36M15
593D72L44k72m32N3L00j4j41J06J78j94l09O3L67J04k51j76J05K7q7J12K42j01
615D96m23j10L87K70k64k50J71J51k99j97L64M10l09n73J5M73J33k36o9J03j41
636A02k21J27L40J3k66n2N5j34r2L27L45l19n96M1N75J42m00j67K97O1m01j44
$$ plain form
658 -367 85 436 93 -406 -355 12 89 -56 -58 -18 -226 -381 -136 162 34 -306 -299 -99 -197 -379 -130 265 8
681 8 -644 -645 -3 247 -173 -444 -206 -117 -453 -485 31 229 -298 -691 -425 -94 -232 -295 1 10 -564 -822 -269
704 -269 267 -18 -510 -435 -171 -307 -488 -176 158 -101 -612 -606 -199 -45 -158 -192 -197 -446 -624 -296 130 -1
726 -1 -433 -528 -232 -164 -403 -312 62 -11 -560 -753 -233 240 -7 -479 -474 -265 -270 -305 -87 64 -228 -551 -448 -148
750 -148 -121 -159 -61 -104 -497 -652 -118 366 72 -518 -502 -66 -59 -309 -145 251 83 -547 -596 -1 323 32 -203
773 -203 -114 -122 -330 -168 294 325 -203 -457 -112 152 7 -60 189 198 -261 -481 47 524 262 -206 -168 82 41
796 41 -51 201 409 87 -305 -105 337 345 58 84 243 51 -221 77 604 523 -88 -292 165 439 271 135
818 135 316 325 15 -77 309 602 409 92 81 196 200 300 581 537 84 -154 196 636 497 181 281 471 212
$$ packed form
658c67M52L51l43m99N1L67P7j45kM0k08j55K45K98j28l40PK00r8j82K49L95k57
681Ho52jO42K50m20k71K38Q9l36l2N16J98n27l93K66L31j38o3K96Rn74k58N53
704b69N36k85m92P5K64j36j81L12L34k59n11OM07J54j13l4nk49j78L28M26j31
726am32r5K96O8k39R1L74p3n49j93N20M73k47m72NK09nl5K18J51k92l23J03L00
750a48K7l8R8m3l93j55N34M84k94n90J6M36Pk50J64L96j68o30m9N95L24k91k35
773b03Q9qk08J62M62L1n28k54L45K64j45o7K49Rm59k20N28M77k62m68L8K50m1
796D1r2K52K08l22l92K00M42Qk87K6J59j92k72K98N27q1o11k04M57K74j68j36
818A35J81Rl10r2L86K93j93l17j1J15MJ00K81m4m53k38L50M40j39l16J00J90k59
$$ plain form
841 212 -84 239 809 647 9 -130 319 554 342 283 458 332 -12 44 481 601 291 137 275 236 72
862 72 235 620 519 -24 -158 292 570 310 104 257 319 47 -28 338 598 274 -136 -54 276 301 177 235
884 235 310 63 -194 39 458 437 30 -129 74 121 5 123 410 243 -236 -315 93 346 143 -13 55 -28
906 -28 -277 -176 280 374 -101 -397 -136 98 -55 -131 135 150 -309 -525 -119 298 100 -295 -291 -105 -153 -236 -45
929 -45 118 -108 -460 -363 -40 2 -146 -174 -139 -300 -436 -184 154 46 -376 -504 -210 -53 -179 -192 -28 -111 -481
952 -481 -529 -98 189 -61 -418 -378 -201 -247 -267 -43 45 -261 -568 -397 -44 0 -167 -218 -225 -374 -440 -184 93 -37
976 -37 -391 -460 -246 -154 -204 -140 -48 -212 -512 -425 -17 101 -181 -397 -278 -157 -269 -265 -1 53 -277 -533 -280 64
1000 64 32 -205 -213 -154 -262 -303 -46 152 -24 -334 -321 -94 -43 -90 0 46 -201 -416 -204 177 176 -119 -259 -116
$$ packed form
841B12k96L23N70j62o38j39M49K35k12n9J75j26l44N6M37J20l10j54J38l9j64
862G2J63L85j01n43j34M50K78k60k06J53O2k72p5L66K60l24m10Q2L30K5j24N8
884B35P5k47k57K33M19k1m07j59K03M7j16J18K87j67m79p9M08K53k03j56O8q3
906b8k49J01M56R4m75k96K61K34j53p6K66J5m59k16M06M17j98l95MJ86m8q3J91
929d5J63k26l52R7L23M2j48k8L5j61j36K52L38j08m22j28K94J57j26j3J64q3l70
952d81m8M31K87k50l57M0J77m6k0K24Q8l06l07J71L53M4j67n1pj49o6K56K77j30
976c7l54o9K14R2n0O4R2j64l00Q7M08J18k82k16J19J21j12MK64N4l30k56K53L44
1000F4l2k37qN9j08m1K57J98j76l10J3K27N1m7R0M6k47k15K12L81jk95j40J43
$$ plain form
1024 -116 -80 -170 -46 198 119 -250 -373 -72 209 110 -83 -63 -16 -139 -146 108 300 98 -219 -188 59 144 79 118
1048 118 150 -46 -208 11 320 287 -8 -51 99 66 -4 171 411 238 -146 -133 257 434 192 69 185 177 7
1071 7 56 394 497 191 -75 60 280 316 266 321 265 50 -8 251 480 385 155 130 198 160 177 368 505 271
1095 271 -60 14 363 466 253 175 260 220 25 125 469 524 171 -72 130 346 291 237 341 301 40 -42 250
1118 250 499 326 94 108 182 115 132 370 445 133 -138 41 334 317 140 164 215 25 -116 123 445 331 -43
1141 -43 -133 82 191 86 111 246 124 -172 -175 149 300 106 -89 -50 -17 -103 -48 198 207 -121 -320 -121 116 58
1165 58 -53 1 -21 -234 -307 -12 215 24 -278 -257 -73 -75 -145 -42 98 -116 -417 -317 46 120 -117 -257 -156
1188 -156 -145 -248 -172 65 41 -276 -412 -211 -36 -91 -143 -94 -165 -374 -338 -35 94 -158 -369 -260 -126 -231 -263
$$ packed form
1024a16L6r0J24K44p9l69j23L01K81r9j93K0M7j23pK54J92k02l17L1K47Q5o5L9
1048A18L2j96j62K19L09l3k95m3J50l3p0J75K40j73l84J3L90J77k42j23J16qj70
1071GM9L38J03l06k66J35K20L6n0N5n6k15n8K59K29r5k30k5O8l8J7J91J37k34
1095B71l31P4L49J03k13p8Q5m0j95J00L44N5l53k43K02K16n5n4J04m0k61q2K92
1118B50K49j73k32J4P4o7J7K38P5l12k71J79K93j7j77K4N1j90j41K39L22j14l74
1141d3r0K15J09j05K5J35j22k96lL24J51j94j95L9L3q6N5K46Rl28j99J99K37n8
1165E8j11N4k2k13p3K95K27j91l02K1J84kp0J03J40k14l01J00L63P4k37j40J01
1188a56J1j03P6K37k4l17j36K01J75n5n2M9p1k09L6L03J29k52k11J09J34j05l2
$$ plain form
1211 -263 -39 39 -271 -513 -301 43 -2 -270 -296 -177 -227 -319 -198 21 -57 -338 -392 -197 -97 -141 -133 -97 -228 -386
1235 -386 -263 12 43 -223 -316 -173 -111 -207 -192 12 37 -243 -403 -158 87 -5 -215 -196 -74 -147 -230 -65 118
1258 118 -32 -310 -258 -10 13 -99 -70 17 -116 -284 -151 141 96 -158 -212 -59 -29 -114 -37 123 28 -235 -224 55
1282 55 160 -14 -87 5 3 -149 -89 170 223 -44 -230 -55 150 107 -25 52 124 1 -110 23 253 219 2 -53
1306 -53 63 103 111 184 242 88 -75 28 262 261 91 83 188 150 -2 87 354 349 37 -103 136 329 239 119 171
1331 171 224 83 14 209 364 269 85 75 169 169 195 290 311 116 -14 140 366 320 145 141 218 162 66 194 411
1356 411 338 58 -2 193 313 257 214 242 190 51 97 319 387 196 61 129 208 153 168 299 308 77 -46 97 303
1381 303 290 127 84 124 82 62 165 260 140 -40 -14 107 132 86 122 150 -5 -155 -37 226 241 -17 -155 -10
$$ packed form
1211b63K24P8l10k42K12L44m5k68k6J19n0r2J21K19p8k81n4J95J00m4QL6j31j58
1235c86J23K75L1k66r3J43O2r6J5K04K5k80j60K45K45r2k10J9J22p3q3J65J83
1258A18j50k78N2K48K3j12K9Q7j33j68J33K92m5k54n4J53L0q5P7J60r5k63J1K79
1282E5J05j74p3R2kj52O0K59N3k67j86J75K05m3j32P7P2j23j11J33K30l4k17n5
1306e3J16M0QP3N8j54j63J03K34jj70qJ05l8j52Q9K67nl12j40K39J93r0j20N2
1331A71N3j41o9J95J55r5j84j0R4%K6R5K1j95j30J54K26m6j75mP7n6r6J28K17
1356D11p3k80o0J95J20n6m3K8n2j39M6K22O8j91j35O8P9n5J5J31Rk31j23J43K06
1381C03j3j63m3M0m2k0J03R5j20j80K6J21K5m6L6K8j55j50J18K63J5k58j38J45
$$ plain form
1405 -10 95 10 -31 107 118 -98 -222 -65 130 108 -27 -93 -102 -134 -92 65 110 -73 -209 -134 -27 -66 -81 13 30
1430 30 -181 -315 -148 104 72 -173 -251 -130 -84 -133 -135 -30 -34 -216 -288 -162 -32 -70 -153 -184 -202 -231 -198 -57 -34 -208
1456 -208 -323 -234 -103 -117 -185 -135 -114 -236 -340 -200 3 -34 -233 -284 -187 -145 -185 -124 -26 -121 -337 -309 -81 -9 -125
1481 -125 -192 -102 -133 -265 -221 8 68 -150 -303 -202 -48 -79 -107 -61 -58 -191 -255 -87 46 -48 -163 -117 -76 -145 -169
1506 -169 -8 79 -104 -289 -170 53 18 -147 -145 -14 -64 -194 -130 69 72 -132 -213 -79 30 -10 -27 20 -35 -158
1530 -158 -132 58 125 -6 -81 -17 10 -68 -43 137 180 -44 -181 -32 159 124 5 40 99 9 -77 51 235 167 -23
1555 -23 -38 84 110 45 104 189 114 -44 -7 183 222 80 36 120 110 21 81 236 207 27 -7 126 205 144 100 172 164
1582 164 33 26 207 304 164 16 77 199 172 118 188 256 151 10 64 264 294 169 93 160 140 123 179 287 253
$$ packed form
1405a0J05q5m1J38J1k16j24J57J95k2j35o6rl2M2J57M5j83j36P5J07l9j5R4J7
1430C0k11j34J67K52l2k45p8J21M6m9kJ05mj82p2J26J30l8q3l1j8k9L3J41K3j74
1456b08j15Q9J31j4o8N0K1j22j04J40K03l7j99n1R7M2m0O1R8r5k16K8K28P2j16
1481a25o7R0l1j32M4K29O0k18j53J01J54l1k8M6Lj33o4J68J33r4j15M6M1o9k4
1506a69J61Q7j83j85J19K23l5j65KJ31n0j30O4J99Lk04q1J34J09m0j7M7n5j23
1530a58K6J90O7j31p5O4K7p8K5J80M3k24j37J49J91l5j19L5N9r0q6J28J84o8j90
1555b3j5J22K6o5N9Q5p5j58L7J90L9j42m4Q4j0q9O0J55k9j80l4J33P9o1m4P2q
1582A64j31pJ81R7j40j48O1J22k7n4P0O8j05j41N4K00L0j25p6O7k0j7N6J08l4
$$ plain form
1607 253 106 70 186 236 173 179 238 179 38 54 265 332 153 41 134 208 127 85 206 274 97 -26 76 241 197
1632 197 83 68 122 91 31 127 213 121 -20 -3 107 125 68 90 119 43 -65 4 166 151 -9 -56 39 66 -10 3 133
1659 133 101 -80 -148 19 138 49 -66 -36 1 -65 -89 11 102 -2 -154 -118 -5 -9 -48 -32 -22 -110 -200 -86 43
1684 43 0 -137 -164 -94 -97 -156 -102 9 -66 -246 -242 -71 -7 -125 -193 -135 -118 -207 -212 -69 -20 -176 -278 -201 -76 -111 -148
1711 -148 -116 -114 -222 -250 -140 -1 -83 -214 -188 -135 -148 -164 -72 -30 -141 -267 -195 -37 -16 -117 -155 -111 -131 -215 -140 -1
1737 -1 2 -177 -259 -125 -29 -68 -103 -67 -67 -186 -203 -59 40 -35 -167 -166 -99 -94 -86 -13 -7 -130 -218 -114 19 -2 -80 -72 -52 -104
1767 -104 -154 -24 105 30 -141 -162 -6 56 -14 -25 31 -7 -123 -96 79 143 24 -81 -39 -14 0 42 123 88 -46
1792 -46 -99 21 127 86 38 46 32 -44 -20 129 202 77 -86 -35 74 98 63 102 117 39 -68 -4 157 193 62 -17
$$ packed form
1607B53j47l6J16N0o3ON9n9j41J6K11O7j79j12R3P4q1m2J21O8j77j23J02J65m4
1632A97j14j5N4l1o0R6Q6r2j41J7J10J8n7K2K9p6j08O9J62j5j60m7R5K7p6J3J30
1659A33l2j81o8J67J19q9j15L0L7o6k4J00R1j04j52L6J13ml9J6J0q8r0J14J29
1684D3m3j37k7P0ln9N4J11p5j80MJ71O4j18o8N8J7q9nJ43M9j56j02P7J25l5l7
1711a48L2Kj08k8J10J39q2j31K6N3j3j6R2M2j11j26P2J58K1j01l8M4k0q4P5J39
1737aLj79q2J34R6l9l5L6%j19j7J44R9p5j32JO7NQP3Oj23q8J04J33k1p8QK0n2
1767a04n0J30J29p5j71k1J56O2p0j1N6l8j16K7J75O4j19j05M2K5J4M2Q1l5j34
1792d6n3J20J06m1m8Qj4p6K4J49P3j25j63N1J09K4l5L9J5p8j07O4J61L6j31p9
$$ plain form
1818 -17 30 72 73 98 162 130 4 -23 83 191 164 93 103 79 27 56 203 248 124 6 50 167 160 148 183 187 98 6
1846 6 104 271 249 112 52 137 150 120 168 247 189 39 28 162 229 175 123 135 114 68 111 228 241 107 26 73 138 129
1874 129 137 173 143 17 -24 109 227 145 19 37 87 69 46 114 195 103 -46 -28 122 169 93 31 41 38 -3 58 151 131
1902 131 12 -42 12 51 43 75 106 49 -92 -85 64 144 19 -63 -23 1 -50 -57 54 80 -38 -163 -106 8 24 -43 -65
1929 -65 -45 -115 -135 -68 23 -9 -143 -168 -73 -74 -100 -71 -38 -114 -205 -183 -45 5 -102 -172 -137 -124 -145 -121 -35 -38 -165 -236 -132
1958 -132 -36 -77 -135 -117 -96 -172 -203 -75 15 -70 -203 -183 -86 -67 -104 -91 -55 -127 -208 -171 -64 -35 -112 -159 -117 -132 -162 -82
1986 -82 -10 -68 -204 -200 -70 -24 -104 -133 -77 -80 -179 -173 -40 40 -78 -202 -157 -50 -53 -83 -54 -42 -110 -157 -99 -1 -11 -68 -71 -60
2016 -60 -83 -86 13 70 -18 -130 -102 32 48 -21 -18 32 -8 -81 -47 72 100 -18 -85 -35 29 30 21 58 49 -40 -67 34 105 61
$$ packed form
1818a7M7M2JK5O4l2j26k7J06J08k7p1J0k4n2K9J47M5j24j18M4J17pj2L5Mq9r2
1846FR8J67k2j37o0Q5J3l0M8P9n8j50j1J34O7n4n2J2k1m6M3J17J3j34q1M7O5r
1874A29QL6l0j26m1J33J18q2j26J8N0j8k3O8Q1r2j49J8J50M7p6o2J0lm1O1R3k0
1902A31j19n4N4L9qL2L1n7j41PJ49Q0j25q2M0K4n1pJ11K6j18j25N7J14J6o7k2
1929f5K0p0k0O7R1l2j34k5R5jk6K9L3p6r1K2J38N0j07p0L5J3k1K4Q6lj27p1J04
1958a32R6m1n8J8K1p6l1J28R0q5j33K0R7J9l7J3L6p2q1L7J07K9p7m7M2j5l0Q0
1986h2P2n8j36MJ30M6q0k9N6lr9OJ33Q0j18j24M5J07ll0K9J2o8m7N8R8j0n7lJ1
2016f0k3lR9N7q8j12K8J34J6o9LN0m0p3L4J19K8j18o7N0O4JrL7rq9k7J01P1m4
$$ plain form
2046 61 -1 -18 21 -3 11 82 117 29 -63 -35 71 100 65 56 60 8 -20 61 153 126 12 -7 61 88 57 84 157 111 -17 -13
2076 -13 102 187 123 41 56 80 80 92 147 163 97 26 52 129 147 130 129 110 44 41 144 225 154 41 41 110 121 95 130 184 117
2107 117 -3 10 158 213 116 34 68 92 69 93 163 151 48 -13 48 129 129 94 109 84 -1 21 126 191 107 10 20 89
2135 89 91 64 118 140 58 -27 20 145 139 53 34 52 56 28 73 151 95 -23 -54 54 92 70 29 24 9 -37 -28 65 109 11 -64
2166 -64 -62 -24 -11 5 35 15 -103 -124 -37 42 14 -65 -63 -52 -97 -112 -18 64 -19 -152 -158 -53 1 -55 -72 -62 -82 -154 -120 -30
2196 -30 14 -78 -136 -123 -93 -79 -57 -17 -58 -165 -177 -80 -11 -62 -113 -107 -100 -157 -143 -24 2 -110 -216 -169 -71 -53 -107 -96 -91 -141
2226 -141 -196 -116 -21 -38 -135 -180 -145 -118 -102 -58 -46 -92 -178 -165 -67 -29 -64 -95 -101 -103 -139 -98 -8 -5 -93 -165 -100 -35 -34 -59 -31 -31
2258 -31 -86 -126 -50 42 22 -75 -95 -38 -24 -33 -1 24 -18 -93 -62 21 38 -6 -16 -9 -34 -67 -7 76 53 -50 -69 -8 42 6 4
$$ packed form
2046F1o2j7L9k4J4P1L5q8r2K8J06K9l5rMn2k8Q1R2k7j14j9O8K7l1K7P3m6j28M
2076a3J15Q5o4q2J5K4%J2N5J6o6p1K6P7J8j7jj9o6lJ03Q1p1j13%O9J1k6L5N4o7
2107A17j20J3J48N5r7q2L4K4k3K4P0j2j03o1O1Q1%l5J5k5q5K2J05O5q4r7J0O9
2135H9Kk7N4K2q2q5M7J25oq6j9J8Mk8M5P8n6j18l1J08L8k2m1nj5m6RR3M4r8p5
2166f4KL8J3J6L0k0j18k1Q7P9k8p9KJ1m5j5R4Q2q3j33oJ05N4n6j7J0k0p2L4R0
2196c0M4r2n8J3L0J4K2M0m1j07j2R7O9n1n1OPn7J4J19K6j12j06M7R8J8n4J1Nn0
2226a41n5Q0R5j7r7m5L5K7J6M4J2m6q6J3R8L8l5l1okl6M1R0Lq8p2O5O5Jk5K8%
2258c1n5m0P6R2k0r7k0N7J4rL2K5m2p5L1Q3J7m4j0Pk5l3O0Q3k3j03j9O1N0l6k
$$ plain form
2289 4 43 13 -52 -62 42 100 59 -45 -31 19 24 22 64 64 25 -48 -8 94 106 58 42 35 28 12 62 127 105 10 16 62 101 86
2321 86 79 113 75 7 28 130 171 83 30 69 94 71 73 124 149 67 7 68 140 128 60 72 81 65 58 113 136 85 27 44 98 97
2353 97 81 95 110 71 11 66 152 141 55 39 90 92 54 76 148 128 23 8 102 151 106 67 75 80 70 63 121 150 78 27 47 85
2385 85 97 89 99 96 62 14 71 125 100 29 24 63 55 24 64 97 50 -27 -23 66 83 20 -15 7 22 -31 -26 50 67 -16 -77 -32 24
2418 24 11 -23 -17 -18 -56 -69 -17 23 -12 -54 -56 -37 -60 -38 1 11 -61 -113 -85 -19 7 -56 -65 -47 -61 -105 -72 7 0 -93 -120 -78 -30
2451 -30 -44 -70 -60 -65 -113 -111 -68 -32 -56 -111 -111 -98 -94 -92 -44 -58 -118 -175 -114 -55 -72 -114 -104 -79 -123 -152 -100 -25 -60 -143 -155 -102 -73
2484 -73 -93 -79 -58 -90 -142 -118 -55 -36 -68 -101 -92 -79 -81 -43 -6 -22 -84 -109 -59 -25 -22 -60 -32 -42 -73 -78 -14 36 -18 -81 -74 -20 -14
2517 -14 -24 -12 18 -40 -89 -47 29 39 -19 -45 -17 -22 -28 -3 32 28 -44 -63 -14 28 21 11 16 -2 -35 -21 58 80 25 -14 6 24 22
$$ packed form
2289DL9l0o5j0J04N8m1j04J4N0NkM2%l9p3M0J02J2m8j6ppj6N0O5k2r5OM6L9j5
2321H6pL4l8o8K1J02M1q8n3L9K5k3KN1K5q2o0O1P2j2o8J2Rj6pN5K3n1n8J7N4j
2353I7j6J4J5l9o0N5Q6j1q6j6N1Kl8K2P2k0j05j5R4M9m5l9QNj0pN8K9p2n1K0L8
2385H5J2qJ0ll4m8N7N4k5p1nL9ql1M0L3m7p7MQ9J7o3l5K2J5n3NP6J7q3o1M5N6
2418B4j3l4Ojl8j3N2M0l5m2kJ9k3K2L9J0p2n2K8O6K6o3rJ8j4m4L3P9pr3k7M2M8
2451c0j4k6J0nm8KM3L6k4n5%J3MKM8j4o0n7O1N9j7m2J0K5m4k9N2P5l5q3j2N3K9
2484g3k0J4K1l2n2K4O3J9l2l3RJ3kL8L7j6o2k5N0L4Ll8K8j0l1nO4N0n4o3PN4O
2517a4j0J2L0n8m9M2P6J0n8k6K8noK5L5mp2j9M9M2pj0Nj8l3J4P9K2n5l9K0J8k
$$ plain form
2550 22 27 63 80 -2 -20 33 103 96 42 36 56 55 37 65 121 96 21 11 70 90 86 83 73 57 13 42 107 113 59 29 55 75 52 90
2584 90 120 99 22 -1 54 120 86 39 44 74 53 35 73 121 87 23 28 66 95 86 85 72 65 33 64 120 110 60 42 59 62 61 90 118
2618 118 85 30 30 92 135 93 61 79 75 48 62 108 130 62 0 40 79 81 57 64 75 14 -8 36 109 89 21 13 24 25 35 58 56
2651 56 36 -25 -9 32 51 16 7 2 -16 -32 5 63 45 -15 -69 -26 17 -7 -10 -4 7 -46 -59 -9 32 19 -44 -53 -40 -19 -21 10 7 -46
2685 -46 -76 -58 -3 -11 -43 -51 -46 -70 -76 -48 7 -20 -98 -111 -61 -42 -58 -65 -54 -72 -106 -121 -67 -30 -65 -120 -107 -91 -107 -93 -65 -59 -105
2718 -105 -139 -115 -59 -76 -92 -98 -89 -107 -113 -69 -34 -69 -122 -116 -76 -67 -74 -74 -54 -86 -122 -94 -30 -31 -75 -91 -73 -64 -70 -63 -30 -21 -77 -113 -61 -18
2754 -18 -13 -61 -80 -55 -64 -54 -27 -5 -40 -72 -71 -44 -36 -47 -27 -20 -64 -76 -52 20 5 -59 -57 -31 -23 -21 -20 33 19 -48 -59 2 51 23 -10
2789 -10 -3 -13 -9 2 29 54 10 -14 -5 37 27 39 45 54 5 -10 51 98 59 8 25 41 35 31 61 87 66 1 10 76 80 59 35 49 50
$$ packed form
2550B2NL6J7q2j8N3P0pn4oK0jj8K8N6k5p5j0N9K0mlj0j6m4K9O5On4l0K6K0k3L8
2584I0L0k1p7k3N5O6l4m7NL0k1j8L8M8l4o4NL8K9rjj3pl2L1N6j0n0j8J7LjK9K8
2618A18l3n5%O2M3m2l2J8mk7J4M6K2o8o2M0L9Kk4PJ1o1k2M4P3k0o8qJ1JJ0K3k
2651E6k0o1J6M1J9l5rnj8j6L7N8j8o0n4M3M3k4lOJ1n3j3N0M1j3o3rJ3K1kL1ln3
2685d6l0J8N5ql2qNk4oK8N5k7p8j3N0J9j6pJ1j8l4j5N4L7l5n5J3J6j6J4K8Om6
2718a05l4K4N6j7j6oRj8oM4L5l5n3OM0Rp%K0l2l6K8O4jm4j6J8RoPL3Rn6l6N2M3
2754a8Nm8j9K5rJ0K7K2l5l2JK7Qj1K0Pm4j2K4P2j5o4KK6QKJN3j4o7j1O1M9k8l3
2789a0Pj0MJ1K7K5m4k4RM2j0J2ORm9j5O1M7l9n1J7J6omL0K6k1o5RO6Mk1k4J4J
$$ plain form
2824 50 24 39 93 97 37 12 26 62 60 57 68 60 18 16 75 103 73 46 47 51 45 52 101 105 45 7 47 100 96 64 58 72 47 42 76 126 102
2861 102 58 41 62 89 94 92 85 68 36 48 81 99 75 49 53 45 31 52 88 79 29 2 26 82 66 22 40 37 12 -9 37 76 49
2894 49 -3 -22 19 35 34 30 50 10 -26 -5 52 54 29 -4 -1 2 9 24 62 50 -27 -29 -5 31 17 6 14 7 -36 -38 17 51 18 -35 -34 -16
2930 -16 -12 -17 -4 -6 -36 -66 -45 7 7 -27 -63 -66 -60 -51 -27 -21 -21 -81 -98 -59 -45 -52 -52 -54 -72 -114 -91 -33 -26 -68 -112 -87 -73 -66 -65 -48 -42 -92
2968 -92 -124 -75 -26 -41 -66 -92 -72 -90 -83 -51 -38 -42 -90 -96 -63 -40 -55 -45 -46 -88 -91 -72 -29 -35 -82 -101 -74 -61 -65 -51 -24 -40 -94 -105
3002 -105 -52 -17 -41 -81 -78 -61 -65 -77 -44 -30 -50 -99 -84 -33 -24 -29 -25 -38 -58 -64 -36 6 4 -36 -42 -22 -17 -31 8 38 10 -46 -39 25 55
3037 55 22 -11 10 10 12 18 50 76 27 -10 10 43 51 39 38 30 13 14 46 67 47 24 11 44 34 33 58 60 27 -7 26 62 74 40 17
3072 17 33 31 18 47 74 80 25 3 43 67 80 66 53 38 27 24 76 92 69 40 34 54 63 66 82 81 46 26 62 85 89 70 65 56 53 47
$$ packed form
2824E0k6J5N4Mo0k5J4L6klJ1qm2kN9K8l0k7JMoPM9Mo0l8M0N3ml2oJ4k5nL4N0k4
2861A02m4j7K1K7Nkpj7l2J2L3J8k4k6Mqj4K1L6rn0k7K4N6j6m4J8lk5k1M6L9k7
2894D9n2j9M1J6jmK0m0l6K1N7Kk5l3LLPJ5L8j2p7kK4L6j4j1Qpm3kN5L4l3n3JJ8
2930a6MnJ3kl0l0K1N2%l4l6lORK4O%o0j7L9J4p%kj8m2K3N8Pm2m4K5J4PJJ7On0
2968i2l2M9M9j5k5k6K0j8PL2J3mm8oL3K3j5J0jm2lJ9M3om7j9K7J3mJ4K7j6n4j1
3002a05N3L5k4m0LJ7mj2L3J4k0m9J5N1RnMj3k0oK8M2km0oK0Nj4L9L0k8n6PO4L0
3037E5l3l3K1%KOL2K6m9l7K0L3Qj2jqj7JL2K1k0k3j3L3j0jK5Kl3l4L3L6J2l4k3
3072A7J6kj3K9K7On5k2M0K4J3j4j3j5j1lN2J6k3k9oK0RLJ6jl5k0L6K3Mj9nrlo
$$ plain form
3108 47 87 100 64 19 20 65 83 75 51 59 26 17 28 71 88 42 19 18 42 51 62 68 48 29 5 23 62 58 24 23 10 17 28 59 68 40
3144 40 -9 4 59 45 31 34 41 14 -13 12 61 67 16 -6 11 28 28 32 47 27 -16 -14 28 30 32 12 -13 -3 -16 -6 37 21 -15 -47
3178 -47 -21 5 -8 -14 -9 -11 -48 -57 -24 8 -9 -38 -57 -47 -37 -45 -34 -26 -50 -85 -75 -49 -19 -40 -52 -64 -59 -71 -45 -19 -37 -71 -85 -66
3212 -66 -54 -43 -33 -35 -58 -79 -82 -39 -9 -45 -65 -71 -54 -49 -58 -46 -24 -68 -93 -72 -33 -37 -44 -63 -70 -68 -57 -56 -23 -43 -60 -86 -67 -49 -51 -51
3248 -51 -55 -68 -96 -71 -26 -31 -61 -69 -61 -51 -54 -49 -23 -6 -43 -64 -41 -14 6 -25 -35 -19 -38 -29 0 11 7 -32 -35 -12 0 24 18 17 -10 -22
3284 -22 -6 33 36 11 -4 14 11 5 14 34 39 -4 -13 13 27 42 28 14 1 -4 19 39 55 30 -7 8 27 43 26 46 42 12 6 24 55
3319 55 45 47 25 36 28 46 61 83 64 24 33 58 65 67 47 61 53 32 42 83 98 70 36 47 76 76 69 74 74 57 46 46 78 79 62 36
3355 36 37 54 50 72 81 60 23 30 53 53 41 42 51 22 -1 20 64 68 21 7 10 35 37 42 46 54 27 12 20 51 47 34 26 21 33 37 38 53 16 13
$$ packed form
3108D7M0J3l6m5JM5J8qk4Ql3rJ1M3J7m6k3jK4RJ1Ok0j9k4J8L9ml4jj3PJ1L1Rk8
3144D0m9J3N5j4j4LPk7k7K5M9On1k2J7J7%MJ5k0m3KM2KKk0k5J0j3J0M3j6l6l2
3178d7K6K6j3oNkl7rL3L2j7k9j9J0J0qJ1Qk4l5J0K6L0k1j2j2Nj2K6K6j8l4j4J9
3212f6J2J1J0kk3k1lM3L0l6k0oJ7NrJ2K2m4k5K1L9mpj9pKJ1JL3k0j7k6J9J8k%
3248e1mj3k8K5M5nl0qQJ0lNK6J7l7k1K3K7K0l1j0J6j9RK9J1ml9lK3J2K4ojk7j2
3284b2J6L9Lk5j5J8loRK0Nm3rK6J4J5j4j4j3nK3K0J6k5l7J5J9J6j7K0ml0oJ8L1
3319E5j0Kk2J1qJ8J5K2j9m0RK5PKk0J4qk1J0M1J5k8l4J1K9%pN%j7j1%L2Jj7k6
3355C6JJ7mK2Rk1l7PK3%j2JRk9k3K1M4Mm7j4LK5KNMQk7j5QL1mj3qnJ2MJJ5l7l
$$ plain form
3395 13 21 40 38 28 28 22 17 7 34 58 42 11 -6 15 34 19 14 17 21 -21 -16 0 29 14 -12 -11 -15 -8 -13 12 3 -22 -38 -25 -2 -15 -20 -25
3433 -25 -23 -48 -40 -13 11 -13 -46 -38 -23 -24 -37 -14 -12 -30 -48 -54 -14 0 -31 -55 -41 -26 -40 -34 -30 -24 -38 -44 -40 -19 -18 -36 -31 -35 -47 -53 -32 -16
3471 -16 -51 -73 -69 -40 -61 -59 -38 -36 -65 -84 -50 -29 -43 -59 -62 -60 -56 -66 -56 -40 -52 -77 -86 -48 -49 -49 -53 -50 -65 -73 -66 -33 -21 -47 -59 -49 -27
3508 -27 -42 -28 -19 -37 -62 -55 -12 -1 -17 -34 -28 -22 -26 -18 3 13 -6 -32 -14 -12 12 -9 -8 -9 -12 -14 -11 5 20 7 -20 -1 3 -1 28 21 -1 -5
3546 -5 -6 8 22 11 5 16 0 -1 9 43 36 21 0 12 34 38 28 32 27 20 7 27 57 55 30 18 42 44 45 55 60 54 48 45 60 80 66 60 49
3585 49 52 46 56 78 59 41 17 36 61 51 43 55 53 22 8 41 64 56 38 23 28 41 34 38 45 34 19 25 36 50 51 41 28 19 24 38 60
3622 60 41 20 11 39 51 22 38 41 44 17 32 50 66 51 29 23 43 35 23 41 52 44 14 29 38 40 25 17 20 9 7 19 28 13 -7 -10 7
3659 7 14 15 3 11 -6 -25 -31 12 14 1 -20 -15 -9 -19 -7 4 -7 -25 -34 -18 3 -8 -18 -21 -23 -25 -27 5 7 -11 -35 -29 -11 -8 -21 -4 -12 -33 -40
$$ packed form
3395A3QJ9kj0%onj0K7K4j6l1j7K1J9j5nLMm2NJ6K9j5k6JmPnK5rk5j6J3K3j3nn
3433b5Kk5QK7K4k4l3QJ5jj3K3Kj8j8oM0J4l1k4J4J5j4OMOj4oMK1Jj8Nmj2oK1J6
3471a6l5k2MK9k1KK1Kk9j9L4K1j4j6lKMj0J0J6j2k5rL8j%mLj5qPL3J2k6j2J0K2
3508b7j5J4Rj8k5PM3J1j6j7OOmQK1J0j9k6J8KK4k1JjlkLJ6J5j3k7J9MmK9pk2m
3546ejJ4J4j1oJ1j6jJ0L4pj5k1J2K2Mj0Mnpj3K0L0kk5j2K4KJJ0NoolJ5K0j4oj1
3585D9LoJ0K2j9j8k4J9K5j0qJ2kl1j4L3K3qj8j5NJ3pMPj1j5OJ1J4Jj0j3rNJ4K2
3622F0j9k1rK8J2k9J6LLk7J5J8J6j5k2oK0qj2J8J1ql0J5RKj5qLj1kJ2Rj5k0lJ7
3659GPJj2Qj7j9oM3Kj3k1NOj0J2J1j1j8rJ6K1j1j0lkkkL2Kj8k4OJ8Lj3J7qk1p
$$ plain form
3698 -40 -26 4 -7 -23 -27 -25 -24 -33 -28 -5 -25 -46 -60 -37 -25 -19 -40 -32 -39 -49 -47 -37 -32 -51 -61 -61 -44 -41 -43 -44 -58 -61 -76 -50 -35 -47 -67 -53
3736 -53 -45 -55 -51 -49 -31 -28 -53 -53 -31 -28 -42 -56 -35 -27 -26 -36 -15 -21 -41 -34 -48 -17 -21 -17 -16 -32 -27 -31 -18 -6 -10 -39 -28 -18 -23 -18 3 13 -17
3775 -17 -35 -20 -3 9 -14 -5 -7 -15 -29 -24 3 12 -16 -21 -19 3 3 2 0 5 -22 -9 0 21 19 8 11 11 20 22 40 42 30 13 27 39 46 39 46 38 23
3816 23 28 38 57 53 24 29 41 50 50 56 53 50 31 39 60 69 54 38 45 37 29 47 59 43 24 22 43 50 53 38 32 33 24 22 39 66 46 29 24 27 45
3857 45 36 32 54 34 30 32 42 57 42 35 34 24 41 46 60 50 28 29 35 50 39 48 46 46 15 46 42 61 38 21 28 34 32 17 32 34 18 -2 8
3896 8 31 27 2 3 11 -2 4 -3 29 11 -20 -19 -5 3 4 -8 -8 -6 -27 -14 -3 9 -13 -15 -20 -10 -2 1 7 -7 -13 -26 5 13 4 -4 -3 3 -15 -8 -2 12
3938 12 8 -24 -20 -18 3 -1 -16 -10 -11 -31 -22 5 -10 -29 -25 -29 -28 -22 -19 -10 -31 -56 -50 -15 -24 -40 -45 -42 -46 -38 -45 -37 -26 -44 -61 -50 -29 -30 -31 -40 -30 -39 -42
3981 -42 -34 -26 -20 -40 -42 -49 -44 -20 -16 -10 -28 -37 -38 -2 -7 -15 -22 -21 -34 -24 -14 -14 -18 -32 -49 -26 -19 -17 -20 -29 -30 -40 -44 -18 4 -16 -24 -41 -32 -37 -19 -12 -15 -35
$$ packed form
3698d0J4L0j1j6mKJrNK3k0k1j4K3J2Ok1Qpj0KJ0Nj9j0%J7Lkjj4lj5K6J5j2k0J4
3736e3Qj0MKJ8Lk5%K2Lj4j4K1QJj0K1ok0Pj4L1mMJj6NmJ3J2mk9J1J0nNK1J0l0
3775a7j8J5J7J2k3Rkqj4NK7Rk8nKK2%jkNk7J3RK1kj1L%RKJ8Kj2j7J4J2PpPqj5
3816B3NJ0J9mk9NJ2R%Ollj9QK1Rj5j6PqqJ8J2j6j9kK1PLj5oJrkJ7K7k0j7nLJ8
3857D5rmK2k0mKJ0J5j5pjj0J7NJ4j0k2JOJ5j1Rk%l1L1mJ9k3j7POkj5J5Kj6k0J0
3896HK3mk5JQj3OpL2j8l1JJ4QJj2%Kk1J3J1J2k2knJ0QLOj4oj3L1QrqJOj8POJ4
3938A2ml2MKK1mj5Ojk0RK7j5j9MmJOLRk1k5OL5rj6nLmQpQJ1j8j7J1K1jjrJ0rl
3981d2QQOk0kpNK4MOj8rjL6nqpJj3J0J0%mj4j7K3PKlrjj0mK6K2k0qj7RnJ8Plk0
$$ plain form
4025 -35 -31 -26 -11 -11 -19 -23 -18 -31 -31 -13 4 -3 -34 -14 -2 1 10 5 18 12 -14 -2 20 28 21 1 2 25 29 27 25 44 18 17 24 41 40 33 39 23 11 25
4067 25 39 51 35 15 25 44 32 26 36 37 26 14 18 49 40 33 15 14 29 29 34 39 40 16 7 28 43 38 27 30 32 26 29 41 55 37 26 20 38
4106 38 34 45 46 37 29 19 38 55 42 32 36 41 31 30 40 51 31 20 28 36 43 28 23 17 16 20 19 35 26 15 8 11 23 20 19 13 23 -8 0 10 19 7
4148 7 -5 -2 9 -3 0 7 12 5 -1 -3 10 22 6 14 -1 5 10 7 21 19 -10 -5 -9 1 8 2 5 -4 -15 -4 9 11 7 -25 -13 -1 -8 -3 8 9 -12 -21 -15
4191 -15 -3 5 -11 -27 -21 -23 -26 -22 -14 -15 -35 -45 -41 -30 -22 -32 -40 -38 -45 -40 -31 -24 -38 -43 -44 -30 -33 -34 -22 -23 -48 -37 -34 -16 -20 -31 -27 -26 -26 -30 -23 -16 -8 -28 -27
4236 -27 -27 -23 -16 -15 -18 -34 -32 -43 -23 -12 -29 -24 -30 -31 -27 -31 -14 -18 -46 -41 -27 -20 -26 -36 -29 -30 -40 -42 -33 -27 -30 -40 -33 -28 -21 -30 -15 -18 -35 -44 -24 -10 0 -14
4280 -14 -16 -19 -20 -10 -9 8 -7 -24 -6 -2 11 -1 3 6 11 -12 12 26 25 17 5 3 31 9 13 32 17 4 -11 5 31 30 12 13 18 3 20 13
4318 13 26 12 1 -2 14 28 21 16 24 9 6 22 33 18 15 13 16 23 19 34 27 22 16 25 30 41 42 25 31 40 36 39 45 51 33 26 25 51 56 50 49 40 44 35 44 47
$$ packed form
4025c5MNJ5%qmNj3%J8J7pl1K0J2LRnJ3ok6J2K2Qpk0JK3MkkJ9k6jPJ7jpOj6j2J4
4067B5J4J2j6k0J0J9j2oJ0Jj1j2ML1rpj8jJ5%NNJk4rK1J5nj1LKoLJ2J4j8j1oJ8
4106C8mJ1Jrqj0J9J7j3j0MNj0jJ0J1k0j1QQPj5nojMjJ6rj1pLJ2ljoJ0l1QJ0Rj2
4148Gj2LJ1j2LPNpokJ3J2j6Qj5ONlJ4kk9NmJ0PoLrj1J1J3Kml2J2J2pNJ1Jk1rO
4191a5J2Qj6j6OklMQjk0j0MJ1Qj0qKpNRPj4njJ4ljJ2jk5J1LJ8mj1MJ%mPPQk0J
4236b7%MPJlj6Kj1K0J1j7NojMmJ7mk8NJ4Poj0Pjj0kROlj0PNPrJ5lj7rK0J4J0j4
4280a4kljJ0JJ7j5j7J8MJ3j2MLNk3K4J4jqj2kK8k2MJ9j5j3j5J6K6jj8JNj5J7p
4318A3J3j4j1lJ6J4pnQj5lJ6J1j5lkLPmJ5pnoRNJ1Jj7ORmLOOj8pjK6NojrMrRL
$$ plain form
4364 47 43 30 40 34 38 30 32 35 31 7 16 27 32 18 8 10 14 19 13 26 20 6 5 -1 14 16 -2 0 0 2 -1 6 20 13 -2 4 10 3 4 16 25 9 -11 2
4408 2 14 21 4 2 11 8 1 3 20 15 4 -1 6 23 15 10 1 12 -7 1 -7 -7 0 -11 -24 -13 -23 -25 -8 -24 -29 -33 -27 -9 -16 -25 -32 -41 -30 -44 -20 -18 -27 -34
4452 -34 -30 -27 -33 -17 -24 -22 -25 -34 -18 -20 -10 -21 -28 -33 -25 -18 -19 -6 -17 -12 -23 -3 -6 -10 -21 -16 -7 -11 -30 -7 -3 -21 -27 -26 -23 -19 -22 -26 -22 -36 -36 -38 -17 -26 -38
4497 -38 -44 -42 -37 -34 -30 -22 -28 -38 -37 -26 -33 -32 -39 -25 -25 -25 -23 -15 -15 -19 -24 -21 -18 -13 -8 -11 -1 -11 -11 -12 15 -7 -11 -15 -12 -2 12 14 12 1 -3 1 4 1 17 9 -1 1
4545 1 4 5 24 20 11 0 13 8 14 5 7 16 -9 -3 23 26 15 -2 -8 0 11 5 8 20 0 10 4 20 40 15 12 27 31 29 36 32 35 37 26 31 42 27 35
4588 35 33 33 30 31 39 37 50 32 44 43 34 25 40 49 30 21 38 46 37 33 28 21 23 35 31 20 24 35 18 10 24 35 16 12 23 14 8 15 30 15 8 14 17 17
4632 17 21 8 14 15 -2 11 25 23 23 14 21 19 19 22 30 28 16 22 13 14 13 27 20 7 6 27 22 28 20 9 8 7 -2 15 14 7 1 -15 0 1 -4 -15 3 -9 -18
4677 -18 -19 -2 -4 -9 -24 -22 -4 -5 -16 -15 -18 -23 -27 -23 -21 -14 -27 -21 -14 -28 -23 -17 -10 -21 -28 -4 -3 -14 -9 -6 -4 -13 -19 -21 -1 -2 -18 -11 -14 -4 -14 -18 -5 -5 -13 -18
$$ packed form
4364D7mj3J0oMqKLmk4RJ1Nj4j0KMNoJ3oj4joJ5Kj8K%KlPJ4pj5OOpJJ2Rj6k0J3
4408BJ2Pj7kRlpKJ7nj1nPJ7qnrJ1j9Qq%Pj1j3J1j0kJ7j6nmOJ8prprJ1j4K4Krp
4452c4MLoJ6pKlrJ6kJ0j1pnQPjJ3j1Nj1K0lmj1NRmj9K3Mj8oJLMlmMj4%kK1rj2
4497c8oKNLMQoj0JJ1pJpJ4%%KQ%mnLLNNlJ0j0%jK7k2mmLJ0J4Kkj1mMLlJ6qj0K
4545ALJJ9mrj1J3nOrKRk5OK6Lj1j7oQJ1oLJ2k0J0oJ6K0k5lJ5MkPmLKj1NJ1j5Q
4588C5k%lJQkJ3j8J2jrrJ5Rj9rJ7QrmnpKJ2mj1MJ1j7qJ4J1j9mJ1roPJ5j5pOL%
4632A7Mj3OJj7J3J4k%rPk%LQkj2OrJjJ4pj3jK1nOqj1jjrJ7jpoj6J5Jnj1J8j2r
4677a8jJ7knj5KJ8jj1JlnmMKPj3OPj4NOPj1pK4Jj1NLKrokK0jj6PlJ0j0mJ3%qn
$$ plain form
4723 -18 -17 -11 -12 -19 -23 -34 -29 -27 -33 -11 -34 -32 -24 -29 -18 -29 -22 -29 -26 -47 -32 -24 -18 -34 -38 -27 -32 -27 -35 -28 -28 -31 -33 -21 -7 -10 -21 -18 -19 -16 -24 -18 -13 -12 -14 -25 -7
4770 -7 3 -6 1 -2 -11 -4 3 -3 0 -4 -10 -10 -5 -22 9 -4 -8 -6 -25 1 -7 -9 -8 -8 -12 -9 -10 6 -14 -13 -19 -7 6 -7 12 -3 -9 -11 -4 5 4 -2 -1 11 14 10 10
4817 10 20 16 6 2 16 19 20 21 19 28 17 9 27 32 26 19 31 26 38 33 28 37 26 27 43 35 25 26 35 27 20 22 26 24 20 10 12 10 25 23 16 18 16 9 16 7 18
4864 18 7 6 8 15 18 13 22 15 16 16 23 39 27 22 17 24 22 13 16 23 25 15 9 22 27 19 8 12 20 16 14 28 24 16 8 13 19 12 3 5 7 -2 1 1 -3 6 5 -12 -17 -11 -4 -4
4916 -4 -2 -11 -14 -16 -9 -16 -18 -10 -15 -19 -21 -18 -4 -6 -21 -25 -11 -19 -9 -14 -8 -3 -21 -15 -8 0 -11 -4 -15 2 2 5 2 -4 -12 -15 -21 -5 8 -7 -17 -7 -15 -26 -7 -4
4962 -4 -18 -24 -19 -8 -15 -26 -11 -13 -26 -38 -31 -24 -20 -27 -33 -37 -22 -24 -35 -34 -31 -28 -30 -30 -27 -16 -16 -18 -27 -24 -34 -24 -14 -33 -21 -23 -24 -15 -20 -10 -16 -20 -27 -24 -1
5007 -1 6 -15 -18 -5 -21 -7 0 3 6 -13 -13 -8 -15 -6 -9 -19 -10 -8 -13 -13 -14 -15 -22 -17 -10 -8 -14 -7 -8 -14 -17 -15 0 -13 -20 -7 -16 -14 -5 -6 -9 -1 -12 -4 -2 10 -10 -3 -6
5056 -6 -4 4 0 14 15 10 4 -1 21 21 15 19 11 19 15 18 16 32 29 22 28 25 30 20 33 24 21 16 26 19 35 16 12 15 15 10 6 25 13 14 6 21 8 10 16 9 7 5 16
$$ packed form
4723a8JOjpmj1NKoK2k3KQnJ1j1PpLk1J5QOj6mJ1nNqP%lkJ2J4lj1LjLqONJkj1J8
4770gJ0rPlrPPoLmo%Nj7L1j3mKj9K6qkJ%mLjJ6k0JoJ2J3j3J9j5okPRjoJJ2Lm%
4817A0J0mj0mJ4LJJkRj1qJ8NopJ2nJ2nnRj1JJ6qj0JRqpKMkmj0KkJ5kpKkpPrJ1
4864A8j1jKPLnRpJ%PJ6j2nnPkrLPKj0oJ3Nqj1MQmkJ4mqqNOprKKrL%mRjj7nOP%
4916dKrlkPpkQnmkLJ4kj5mJ4qJ0nONj8OPQj1Pj1J7%LloqloJ6J3j5j0J0qj1J9L
4962dj4oNJ1pj1J5kj3j2PPMpomJ5kj1JLLk%LJ1%krLj0J0J0j9J2kjRnJ0ompLK3
5007aPk1lJ3j6J4PLLj9%NpRlj0RKn%jjpNPKoPjolKJ5j3pJ3rKRjlQj1QKJ2k0Pl
5056fKQmJ4JnonK2%oMqQmLkJ6lpOlNj0J3rlnJ0pJ6j9mL%nmJ9j2JqJ5j3KOpkkJ1
$$ plain form
5105 16 23 25 10 5 0 7 11 21 31 20 2 17 24 32 19 21 24 21 18 25 20 37 22 9 29 22 10 33 33 11 29 13 22 24 17 28 26 16 8 4 14
5146 14 15 12 0 10 7 0 11 -7 -4 -13 -12 1 -2 -13 -7 -10 -2 -5 -19 -13 -7 -11 -21 -12 1 8 -6 -4 -13 -9 -9 2 12 0 -7 4 2 0 -6 3 6 -17 -11 -5 11
5191 11 1 -11 -4 0 -8 3 -2 -19 -2 -7 -20 -11 3 -14 -13 -24 -16 -25 -12 -20 -22 -26 -27 -18 -30 -23 -22 -17 -26 -33 -39 -19 -19 -23 -25 -17 -35 -27 -19 -19 -16 -19 -25 -24 -21 -12 -9
5238 -9 -7 -6 -13 -16 -5 -6 -11 -4 -8 -4 -15 -2 7 -2 -3 -4 -2 -4 4 7 -2 -15 2 -1 4 -13 1 -12 -17 -6 -12 -17 -4 -21 -14 -27 -4 -20 -5 -11 -22 -12 -27
5281 -27 -9 -14 -19 -14 -9 -19 -14 -12 -7 -14 -9 -15 -21 -12 -6 -9 -3 -7 -6 -12 4 4 1 4 10 6 -1 17 13 8 18 6 6 32 25 27 21 24 32 7 17 17 19 14 0 2 16 17 16
5330 16 23 0 4 13 14 10 6 5 2 3 5 6 24 14 2 5 15 22 7 20 12 28 19 21 19 23 26 15 18 18 23 22 22 27 22 14 30 20 35 25 37 26 20 19 26
5375 26 30 24 15 14 21 23 23 20 11 13 16 7 13 11 13 -7 -3 -11 5 5 13 6 -11 -15 -4 -9 -14 10 -15 8 1 -2 5 7 1 -10 -2 -9 -3 -13 5 1 -1 -12 -3 -1 4 5 2
5424 2 -4 9 4 0 15 14 -4 0 14 13 0 10 -18 9 -7 -6 -5 -16 -9 -20 1 -7 -14 -12 -13 -12 -16 -22 -20 -29 -23 -12 -28 -20 -1 -20 -10 -21 -16 -12 -12 -21 -19
$$ packed form
5105A6PKj5nnPMJ0J0j1j8J5PQj3KLllPnJ7j5j3K0pj2K3%k2J8j6RKpJ1kj0qmJ0
5146A4Jlj2J0lpJ1j8LrJJ3lj1OlQlj4OOmj0RJ3Pj4KrM%J1J0j2pJ1kkoRLk3OOJ6
5191A1j0j2PMqJ1nj7J7nj3RJ4j7Jj1QrJ3qkmjRj2PJNrpoK0%mkQj8QQ%LloJLRL
5238iKJplJ1jnPmMj1J3RrjjKkQLrj3J7lNj7J4j3nJ1onJ3j7Pj3K3j6J5oj1J0j5
5281b7J8nnNNj0NKNpNooROlOmJoJ6%lLOmpJ8mnJ0j2%K6pKoLQk5J0%Knj4KJ4Jj
5330A6Pk3MRJmmjlJKJJ8j0j2LJ0Pj5J3qJ6rKkMLj1L%Nj%NnqJ6j0J5j0J2j1ojP
5375B6MorjPK%lrKLrOkKk0MqJ6%Qpj7mJ1nnK4k5K3plPKoj1QpOj0J8mkj1RKNJl
5424BoJ3nmJ5jj8MJ4jj3J0k8K7j6JJj1Pj1K1qpKjJmoKrOJ1j6QJ9j9J0j1NM%rK
$$ plain form
5467 -19 -19 -12 -16 -13 -22 -10 -2 -25 -11 -17 3 -11 -5 -1 2 -9 -12 -15 -2 -18 -12 -15 -11 -13 -8 -5 5 6 -4 -11 -12 -1 -6 -1 1 -16 -12 -12 -16 -11 -14 -7 -20 -12 -11 -16 -8
5514 -8 -15 -18 -18 -24 -13 -17 -13 -15 -11 -16 -11 -20 -13 -8 -18 -21 -11 3 -2 -17 -11 -10 -5 7 7 11 12 -5 1 5 1 5 12 14 -2 4 5 7 4 13 16 10 9 19 23 16 16 7 2 7 11 10
5566 10 7 4 11 3 1 5 9 17 -4 10 9 9 4 20 21 0 8 16 10 12 7 6 -6 8 10 17 28 19 10 13 26 10 23 29 24 26 19 28 27 25 21 26 13 28 28 29 20 24
5614 24 21 14 25 20 29 28 14 15 14 9 19 12 25 1 2 8 17 8 4 12 4 7 4 19 1 6 1 -1 -6 -1 2 19 3 8 1 2 12 7 12 3 3 16 8 1 11 4 14
5661 14 16 13 9 13 14 12 6 0 13 17 4 -8 1 9 -2 10 10 13 8 -3 3 -5 -6 -13 7 -8 -27 -10 -1 -12 -9 -13 -30 -9 -10 -25 -23 -11 -12 -16 -25 -19 -29 -15
5705 -15 -40 -20 -14 -19 -19 -11 -11 -12 -3 -9 -11 -1 12 -19 -11 -12 -2 -6 8 -6 -2 -12 -4 -12 -2 -13 -5 8 -13 -19 -5 -5 9 -1 -8 -5 0 -17 -19 -23 -11 -21
5747 -21 -18 -17 -14 -18 -23 -18 -22 -21 -9 -7 -21 -13 -17 -4 -9 -23 -14 -14 -18 -20 -19 -4 -23 -10 -12 -14 -15 -12 -6 6 8 1 1 11 15 -1 7 0 11 6 5 10 12 0 -6 1 10 2
5795 2 17 2 12 9 14 2 11 10 7 5 10 12 -4 4 -7 8 -12 0 11 -2 12 -12 -6 1 -3 6 0 1 7 5 1 -1 12 4 4 12 9 4 15 15 23 19 12 17 17 37
$$ packed form
5467a9%PmLrJ2Qk3J4oK0j4OMLj1llJ3j6OlMkNLJ0Jj0pjJ1nNKj7M%mNlPj3QJnQ
5514hpl%oJ1mMkMnNrPNj0lJ0J4nj5OJNJ2%MJj7OMmMPKj6OJKlRLojJ0Mp%rnNMj
5566A0llPqkMMQk1J4j%nJ6Jk1QQoKnjj2J4KPJ1rrLJ3j6J3OnKpRjkmNj3J5%JrM
5614B4lpJ1nRjj4JjnJ0pJ3k4JORrmQqLlJ5j8NnknNLJ7j6NpJJ0nNr%J3qpJ0pJ0
5661A4KlmMJkooJ3Mj3j2RQj1J2%Lnj1OqjpK0j5j9J7Rj1Lmj7K1jj5KJ2jmrOj0J4
5705a5k5K0On%Q%jRokJ0J3l1QjJ0mJ4j4Mj0QqJ0j1QJ3k1oJ4%J4j0pLNj7kmJ2j0
5747b1LJLmnNmJJ2Kj4QmJ3nj4R%mkJJ5j9J3kkjLOJ2Kp%J0Mj6QpJ1njNKj2oPRq
5795BJ5j5J0lNj2RjlkNKj6Qj1J5k0J2J1j3J4k4OPmRoJOkmkJ3q%QlnJ1%QmpN%K0
$$ plain form
5841 37 38 27 22 23 23 21 19 27 15 18 16 9 27 24 28 11 14 23 18 14 5 17 11 15 12 14 5 5 11 10 10 16 11 8 7 10 0 14 5 4 -7 10 -1 5 7 12 17 10 8 6
5891 6 12 14 10 6 7 5 11 16 2 16 11 17 25 12 2 9 18 18 17 13 21 7 7 9 4 9 5 9 4 4 5 -9 -7 -10 2 -11 -17 -15 -8 -5 -10 6 -29 -9 -19 -3 -13
5938 -13 -19 -16 -14 -4 -17 -9 -19 -15 -21 -15 -8 1 -6 -10 -3 -4 -9 -11 -23 -3 -9 -9 -2 -5 -9 -4 1 10 5 1 -3 5 -8 -7 3 2 -1 -5 -10 -9 -10 -9 -15 -9 -5 -22 -16 -22 -23 -22 -15 -28
5990 -28 -18 -11 -14 -15 -35 -29 -23 -18 -18 -12 -17 -20 -13 -15 -24 -15 -6 -14 -20 -6 -11 -9 -12 -6 3 -2 -2 7 0 11 1 7 6 1 2 11 17 14 4 6 16 6 -1 0 4 5 0 17 8 0 11
6041 11 3 -2 14 -4 -2 2 5 -6 -11 -9 -4 -1 -4 -6 0 -4 -5 -5 3 -1 -11 -10 -2 5 8 -7 0 0 4 11 17 15 9 8 16 26 15 21 21 19 15 20 32 21 26 17 11 13 26 17
6091 17 27 21 13 16 8 19 11 20 10 17 8 4 15 8 17 6 5 12 2 2 7 3 0 4 3 10 13 9 6 0 7 9 2 0 12 -4 -3 3 7 14 9 6 17 17 17 26 22 9 23
6140 23 10 22 21 24 31 12 22 15 11 15 18 17 17 11 8 15 13 11 13 6 -14 -2 -9 5 4 -12 3 -9 -15 -13 -7 -6 -5 -6 -7 -7 -7 -12 -21 -22 -18 -8 -13 -6 -10 -20 -12 -3
6188 -3 -18 -10 -8 -19 -3 -5 -20 -1 -2 -11 0 -1 6 -16 0 11 -10 -18 -14 -15 -10 -15 3 -8 2 -10 -9 -5 -3 -7 -16 -11 -12 -17 -22 -10 -15 -24 -21 -19 -24 -15 -22 -22 -23 -26
$$ packed form
5841C7Jj1nJ%kkQj2LkpJ8lMj7LRnmrJ2oMlKr%Oj%OnljLj0J4rjj1J7j1OKNNpkk
5891FOKmmJkONj4J4nOQj3j0PR%jmQj4%KnNmMn%Jj4KlJ2j3oKPLnJ6l5K0j0J6j0
5938a3oLKJ0j3Qj0MoOPRpmPjnkj2K0o%PlmNNRnmmQj3JJ0jlmnJjJoOMj7OojJPj3
5990b8J0Pljk0OON%OnlPkrRRqoJ4nKlORn%RpJ1j0OjnJROlj0KJ0j0pJMJnJ7rqJ1
6041A1qnJ6j8KMLj1nKNLlkOmj%Qmj0JQPLj5P%MPOkojQJ0j1O%kmNJ2j1NroKJ3r
6091A7J0oqLqJ1qRj0PrmJ1pRj1jPj0%NmlMjPLmloPKpkJ2j6JOMPnlJ1%%Rmj3J4
6140B3j3J2jLPj9J0pmMLj%olPkkKpk0J2pJ4jj6J5j2oKOJJjj%%nrjMJ0nPmj0QR
6188cj5QKj1J6kj5J9jrJ1jPk2J6J1k1qMjNnJ8j1J0j2JMKmrNjnnJ2nrLKnRp%jl
$$ plain form
6234 -26 -18 -14 -17 -14 -16 -22 -25 -15 -22 -26 -20 -18 -9 -19 -12 -18 -17 -21 -17 -18 -2 6 1 -2 -3 3 -3 4 9 1 -7 -3 -5 -2 10 6 2 5 -2 6 -3 7 -2 -2 5 4 12 14 0 -2 -1 -11 -19
6287 -19 -13 -13 -3 -5 -3 3 -3 -2 -13 -12 -8 -3 -7 -8 -5 0 -5 -3 7 -2 -12 -1 -1 2 11 15 15 8 11 10 3 14 17 4 20 21 7 13 8 12 15 20 15 9 12 7 9 14 13 17 14
6338 14 22 20 13 11 10 7 -3 11 9 7 -4 -7 -13 -4 2 -1 7 -2 9 6 4 3 -8 3 3 -5 9 8 9 8 9 15 7 19 21 13 13 15 29 27 25 12 25 26 27 19 14 27
6386 27 33 15 16 16 21 21 24 27 7 15 12 11 8 17 8 6 -8 2 -4 0 0 -4 -11 -13 -9 -5 -13 -20 -22 -11 -11 -10 -12 -10 -14 -14 -8 -7 -20 -1 -7 -7 2 0 -12 -3 -2 -2 -2 -4 3 16
6438 16 11 12 8 -4 -7 5 5 1 -10 -2 -7 -4 -5 3 1 1 -14 -19 -17 -11 -11 -19 0 -22 -26 -23 -13 -23 -17 -15 -24 -33 -31 -32 -18 -18 -11 -7 -17 -11 -8 -14 -11 -16 -4 -24 -15 -20
6486 -20 -11 -19 -28 -11 -23 6 2 -7 4 -5 0 -3 -2 -3 -1 4 2 0 6 -2 3 4 0 12 0 5 7 1 -18 -2 5 -10 1 5 1 1 2 -15 -22 -5 -6 -10 -12 -5 -12 -8 -8 -5
6534 -5 -12 -6 1 1 -4 4 -6 0 -6 -10 -3 -3 4 -4 3 13 3 9 8 12 15 2 16 -2 20 21 9 7 14 12 18 17 19 8 20 16 14 12 13 10 18 22 7 19 11 15 15 4
6582 4 4 11 18 -2 -6 -8 1 0 -1 13 3 -3 -8 0 -1 0 -4 -2 14 6 -3 0 4 6 -6 -2 6 13 17 11 10 16 7 24 23 18 21 16 19 25 5 7 14 21 17 8 21 18 11 17 14 19 10
$$ packed form
6234b6QMlLkolJ0pmOKRj0PoJmMjJ6QnljOoPNqqMkLJ2mmLpQrJ0r%PjQKj4kJj0q
6287a9O%J0kKOoJj1JMNmjLNnKJ0rj0J1%LRM%pLjpJ1Lj3J6Jj4OnMLNnoLnKNjMl
6338A4Qkpkjlj0J4kkj1loROlQrJ1lkjj1J1%qJ4jJjJOqJ2Kq%KJ4kkj3J3JJqnJ3
6386B7Oj8J%N%LLk0QljlRrkj4J0oM%mpkMMqpkJ1%JkKm%OJj3J9o%Rkj2RJ%%kPJ3
6438A6nJmj2lJ2%mj1QnLjQk%j5nKO%qJ9k2mLJ0j0OKrrKjJ4%PMj0OLoLnJ2k0Rn
6486b0RqrJ7j2K9mrJ1rNlJjKNkkOqNJmJ2j2NKoj9J6Pj5J1Mm%Jj7pJ7jmkPpM%L
6534epOP%nQj0OomP%PqPJ0j0OjMLj3J4j8K2Jj2kPkOjKj1J2mkkJlQMj5J2qM%j1
6582D%PPk0mkRjjJ4j0onQjJmKJ6qrLMKj2MQPMojOrJ7jnLnLOk0KPPmrJ3lpOlNr
$$ plain form
6635 10 9 17 13 3 8 -6 11 -8 7 11 12 3 -1 1 -14 -6 -1 -5 -8 7 5 8 7 -2 2 -5 -9 -8 3 -10 4 6 10 -1 -3 3 -11 7 0 8 4 4 6 1 13 -1
6681 -1 6 6 12 4 -3 2 6 6 2 0 13 17 1 -2 4 -11 -2 -15 -8 4 -8 -11 -13 -20 -14 -28 -25 -12 -14 -13 -20 -9 -15 -8 -15 -16 -18 -13 -25 -4 -10 -4 -15 -15 -26 -20 -6
6728 -6 -5 -3 -16 -8 1 2 -7 -1 0 7 5 4 7 16 5 1 8 -1 -1 4 -6 13 -2 -8 -7 -4 -4 6 -4 -12 -13 0 -5 -9 -6 -11 -9 -12 -8 -7 -4 -8 -27 -21 -16 -14 -14 -10 1 -4 -13
6779 -13 -1 -6 0 -2 2 -2 16 -1 -8 4 2 6 -1 12 15 4 4 14 16 13 24 10 18 21 9 5 7 5 24 7 12 2 23 6 1 26 14 -4 14 12 10
6820 10 1 7 13 -13 0 4 7 5 7 -6 1 -1 -9 -2 3 -5 2 2 6 13 2 -5 -1 -6 14 19 22 23 8 4 17 24 14 9 18 20 16 30 24 22 22 14 16 16 21 20 8 5 7 18
6870 18 7 15 20 17 13 12 14 1 3 10 7 -6 -2 4 6 -6 -12 7 -9 -2 -5 -4 -1 -2 10 -5 5 1 -1 -2 -6 0 1 -5 -8 1 6 2 3 13 13 3 10 20 9 18 15
6917 15 19 6 5 17 20 14 22 10 4 20 4 19 4 12 6 0 4 -1 -8 3 -5 -8 -1 -6 5 -3 -4 -4 -14 -17 -12 -3 -4 -8 -22 -7 0 -12 -6 -13 -17 -13 -18 -13 -4 -15
6963 -15 -13 -6 2 3 -6 -12 -4 5 -14 -6 14 -6 1 -6 10 2 1 6 4 -1 4 -2 -1 -11 -1 -7 12 -4 -5 -7 3 -4 1 -6 -12 4 -6 -19 -9 -5 -18 -9 -14 -22 -23 -21
$$ packed form
6635A0jQmj0Nj4J7j9J5MJrmKj5QNmlJ5kLjrMpmJJ1j3J4KMj1kOj4J8pQm%KnJ2j4
6681aP%OqpNM%mkJ3Mj6lOj5Rj3PJ2j2lkpOj4LJ3kJpJ1oPpjkNj2K1oOj1%j1OJ4
6728fJKj3QRJrOJPkjLRj1mPr%Nj0J9j5oJL%J0j0qjJ3nmLnKlMJLmj9ONK%MJ1nr
6779a3J2nOkMmJ8j7pJ2kMpJ3Lj1%J0KlJ1j4QLj2mKkJ9j7Nj0K1j7nK5j2j8J8kk
6820A0rOOk6J3MLkKj3PkqPNqP%MPj1pMnK0NLJj5mJ3Pj0nRKmJ4ok%qK%Njj2lKJ1
6870A8j1QNlmjKj3KPlj3MOKj2oJ9j6PlJLjJ2j5J0mkjmOJolRNmJJ0%j0PJ0j1Rl
6917A5Mj3jJ2LoQj2oJ6j6J5j5QooMnpJ1qlPnJ1qj%j0lNRjmj4J5Pj2OpmMnNRj1
6963a5KPQJroQRj9QK0k0PpJ6qjNknNoJj0J0oJ9j6jkJ0pNpoJ6j0j3J0Mj3RnqjK
$$ plain form
7009 -21 -15 -13 -17 -21 -18 -14 -10 -5 0 -15 -7 -7 -8 -11 -9 -1 -4 -11 -3 -6 -6 4 -3 -9 -2 21 3 1 11 16 7 0 13 8 2 9 9 12 8 0 6 1 4 7 -1 5 0 7 5 1 -7 3 -2
7062 -2 -1 0 -7 -3 -3 2 -12 5 -15 2 -4 6 -10 0 8 -3 -3 2 3 -3 2 -6 1 15 16 3 -1 13 7 5 18 10 15 8 8 15 14 7 13 13 10 10 -1 14 11 12 24
7109 24 12 18 4 11 -1 1 6 -4 8 -4 10 6 1 0 3 4 -4 -3 -16 -4 1 5 -8 -3 -1 2 4 2 6 10 4 5 5 -6 6 -3 3 1 -2 -6 5 7 5 7 16 6
7155 6 13 16 6 9 5 6 13 15 16 8 6 6 13 5 7 10 -1 6 -11 0 -1 8 2 0 -12 -10 -5 -12 -11 -15 -18 -11 -13 -26 -9 -17 -5 -8 -17 -4 -13 -19 -19 -12 2 -11 -12 0 -8
7204 -8 -9 -14 -11 1 -5 -1 3 -4 -14 2 0 0 6 -15 0 -4 -11 -3 -1 5 0 -11 4 -6 4 -11 -9 3 2 -3 -2 -6 -12 -2 -9 -10 -9 -1 -7 -15 -11 -15 -11 -16 -7 -7 -13 -18 -14
7253 -14 -7 -11 -14 -14 -4 -17 -16 -8 -13 0 -13 -2 -5 -5 2 4 2 -3 5 4 6 3 18 10 6 2 3 9 9 -3 -2 8 2 3 -1 -1 9 -5 1 0 1 2 -11 -5 -3 -7 -11 -2 12
7302 12 -8 -6 -11 -9 -4 -4 -10 -10 -12 -5 -3 -4 -2 -1 -15 9 1 6 3 2 1 8 -5 9 6 9 -4 23 10 -5 7 17 7 21 18 18 14 11 5 12 12 3 19 18 11 11
7348 11 5 8 12 12 6 -4 -5 1 -1 -3 4 -5 -2 -2 4 -11 2 5 -3 -4 -10 -1 -21 1 11 1 -7 -3 -7 1 -11 -4 10 4 -6 9 -4 -4 11 9 4 3 8 6 7 15 17
$$ packed form
7009b1OKmmLMMNNj5Q%jlKQlpQl%J0poPK3j8kJ0NrpJ3noP%LmqOnLLqOnPkmqJ0n
7062bJJpM%Nj4J7k0J7oJ0j6J0Qj1%NJoNqPJ4Jj3mJ4okJ3qNp%PjpO%l%j1J5lJJ2
7109B4j2Oj4Pj2KNj0J2j2J4mnjLJqJj3J2NMj3NKLKkMMoJ%j1J2rOklmJ1KkKRj0
7155FPLj0LmJPKJqk%PqKLj1Pj7J1jRokj2KNpJmlPkj3J7qJ2lrJ3ro%PJ4j3jJ2q
7204hjnLJ2oMMpj0J6k%Ok1J5mpQKOnj1J5j0J0j5KJ2jnJmoJ0pjJQoqMmMnR%onM
7253a4Pml%J0j3JQnJ3j3J1l%PKknQjKlJ5qmmJO%j2JJ0oJm%J0j4OjJJj3OKmmRJ4
7302A2k0KnKN%o%kPKjKJj4K4qNljjPj3J4lLj3K7j3j5J2J0j0J4l%mloP%rJ6jp%
7348A1oLM%oj0jOkkPrL%Oj5J3LqjoRk0K2J0j0qMmQj2PJ4oj0J5j3%J5knjNkJQK
$$ plain form
7395 17 6 11 20 14 12 25 10 9 14 15 2 3 -2 8 11 5 1 7 3 4 3 2 0 -6 1 -4 -6 -7 -11 0 -8 -1 -15 -13 -9 -7 -11 -4 -8 -6 -13 -15 4 -4 -6 -3 10 -13 7
7444 7 9 -4 -1 -6 4 21 3 6 6 7 8 7 4 6 10 3 3 19 1 -3 15 4 3 10 0 1 4 9 -7 -4 -8 4 8 -6 -3 -18 -15 -5 -15 -11 -9 -16 -7 -21 -15
7489 -15 -12 -12 -12 -27 -22 -11 -12 -9 -13 -2 -10 -11 -10 1 -13 -7 -2 -1 -2 -2 -8 11 -9 6 9 1 11 10 1 9 14 7 11 4 -1 4 13 5 11 0 6 1 9 16 -4 -9 7 5
7537 5 6 -1 -6 -9 -10 7 -4 -4 -8 -5 -15 -7 -1 -13 -8 0 -7 -1 8 3 10 -3 3 14 3 7 10 7 -6 15 -5 5 2 12 3 5 7 7 19 17 8 20 16 20 20 14 16
7584 16 12 10 6 15 9 16 17 7 -3 5 3 5 4 -1 4 -1 7 -2 -4 5 -5 -3 -12 -9 -3 -9 -4 -8 6 -6 1 0 7 4 10 -2 -5 -9 7 -6 -14 14 -4 5 1 14 16 1
7632 1 2 17 10 10 19 13 24 7 12 17 18 11 19 4 6 23 -1 1 5 -8 5 6 -3 1 1 -2 -7 -19 -5 -1 -5 -13 -15 -3 -10 -20 -7 -15 -16 -20 -16 -11 -15 -5 2 -13
7678 -13 -27 -10 -17 5 -5 -7 -13 -20 -16 0 -12 8 0 1 -6 1 -4 -9 -4 -4 -6 7 5 -3 -8 -16 -22 1 -8 -10 -1 -11 -5 -16 -6 3 -15 -8 -16 -10 -5 -12 -9 -25 -18 -7
7724 -7 -18 -17 -21 -14 -15 -21 -19 -16 -30 -16 -24 -7 -15 -4 -7 -9 -8 -8 -8 1 0 -5 -11 -3 -6 -10 -5 2 14 3 7 16 5 8 -2 2 -2 6 6 3 7 -10 6 7 -7 9 -1
$$ packed form
7395A7j1NRokJ3j5jNJj3JnJ0LomOmJjjkoPnkjmJ1qPj4KMKmPmKpkJ9qkLJ3k3K0
7444GKj3LnJ0J7j8L%JJjlKMp%J6j8mJ8j1jPj0JLNj6LmJ2Mj4Lj5LJ0j0MKpRj4O
7489a5L%%j5NJ1jLmJ1qjJJ1j4ONJj%oJ9k0J5LqJ0jrQNpMpnNRqOj1OnQPk0nJ6k
7537EJpnljJ7j1%mLj0QOj2NQpORnPj3OJ1j1MLlj3K1k0J0lJ0rKK%J2krJ2mM%oK
7584A6mkmRoPJj0j0QkKjnNnQrkRj0KrLOoNmJ4j2PjPlOj2lmJ6j3qK8j8RmJ3Kj5
7632AJJ5p%RoJ1j7NNJpQj5KJ7k4KMj3J3JrM%lnj2J4MmqkJ2pj0J3qjmMNmJ0Pj5
7678a3j4J7pK2j0kopMJ6j2K0qJpPnnN%kJ3kqnqoK3rkRj0Oj1J0Rj8PqONpLj6PJ1
7724gj1JmPjoKLj4J4qJ7qJ1lkJ%%RjnoQlmNPJ2j1MRj1Lj0MmQ%lMj7J6Jj4J6j0
$$ plain form
7771 -1 -13 4 -2 -14 -11 -8 -13 -17 -9 -9 -9 -19 -16 -10 -10 -22 -13 -3 -16 -11 4 -11 -5 -6 -6 -1 -4 3 0 -11 -3 -2 1 -8 1 7 1 0 5 4 1 17 7 5 13 20 14 8 10
7820 10 15 13 6 4 14 11 17 -6 10 8 3 3 2 10 -9 8 4 -2 -5 5 -8 -5 -6 -10 -8 -10 -7 -3 -12 -5 -13 -13 -6 -2 9 10 5 -5 1 10 -6 6 10 2 10 1 10 5 8
7869 8 1 11 15 21 20 14 19 8 4 12 15 4 6 16 5 12 19 -12 8 8 2 9 12 8 -6 -8 -6 -16 -13 -6 -2 -11 -13 -15 3 -15 -22 -4 -12 -14 -3 -8 -6 -10 -12 -5 -3 0
7917 0 5 -9 9 -3 -10 -6 -2 7 2 4 -8 19 -3 5 4 5 8 9 7 14 9 6 -4 8 13 5 7 12 -6 4 -1 -2 -1 -1 2 -7 6 -5 -14 -16 -1 -15 -8 -3 -13 -13
7963 -13 -2 -10 -13 -26 -20 -27 -29 -18 0 -4 -7 -9 0 -15 -2 -4 -4 -1 1 -1 0 -2 -2 -2 1 7 8 0 7 10 -2 -1 11 3 10 7 -1 -1 13 10 -6 6 -6 -2 -1 5 0 -5
8011 -5 -2 8 -13 -12 -2 -7 -15 -9 -13 -10 -13 -7 -23 -18 -11 -15 -28 -5 -6 -20 -12 -4 -10 -8 0 0 4 6 2 -9 4 13 6 2 10 3 11 8 7 3 14 14 2 19 10 17 16 8 23
8060 23 10 25 13 23 13 8 8 8 4 5 9 5 16 -2 14 7 16 -8 3 -4 4 -4 -1 0 2 5 -3 -3 -1 -1 -1 -15 -2 1 -4 -6 -3 -2 4 3 14 -4 0 12 2
8105 2 11 11 23 4 10 9 18 10 15 2 17 12 10 10 9 11 9 9 5 3 4 3 1 1 7 -16 6 -5 0 -5 -5 0 -6 -2 -7 -6 -5 -12 -4 -12 -1 -7 -12 -14 -23 -14 -3 -3 -6 0 2 2
$$ packed form
7771aj2J7oj2LLnmQ%%j0LO%j2RJ0j3NJ5j5Oj%NlPlj1QJLrROojNjlJ6j0kQPooK
7820A0NkpkJ0lOk3J6kn%jQj9J7molJ0j3LjmKkLMrPq%PMJ1Jnj0ORj6J2MqQrRnL
7869HpJ0MOjoNj1mQLj1KJ0j1PPl1K0%oPLmj4kKj0LPMrkkJ8j8pJ8qkJ1nKmkPKL
7917@Nj4J8j2pMMRnKj2K7k2QjJLJkPnlj0J2NqKNj8J0njJ%LrJ3j1rkJ5j4PNj0%
7963a3J1qlj3OpkJ1J8mlkRj5J3k%LKkJk%%LOJqPLj2JJ2qPlq%J4lj6J2j2MJOnn
8011eLJ0k1JJ0nqOmLlOj6NPmj3K3jj4QQoKQ%MKmj1J3RpmQpQljmJ1%j2J7rPjqJ5
8060B3j3J5j2J0j0n%%mJMmJ1j8J6pRk4J1pQqLJKLq%K%%j4J3LnkLJOjJ1j8MJ2j0
8105BR%J2j9OjRqNj3J5nk%jKk%mkJjk%Ok3K2j1Nn%NoMnJJpQqJ1onkrRJ1%lOK%
$$ plain form
8157 2 5 -7 -10 1 -10 1 -4 6 -2 10 8 5 4 8 10 5 17 20 20 14 12 10 8 5 7 12 3 -4 0 6 -4 -2 -12 -5
$$ packed form
8157BLj2lJ1j1J1nJ0qJ2kljMKnJ2L%okkklKNrpMOj0Kj0P
8191e
$$ Imaginary data points
##PAGE= N=2
##DATA TABLE= (X++(I..I)), XYDATA
$$ plain form
0 0 0 0 0 0 0 0 0 0 0 0 0 0 0 0 0 0 0 0 0 0 0 0 0 -8 8 -8 8 -8 8 -8 8 -12 16 -16 16 -16 24 -24 24 -31 32 -32 40 -40
44 -40 48 -54 56 -64 72 -80 91 -104 120 -137 161 -195 239 -312 438 -729 2859 -3352 -8760 2647
64 2647 7001 -435 -4856 2714 5678 -1974 -6290 1574 6759 708 -5026 -299 4173 -142 -4075
79 -4075 1170 5663 481 -5656 -1804 4627 2659 -2999 -1626 3016 1286 -3629 -1808 3878 2962 -3159
95 -3159 -3842 1418 3099 -847 -2242 842 1344 -2191 -2621 1409 2593 -1085 -2696 119 1172 -1541
111 -1541 -1966 1477 2174 -1839 -3621 -145 2321 136 -1857 -472 320 -1542 -1844 761 1525 -1153
127 -1153 -2333 -209 619 -1494 -1921 757 1474 -1647 -3156 -360 1749 -300 -2356 -820 886 -672
143 -672 -2262 -542 1456 -6 -2301 -1465 574 135 -1384 -722 561 -520 -2075 -778 1255 115
$$ packed form
0@%%%%%%%%%%%%%%%%%%%%%%%qJ6j6J6j6J6j6J6k0K8l2L2l2M0m8M8n5O3o4P2q0
44d0Q8j02J10j20J36j52J71j95K24k57K98l56M34n51P50j167L588o211n408J1407
64B647M354p436m421P570K964p652m316P864N185o051n734M727M472m315l933
79d075N245M493n182o137L852O431j968n658J373M642j730m915J821N686r16o121
95c159o83N260J681l946j395L084N02l535m30M030J184l678j611K815J053k713
111a541m25L443O97m013j782L476K466k185j993J385P92j862l02K605P64k678
127a153j180K124Q28k113m27K678P17l121j509K796K109k049k056J536J706j558
143f72j590J720J998j462k295Q36K039m39j519O62J283j081j555J297K033j140
$$ plain form
159 115 -2320 -1588 919 525 -1889 -1604 933 827 -1894 -2309 264 1272 -664 -1655 -313 259 -958
176 -958 -1154 367 598 -1025 -1516 -89 492 -625 -939 222 359 -1093 -1460 58 876 -283 -1161 -364
194 -364 315 -481 -1058 -90 716 -121 -1125 -580 405 131 -587 -225 358 -227 -971 -216 936 428 -920
213 -920 -722 557 532 -635 -593 649 719 -576 -867 347 836 -68 -508 152 310 -346 -218 799 785 -460
233 -460 -785 341 964 178 -308 388 747 -45 -510 301 1132 678 -272 -283 397 673 372 255 534 526 28
254 28 -228 322 1005 884 220 -71 194 435 509 715 830 378 -163 143 908 969 386 280 674 532 -15
275 -15 237 1176 1261 249 -316 319 990 778 403 553 659 238 14 576 1172 863 109 -24 438 706 596
296 596 624 766 484 -43 13 732 1092 642 135 198 383 265 376 878 923 106 -456 113 870 752 264 288
$$ packed form
159A15k435P32K507l94k414K85K537j06k721m15K573J008j936r91J342N72j217
176i58j96J521K31j623m91J427N81j117l14J161J37j452l67J518Q18j159q78P97
194c64O79p96n77R68Q06q37j004N45R85k74p18L62N83n85p44P55J152n08j348
213i20J98J279k5j167M2J242P0j295k91J214M89r04m40O60J58o56J28J017j4j245
233d60l25J126O23p86m86O96L59p92m65Q11Q31m54r50j1O80K76l01j17K79qm98
254B8k56N50O83j21o64k91K65K41P4K06J15m52n41L06P65O1n83j06L94j42n47
275a5K52R39Q5j012n65O35O71k12l75J50J06m21k24N62N96l09p54j33M62K68j10
296E96K8J42k82n27N6P19L60m50n07O3J85j18J11N02M5q17n62N69P57j18m88K4
$$ plain form
318 288 382 -76 -313 449 1149 600 -402 -352 379 458 91 267 647 147 -627 -361 631 825 78 -348 -88
339 -88 -19 -223 55 625 393 -521 -760 -48 423 82 -184 18 -103 -667 -565 313 637 -202 -897 -510 52
360 52 -139 -371 43 226 -542 -1115 -469 432 231 -572 -680 -321 -411 -614 -150 333 -174 -1042 -934 -146 71
381 71 -356 -420 -216 -525 -988 -629 237 234 -656 -1016 -465 -183 -501 -477 53 -20 -941 -1221 -295 418 -130 -861
403 -861 -643 -242 -550 -794 -142 358 -348 -1193 -815 47 -5 -542 -371 -69 -578 -1078 -421 491 115 -883 -814
424 -814 -110 -192 -655 -245 435 -104 -1175 -924 268 442 -446 -689 -89 -89 -708 -563 376 467 -525 -975 -285
445 -285 232 -86 -296 71 81 -596 -762 63 627 42 -577 -296 113 -193 -395 215 632 -129 -934 -418 584
466 584 459 -307 -248 296 36 -627 -230 775 626 -438 -634 184 461 -40 -50 507 333 -499 -459 526 809
$$ packed form
318B88R4m58k37P62P00n49j002N0P31P9l67J76L80n00p74K66R92J94p47m26K60
339h8O9k04K78N70k32r14k39P12M71l41k66K02j21n64J02Q78L24q39o95L87N62
360E2j91k32M14J83p68n73O46R01k01q03j08L59r0k03M64M83n07q68J08P88K17
381G1m27o4K04l09m63L59Q66lq90l60N51K82l18K4N30p3r21k80R26P13n48p31
403h61K18M01l08k44O52N00p06q45L78Q62n2n37J71L02n09n00O57R12l76r98O9
424h14P04q2m63M10O80n39j071K51J192J74q88k43O00%o19J45R39R1r92m50O90
445b85N17l18k10L67J0o77j66Q25N64n85o19K81M09l06k02O10M17p61q05N16J002
466E84j25p66N9N44k60o63L97J005j49j064j96Q18K77n01j0N57j74q32M0R85K83
$$ plain form
487 809 75 -288 193 326 -175 -101 715 817 -116 -575 163 744 330 -31 355 535 -63 -376 375 1031 530
508 530 -245 -83 499 411 100 421 836 394 -322 -95 760 877 279 71 385 372 48 259 856 763 19
529 19 -176 412 680 345 273 659 552 -115 -151 680 1051 371 -146 243 664 355 87 530 854 297 -260
550 -260 125 781 698 201 177 407 261 48 388 765 453 -105 -9 446 450 166 276 557 246 -267 -34 680
572 680 723 51 -211 181 390 97 46 421 463 -75 -332 100 471 245 -40 38 117 -122 -178 208 427 39
594 39 -380 -227 142 136 -86 -41 75 -100 -353 -208 170 165 -184 -347 -177 -65 -146 -96 28 -99 -452 -466 -50
617 -50 138 -178 -468 -289 -106 -317 -476 -125 145 -232 -741 -595 -34 67 -305 -448 -302 -347 -501 -332 -29
638 -29 -104 -427 -499 -334 -353 -414 -152 55 -332 -821 -613 -8 67 -432 -601 -293 -175 -507 -582 -142 97 -324 -762
$$ packed form
487H09p34l63M81J33n01P4Q16J02r33m59P38N81m14l61L86J80n98l13P51O56n01
508E30p75J62N82q8l11L21M15m42p16K27Q55J17n98k08L14j3l24K11N97r3p44
529A9j95N88K68l35p2L86j07o67l6Q31L71o80n17L89M21l09k68M43L24n57n57
550b60L85O56q3m97k4K30j46k13L40L77l12n58R6M55Mk84J10K81l11n13K33P14
572F80M3o72k62L92K09k93n1L75M2n38k57M32L71k26k85P8P9k39n6L86K19l88
594C9m19J53L69ok22M5J16j75k53J45L78nl49j63J70J12q1N0J24j27l53j4M16
617e0J88l16k90J79J83k11j59L51K70l77n09J46N61J01l72j43J46m5j54J69L03
638b9p5l23p2J65j9o1K62K07l87m89K08O05P5m99j69L08J18l32p5M40K39m21m38
$$ plain form
661 -762 -562 -113 -54 -299 -360 -301 -409 -473 -214 28 -170 -522 -453 -179 -186 -363 -171 78 -209 -719 -565 107 281
684 281 -272 -564 -258 -65 -330 -346 106 194 -344 -671 -234 153 -17 -192 -15 -27 -462 -546 68 492 55 -490
706 -490 -336 50 -21 -201 46 297 -27 -478 -323 165 287 25 -94 -75 -188 -226 110 426 191 -271 -269 121
728 121 216 -5 39 308 205 -263 -297 276 628 232 -271 -172 191 249 143 260 320 48 -204 21 381 375 195
751 195 194 179 -77 -92 411 749 310 -270 -116 413 458 143 217 512 307 -211 -112 543 755 297 -19 116 253
774 253 144 280 614 526 0 -159 291 587 373 184 371 373 13 -71 456 818 422 -105 14 400 401 246
796 246 390 515 193 -120 172 626 530 138 120 326 205 20 301 714 471 -139 -214 343 616 315 75
817 75 226 268 27 6 364 559 243 -110 -51 180 238 241 357 250 -159 -289 160 535 270 -117 -45 181 -5
$$ packed form
661g62K00M49N9k45o1N9j08o4K59K42j98l52O9K74pj77J92K49k87n10J54O72J74
684B81n53k92L06J93k65j6M52Q8n38l27M37L87j70j75J77j2m35q4O14M24m37n45
706d90J54L86p1j80K47K51l24m51J55M88J22k62j19J9j13l8L36L16k35m62KL90
728A21R5k21M4K69j03m68l4N73L52l96n03R9L63N8j06J17O0k72k52K25L60oj80
751A95jj5k56j5N03L38m39n80J54N29M5l15P4K95k05n18R9O55K12m58l16J35J37
774B53j09J36L34q8n26j59M50K96k14j89J87Kl60q4N27L62l96n27J19L86Jj55
796B46J44J25l22l13K92M54r6l92j8K06j21j85K81M13k43o10p5N57K73l01k40
817G5J51M2k41k1L58J95l16l53N9K31N8LJ16j07m09j30M49L75k65l87P2K26j86
$$ plain form
840 -5 -218 95 518 245 -411 -422 143 372 42 -118 7 -31 -286 -186 232 247 -156 -334 -122 -57 -188 -70
862 -70 197 11 -485 -486 27 245 -124 -391 -218 -90 -292 -331 -4 141 -240 -590 -389 -10 -6 -233 -246 -194 -358
885 -358 -497 -226 118 -30 -484 -560 -258 -127 -247 -218 -53 -231 -619 -578 -88 108 -210 -447 -354 -300 -441 -309
907 -309 61 35 -464 -665 -282 -12 -178 -344 -153 -114 -498 -591 -128 211 -98 -529 -450 -167 -150 -258 -120 -14
929 -14 -269 -512 -327 28 25 -222 -284 -199 -269 -301 -66 171 -27 -451 -447 -63 96 -78 -176 -56 -92 -359 -314 117
953 117 297 -49 -395 -267 13 12 -45 80 113 -183 -387 -116 251 221 -55 -131 -67 -96 -98 128 321 101 -226 -203
977 -203 113 212 96 74 134 -8 -205 -33 343 393 18 -186 18 201 120 83 261 268 -48 -193 129 447 306
1000 306 12 -19 128 112 77 292 399 154 -117 -19 280 335 207 208 218 39 -56 192 513 400 41 -48 176
$$ packed form
840ek13L13M23k73o56j1N65K29l30j60J25l8k55J00M18J5m03j78K12O5j31J18
862g0K67j86m96jN13K18l69k67J73J28k02l9L27J45l81l50K01L79Mk27j3N2j64
885c58j39K71L44j48m54p6L02J31j20K9J65j78l88M1M90J96l18k37R3N4j41J32
907c09L70k6m99k01L83K70j66j66J91L9l84r3M63L39l09m31P9K83J7j08J38J06
929a4k55k43J85L55lk47o2Q5p0l2K35K37j98m24ML84J59j74r8J20l6k67M5M31
953A17J80l46l46J28K80jn7J25L3k96k04K71L67l0k76p6O4k9kK26J93k20l27K3
977b03L16R9j16k2O0j42j97J72L76N0l75k04K04J83q1l7J78Pl16j45L22L18j41
1000C06k94l1J47j6l5K15J07k45k71R8K99N5j28JJ0j79r5K48L21j13l59q9K24
$$ plain form
1023 176 275 204 262 398 278 -33 -70 297 535 336 85 100 217 181 172 368 453 219 -64 52 344 398 255
1046 255 211 236 102 23 248 502 373 33 14 238 263 176 275 417 210 -112 -28 390 495 172 -1 137 203
1069 203 62 116 383 392 22 -178 54 327 290 146 112 79 -47 -54 209 362 161 -102 -88 60 90 74 188 222
1093 222 -37 -288 -103 249 270 -18 -155 -22 -17 -141 -41 218 170 -218 -371 -94 155 46 -113 -67 -86 -269
1115 -269 -287 23 180 -69 -347 -275 -99 -131 -142 -3 6 -302 -487 -226 81 -1 -263 -271 -180 -275 -364 -122 94 -101
1139 -101 -477 -477 -157 -50 -195 -234 -162 -244 -454 -382 -39 54 -233 -440 -327 -205 -235 -213 -36 -105 -393 -506 -234
1162 -234 10 -105 -281 -246 -215 -354 -350 -71 74 -168 -474 -362 -106 -87 -198 -144 -60 -235 -451 -285 78 74 -225
1185 -225 -361 -201 -115 -179 -118 38 -29 -318 -379 -98 87 -12 -148 -106 -131 -239 -162 108 160 -135 -327 -137 58
$$ packed form
1023A76R9p1N8J36j20l11l7L67K38j99k51J5J17l6rJ96Q5k34k83J16K92N4j43
1046B55m4K5j34p9K25K54j29l40j9K24K5q7R9J42k07l22Q4M18J05l23j73J38O6
1069B03j41N4K67Rl70k00K32K73l7j44l4l3j26pK63J53k01k63J4J48L0j6J14L4
1093B22k59k51J85L52K1k88j37J33Nj24J00K59m8l88j53K77K49j09j59M6j9j83
1115b69j8L10J57k49k78P2J76l2j1J39Rl08j85K61L07q2k62qR1r5q9K42K16j95
1139a01l76%L20J07j45l9P2q2k10P2L43R3k87k07J13J22l0K2J77o9k88j13K72
1162b34K44j15j76L5L1j39MK79J45k42l06J12K56J9j11N4Q4j75k16J66L63mk99
1185b25j36J60Q6o4O1J56o7k89o1K81J85r9j36M2k5j08P7K70N2k95j92J90J95
$$ plain form
1208 58 -31 -91 64 110 -175 -329 -33 286 152 -160 -168 35 21 -54 47 209 88 -159 -146 107 189 86 36 66
1232 66 -6 -97 49 287 240 -43 -108 86 180 73 63 213 187 -69 -135 149 384 210 -42 -3 163 138 62 192
1256 192 309 128 -94 9 294 285 118 105 183 119 -6 145 398 319 8 -22 198 270 160 170 285 189 -23
1279 -23 37 331 386 165 53 170 210 101 146 359 349 60 -65 162 381 274 108 153 234 140 48 203 371
1302 371 268 38 10 176 251 204 213 218 99 -13 122 325 285 77 34 171 153 28 118 326 249 -63 -135 157
1326 157 351 186 5 47 129 25 -1 165 266 108 -72 -38 96 117 85 121 112 -88 -154 43 231 124 -85
1349 -85 -80 21 8 -64 32 158 44 -223 -221 14 126 -9 -103 -79 -90 -183 -111 58 72 -149 -280 -148 -48 -76 -108
1374 -108 -40 -68 -247 -338 -129 61 -20 -230 -263 -181 -166 -164 -83 -46 -185 -327 -260 -96 -88 -159 -162 -153 -252 -345 -185 36 -30
$$ packed form
1208E8q9o0J55M6k85j54K96L19j34l12qK03j4p5J01J62j21k47J3K53Q2j03n0L0
1232F6p2r1J46K38m7k83o5J94R4j07j0J50k6k56o6K84K35j74k52L9J66k5p6J30
1256A92J17j81k22J03K85rj67j3P8o4j25J51K53p9l11l0K20P2j10J0J15r6k12
1279b3O0K94N5k21j12J17M0j09M5K13j0k89j25K27K19j07j66M5Q1r4r2J55J68
1302C71j03k30k8J66P5m7RNj19j12J35K03m0k08m3J37j8j25R0K08p7l12p2K92
1326A57J94j65j81M2Q2j04k6J66J01j58j80L4J34K1l2L6rk00o6J97J88j07k09
1349h5NJ01j3p2R6J26j14k67KK35J12j35r4K4j1r3P2J69J4k21j31J32J00k8l2
1374a08O8k8j79r1K09J90q1k10l3Q2J5KQ1L7j39j42O7J64Qp1lRr9r3J60K21o6
$$ plain form
1401 -30 -325 -398 -189 -64 -168 -235 -131 -125 -308 -372 -164 13 -76 -282 -317 -249 -210 -167 -58 -71 -258 -348 -223 -75
1425 -75 -117 -184 -121 -110 -273 -338 -130 80 -27 -289 -317 -122 -48 -121 -135 -69 -87 -225 -248 -76 34 -40 -152 -159 -117 -111
1451 -111 -54 31 20 -146 -226 -95 71 29 -76 -51 -10 -88 -145 7 170 79 -144 -156 11 71 17 33 99 -8 -154
1476 -154 -73 162 207 21 -62 26 45 -34 21 203 199 -32 -143 26 190 142 49 74 103 -8 -19 161 243 113 -17
1501 -17 40 133 82 64 192 237 53 -75 83 308 231 32 47 190 161 56 108 277 222 10 -6 155 270 190
1525 190 123 139 122 47 90 254 291 120 23 116 185 118 137 265 261 46 -53 146 317 233 75 107 181 109 40 178
1551 178 307 199 5 21 183 225 129 140 199 117 -10 57 256 249 72 25 119 144 71 104 214 169 1 -15 139
1576 139 216 102 44 93 104 0 12 174 219 39 -91 -4 142 92 24 53 102 15 -103 -6 168 145 -25 -85 -25
$$ packed form
1401c0k95p3K09J25j04o7J04Oj83o4K08J77q9k06l5O8L9M3J09j3j87r0J25J48
1425g5m2o7O3J1j63o5K08K10j07k62k8J95P4p3j4O6j8j38k3J72J10p4j12pM2O
1451a11N7Q5j1j66q0J31J66m2j05K5M1p8n7J52J63r1k23j2J67O0n4J6O6j07j46
1476a54Q1K35M5j86q3Q8J9p9N5J82mk31j11J69J64m8r3K5K9j11j1J80Q2j30j30
1501a7N7R3n1j8J28M5j84j28J58K25p7j99J5J43k9j05N2J69n5k12j6J61J15q0
1525A90o7J6j7p5M3J64L7j71r7R3O9o7J9J28mk15r9J99J71q4j58L2P4p2o9J38
1551A78J29j08j94J6J62M2r6J1N9q2j27O7J99pj77m7R4K5p3L3J10m5j68j6J54
1576A39P7j14n8M9J1j04J2J62M5j80j30Q7J46n0o8K9M9q7j18R7J74k3j70o0O0
$$ plain form
1601 -25 20 6 14 78 11 -123 -134 12 53 -21 -66 -6 -60 -167 -103 61 84 -113 -223 -91 -1 -66 -133 -59 -9 -168 -259
1628 -259 -114 42 -44 -201 -200 -104 -116 -160 -93 -37 -125 -257 -198 -82 -62 -155 -175 -121 -192 -245 -161 -26 -72 -244 -270 -152
1654 -152 -111 -186 -166 -88 -126 -268 -288 -111 6 -126 -250 -215 -137 -177 -192 -103 -58 -170 -286 -225 -84 -74 -140 -158 -144 -200
1680 -200 -232 -107 -1 -77 -222 -211 -100 -76 -136 -88 -18 -88 -239 -197 2 46 -99 -172 -94 -48 -102 -96 20 29 -117 -181
1706 -181 -56 59 19 -63 -36 -12 -85 -92 38 107 13 -112 -73 31 23 13 50 72 -26 -121 -17 148 129 -20 -44 36 25
1733 25 -3 62 169 105 -63 -80 77 176 110 32 55 69 11 10 141 219 99 -16 24 112 133 110 146 130 30 -22 100
1760 100 226 181 49 68 124 91 73 154 255 135 -32 8 183 231 122 85 139 118 34 62 230 242 92 -10 74
1785 74 160 164 151 168 119 15 14 160 245 159 83 84 94 69 95 199 238 75 -30 40 178 196 114 97 126 68 -1 73 226
$$ packed form
1601b5M5j4QO4o7j34j1J46M1p4m5O0n4j07O4J64K3j97j10J32R0o5o7P4N0j59r1
1628b59J45J56q6j57JR6j2m4O7N6q8j32N9J16K0r3k0N4p1n3Q4J35m6j72k6J18
1654a52M1p5K0P8l8j42k0J77J17j32j24L5P8m0j5Q9M5j12j16O1J41J0o6j8J4n6
1680b00l2J25J06p6j45J1J11K4o0M8P0p0j51M2J99M4j45p3P8M6n4OJ16Rj46o4
1706a81J25J15m0q2K7K4p3pJ30O9r4j25L9J04qj0L7K2r8r5J04J65j9j49k4Q0j1
1733B5k8O5J07o4j68j7J57R9o6p8K3J4n8jJ31P8j20j15M0Q8K1k3L6j6j00n2J22
1760A00J26m5j32J9N6l3j8Q1J01j20j67M0J75M8j09l7N4k1q4K8J68J2j50j02Q4
1785G4Q6Mj3J7m9j04jJ46Q5q6p6JJ0k5K6J04L9j63j05P0J38J8q2j7K9n8o9P4J53
$$ plain form
1814 226 214 38 -27 56 141 118 111 136 96 -19 -19 116 200 113 26 26 28 17 46 157 141 2 -91 1 132 110 33 29 45
1843 45 -37 -83 46 163 84 -93 -87 9 38 6 19 64 -12 -144 -108 45 103 -7 -77 -81 -65 -78 -29 44 6 -110 -162 -87
1871 -87 1 -10 -63 -41 -75 -159 -164 -19 70 -50 -201 -153 -64 -67 -112 -65 -24 -117 -239 -181 -30 3 -105 -185 -145 -129 -147 -107
1899 -107 -30 -82 -197 -243 -142 -77 -110 -122 -107 -157 -247 -199 -40 -20 -145 -258 -172 -103 -144 -160 -70 -54 -181 -265 -164 -32
1925 -32 -44 -135 -168 -126 -151 -139 -79 -21 -90 -200 -186 -85 -49 -88 -97 -69 -111 -177 -123 7 18 -94 -171 -106 -55 -66 -63 6 -15
1954 -15 -129 -140 -34 53 -23 -80 -59 -29 -70 -78 33 97 -6 -131 -95 55 65 3 -5 22 -6 -70 -3 99 97 -6 -36 17
1982 17 40 18 77 118 40 -57 -25 121 151 53 11 78 89 7 17 157 193 54 -52 30 153 139 86 84 103 49 31 95
2010 95 186 142 67 59 82 79 95 165 180 73 -10 57 184 166 75 68 108 102 45 82 194 193 58 2 74 174 139 98 108 98
$$ packed form
1814B26j2j76o5Q3Q5k3pK5m0j15%J35Q4q7q7%Kj1K9J11j6j39r3R2J31k2p7mJ6
1843D5q2m6J29J17p9j77OR6K9l2J3M5p6j32L6J53N8j10p0mJ6j3M9P3l8j16n2P5
1871h7Q8j1n3K2l4q4nJ45Q9j20j51M8Q9lm5M7M1r3j22N8J51L3j08q0M0J6j8M0
1899a07P7n2j15m6J01O5l3j2J5n0r0M8J59K0j25j13Q6O9m1j6R0J6j27q4J01J32
1925c2j2r1l3M2k5J2O0N8o9j10J4J01L6l9rK8m2o6N4J30J1j12p7O5N1j1LO9k1
1954a5j14j1J06Q7p6n7K1L0m1qJ11O4j03j25L6J50J0o2qK7k8o4O7J02kj03l0N3
1982A7K3k2N9M1p8r7L2J46L0r8m2O7J1q2J0J40L6j39j06Q2J23j4n3kJ9n4j8O4
2010I5R1m4p5qK3lJ6P0J5j07q3O7J27j8r1pM0on7L7J12jj35n6P2J00l5m1J0j0
$$ plain form
2040 98 38 40 141 200 120 28 48 118 104 98 153 155 62 -13 60 168 161 92 68 76 49 40 114 186 119 8 1 87 130 75 80 113 62
2073 62 -15 -4 131 180 71 -12 21 66 67 63 93 94 8 -42 15 95 92 35 15 3 -24 -2 65 115 8 -80 -46 48 49 0 3 38
2105 38 0 -105 -59 80 111 -37 -113 -60 3 -12 -19 31 -3 -100 -126 -41 28 1 -56 -61 -81 -126 -97 15 37 -76 -159 -125 -38
2134 -38 -61 -75 -65 -59 -130 -181 -109 14 -27 -136 -161 -122 -95 -115 -70 -32 -97 -206 -193 -66 -36 -103 -141 -128 -134 -160 -133 -53 -47 -137
2164 -137 -207 -159 -88 -85 -94 -78 -109 -189 -180 -82 1 -79 -148 -146 -93 -117 -119 -47 -9 -110 -211 -177 -36 -3 -78 -117 -99 -93 -131 -79 -9
2195 -9 -1 -92 -148 -96 -54 -37 -31 -29 -61 -129 -104 12 49 -37 -82 -59 -37 -62 -42 38 53 -56 -135 -55 66 54 -5 -37 -13 -30 -49
2226 -49 31 104 64 -42 -57 9 53 57 60 64 3 -27 8 98 134 58 3 16 41 36 74 145 90 14 -37 49 138 115 63 67 70 34 31
2259 31 106 183 111 10 17 92 116 94 110 96 56 8 70 144 153 82 50 77 74 76 110 161 113 28 20 106 142 103 86 82 88 36 47
$$ packed form
2040I8o0KJ01N9q0r2K0P0j4oN5Kr3p5P3J08po9k4Qk7rP4P2o7j11pQ6M3n5NL3n1
2073F2p7J1J35M9j09q3L3M5JmL0Jq6n0N7Q0ln7k0j2k7K2O7N0j07q8L4R4Jm9LL5
2105C8l8j05M6J39L1j48p6N3O3j5pN0l4r7k6Q5O9k7n7nk0m5K9J12K2j13q3L4Q7
2134c8k3j4J0Op1n1P2J23m1j09k5L9K7k0M5L8o5j09J3J27L0o7l8J3ok6K7Q0Or0
2164a37p0M8P1LrJ6l1q0RR8Q3q0o9KN3k4kP2L8j01j01L4J41L3p5l9J8Ol8N2P0
2195iQr1n6N2M2J7OKl2o8K5J16L7q6m5K3K2k5K0Q0J5j09p9Q0J21j2n9l2K4j7j9
2226d9Q0P3m0j06j5O6M4MLMo1l0L5R0L6p6n5J3K5nL8P1n5p6n1Q6Q9k3n2MLl6l
2259C1P5P7p2j01PP5K4k2J6j4m0m8O2P4Rp1l2K7lKL4N1m8q5qQ6L6l9j7mOn2J1
$$ plain form
2292 47 142 164 97 19 33 119 119 93 99 94 49 5 67 157 140 62 34 55 59 59 111 133 78 0 10 89 103 77 45 66 39 0 32
2325 32 117 113 17 -30 35 74 43 33 72 64 6 -48 33 100 72 -15 -20 28 18 7 32 68 8 -55 -23 44 44 8 1 15 -17 -55 -12
2358 -12 64 38 -76 -67 -7 14 -23 -34 23 0 -95 -102 0 36 -33 -97 -75 -43 -54 -52 -30 -7 -71 -129 -95 -31 -34 -58 -71 -75 -105 -107
2390 -107 -54 -25 -58 -129 -116 -82 -71 -108 -83 -46 -102 -153 -133 -53 -45 -100 -144 -94 -77 -108 -102 -54 -50 -133 -173 -100 -41 -68 -107 -94 -102 -119
2422 -119 -135 -72 -46 -87 -145 -131 -86 -88 -100 -70 -67 -121 -153 -95 -30 -43 -112 -121 -82 -77 -105 -68 -14 -33 -131 -139 -58 -13 -33 -86 -69 -72 -92
2455 -92 -74 -18 -5 -41 -75 -70 -28 -30 -25 2 -7 -52 -88 -7 44 22 -26 -18 12 -8 -35 25 72 41 -51 -35 38 79 27 17 34 23 3
2488 3 26 83 97 40 -7 20 59 58 65 88 71 10 3 70 108 73 44 56 61 45 54 110 130 71 1 34 108 100 66 81 103 57 17 66
2522 66 138 125 60 33 68 84 87 91 116 92 36 22 93 123 96 64 72 73 47 72 113 121 67 11 55 103 81 73 83 83 33 11 66 133
$$ packed form
2292D7R5K2o7p8J4Q6%k6Onm5m4O2R0j7p8k8K1M%N2K2n5p8J0P9J4k6l2K1k7l9L2
2325C2Q5mr6m7O5L9l1j0L9qn8n4Q1O7k8q7nM8j0j1K5L6o0o3L2O7%l6pJ4l2l8M3
2358a2P6k6j14RO0K1l7j1N7k3r5pJ02L6o9o4K2L2j1KK2K3o4n8L4O4lk4j3ml0k
2390a07N3K9l3p1J3L4J1l7K5L7n6n1K0Q0Qn5m4N0J7l1OM8Mq3m0P3N9k7l9J3qj7
2422a19j6O3K6m1n8J4M5kj2L0Ln4l2N8O5j3o9rL9Nk8L7N4j9r8qQ1M5k0n3J7lk0
2455i2J8N6J3l6l4NM2kNK7rm5l6Q1N1k2m8QL0k0k7O0M7l1r2J6P3M1n2j0J7j1k0
2488CK3N7J4n7m7K7L9jPK3j7o1pO7L8l5k9J2Nj6RN6K0n9p0L3P4ql4J5K2m6m0M9
2522F6P2j3o5k7L5J6LMK5k4n6j4P1L0k7l2QJk6K5M1Qn4n6M4M8k2qJ0%n0k2N5O7
$$ plain form
2556 133 111 24 18 46 65 41 65 104 46 3 -3 60 103 72 35 35 34 16 41 101 78 11 -2 28 50 31 38 59 47 -31 -32 43 82
2589 82 39 -11 -11 19 23 4 34 59 6 -48 -29 30 52 16 -19 -11 -20 -32 3 40 25 -39 -57 -16 0 -10 -5 0 -27 -79 -61 -1 29
2622 29 -28 -77 -48 -46 -57 -52 -1 -5 -75 -114 -58 -6 -29 -74 -68 -47 -84 -92 -61 -5 -46 -114 -121 -75 -54 -66 -44 -54 -81 -126 -97 -48 -44 -83
2656 -83 -103 -81 -96 -99 -64 -31 -55 -121 -146 -90 -40 -69 -90 -86 -74 -105 -117 -73 -21 -76 -114 -125 -82 -69 -53 -67 -82 -109 -135 -85 -37
2687 -37 -40 -87 -76 -82 -95 -97 -54 -3 -48 -113 -115 -37 -11 -49 -70 -56 -46 -81 -66 -15 7 -35 -73 -60 -20 -18 -23 -12 -16 -55 -69 -23 33 8
2721 8 -39 -22 -13 -16 -20 18 38 11 -39 -30 27 36 19 18 29 -4 -23 13 76 68 0 -18 20 49 37 36 63 58 14 4 39 100 79 23 19 35
2757 35 50 60 79 81 49 21 51 84 87 62 75 72 48 33 79 122 81 36 32 65 91 70 75 94 86 34 34 94 125 91 38 41 72 74 66
2792 66 97 93 37 30 56 95 85 66 62 60 18 33 77 107 63 10 18 51 66 50 66 84 39 -8 20 76 99 40 16 32 37 22 38
$$ packed form
2556A33k2q7oK8J9k4K4L9n8m3oO3M3l1l7%jj8K5O0k3o7j3L0K2j9PK1j2p8jP5L9
2589H2m3n0%L0Mj9L0K5n3n4J9N9K2l6l5Qrj2L5L7j5o4j8M1J6j0NNk7n2J8O0L0
2622B9n7m9K9Kj1NN1mp0l9N6N2k3m5OK1l7qL1N6m1o8pM6K1j2K2j0k7m5K9M9Ml9
2656h3k0K2j5lL5L3k4o6k5N6N0k9k1MJ2l1j2M4N2n5l8j1M3J3J6j4j5k7k6N0M8
2687c7lm7J1oj3kM3N1m5o5kP8K6l8k1J4J0l5J5N1K2m2l8J3M0KnJ1ml9j4M6N6k5
2721Hm7J7RlmL8K0k7n0RN7Rj7jJ1l3j9L6O3qo8j8L8K9j2jK7nm4j0L5O1k1n6mJ6
2757C5J5J0J9Kl2k8L0L3Lk5J3lk4j5M6M3m1m5mL3K6k1NJ9qn2%O0L1l4n3LL1Kq
2792F6L1mn6pK6L9j0j9mkm2J5M4L0m4n3QL3J5j6J6J8m5m7K8N6K3n9k4J6Nj5J6
$$ plain form
2825 38 69 62 5 -10 30 71 48 32 21 15 -10 8 51 65 15 -16 4 18 12 10 46 25 -28 -69 -1 54 26 -17 -25 4 -13 -31 9
2858 9 24 -1 -50 -61 -14 6 -9 -24 -21 -38 -50 -34 18 7 -35 -57 -47 -40 -40 -33 -3 -30 -90 -101 -42 -9 -27 -60 -58 -49 -71 -75 -25 -1
2892 -1 -38 -98 -83 -42 -35 -38 -55 -56 -84 -97 -72 -34 -34 -63 -98 -74 -63 -61 -48 -33 -60 -93 -118 -58 -31 -58 -64 -72 -83 -97 -88 -46 -26 -80 -121
2927 -121 -92 -52 -51 -59 -67 -68 -91 -96 -86 -24 -36 -79 -104 -93 -57 -60 -33 -34 -63 -91 -79 -43 -20 -33 -54 -62 -52 -78 -39 -1 -4 -53 -79 -51
2961 -51 -10 -12 -29 -24 -27 -59 -57 -26 22 21 -17 -38 -28 0 -8 7 30 -5 -28 -25 20 38 12 1 12 -6 -12 25 60 48 -1 -15 25 43
2995 43 41 40 53 26 8 8 54 102 48 10 32 56 56 50 75 84 43 14 46 89 91 70 58 44 34 43 90 110 75 37 34 67 68 68 75 79 43
3032 43 19 47 99 117 63 39 49 77 48 55 76 73 39 14 44 84 80 58 49 40 35 49 68 90 55 25 31 55 71 66 67 60 30 10 49
3067 49 82 72 40 11 27 36 29 44 60 43 5 -1 46 70 34 20 12 23 5 19 52 61 16 -22 -6 22 36 16 19 3 -25 -17 20 43
$$ packed form
2825C8L1pn7j5M0M1k3j6j1ok5J8M3J4n0l1K0J4okL6k1n3m1O8N5k8m3qK9j7j8M0
2858IJ5k5m9j1M7K0j5j5Lj7j2J6N2j1m2k2J0P%PL0k7o0j1N9L3j8l3KRk2mN0K4
2892al7o0J5M1Plj7jk8j3K5L8%k9l5K4J1KJ3J5k7l3k5O0K7k7oqj1j4RM2K0n4m1
2927a21K9M0Jqqjk3nJ0O2j2m3k5J1L6lK7jk9k8J2L6K3j3k1qJ0k6L9L8lm9k6K8
2961e1M1kj7Nll2KL1M8jl8k1J0K8qJ5K3l5k3LM5J8k6j1J1j8oL7L5j2m9j4M0J8
2995D3kjJ3k7j8%M6M8n4l8K2K4%oK5Rm1k9L2M3Kk1j2j4j0RM7K0l5l8lL3J%PMl6
3032D3k4K8N2J8n4k4J0K8k9PK1ll4k5L0M0mk2rrnJ4J9K2l5l0OK4J6nJpl0k0L9
3067D9L3j0l2k9J6RpJ5J6j7l8oM7K4l6j4qJ1j8J4L3Rm5l8J6K8J4k0Lj6k8QL7K3
$$ plain form
3101 43 25 -22 -21 -9 -9 -5 2 24 -1 -55 -40 0 25 -16 -26 -27 -28 -48 -37 7 17 -40 -83 -49 -18 -18 -25 -15 -45 -52 -69 -32 2 -17 -47
3136 -47 -48 -48 -57 -39 -14 -18 -72 -92 -53 -13 -26 -49 -63 -47 -64 -75 -41 -21 -42 -71 -100 -61 -28 -46 -53 -56 -61 -98 -79 -43 -29 -48 -75 -86
3170 -86 -67 -66 -43 -29 -38 -80 -99 -62 -24 -40 -61 -54 -43 -76 -81 -50 -15 -29 -74 -90 -38 -32 -36 -37 -36 -62 -66 -53 -16 -2 -28 -62 -67 -46 -45 -17
3206 -17 -12 -28 -64 -65 -22 0 -20 -24 -26 -32 -51 -27 11 23 -22 -54 -33 -3 -2 -1 8 2 -20 -39 -18 36 34 -5 -12 -4 1 10 24 40 23 -8 -7 20
3244 20 34 37 31 39 19 4 34 60 70 35 4 34 60 41 48 62 58 26 18 48 92 84 45 28 47 62 57 70 79 56 33 39 62 80 64
3279 64 69 55 30 39 56 89 85 37 26 37 69 52 59 77 62 40 34 63 92 62 48 38 46 41 52 77 64 42 18 35 55 69 64 42
3313 42 46 24 34 40 66 58 30 18 34 34 41 44 46 28 0 5 41 51 28 12 18 14 1 6 36 27 0 -24 -6 28 12 0 -5 -8 -6 -26 3 25
3351 25 16 -4 -21 -19 -2 -9 2 10 -21 -53 -10 -10 0 -12 -15 -9 -26 -33 -10 18 -8 -23 -58 -19 3 3 -20 -19 -23 -41 -33 -18 -8 -18 -40 -36 -27
$$ packed form
3101D3j8m7JJ2%MPK2k5n4J5M0K5m1j0jjk0J1M4J0n7m3L4L1%pJ0l0pj7L7L4j9l0
3136d7j%rJ8K5mn4k0L9M0j3k3j4J6j7j1L4K0k1k9k9L9L3j8plnl7J9L6J4j9k7j1
3170h6J9JK3J4rm2j9L7L8j6k1PJ1l3nL1L5j4m5j6N2OmjJk6mJ3L7J4k6l4nK1JK8
3206a7Nj6l6jM3K2k0mkoj9K4L8J2m5l2K1L0JJRok2j9K1N4kl9pQNRJ4J6j7l1JK7
3244B0J4LoQk0j5L0K6J0l5l1L0K6j9PJ4ml2qL0M4ql9j7J9J5nJ3Rk3k3OK3J8j6
3279F4Nj4k5RJ7L3mm8j1J1L2j7PJ8j5k2oK9K9l0j4j0QnJ1K5j3k2k4J7K0J4nk2
3313D2Mk2J0OK6qk8j2J6%PLKj8k8NL6J0k3j6Omj3NL0rk7k4J8L4j6j2nlKk0K9K2
3351B5rk0j7KJ7pJ1Ql1l2M3%J0j2lOj7pK3K8k6j5l5L9K2%k3Jmj8QJ5J0j0k2MR
$$ plain form
3388 -27 -36 -26 -19 -24 -43 -52 -44 -21 -24 -46 -40 -42 -56 -54 -33 -3 -28 -66 -73 -39 -31 -45 -51 -44 -50 -75 -61 -25 -27 -60 -55 -60 -41 -47 -34 -27 -46 -60 -71 -48
3428 -48 -20 -30 -40 -47 -54 -52 -58 -36 -24 -42 -69 -50 -28 -24 -49 -38 -25 -47 -62 -42 -9 -18 -35 -54 -48 -20 -32 -15 -21 -17 -42 -57 -21 -14 -14 -34
3464 -34 -30 -28 -23 -17 4 2 -14 -35 -22 6 4 5 7 14 -14 -18 15 29 23 -7 -14 9 14 10 27 39 21 -4 1 38 45 17 16 22 5 22 30 57 52 26
3504 26 28 30 40 49 52 56 49 13 24 61 70 52 33 37 45 55 43 54 67 45 33 36 75 79 62 46 35 42 48 58 78 67 46 34 42 60 59 70
3542 70 50 37 28 47 68 76 61 51 45 54 52 50 74 63 38 10 23 63 57 53 35 37 36 15 30 68 45 19 7 19 44 43 32 24 19 7 23
3579 23 30 34 16 6 9 9 12 25 32 23 -10 -17 15 26 24 -3 -5 13 -2 -20 0 16 0 -19 -28 -4 -2 -2 -5 -1 -8 -32 -23 -3 2 0 -18 -28 -24 -13
3619 -13 -21 3 -15 -35 -38 -22 -7 -21 -19 -22 -25 -38 -44 -16 -9 -24 -48 -50 -39 -19 -26 -22 -33 -49 -62 -45 -24 -25 -51 -54 -34 -43 -47 -22 -12 -40 -53
3656 -53 -52 -31 -28 -32 -39 -39 -51 -63 -44 -20 -21 -45 -61 -46 -30 -40 -37 -25 -36 -50 -49 -40 -15 -27 -49 -39 -42 -37 -41 -31 -18 -35 -47 -40 -27 -25 -17 -28
$$ packed form
3388b7rJ0Pnj9rQK3lk2Okj4KK1L0k5l8pL4Qj4oPok5J4L6kl3NnJ9oJ3Pj9j4j1K3
3428d8K8j0j0ppKoK2J2j8k7J9K2Mk5J1J3k2j5K0L3rj7j9OK8j2J7oMk5j5L6P%k0
3464c4MKNOK1kj6k1J3K8kJKPk8mL3J4ol0pK3NmJ7J2j8k5NL7Pk8jOj7J7QK7nk6
3504B6KKJ0RLMpl6J1L7Rj8j9MQJ0j2J1J3k2j2LL9Mj7j6j1POJ0K0j1k1j2QJ8jJ1
3542G0k0j3rJ9K1Qj5j0oRkkK4j1k5k8J3M0omj8Kjk1J5L8k3k6j2J2K5jj1qnj2J6
3579B3PMj8j0L%LJ3Prl3pL2J1kk7kJ8j5j8K0J6j6j9rK4K%lMpk4RK0Nkj8j0MJ1
3619a3qK4j8k0lJ6J5j4Kllj3oK8Pj5k4kJ1K0pMj1j6j3J7K1jk6lK0rmK5J0k8j3
3656e3JK1Lmp%j2j2J9K4jk4j6J5J6j0LJ2j1j4JRK5j2k2J0lNmJ0J3j7j2PJ3KQj1
$$ plain form
3694 -28 -30 -47 -44 -47 -10 -21 -47 -51 -33 -19 -40 -24 -8 -28 -44 -44 -15 16 -6 -33 -22 -23 -29 -14 -1 3 -18 -25 -17 -7 -2 -2 -2 -16 -23 -18 1 13
3732 13 -3 -10 4 -3 12 6 16 31 15 -7 2 11 40 18 15 13 13 11 21 42 33 11 -1 19 28 32 20 25 30 22 12 48 45 43 23 28 38 30 41 49
3772 49 51 33 13 39 58 58 46 44 56 58 46 59 61 61 43 32 47 61 66 59 55 54 37 42 62 69 56 39 47 48 46 54 47 49 28 41 47 50 49 33 51
3813 51 42 31 28 43 48 47 15 26 44 36 26 20 17 21 3 14 30 32 19 9 -3 11 23 21 24 15 -1 -6 10 7 -2 -6 1 1 -3 3 17 26 3 -11 -14
3854 -14 7 9 1 -3 -2 -9 -28 -17 7 -3 -17 -27 -28 -25 -20 -14 -3 -20 -28 -34 -16 -6 -12 -21 -29 -38 -34 -28 -13 -5 -31 -45 -34 -28 -21 -22 -20 -35 -49 -50 -22 -15
3896 -15 -19 -46 -46 -28 -31 -16 -26 -18 -36 -39 -39 -8 -10 -21 -29 -33 -44 -35 -32 -13 -17 -33 -60 -36 -32 -31 -29 -27 -30 -58 -39 -22 -6 -36 -39 -35 -40 -40 -25 -30 -27 -32
3938 -32 -61 -45 -29 -29 -31 -32 -43 -38 -37 -24 -18 -15 -36 -43 -24 -26 -19 -1 -6 -29 -39 -36 -7 4 -15 -9 -24 -19 -14 -9 19 1 -18 -28 -9 21 7 -3
3976 -3 -11 -13 -24 -17 13 13 20 -4 -17 0 10 6 15 16 7 -17 17 27 32 13 9 17 10 20 29 28 22 4 11 26 31 36 21 21 18 21 18 33 48 36 22 24 33
$$ packed form
3694b8kj7LlL7j1k6mJ8J4k1J6J6k0j6%K9L1k2k7J1joJ5J3Mk1pQJ0N%%j4pNJ9J2
3732A3j6pJ4pJ5oJ0J5j6k2RRK9k2lk%kJ0K1rk2j2K0RMj2NNqj0L6lkk0NJ0qJ1Q
3772D9Kj8k0K6J9%j2kJ2Kj2J3K%j8j1J5J4Npmjj7NK0Pj3j7QJkQpKk1J3OLjj6J8
3813E1rj1lJ5Njl2J1J8qj0olMj8J1J6Kj3j0j2J4J2kLrj6nJ6lrmP%mOJ4Rk3j4l
3854a4K1KqmJpj9J1K4j0j4j0jLNOJ1j7qoJ8J0orqrMOJ5Qk6j4J1OPjKj5j4jK8P
3896a5mk7%J8lJ5j0Qj8l%L1kj1qmj1RLJ9mj6k7K4MJKKlk8J9J7J6l0lMn%J5nLn
3938c2k9J6J6%kjj1NJJ3OLk1pJ9kPJ8nk3j0LK9J1j9Oj5NNNK8j8j9j0J9L0j4j0
3976cqkj1PL0%Pk4j3J7J0mRJrk4L4J0Nj9mQpJ0Rjoj8PJ5NNj5%lLlJ5J5j2j4KR
$$ plain form
4019 33 42 42 45 40 19 30 34 57 62 45 29 38 40 35 41 54 52 17 32 39 61 43 40 29 37 29 25 42 55 36 30 27 42 48 46 57 43 30 25 38 44
4060 44 45 28 28 31 31 30 29 55 27 16 32 36 30 25 17 33 19 10 23 42 34 27 11 15 21 26 23 30 11 4 1 23 26 22 13 7 6 -4 4 17 10 3 -7 -3 8
4105 8 5 -1 2 0 -18 -22 -9 9 -6 -13 -16 -7 -19 -16 -13 -9 -26 -36 -27 -10 -18 -22 -19 -26 -24 -26 -11 -16 -23 -34 -37 -29 -12 -27 -16 -30 -31 -34 -30 -24 -7 -27 -36 -35 -24
4150 -24 -22 -27 -16 -22 -42 -48 -20 -9 -20 -15 -41 -36 -27 -16 -22 -11 -24 -33 -41 -32 -16 -17 -23 -30 -36 -41 -30 -30 -11 -33 -32 -42 -32 -20 -24 -18 -28 -29 -53 -30 -7
4191 -7 -16 -30 -29 -24 -23 -12 -28 -15 -22 -39 -31 -15 -3 -9 -7 -22 -28 -16 -14 -10 11 -15 -20 -5 -1 -6 3 7 -12 -8 -17 -9 16 -4 -14 -8 -8 -13 0 16 11 8 -23
4234 -23 -9 11 8 6 5 2 -1 -2 0 19 12 5 0 3 14 13 15 21 11 0 11 26 24 24 13 12 24 18 21 23 33 25 16 14 35 32 29 33 33 36 31 47 41 38 18 22
4280 22 33 26 44 41 44 39 26 33 52 45 40 35 41 34 37 50 44 37 23 16 30 42 48 22 30 35 24 30 35 56 38 18 23 34 34 43 41 28 31 21 26 38 34
4323 34 31 29 11 6 16 39 46 26 10 21 31 30 19 13 22 21 3 13 21 22 10 3 5 7 11 9 7 14 -7 -13 -2 -5 4 1 -11 -8 -13 -9 -5 4 -7 0 -14 -16
$$ packed form
4019C3R%Lnk1J1MK3Nj7j6RKnOJ3kl5J5PK2j8lj1QqmJ7J3j9olJ5OkJ1j4j3nJ3O
4060D4Jj7%L%jjK6k8j1J6MonqJ6j4rJ3J9qpj6MONlPj9plK2Lmrojj0QJ3ppj0MJ1
4105HloLkj8mJ3J8j5plRj2LLMj7j0RJ7qmLpKkJ5npj1lQJ7j5J1j4jlMOJ7k0rJJ1
4150b4KnJ1ok0oK8J1j1Nk6NRJ1oJ1j3rqRJ6joponJ1%J9k2Jj0J0J2mOj0jk4K3K3
4191grj4JNJJ1j6J3pj7QJ6J2oKj5oJ2KMK1k6nJ5MnRMj9MrQK5k0j0O%nJ3J6nll1
4234b3J4K0lkjlljKJ9ppnLJ1jKOj0j1J1J5k%j1jJ2oLKJ0qrkK1llM%LnJ6olk0M
4280B2J1pJ8lLnj3PJ9pnnOpLJ3opj4pJ4J2Ok6QNj1ONK1j8k0NJ1%Rkj3Lj0NJ2m
4323C4lkj8nJ0K3Pk0j6J1J0jj1oRjj8J0QJj2pKKMkkPk1oJ1lRlj2LnMMRj1Pj4k
$$ plain form
4367 -16 -4 -16 -8 -10 -23 -27 -19 -8 -12 -12 -26 -32 -13 -18 -15 -10 -10 -20 -21 -20 -13 -9 -26 -27 -17 -24 -15 -9 -7 -13 -28 -34 -18 -19 -20 -17 -28 -24 -29 -21 -5 -15 -31 -35 -16
4412 -16 -17 -23 -23 -22 -32 -31 -41 -28 -21 -28 -27 -25 -27 -30 -24 -17 -17 -22 -31 -27 -19 -11 -15 -7 -19 -25 -29 -7 -15 2 -25 -24 -13 -13 -5 1 -5 -12 -27 -5 1 -4 -16 -13 3 -18 -19
4459 -19 -9 2 -4 -17 -13 3 11 -5 -6 -2 -13 -7 -5 -5 12 -2 -5 -5 10 -10 -10 16 -3 -11 -13 -3 12 18 4 15 15 -1 4 8 25 12 2 5 7 12
4499 12 11 16 26 16 14 14 20 36 17 12 18 17 35 27 40 35 25 16 27 31 34 26 28 27 19 16 30 44 39 15 16 29 37 34 26 21 24 33 25 34 39 23 18 18 25 41
4545 41 39 43 40 29 28 38 30 26 21 42 27 31 18 31 33 28 14 25 25 37 28 22 31 27 18 25 41 38 12 25 26 25 27 35 28 13 8 14 24 14 24 20 17 -2
4589 -2 2 17 24 19 7 3 14 1 9 6 11 -1 -12 -7 -11 4 11 6 -3 -1 -9 -3 1 4 -15 -20 -12 -8 -7 2 -6 -8 -18 -5 -13 -10 -14 -18 -25 -27 -12 -9 -8 -18 -30 -24 -25 -19
4637 -19 -16 -3 -43 -22 -21 -24 -21 -17 -14 -17 -29 -33 -21 -16 -23 -28 -19 -24 -26 -28 -21 -29 -33 -29 -36 -32 -30 -14 -25 -21 -27 -27 -13 -23 -19 -24 -16 -24 -37 -27 -12 -19 -19 -33 -27 -16
4683 -16 -16 -24 -13 -13 -20 -22 -21 -4 -4 -29 -24 -17 -15 -11 -8 -13 -20 -26 -23 -7 -7 -9 -12 -24 -26 -21 -6 -3 -14 -20 -10 -14 -8 -6 -12 -5 -6 -17 -20 -11 6 -17 -18 -9 -5 -10 -9 10
$$ packed form
4367a6J2j2Qkj3mQJ1m%j4oJ9nLN%j0jJPMj7jJ0pROKoj5oJ6jjLj1MnQJ6j0j6mJ9
4412a6jo%Jj0Jj0J3PpJKklOP%nrMQQmQj2omK2qJ7k7JJ1%QOopj5K2Onj2LJ6k1j
4459a9J0J1oj3MJ6Qj6jMj1OK%J7j4l%J5k0%K6j9qkJ0J5Oj4J1%j6NMJ7j3j0LKN
4499A2jNJ0j0k%OJ6j9nOjJ8qJ3nj0rJ1MLqKjqlJ4J4nk4JJ3QlqnLRqRNj6n%PJ6
4545D1kMlj1jJ0qmnK1j5Mj3J3Knj4J1%J2roRmrPJ6lk6J3JjKQpj5nOJ0j0J0mlj9
4589bMJ5Pnj2mJ1j3QlNj2j1NmJ5PnrKqOMLj9nQMJRqkj0J3qLmmpkJ5LJj0j2OjO
4637a9LJ3m0K1JlLMLlj2mJ2NpnRnkkPqmMpMKJ6j1Mo%J4j0MnQqj3J0J5p%j4OJ1
4683a6%qJ1%pkJJ7%k5NPKMLnpoLJ6%klj2kNJ5Lj1oJ0mOKoPjj1lRJ7k3jRMnJJ9
$$ plain form
4731 10 -3 -6 -2 -9 -4 7 6 1 -18 -12 6 10 21 -5 -6 13 14 9 16 13 13 17 7 6 19 28 11 11 5 25 20 8 19 18 14 14 17 34 22 15 22 21 21 20 31
4776 31 37 20 7 14 32 29 26 25 24 19 18 18 27 28 21 17 32 26 33 34 29 9 27 17 31 30 29 30 23 28 24 26 30 32 25 25 34 18 20 27 40 30 14 24 24 22 26
4823 26 14 7 13 18 11 21 18 8 8 17 8 23 7 7 3 -1 7 -4 10 18 1 1 8 8 15 11 6 3 -2 -1 -5 8 -2 -10 -5 -3 3 12 -1 2 -5 -13 -13 -1 5 -9 -7
4870 -7 -9 -4 -6 -19 -2 3 -9 -21 -7 -12 -2 -8 -12 -24 -16 -24 -5 -4 -16 -25 -23 -17 -19 -8 -16 -14 -17 -32 -24 -12 -12 -22 -20 -6 -21 -16 -12 -6 -21 -28 -24 -20 -14 -9 -5
4915 -5 -14 -14 -17 -25 -14 -2 -22 -23 -21 -23 -10 -25 -9 -32 -28 -28 -11 -5 -11 -19 -8 -15 -36 -33 -15 -10 -16 -23 -17 -15 -14 -14 -10 -30 -16 -15 -2 -6 -15 -13 -4 -18 -17 3 -2
4960 -2 4 -14 -17 -9 -3 -4 9 5 -7 -7 2 0 11 16 -9 -5 -1 9 16 5 -2 11 0 -4 -1 7 11 7 13 8 12 19 14 8 11 -10 8 26 16 19 17 10 4 -1 16 28
5006 28 30 17 3 3 11 16 9 14 15 6 12 31 37 28 19 23 17 14 12 29 32 26 15 22 18 32 32 20 15 20 21 22 26 28 25 11 12 29 34 33 25 19 18 21 29 19 32 25 27
5055 27 20 15 24 34 25 25 15 24 31 33 24 22 25 11 20 27 33 32 20 17 16 10 23 14 17 13 16 0 19 22 23 20 23 14 10 29 33 13 18 5 3 13 15 11 7 8 11 20 19
$$ packed form
4731A0j3lMpNJ1jnj9OJ8MJ1k6jJ9JnPl%Mj0jJ3Rj7%oK0nj2J1jm%LJ7j2pPj%jJ1
4776C1Oj7j3PJ8lljjnj%RJpmJ5oPJnk0J8j0J4jjJpNmKMKp%Rj6KPJ3j0j6J0%kM
4823B6j2pONpJ0lj0%RrJ5j6%mmQj1J4Qj7%P%PmnlnJmJ3j0qNKORj3Lpq%J2Oj4K
4870gkNkj3J7Nj2j2J4nJ0omj2QqJ9Jj2rKOkJ1qKlj5QJ2%j0KJ4j5NMOj5pMMONM
4915er%lqJ1J2k0jKkJ3j5J6k3M%J7OoqJ1pk1LJ8NopOKJ%Mk0J4JJ3mrKRj4JK0n
4960bOj8lQOjJ3mj2%RkJ1Nk5MMJ0Pj1pJ3j1mLQMmOnMPnoLk1J8J8j0LkponJ7J2
5006B8Kj3j4%QNpNJrOJ9OrrMolkJ7Loj1PmJ4%j2nNJJMKlj4JJ7NjqojLQj0J3pK
5055B7pnRJ0r%j0RPKrkLj4RPOjj2ljoJ3rLmLj6J9LJlLrmJ9Mk0Nj3kJ0KmmJLRj
$$ plain form
5104 19 14 7 11 10 -1 10 0 9 -6 0 -21 0 11 14 -14 -5 4 -11 -4 -3 -12 -1 -20 -20 -4 -8 -14 -8 -8 -13 -13 -16 -17 -20 -13 -23 -16 -26 -30 -24 -10 -26 -14
5147 -14 -20 -13 -13 -5 -11 -13 -17 -16 -6 -14 4 -8 -25 -8 -21 -6 -14 -10 3 -7 -25 -13 -10 -12 -4 -15 -4 -10 -18 -14 -24 -11 -35 -19 -4 -9 -10 -15 -12 3 -8
5188 -8 -19 -6 -3 -18 -26 -9 -8 -13 -22 -16 -9 -18 -5 -18 5 -8 -14 -9 -15 -12 0 4 -1 -10 -11 -5 -4 1 0 -1 2 -2 3 7 3 4 3 -13 2 5 3 8 1 13 -3 -17 14
5235 14 19 3 1 1 -4 3 17 6 18 0 1 7 4 17 -5 -1 6 -2 8 13 -1 13 -1 -5 -2 18 18 12 13 1 1 18 23 30 21 21 4 13 21 19 17 23 19 21 21
5280 21 23 16 27 16 19 24 28 25 17 24 25 16 30 38 38 28 21 21 12 19 34 28 24 17 6 26 16 5 27 17 10 5 14 25 32 17 7 23 13 6 14 9 11 9
5324 9 14 11 21 25 13 12 12 19 15 35 14 11 16 8 20 20 13 25 5 9 4 5 23 10 10 6 10 7 8 14 13 14 -7 2 13 6 -11 16 -8 -11 -8 -1 -1 -1 -10 -2 -5
5371 -5 -18 2 -4 -6 -5 -13 -15 -4 -10 -4 -17 -19 -8 -18 -15 2 -4 -14 -12 -17 -12 -14 -19 -16 -16 -17 -13 -15 -8 -9 -10 -17 -8 -20 -6 -5 -1 -21 -15 -15 -10 -10 -7 -20 -13 -28 -16
5418 -16 -18 -8 -8 -17 -26 -24 -5 -26 -19 -17 -24 -22 -21 -16 -10 -13 -29 -17 -16 -12 -15 -7 -7 -14 -20 -18 -6 3 0 -8 -11 -11 -7 -7 0 -10 -16 -13 -6 1 9 -2 -10 -5 -6 -8 10 4 3 6 8
$$ packed form
5104A9npMjj1J1j0Rj5Ok1K1J1Lk8RRj5PJrJ1j9%J6moO%n%ljlPj0Pj0mOJ4j6J2
5147a4oP%QokmJJ0qJ8j2j7J7j3J5qMJ3j0j8J2LkQj1J1oqMj0J3k4J6J5njnLJ5j1
5188hj1J3Lj5qJ7JnrOPrJ3j3K3j3oNoLJ2MnrjOJNjjLmNMmJjj6J5LkNpJ2j6j4L1
5235A4Nj6k%nPJ4j1J2j8JOlJ3k2MPqJ0Nj4J4j4mLK0%oJj2%J7NPr%j7RQkkOmK%
5280B1KpJ1j1LNMlqPJrJ4Q%j0p%rPJ5ompj1K0j0j1K2j0pnRJ1Pj5j0J6j0pQnKk
5324INlJ0Mj2j%PmK0k1lNqJ2%pJ2k0MnJJ8j3%mMlJOjJk1RJ1pj7K7k4lLP%%rQl
5371ej3K0okJqkJ1oOj3kJ1j0LJ7oj0KnNknL%jMkPjjpRj2J4JMk0O%N%Lj3Pj5J2
5418a6kJ0%rrKJ9k1PKpKJNOlj6J2JMlQ%poKJ2Rlql%M%Pj0oLPPQj1qNjkJ8ojLK
$$ plain form
5469 8 8 0 -5 2 3 -3 -1 8 -4 6 10 2 0 -2 11 9 6 -5 1 3 -4 5 7 12 12 4 -5 -1 3 11 -4 2 6 -3 11 6 6 11 11 5 14 17 14 13 11 15 11 4 7 26 16 10 1
5522 1 15 19 10 17 18 13 5 17 23 20 24 17 10 18 12 21 24 14 15 0 20 9 18 10 20 21 6 14 19 19 26 18 1 15 11 17 13 13 6 7 19 26 11 6 19 21 1
5569 1 18 18 13 10 9 7 8 26 17 22 6 16 17 15 19 18 14 20 22 15 18 23 18 4 19 4 9 14 17 0 18 19 8 7 13 12 2 9 9 7 1 9 2 -3 11 7 1 5 -5
5618 -5 -4 4 3 -3 -16 -9 -1 -6 -9 -13 -7 -20 -8 -13 0 -14 -4 -3 1 3 -17 -11 -10 -8 -10 5 -1 -5 -8 -3 -4 5 -19 -22 -17 -10 -14 -14 -19 -20 -8 -23 -13 -21 -17 -23 -10 -8
5666 -8 -17 -19 -10 -11 -22 -6 -20 -16 -14 -13 -20 1 -19 -19 -6 -6 -13 -24 -26 -13 -11 -15 -5 -9 -1 -3 -1 -15 -4 2 -12 -6 -3 -6 -8 -2 0 -5 -6 -1 -4 -8 1 4 0 7 -11 -11
5714 -11 13 -5 -15 -11 -11 -7 6 -3 -9 -10 -5 -10 2 -4 3 -8 -15 -12 3 3 -7 3 -1 -16 6 10 -1 12 -8 9 6 6 13 20 15 -2 5 8 17 13 12 1 14
5757 14 2 14 14 13 24 18 13 22 22 13 18 14 16 9 2 10 5 21 7 26 7 10 22 17 13 9 14 15 -2 14 12 21 16 9 13 20 19 11 15 7 12 14 28 33 18 15 11 10
5805 10 13 20 14 11 6 9 21 19 28 20 11 7 14 27 15 20 27 12 0 13 26 16 0 19 9 11 16 7 14 9 16 3 4 10 -5 5 9 -3 6 18 3 12 15
$$ packed form
5469H%qnPJoKRj2J0MqkkJ3klj1OKpRKN%qrMMQj5OMrJ4n%N%oRLljkMmpLJ9j0or
5522AJ4MrPJnqJ2OlMppQoRLj0Jj5K0j1RqJ0Jj5QN%Pqj7J4mOm%pJJ2Pj5nJ3Kk0
5569AJ7%nljkJJ8rNj6J0JkMjmOKpLNnj4J5j5NNLj7J8Jj1jOjj0P%koQpnJ4moMj0
5618eJQjoj3PQnlmOj3J2nJ3j4J0JMKk0OJKkJ5omlNjRk4lNPm%njJ2j5J0qMoJ3K
5666hrkRjj1J6j4MKJpK1k0%J3%pj1kJ3KmJ0mQkKj4J1Oj4OLlkOKnjNlmRLmPj8%
5714a1K4j8j0M%MJ3rojNnJ2oPj1pLJ5%j0J0mj5K2Mj1J3k0J7l%PPnj7PLRmjj1J3
5757A4j2J2%jJ1onR%rNmKppQnJ6j4J9j9LJ2nmmNJj7J6kRnpMPjqMqNKJ4Nj5lmj
5805A0LPolnLJ2kRqrmPJ3j2NPj5j2J3J3j0j6J9j0KNrPnPj3JOj5J0Mj2RJ2j5RL
$$ plain form
5848 15 -12 -2 -6 -8 0 0 3 4 -3 -16 10 -3 2 3 -10 -7 -2 -2 21 -15 -3 -1 -8 -3 -9 -4 9 -9 -11 -9 -7 0 -15 -20 -1 -6 -13 -15 -2 -11 -11 -17 -7 -12 -5
5893 -5 -14 -14 -24 -22 -20 -22 -15 -20 -9 -14 -10 -18 -20 -17 -14 -30 -23 -24 -12 -21 -11 -9 -6 -14 -17 -20 -33 -23 -15 -10 -19 -9 -22 -28 -23 -17 -15 -15 -17 -18 -34 -31 -16 -10 -18 -16 -7 -18 -14
5942 -14 -8 -5 -8 -3 1 -5 -1 -7 -7 -4 -11 -14 -6 -27 -12 -5 -1 -10 -17 -17 -13 -8 -7 -4 -15 2 -6 -6 0 -8 6 3 -1 -8 -3 0 -10 1 0 3 8 6 5 -4 -8 7 9 1 14 20 8
5993 8 7 7 -6 11 7 7 8 6 16 9 12 17 10 13 10 6 15 15 11 11 -1 18 10 2 3 9 13 3 5 -1 7 7 10 5 0 5 1 18 4 15 8 1 16 12 3 17 6 1 4
6042 4 11 13 18 17 9 6 10 11 11 22 10 11 10 26 18 19 24 14 4 13 8 14 9 6 2 14 10 15 5 22 0 6 7 7 25 15 12 0 9 0 3 8 -1 4 -6 13 9
6089 9 4 14 8 3 4 -9 4 9 -1 3 12 -3 8 5 8 6 4 0 -9 2 4 -1 9 6 -4 -12 -1 3 -1 -3 -8 0 -5 -8 -2 -1 -9 1 -9 -3 -7 -7 -6 1 -9 -14 -14 -10
6137 -10 -7 -9 -18 -21 -13 -16 -5 -18 -9 -14 -16 -17 -17 -5 -21 -18 -19 -18 -18 -16 -17 -9 -11 -13 -16 -11 -19 -4 -15 -6 -16 -13 -6 -17 -17 0 -10 -9 -13 -5 -10 -12 -15 -12 -7 -16 -10 -18 -5
6186 -5 -14 -18 -7 -4 -3 -14 -11 -8 -5 -13 -27 -11 -12 -19 -1 -5 -15 -8 -3 -4 -3 -10 -6 -11 -15 -10 -15 -4 -15 6 -2 -13 -3 1 7 -3 -2 3 -3 0 8 9 -1 1 4 5 0 -1
$$ packed form
5848A5k7J0mkQ%LJpj3K6j3NJj3LN%K3l6J2KpNoNJ3j8kKKPj5nJ9npkJ3r%oJ0nP
5893er%j0KKkPnJ1nMqkLLj6PjJ2rJ0KLqllj3J0QNrJ0j3oNOK%kjj6LJ5OqKRj1M
5942a4OLlNMoMo%LplQk1J5PMrp%MNJLj1J7q%OqJ4lmpNLj0J1jLNkjrmJ5KqJ3Oj2
5993Hj%j3J7m%JkJ0pLNpLlmR%m%j2J9qqJOMj0KoQ%LnnNmJ7j4J1ppJ5mrJ4j1nL
6042DPKNjqlMJ%J1j2JjJ6qJNj0j0RnOnlmJ2mNj0J7k2OJ%J8j0lj2RrLNrNj0J9m
6089InJ0onJj3J3Nj0MRj5J1lLkkmrJ1KnJ0lj0qJ1MmknQnlOJqJ0j0Om%JPj0n%M
6137a0LkrlQlJ1j3Rnkj%J2j6LjJ%KjQkklNqJ5j1Rj0LPj1%J7j0JmQnklLNrOqJ3
6186ermJ1LJj1LLLqj4J6jpJ8mj0PNjJpMnmNnJ1j1K1qj1J0MOj0JNoLQJj0KLJnj
$$ plain form
6234 -1 -6 1 -7 0 3 15 15 6 7 9 8 5 14 5 11 15 12 5 15 1 8 11 13 17 9 14 11 9 4 17 19 8 7 10 8 18 20 7 10 16 11 21 12 3 11 11 1 13 9 3 24
6285 24 16 10 25 22 23 14 12 12 12 19 19 16 20 14 29 24 21 16 29 15 16 18 15 13 13 12 8 16 25 2 10 9 20 12 11 6 15 3 16 19 11 12 7 9 17 13 16 19 0 16
6335 16 -1 5 13 3 -5 12 -1 18 11 17 14 18 16 1 11 7 11 8 21 9 5 7 8 2 12 -3 -8 -9 -3 -1 5 -3 -4 16 6 8 12 2 4 -4 6 0 -8 0 -4
6380 -4 -5 2 -2 -6 -19 -7 2 -16 -2 2 -1 -7 -3 -2 -20 5 -14 -6 9 4 2 -7 -10 -2 2 -1 -4 -10 5 -5 4 -14 -7 -9 7 -14 -11 -13 -4 -4 -26 -22 -9 -7 -15 -16
6426 -16 -22 -13 -9 -16 -10 -12 -7 -2 -28 -9 -13 -9 -18 -18 -17 0 -19 -5 0 -4 -9 -8 -2 -4 -13 -4 -8 -12 -16 -10 -11 -1 -16 -1 -8 -10 3 1 -2 -1 -11 -3 2 2 -4 1 -1 -3 9
6475 9 1 10 3 6 -1 3 11 1 9 12 3 8 9 7 9 3 5 6 3 2 0 3 0 7 4 0 21 13 22 -2 3 13 -3 7 11 11 19 4 4 3 7 7 16 13 7 0 3 6 14 7 12 8 3 4
6529 4 11 15 16 18 14 17 11 14 10 6 22 11 11 20 17 12 14 10 19 15 19 21 24 10 1 19 5 2 9 6 12 -7 13 14 8 16 9 13 13 15 7 7 16 -3 -3 15 1 1 16 4
6579 4 13 17 10 10 16 6 17 17 8 13 5 13 8 7 0 -4 1 -3 5 6 11 1 0 -1 1 1 5 10 17 8 9 14 0 -9 5 7 2 -1 9 2 2 -1 -5 1 -9 -8 -6 -7 -6 1 -6 -13 -9 0
$$ packed form
6234anPqPLJ2%rJKjlRrOMlpJ0j4PLKMqNlknJ3Kj1jLkJ0Kj3LOnJ0rrQ%j0J2moK1
6285B4qoJ5lJrk%%P%lMoJ5nlnJ3j4JKlk%jmQRk3QjJ1qjnRj2J3LqJnKQmLLj9J6
6335A6j7OQj0qJ7j3J9pOlMkj5J0mMlJ3j2mKJoJ0j5njOKOqjK0j0KMj0KqJ0oqQm
6380djPmmj3J2Rj8J4MloMJj8K5j9QJ5nkrlQMlloJ5j0Rj8PkJ6k1LkR%k2MJ3Kqj
6426a6oRMpOkNNk6J9mMr%JJ7j9J4NmnJOkrRmmmOjJ0j5J5pkJ3klJj0QN%oNkkJ2
6475IqRpLpMQj0QLrNJkKoKJljkLlPlmK1qRk4NJ0j6J0M%Qj5%jM%RlopLLQpNmnJ
6529DPMJKmLoLmmJ6j1%RlnKmRmMKLj4rJ8j4lPlOj9K0JoQpM%Kq%Rj9%J8j4%J5j2
6579DRMp%Oj0J1%rNqQnjpmNmQJNj0jjK%MNPrJNj4rJ4KnlJ0p%lmOj0JKjJPppMR
$$ plain form
6633 0 1 -6 0 0 -1 -4 -9 -3 10 -10 1 -4 -16 -6 1 1 9 -13 2 -2 -10 -8 -5 -3 -15 -6 0 -13 -11 -9 -1 -3 -5 -3 -3 -12 -7 -5 -5 -3 5 -12 -10 -10 -8 -8 -5 -8 -2 -6 -1
6684 -1 -10 -5 -6 -15 -2 0 -4 0 -10 2 -4 -18 -3 -11 9 -4 -4 5 4 -7 -7 10 15 9 -3 -1 0 -11 -11 3 9 3 5 2 9 0 1 7 7 5 5 12 8 -1 -2 -6 2 -2 1
6733 1 -1 1 3 4 0 -10 -4 -9 0 -3 2 10 4 5 -2 7 6 10 14 11 9 6 8 9 7 16 5 9 11 0 10 23 7 16 17 16 9 11 19 16 16 14 7 21 7 12 18 9 15 18 13 7 5
6786 5 6 26 14 20 19 24 5 14 20 18 19 12 3 20 15 23 11 16 23 1 10 5 3 4 1 -2 12 4 8 1 -2 7 4 -5 11 9 6 0 1 12 -2 7 6 4 8 4 9 17 6 15
6836 15 4 12 9 10 -7 10 3 8 2 6 11 3 0 9 -2 10 3 5 9 3 5 -7 9 -9 -1 2 0 -4 14 7 0 0 -6 -5 13 11 -3 1 -1 -5 -11 -4 5 13 3 7 0 -2
6884 -2 2 -8 -2 21 -8 3 1 -4 -7 -9 -1 -10 -6 10 -3 -6 4 -6 3 4 2 -10 3 -5 0 -5 -2 3 -8 -9 -15 -16 -4 -3 -4 0 -17 -5 -1 -12 -9 -8 -2 -9 -17 -2
6930 -2 -6 3 -5 -5 -7 -13 -10 -15 -3 -1 -1 4 3 2 -1 4 6 -4 -15 7 -4 10 9 1 -11 -2 -7 -3 -5 -3 -10 -1 3 -3 5 -9 1 0 3 -5 -12 0 -6 0 4 1 2 -5 12 -9
6980 -9 -1 5 7 -2 -2 10 1 2 15 4 1 0 -4 3 2 12 6 8 -9 4 4 1 5 8 11 14 14 9 7 24 8 9 5 14 8 9 -2 24 19 1 1 6 3 10 -2 12 7 5
$$ packed form
6633@JpO%jlnOJ3k0J1nj2J0P%Qk2J5mqKLKj2ROj3KKQkkK%rNK%KQj7K%K%LlOmN
6684arNjrJ3KmMj0J2oj4J5qK0j3%Rjj1%J7Noj2KJj1%J4OoKlPrJO%k%PmrjmQmL
6733AkKKJmj0OnRlNQoJpRjMMlklKJkRj1MKj1J0J3j6RJjpKQl%kpJ4j4NOrOLnok
6786EJK0j2OjNj9ROkJprJ7nQj2NPk2RnkJllJ4qMplRlrJ6kloJJ1j4RjkMmNQj1R
6836A5j1QlJj7J7pNoMNqlRj1J2pKMoKj2J6j8QLkmJ8pp%oJJ8kj4MkmoPRQj0Mpk
6884bMj0OK3k9J1knlkQrMJ6j3lJ0j0RJkj2J3qNnLNj1jojJ2JjMj7J2Mj1LJOpqJ5
6930bmRq%koLnJ2K%NjjlNKj0j1K2j1J4jqj2RnMkKpRMoQj4J0jLqpJ2oOMlJpJ7k1
6980iQOKr%J2rJJ3j1ljmPjJ0oKj7J3%lMLLL%nkJ7j6JmRoJj1K6nj8%NlPj2J4nk
$$ plain form
7028 5 -1 0 4 3 4 8 2 4 1 3 -1 1 5 -1 6 10 16 8 12 6 8 2 5 -1 7 13 -3 5 3 5 9 9 7 14 10 11 10 3 10 7 7 5 10 15 18 11 15 21 -1 5 7 3 17 18 1 1 4
7085 4 8 18 3 -1 2 -4 -6 4 2 2 11 -2 -9 2 1 -4 5 -7 -2 0 -1 0 0 8 2 3 -9 6 1 -2 -2 9 9 1 7 -3 -2 4 -4 -1 7 1 3 -6 9 -2 2 -5 -3
7134 -3 -1 -8 1 -14 -10 -6 -3 9 2 1 2 3 -5 8 -7 -13 -12 -6 3 0 -1 -3 -15 -5 4 -10 -4 -1 1 4 -4 -7 -6 -2 -4 -9 -1 0 -6 -3 -1 3 -7 -2 -7 11 4 -8 0 -6 5
7185 5 1 -1 6 -5 4 -9 -2 8 4 0 -3 3 4 6 4 4 1 7 3 9 1 -4 9 -10 11 10 2 8 1 1 -12 -7 -1 2 -5 0 -14 -8 -3 1 -9 1 -4 -12 -12 3 12 0 1
7234 1 -6 2 -8 3 2 11 8 11 13 7 5 6 -3 3 2 17 6 13 11 2 9 14 6 -9 17 11 13 9 19 10 16 2 12 5 15 11 12 15 13 1 14 8 -5 4 8 15 13 12
7282 12 7 4 -5 8 6 9 11 -2 8 10 -1 15 1 10 6 4 17 8 5 10 14 15 6 12 4 1 11 12 4 18 14 9 19 11 12 18 16 -2 2 3 7 7 19 10 6 4 7 1
7330 1 15 6 6 -3 -1 -6 9 -2 -10 10 5 -2 -2 3 10 -4 5 11 8 2 6 8 7 4 3 -2 9 3 1 5 -2 1 6 0 14 3 9 16 10 9 17 18 12 -12 8 10 -1 0 11
7379 11 2 8 3 7 5 -7 8 5 5 2 -8 4 10 -6 -7 -3 -12 -5 -7 -3 -15 -15 0 -19 1 1 2 -10 -7 0 -4 1 -16 -2 -7 -9 -13 -3 5 -10 -3 -4 -16 -6
$$ packed form
7028EoJMjJMoKlKmKMoPMOqMoKoLoQOj6QkKM%kPmJjpPl%kNNLpMOk2OKmJ4Jj7%L
7085DMJ0j5mLokJ0k%Rj3pJ1jnRj2NKjJ%QoJj2J5nl%J1%qOj0JOqLQoKrJ5j1MpK
7134cKpRj5MMLJ2pjJJqJ3j5oJORljkj2J0Rj4OLKLqlJMknQJoLKMj0NnJ8pj2QoJ1
7185EmkPj1Rj3PJ0mmlOJKk%lOmOqnJ3j9K1jqOp%j3NOLpNj4ONMj0J0nq%J5Rj2J
7234ApQj0J1jRlLKokJrOjJ5j1PkrPNqj5K6oKmJ0rOj4J0pJ0mJLkj2J3oj3RMPkj
7282A2nlrJ3kLKj3J0Kj1J6j4RmkJ3rlNMJrOqlJ0JqJ4mnJ0qJOkj8MJM%J2rmkLo
7330AJ4r%rKnJ5j1qK0np%NPj4ROloMKjljnJ1okMpLNoJ4j1OPojQJok4K0Kj1JJ1
7379A1rOnMkj2J5l%lj0J2Oj6jMrPkMj2%J5j9K0%Jj2LPmNj7J4nkmJ0Qj5Pjj2J0
$$ plain form
7423 -6 0 1 -5 -3 5 -1 7 15 -1 5 1 5 4 1 -2 1 5 10 -5 -4 4 5 -6 4 -6 -4 0 -5 8 -12 -6 -3 6 -3 -8 -2 -7 -8 -3 7 -2 -8 4 7 -5 2 -4 9 -1
7472 -1 -10 4 0 4 -10 3 5 0 12 -4 6 11 9 3 7 12 4 10 5 6 7 9 3 2 -1 5 15 -1 10 11 9 -3 20 4 14 6 19 12 3 4 3 7 6 1 6 8 4
7519 4 10 -3 -8 -2 5 -5 -2 -6 -9 -9 7 1 7 12 7 4 5 -2 -1 5 -7 -5 10 11 -2 5 15 6 2 -6 -7 -7 -1 -7 9 0 7 4 1 1 5 4 4 14 10 16 12 -1 8 -1 13
7570 13 3 8 7 1 -1 -2 0 -11 -6 9 2 0 -5 -10 -3 -2 0 3 6 -14 7 10 -2 9 5 1 -5 -4 3 2 -1 4 -7 5 -10 -7 4 5 5 1 -7 -6 7 3 2 -4 -11 -3
7618 -3 1 4 8 3 5 7 4 3 3 -6 -10 -5 -6 -2 2 -2 -14 -13 -8 -10 -7 2 5 -13 -3 -1 -5 -3 -14 -7 -17 -5 -3 -6 -10 -11 -5 -12 -7 -8 -14 -2 5 -12 -3 -5 5 4 -1 -4 -10 2
7670 2 -11 2 -5 -5 0 -5 10 -4 3 -9 -10 2 -3 4 0 -3 5 2 -3 -2 -7 5 -5 -6 -10 -12 -7 -19 -1 -5 1 10 -1 -7 -6 -11 3 -5 2 3 -3 -12 -12 -3 0 -4 -14 -10
7718 -10 -7 -6 -4 -14 -5 4 3 5 1 6 4 3 -12 7 -6 1 2 -4 1 -3 -8 3 2 2 2 -5 2 6 -3 -3 9 5 2 -6 0 4 -1 3 -2 2 13 -5 -1 3 -6 7 8 -2 1 7
7768 7 5 4 2 0 5 7 -7 7 -5 4 13 -1 7 -2 4 2 9 7 4 12 -2 -3 -4 -1 3 3 1 -2 6 0 8 1 0 2 -6 7 4 6 2 -4 -5 10 1 9 -4 4 4 3 1 0 -5 -5 3
$$ packed form
7423fOJoKQoQQj6OmMjllLMNj5JQJj1J0j0KMnJ3k0OLRrnOnjNJ0roJ2Lj2PoJ3j0
7472arJ4mMj4J3KnJ2j6J0NkoMNqOnJJKojlOJ0j6J1Jkj2K3j6J0qJ3prJjMjnNKm
7519DOj3nOPj0Lml%J6oONnlJpJOj2KJ5Jj3PJ0rmqj%OoJ6rPll%Mj%J0mOmj3RrJ4
7570A3j0NjokjKj1NJ5pknnPJKLLk0K1Lj2J1mmoJPjlNj1J2j5LJ1J%mqJJ3mjopQ
7618cMLMnKKlj%rmNjMMmj2JNkLRLj8J0KmKj1Pj0J2KlmjOpNjoJ2Pj7RkJ0jnloJ2
7670Bj3J3p%NnJ5j4Pj2jJ2nPmlQlnJnJ2j0jmkNj2J8mORj1oJnJ4qPJor%RLmj0M
7718a0LJKj0RRjKmNkjj5J9j3PJoNmnJ1j%%pPMr%J2mlqOMnMnMJ1j8MMrJ3Jj0LO
7768GkjkkNKj4J4j2RRj4QrOkPklQj4jjLM%klQoQpjKqJ3lKmojJ5rQj3Q%jkjn%Q
$$ plain form
7821 3 -15 2 -3 -6 -2 6 -5 -10 4 -1 -4 4 5 -14 -10 2 3 -2 5 -4 7 2 -2 0 -6 2 -13 1 -2 5 -1 3 5 2 11 1 8 4 5 -3 3 9 -7 4 2 0 5 -10
7869 -10 4 5 0 -5 3 -6 -14 0 -21 1 3 -1 3 -3 1 -1 -5 1 5 -6 -3 -2 -4 -6 -6 -1 -18 -3 -7 -1 -2 -18 6 2 6 9 2 3 -6 -4 1 3 4 -1 2 -4 -10 -1 6 -1 2
7920 2 -1 -2 4 3 -9 -10 -3 -4 -16 -10 -8 6 -12 -16 -11 -9 -7 -10 -8 -5 -9 -10 -6 -14 -11 -6 -18 -8 -1 -12 0 -1 -2 -11 -6 -7 0 -9 8 -2 10 -5 1 -1 -9 -7 -1 20
7968 20 4 10 13 5 3 3 1 -1 2 1 -10 0 -5 -1 7 4 6 7 11 3 3 7 7 -1 -11 -13 5 10 12 -1 -5 -6 -12 1 -6 1 1 -10 -3 14 4 -6 6 8 2 12 9
8015 9 3 1 4 -8 -2 7 4 7 -5 5 5 7 -2 18 10 14 5 6 14 3 0 -1 11 -2 10 9 7 3 5 2 -2 2 2 3 10 1 -3 -2 12 -3 -2 3 6 9 -8 -4 10 9 -4
8064 -4 11 9 8 0 0 2 7 3 -11 -5 7 0 -2 13 8 6 6 20 6 12 1 11 14 6 6 18 5 10 13 -4 5 4 12 2 9 7 8 7 10 5 4 6 6 -8 2 -5 13
8111 13 -9 3 -7 1 -3 0 -8 -16 -6 -5 -14 -4 4 -5 -12 -4 -6 -13 -7 -3 -19 2 -16 -2 4 -16 -14 -9 -8 3 0 -6 -10 5 -10 6 8 -3 -2 -6 -2 2 -3 -1 -1
8156 -1 -6 -6 1 -18 -1 -2 -3 -4 1 -1 6 0 -2 -1 7 -5 -8 -6 -2 -3 -7 -4 -9 -9 -10 -3 -12 -4 -4 -4 -3 1 -3 -8 -11
$$ packed form
7821Cj8J7nlMQj1nJ4nlQJj9MJ2JnPrJ1nmKoQj5J4lPoMKlRj0PmJqOOj6J1kkNj5
7869a0J4JnnQrqJ4k1K2KmMoMkmOMj1LJkk%Nj7J5mOjj6K4mMLpJrKNKJnLooRPpL
7920BljOjj2jPjj2OKJ4j8mNKKlKLmjMqLNj2J0Pj1J2jjrNjPrJ7j0J2j5OkqKOK1
7968B0j6OLqk%kkLjj1J0nMQlKJMq%M%qj0kJ8NKj3mjoJ3pP%j1PJ7j0j0J2KoJ0l
8015IokLj2ORlLj2J0%KrK0qMrJQj1ljJ2j3J2jkmKlmM%JPrmJJ4j5JNLLj7MJ4jj3
8064dJ5kjq%KNmj4OJ2pkJ5nk%J4j4Oj1J0Lq%J2j3NLj7RjQj0PkJjLnjK%j4J0pJ8
8111A3k2J2j0QmLqqJ0JrJ0QrpQkpOMj6K1j8J4Ok0KNJJ1lomJ5j5J6Kj1JmMMnK%
8156an%Pj9J7jjjNkPokJQj2lKMjmLn%jPrQ%%JMmnl
8191a1
##END NTUPLES=NMR FID
##END=
