##TITLE=1H_Lac-DMe-B1-f17
 CDCl3, 8 sc, 
 22.11.2019
##JCAMPDX= 6.0         $$ Bruker NMR JCAMP-DX V2.0
##DATA TYPE= NMR FID
##DATA CLASS= NTUPLES
##ORIGIN= UXNMR, Bruker Analytische Messtechnik GmbH
##OWNER= root
$$ XWIN-NMR		Version 3.5
$$ Fri Nov 22 16:44:40 2019 Russian Standard Time (UT+4h)  she@DPX200
##.OBSERVE FREQUENCY= 200.1315
##.OBSERVE NUCLEUS= ^1H
##.DELAY= (6, 6)
##.ACQUISITION MODE= SIMULTANEOUS
##.ACQUISITION SCHEME= undefined
##.AVERAGES= 8
##.DIGITISER RES= 18
##SPECTROMETER/DATA SYSTEM= spect
##.PULSE SEQUENCE= zg30
##.SOLVENT NAME= CDCl3
##.SHIFT REFERENCE= (INTERNAL, CDCl3, 0, 15.7039)
##AUDIT TRAIL= $$ (NUMBER, WHEN, WHO, WHERE, WHAT)
$$ ##TITLE= Audit trail, XWIN-NMR		Version 3.5
$$ ##JCAMPDX= 5.01
$$ ##ORIGIN= Bruker BioSpin GmbH
$$ ##OWNER= she
$$ F:/spectra/data/she/nmr/H-F/1/audita.txt
$$ ##AUDIT TRAIL=  $$ (NUMBER, WHEN, WHO, WHERE, WHAT)
(   1,<2019-11-22 16:43:44.00 +0400>,<she>,<DPX200>,
      <created by zg, POWCHK disabled, PULCHK disabled
       configuration hash MD5:
       00 E9 B6 7A A2 85 ED C7 34 08 36 98 17 FE 4E 26
       data hash MD5: 16K
       B6 25 A5 7B 3A 71 5E 4B C9 7C 2B 5F 2C 75 4A C6>)
$$ ##END=
$$ 
$$ hash MD5
$$ 3A 35 CA AB 24 CC 25 E4 34 3B 8A AA 49 8B A9 6D
##$RELAX= 
##$RELAX= 
##$RELAX= 
##$RELAX= 
##$RELAX= 
##$RELAX= 
$$ Bruker specific parameters
$$ --------------------------
##$DU= <F:/spectra>
##$EXPNO= 1
##$NAME= <H-F>
##$PROCNO= 1
##$TYPE= <nmr>
##$USER= <she>
##$AMP= (0..31)
100 100 100 100 100 100 100 100 100 100 100 100 100 100 100 100 100 100 
100 100 100 100 100 100 100 100 100 100 100 100 100 100 
##$AQSEQ= 0
##$AQ_mod= 1
##$AUNM= <au_zg>
##$AUTOPOS= <>
##$BF1= 200.13
##$BF2= 200.13
##$BF3= 200.13
##$BF4= 200.13
##$BF5= 200.13
##$BF6= 200.13
##$BF7= 200.13
##$BF8= 200.13
##$BYTORDA= 1
##$CFDGTYP= 0
##$CFRGTYP= 5
##$CHEMSTR= <none>
##$CNST= (0..31)
1 1 145 1 1 1 1 1 1 1 1 1 1 1 1 1 1 1 1 1 1 1 1 1 1 1 1 1 1 1 1 1 
##$CPDPRG= <>
##$CPDPRG1= <>
##$CPDPRG2= <>
##$CPDPRG3= <>
##$CPDPRG4= <mlev>
##$CPDPRG5= <mlev>
##$CPDPRG6= <mlev>
##$CPDPRG7= <mlev>
##$CPDPRG8= <mlev>
##$CPDPRGB= <>
##$CPDPRGT= <>
##$D= (0..31)
0 1.2 0 0 0 0 0 0 0 0.06 0 0.03 0 0 0 0 0.0002 0 0 0 0 0 0 0 0 0 0 0 0 
0 0 0 
##$DATE= 1574426623
##$DBL= (0..7)
120 120 120 120 120 120 120 120 
##$DBP= (0..7)
150 150 150 150 150 150 150 150 
##$DBP07= 0
##$DBPNAM0= <>
##$DBPNAM1= <>
##$DBPNAM2= <>
##$DBPNAM3= <>
##$DBPNAM4= <>
##$DBPNAM5= <>
##$DBPNAM6= <>
##$DBPNAM7= <>
##$DBPOAL= (0..7)
0.5 0.5 0.5 0.5 0.5 0.5 0.5 0.5 
##$DBPOFFS= (0..7)
0 0 0 0 0 0 0 0 
##$DE= 6
##$DECBNUC= <off>
##$DECIM= 24
##$DECNUC= <off>
##$DECSTAT= 4
##$DIGMOD= 1
##$DIGTYP= 9
##$DL= (0..7)
0 120 120 120 120 120 120 120 
##$DP= (0..7)
150 150 150 150 150 150 150 150 
##$DP07= 0
##$DPNAME0= <>
##$DPNAME1= <>
##$DPNAME2= <>
##$DPNAME3= <>
##$DPNAME4= <>
##$DPNAME5= <>
##$DPNAME6= <>
##$DPNAME7= <>
##$DPOAL= (0..7)
0.5 0.5 0.5 0.5 0.5 0.5 0.5 0.5 
##$DPOFFS= (0..7)
0 0 0 0 0 0 0 0 
##$DQDMODE= 0
##$DR= 18
##$DS= 0
##$DSLIST= <SSSSSSSSSSSSSSS>
$$ [...]
##$SUBNAM2= <"">
##$SUBNAM3= <"">
##$SUBNAM4= <"">
##$SUBNAM5= <"">
##$SUBNAM6= <"">
##$SUBNAM7= <"">
##$SUBNAM8= <"">
##$SUBNAM9= <"">
##$SW= 24.9337058887773
##$SWIBOX= (0..15)
0 0 2 0 0 0 0 0 0 0 0 0 0 0 0 0 
##$SW_h= 4990.01996007984
##$TD= 16384
##$TD0= 1
##$TE= 0
##$TE2= 300
##$TE3= 300
##$TEG= 300
##$TL= (0..7)
0 120 120 120 120 120 120 120 
##$TP= (0..7)
150 150 150 150 150 150 150 150 
##$TP07= 0
##$TPNAME0= <>
##$TPNAME1= <>
##$TPNAME2= <>
##$TPNAME3= <>
##$TPNAME4= <>
##$TPNAME5= <>
##$TPNAME6= <>
##$TPNAME7= <>
##$TPOAL= (0..7)
0.5 0.5 0.5 0.5 0.5 0.5 0.5 0.5 
##$TPOFFS= (0..7)
0 0 0 0 0 0 0 0 
##$TUNHIN= 0
##$TUNHOUT= 0
##$TUNXOUT= 0
##$USERA1= <user>
##$USERA2= <user>
##$USERA3= <user>
##$USERA4= <user>
##$USERA5= <user>
##$V9= 5
##$VALIST= <valist>
##$VCLIST= <CCCCCCCCCCCCCCC>
##$VD= 0
##$VDLIST= <DDDDDDDDDDDDDDD>
##$VPLIST= <PPPPPPPPPPPPPPP>
##$VTLIST= <TTTTTTTTTTTTTTT>
##$WBST= 1024
##$WBSW= 4
##$XGAIN= (0..3)
0 0 0 0 
##$XL= 0
##$YL= 0
##$YMAX_a= 9276
##$YMIN_a= -8430
##$ZGOPTNS= <>
##$ZL1= 120
##$ZL2= 120
##$ZL3= 120
##$ZL4= 120
##$ABSF1= 10
##$ABSF2= 0
##$ABSG= 5
##$ABSL= 3
##$ALPHA= 0
##$AQORDER= 0
##$ASSFAC= 0
##$ASSFACI= 0
##$ASSFACX= 0
##$ASSWID= 0
##$AUNMP= <proc_1d>
##$AZFE= 0.1
##$AZFW= 0.1
##$BCFW= 1
##$BC_mod= 2
##$BYTORDP= 1
##$COROFFS= 0
##$CY= 11.3945322036743
##$DATMOD= 1
##$DC= 2
##$DFILT= <>
##$DTYPP= 0
##$F1P= 16.9975609425685
##$F2P= -3.02152046262296
##$FCOR= 0.5
##$FTSIZE= 0
##$FT_mod= 4
##$GAMMA= 1
##$GB= 0.15
##$INTBC= 1
##$INTSCL= 1
##$ISEN= 128
##$LB= 0.24
##$LEV0= 0
##$LPBIN= 0
##$MAXI= 10000
##$MC2= 0
##$MEAN= 0
##$ME_mod= 0
##$MI= 1.114404
##$NCOEF= 0
##$NC_proc= 0
##$NLEV= 6
##$NOISF1= 3.799351
##$NOISF2= 2.8
##$NSP= 1
##$NTH_PI= 0
##$NZP= 0
##$OFFSET= 15.70392
##$PC= 1
##$PHC0= -9878.419
##$PHC1= 31.80086
##$PH_mod= 1
##$PKNL= yes
##$PPARMOD= 0
##$PSCAL= 0
##$PSIGN= 0
##$REVERSE= no
##$SF= 200.130013532006
##$SI= 16384
##$SIGF1= 3
##$SIGF2= 2
##$SINO= 400
##$SIOLD= 16384
##$SREGLST= <1H.CDCl3>
##$SSB= 0
##$STSI= 0
##$STSR= 0
##$SW_p= 3612.71676300578
##$SYMM= 0
##$S_DEV= 0
##$TDeff= 0
##$TDoff= 0
##$TI= <>
##$TILT= no
##$TM1= 0
##$TM2= 0
##$TOPLEV= 0
##$USERP1= <user>
##$USERP2= <user>
##$USERP3= <user>
##$USERP4= <user>
##$USERP5= <user>
##$WDW= 1
##$XDIM= 8192
##$YMAX_p= 0
##$YMIN_p= 0
$$ End of Bruker specific parameters
$$ ---------------------------------
##NTUPLES= NMR FID
##VAR_NAME=  TIME,          FID/REAL,        FID/IMAG
##SYMBOL=    X,             R,               I
##VAR_TYPE=  INDEPENDENT,   DEPENDENT,       DEPENDENT
##VAR_FORM=  AFFN,          ASDF,            ASDF
##VAR_DIM=   8192,          8192,            8192
##UNITS=     SECONDS,       ARBITRARY UNITS, ARBITRARY UNITS
##FACTOR=    0.0002004,     1,               1
##FIRST=     0,             0,               0
##LAST=      1.6414764,     0,               0
##MIN=       0,             -8430,           0
##MAX=       1.6414764,     9276,            0
$$ Real data points
##PAGE= N=1
##DATA TABLE= (X++(R..R)), XYDATA
0@%%%%%%%%%%%%%%%%%%%%%%%%Qj6J6j6J6j6J6j6J6k4L2l2L2l4M2m8M8n5O3o8P6
45D0q4R2j03J17j32J48j67J91k20K60l14L91n15P39j277M750N360j1468m233O628
65B03M453n633k207N957K715o896m111N310N038l340l681K279K012l423j632M468
81A512L027m065l995K536L610j785k550K195K621k646l459K022M101p61l671j57
97a465K596M6j985N22K254o24k802k16K412P82j396l31R07o47j478Q23K185j33
115A450k065m40J264R6p86P67J285j067k032M71J997j6j450M08J403r56k190N88
133a273K706K97k396q80J671P64j303n28J284N33j302p09J011P26o36l43O31k8
151B25j070L1J501L88j586q12J429J071j215j223J048J306r17j477P35J663l12
$$ plain form
0 0 0 0 0 0 0 0 0 0 0 0 0 0 0 0 0 0 0 0 0 0 0 0 0 0 8 -8 8 -8 8 -8 8 -8 8 -16 16 -16 16 -18 24 -24 24 -31 32 -36 40
45 40 -44 48 -55 62 -70 78 -89 102 -118 142 -172 219 -296 443 -834 3916 9276 -2192 -6425 203
65 203 4656 -977 -3184 2773 5488 -1408 -5519 -209 4829 1489 -2192 87 2099 -1324 -2956 1512
81 1512 4539 474 -3521 -985 2625 840 -1710 485 3106 460 -2999 -977 3124 2363 -1308 -1465
97 -1465 1131 1177 -808 -286 1968 1344 -1458 -1674 738 1520 124 -207 700 53 -1425 -602 1583 1450
115 1450 -615 -1055 209 305 -481 286 1571 504 -1528 -1057 940 924 -526 -118 1285 329 -1861 -1273
133 -1273 1433 1730 -666 -1546 125 889 -414 -942 342 875 -427 -1136 -125 601 -35 -378 253 225
151 225 -845 -814 687 1075 -511 -1323 106 1177 -38 -1261 -213 1093 176 -1301 -566 1097 785
168G85j683k20J310M36p79k87N05J8n05R0N05n6l56J81K28m53l43P25O86o30r92
189h35L12R51n7p38N2O75j23p17J0P00J40n96k06L95J63k56K1L01j41n51L3O14
211A47K38m10k44K27lk67J22N57k0p02k31N96L58m13k33M20M5p02j94Q93N92p09
233F7q57K68O99p4m20K13L87l20o10J26O64K25l32l15r2jK06L87Q0m47l09J96
255b59K19j41j9M02J23o11n28M21P89M7o08l24J99J62j0J24K23n2l79k47J37L00
277c2K99Q6l19m66n4N22M02k20l67L3J57j72p0M04L66l80o32L2N63K58j87j50
299G3nj38j67K09M01O6l02k41j7O8J96L11L8m06l76J86M11R7j47jRk76k05L42
323A26N08l9n15k53J93K05M7O7Q4j80l68m9L86L11q5k53j54p3M2K53K61r3l77
$$ plain form
168 785 -898 -1118 192 628 -151 -438 67 85 -420 -330 175 119 -237 -56 172 -281 -624 101 787 157 -835
189 -835 -523 428 371 -367 -315 360 237 -480 -470 230 370 -226 -432 -37 126 -130 -109 192 51 -500 -467 147
211 147 385 -25 -269 -42 -45 -312 -190 367 347 -355 -586 10 368 -45 -278 142 187 -515 -709 184 776 67
233 67 -790 -522 177 103 -317 -104 283 -37 -647 -521 143 368 36 -279 -371 -372 -166 221 301 -146 -455 -259
255 -259 -40 -181 -200 202 325 -286 -814 -393 396 443 -165 -489 -290 -128 -138 -14 209 157 -222 -469 -332 -32
277 -32 267 353 34 -432 -486 36 438 218 -149 -116 41 -131 -201 203 569 189 -443 -411 152 410 223 73
299 73 68 -70 -237 -28 373 439 137 -104 -121 -53 143 454 492 86 -290 -104 307 404 257 256 265 -11 -216 126
323 126 634 595 80 -173 20 225 272 339 423 243 -125 -174 212 523 438 185 31 -42 0 253 514 421 44
346D4j47J91J66OL5P7k09l64N2M95K24l23l84P0J72k6K1K07J5l91k64K34L93N
370B99k20j11k9q4N1K60J27k14k81J4J73P5L0O3r3l04j09K81L35p0k95j28Q3K4
394a23j9J59J64j38l75j00L19K93q4k20p3J3n4O2K34J50k28l27k1K51J76K8l5
417E2j51k64oL28K54j13k48p7Om0J12L18J27m35m39J78M71J40k36j06N1j40j57
440c75K42M47rm72k85J75K92J05L7qk41k88P5L76K14j46j77r1j27m7L19L96j07
463C05n62k65L48L58n0j06N7p0l62q1M81M28k12m89j27J91J35R0J61Kl58k78J58
486b46L49J26j16r8j46k14L4L99K79k33m00n3J90L8L8K08J00l61m01J48N35J86
508C62k85k58j3M2j6J55K90%l72l30J29L70J72m3j76k28j12J67K82P8j40j40n3
$$ plain form
346 44 -103 88 254 260 295 372 163 -201 -149 346 570 247 -137 -67 105 79 100 307 322 -69 -333 -99 294 299
370 299 79 -32 -61 -145 -94 166 293 79 -202 -188 -15 60 90 153 60 -244 -353 -72 263 193 -102 -230 -147 -123
394 -123 -142 17 181 43 -332 -432 -113 180 96 -124 -197 -184 -238 -176 58 208 -20 -347 -368 -117 59 87 52
417 52 -99 -363 -369 -41 213 100 -148 -225 -219 -259 -147 171 298 -137 -576 -398 73 213 -23 -129 -78 -218 -375
440 -375 -133 314 305 -167 -452 -277 15 120 157 149 -92 -380 -305 71 285 139 -38 -129 -256 -303 16 412 305
463 305 -257 -522 -174 184 134 28 85 15 -347 -428 53 481 269 -220 -347 -156 -21 69 230 232 -126 -404 -246
486 -246 103 229 113 15 -131 -345 -311 88 367 134 -266 -319 -129 -91 -53 155 255 -106 -507 -359 176 362
508 362 77 -181 -194 -152 -168 -13 277 277 -95 -425 -296 74 246 203 27 -201 -313 -146 136 214 74 -66 -119
531a19p7nK51L06r9m56k37L27L74l9k08k9Q6j11j57J73L21J7l15k27R5K38J29
554B38l8j29j46J3J15R1j5nL6q4j91J2L47J99k47l32J0L15J14j31l3O5p7j71N1
579GK81J26j74k07o5J13J31P2l9j08o5MJ1J8J20Q2j36k39NK63J35j74j70Q7J27
604B05r5r5Q8J36n9j88m2J66J44q3k08q1J44J94j9k04j16J02J15r8r9J61J58j50
628G6l35l7L57K87j96l52m6K39J06j24p9J58R4k01k48N1L17K00j97l27n7K31J99
651A16r7j92OJ44Rk23l3K76J73k70l36J11M07O0k85j75J40J29o8k3J13M1j54j50
675b81M9J64J28L2j53k55o9K74K89q7k27l3O5j09p3K67L33j77m76q2L37K21j13
698B4n1J01o9k97k8L69K80j75l28o6J33R9O3N5n3j34p1N1O9P6Q9k0k45k07K13
$$ plain form
531 -119 -196 -201 50 356 257 -199 -436 -109 265 226 18 -11 75 -36 -193 -20 301 318 3 -224 -129 109 238
554 238 200 71 -75 -62 53 144 129 124 160 76 -115 -103 244 443 196 -136 -126 189 303 172 139 204 127 -44 7
579 7 288 414 240 33 -32 81 212 284 245 137 72 76 87 105 225 307 171 -68 -63 200 335 161 -9 78 205
604 205 110 15 103 239 180 -8 -50 116 260 177 -31 -112 32 226 207 3 -113 -11 104 6 -93 68 226 76
628 76 -259 -296 61 348 152 -200 -246 -7 99 -25 -104 54 148 -53 -301 -250 67 267 70 -257 -314 -83 116
651 116 19 -173 -167 -23 -14 -237 -270 6 179 -91 -427 -316 91 151 -134 -309 -169 -40 -108 -131 -18 23 -131 -281
675 -281 -232 -68 60 92 -61 -316 -385 -111 178 91 -136 -169 -104 -213 -286 -19 314 137 -339 -421 -84 137 24
698 24 -27 74 5 -292 -320 49 329 154 -174 -240 -107 -8 55 110 57 -77 -148 -97 -28 48 137 117 -128 -335 -122
723a22L96L0l84k44K25K44r9j34J56J39k47l37J52M67J45k95l57j4K23J77O4o1
745A24j39r5QmL1K15J91j78m85j02M38M05j84l91RK21n5j85J34L37m7m03j77K42
769i0K61Kj25j12n1J6J39R0o1q5jqq9N1K42P0k82k54J34L23L4j88m5O4q5j19J37
796c2K77K2k91k18J09K17J00l0p1r3o4RQ5Q9J06j6j90k09Q8L30J39k49k24J20
820DJ72p8j23J31J96j53k88N6K70J53j54k09l7J01J47O1j10j36L2J02m1j10J32
843A18K54j40m18n1M26K81k76l03O4J72m4p2J23J22j06k15m0J12J40J06n2k34
865c3j63J35K81j0k16k4J36m8k00P7L10M1l66k18K33K75o7j81k9N3m9m1J38J14
889A48q8k08l8P9J00Q6L5j39k39pK50J30q8j12L0l8j65L5L18J53l09k97Q8K47
$$ plain form
723 -122 274 304 -80 -324 -99 145 46 -88 68 207 -40 -377 -225 242 387 92 -265 -279 -56 121 185 124
745 124 -15 -110 -102 -106 -75 140 331 153 -332 -434 4 409 225 -166 -157 64 9 -176 -42 295 248 -155 -332 -90
769 -90 171 173 48 -64 -115 -99 40 130 69 -16 -17 -25 -114 -63 179 249 -33 -287 -153 170 204 16 -29 35 -50 -169 -32
796 -32 245 267 -24 -242 -133 84 184 154 83 -10 -74 -65 20 109 215 199 9 -200 -112 218 357 108 -116 4
820 4 176 98 -25 106 302 149 -139 -83 187 340 186 -23 -60 41 188 249 139 3 35 137 96 -14 118
843 118 372 232 -186 -237 189 470 194 -109 -45 127 83 11 134 256 150 -65 -105 7 147 253 201 -33
865 -33 -196 -61 220 210 -6 -30 106 58 -142 -65 245 286 -80 -298 -65 210 143 -38 -67 -14 -63 -104 34 148
889 148 60 -148 -186 -107 -7 79 114 -25 -264 -271 -21 109 21 -91 -61 -99 -264 -229 89 242 -67 -364 -276 -29
913b9L4r8L2N6j41j74J09K40O0j51j27l7K9J12J39k7j86r4J16Q9l1%J07l6k21
938b29q8K63K35j06k65m1J38P2j2K5M2o8j43l0J58J51J5j39j40n1J13J78M1r2
962B7j08j4PpR8J52k5j92j53Q9K05N4p2q6m0KJ6Q4P8Jj00j07k1J06J61jj50j07
990a03N2J02J3j0K6qj15n4R4J62Jj51q8L3P4O1J1k1p7m9K2O5K7L1Jj09r3K1J83
1019A01Q4j27j44J8Q9MkN6J5j12j23M9J73Q0j04r9k3K2M7O9K9n4j01qM5O2L4K2
1047A02o8j08l4J45J16m5j21l2O3J1k1P0P3o8j62j8J53R5k7j03m2ML1O3N9j6q0
1074D0o5%M0R7N6m5j45n3P7J18K8l8o0k9m5K1Q3J01k3j34j01L1J30R6l5r6o1J
1102a1K9M1Q3L5j19j34J0J36R2j3o3q2n8K0Q7R5J6j27j03j9O4J22M8m9j41p9M8
$$ plain form
913 -29 5 -93 -61 -5 -146 -320 -211 29 89 -62 -189 -226 -197 -85 54 27 -159 -253 -137 -48 -79 -79 28 -8 -229
938 -229 -317 -54 181 75 -190 -231 -93 -21 -33 -8 34 -34 -177 -207 -49 102 117 -22 -162 -213 -100 78 119 27
962 27 -81 -95 -88 -95 3 155 130 -62 -215 -126 79 133 61 -25 -65 -63 -47 37 115 116 16 -91 -112 -6 155 154 4 -103
990 -103 -51 51 64 54 80 72 -43 -97 -3 159 160 9 -79 -46 28 89 100 79 2 -47 -25 40 67 98 99 -10 -103 -82 101
1019 101 185 58 -86 -68 21 25 23 79 94 -18 -141 -92 81 161 57 -42 -65 -43 4 73 102 48 -53 -61 -16 46 80 102
1047 102 34 -74 -108 37 153 108 -13 -45 18 29 8 78 151 83 -79 -97 56 151 124 21 -21 -17 14 77 136 120 40
1074 40 -25 -25 15 112 168 123 -22 -75 2 120 148 110 50 21 -24 -3 80 181 158 24 -77 -46 84 180 145 49 -12 -11
1102 -11 18 59 142 177 58 -76 -66 70 162 149 86 4 -54 -34 53 148 164 37 -66 -85 -21 101 149 100 -41 -120 -72
1129g2J08P0k1p6n5p6J8J18J24k8j81j14N9J28N6l6k0o3r5%J15J40l1j44j15J3
1155a78Q7P9L7l4r9r0L5Q8R0pm5j02q6N0J73R3j02j65kP1L0mO7N0j17j59L8J87
1183a5R2q3j12m0L4L7O4L1l6p5m0rO5J03N9j01j42k7J16J30pj14k8M0j0l2P3J21
1211I4k2j59r5R2J57N5j15q1oN8K8kL6K4k5r3m3R8J24J3j26j03N0J11K7m4j1J1
1239E3j2n2%R9O1m8j39k8J11R8k4r9k8O2Kk4RO9Mj16p2O7J26L3r9q6J7N4NJ2K2
1270G7Lo2n6J0Q0P2k1j01o1M7R1J8o2j8K7kn7lR0O6q9j40K3J64M5j03r8M1O9j4
1300C6n9N2P1m2j17j8J04J15j4j00j01RJ16N8m4o2rM8n3o3R5J46k2k16r0J44J73
1327A57m8j33j8R4k8p0K5J25L0j10j11M7R1O3kj06m7K1R3M2p3k1L3mp5PJ26P3
$$ plain form
1129 -72 36 106 85 9 -46 -122 -104 14 138 110 -71 -185 -126 2 58 22 2 -61 -156 -156 -41 99 68 -76 -191 -178
1155 -178 -91 -12 25 -9 -108 -198 -163 -75 15 8 -37 -139 -225 -175 -2 91 -11 -176 -178 -107 -77 -81 -14 36 -81 -240 -202 -15
1183 -15 77 -6 -118 -158 -124 -87 -23 8 -28 -103 -143 -152 -87 16 75 -26 -168 -195 -79 51 44 -70 -98 -58 -68 -100 -27 94
1211 94 72 -87 -182 -90 67 122 7 -74 -80 -22 6 4 40 64 39 -54 -97 1 125 138 12 -91 -41 70 97 53 42 53
1239 53 41 -11 -11 88 149 101 -38 -66 45 143 119 20 -8 54 56 32 41 110 114 -2 -74 -7 119 152 53 -33 -16 38 43 55 77
1270 77 80 18 -38 -28 52 124 103 2 -59 -12 79 97 35 17 44 42 -15 -18 72 138 49 -91 -68 96 141 38 -60 -19 50 36
1300 36 -23 29 100 58 -59 -77 27 142 128 28 -73 -64 52 110 66 4 -5 43 -10 -73 22 168 146 -70 -160 -16 157
1327 157 109 -24 -42 52 24 -46 -21 104 134 24 -87 -40 51 114 112 6 -41 -20 73 115 42 21 54 50 -25 -18 108 181
1355A81j30j66N5J66K7q7m9M6k4q0K6J32P3j01j40j1P6Q2Rk7o1l2j6L2L1L2M4
1382H8n2j47m4J34J41m0j59k6Q4L4q7kJ07L3j37j16R8J59Kj43q7P7R2Km5l9J9
1409e4J8k2n6N5Q8K3j58j19Q7K07K3j65j24Q7J00n7n0Q0J07r6j97kJ71J41n2j39
1435a04n9K8Q5J3j9j0N5l2q3l9J10J26m2j67l6J47P8q5q1N6Q0n0o4M3Q2kj02k8
1463a00P6O6Ro7n7MP2P0k5n0J5K5p6l3J01J45m5j77o7J11J15m3m8O2Rr7p4R2J21
1492A34K1j06p2MN2N6%l0n0L7J1k8l2P8O4o9j43M3J75L1j46j16J28R6n5q5M6Q3
1520A27p7r0K2J32L2o5j02j5K9Q2O3l9p7m3L8K2l5N8R5l7j90q3J76J71o8j51j
1547b6P9l9p1O2J35l7j47o0R6P7ll3k8m2j7O5M4k9m2J8nn0%J15N7j26j33R1J39
$$ plain form
1355 181 51 -115 -60 106 133 46 -3 43 19 -61 -35 97 170 69 -71 -82 -6 76 85 58 -3 -35 -51 -19 12 44 88
1382 88 36 -111 -155 -21 120 80 -79 -105 -21 13 -74 -76 31 64 -73 -189 -91 68 70 -73 -160 -83 9 11 -34 -73 -54
1409 -54 -36 -58 -114 -59 29 52 -106 -225 -138 69 92 -73 -197 -110 -10 -67 -117 -37 70 -26 -223 -225 -54 87 35 -104
1435 -104 -163 -135 -50 -37 -56 -66 -11 -43 -126 -165 -55 71 29 -138 -174 -27 51 -34 -115 -59 21 -29 -93 -50 32 30 -72 -100
1463 -100 -24 42 51 -16 -73 -69 3 73 48 -2 13 38 -38 -71 30 175 130 -47 -114 -3 112 69 21 83 92 -5 -79 13 134
1492 134 155 49 -23 -19 33 89 89 59 9 46 57 29 -3 75 139 70 -73 -30 145 176 30 -86 42 138 83 -2 44 127
1520 127 50 -40 -18 114 146 81 -21 -36 -7 75 138 99 22 -21 17 39 4 62 157 120 -70 -153 23 194 126 -25 -26
1547 -26 53 14 -57 5 140 103 -44 -104 -8 69 66 33 5 -37 -54 11 55 26 -16 2 -3 -53 -53 62 119 -7 -140 -49 90
1576I0mj14OP2l3r6M2J39L0j28j04M6Q7L6kl8m1l2J4M8K5J0%l1r8j4J40J07q2
1605G5j23k0J05K5p3QP8mj19m5J05J07n2r4l2L7L5K9ol5k1nJoJ2N5J4r8n6N9J07
1636F3Kj12k3M9J5l3RN9J3q6n6L9P1L0j7n6m1J1N1J0l2pK2k6n4J6R8L3r0r7N7
1667h2Q3ln7%K3l2k6K5N3J4n9l4nJ9N6L3m4o5MN6K2l5JK2j8p1J3Q2O7p2p3RO3
1700c1J4j6K3Pl7k8K9N6Ok7j9k7oM3O8mn3m8L9M4k9RL2j4p1j0Q1P2m4o5nL2oP
1734B2L4K9n7n9K5O8K0j5k4j7k2K1N9K3l6o1J7MmM4L3jq0m8N3P5Km6pNk9oN1O0
1768A33l9o6k1J7N7J7j0k6m1nK5K8J6Jl6l5k9M0P1J1p2n4J6K7J9lK0j9n1k8M1
1799DM0J8k4n8l3J6P3K2k7m8j5KlL1N5Mp9n8K9P0K8k7j6k4k1%N3L9qn8m1J6K9
$$ plain form
1576 90 86 -28 -22 50 17 -79 -37 102 132 4 -100 -54 33 69 67 29 -12 -44 -30 18 43 53 53 22 -76 -90 50 157 75
1605 75 -48 -68 37 62 -11 -3 75 71 -48 -93 12 119 67 -27 -59 -22 13 42 36 1 -20 -25 -24 -30 -18 37 51 -47 -103 -44 63
1636 63 65 -47 -70 -21 -6 -39 -30 29 42 -44 -100 -61 10 40 23 -33 -74 -63 -12 -2 -34 -41 -19 -45 -99 -83 15 48 -42 -139 -82
1667 -82 1 -2 -59 -59 -36 -68 -94 -69 -16 -2 -61 -95 -100 -81 -25 8 -36 -101 -97 -41 -19 -54 -53 -31 -49 -120 -107 -25 42 -30 -103 -94 -31
1700 -31 -17 -33 -10 -3 -40 -68 -39 17 23 -4 -23 -50 -56 -13 55 51 -2 -50 -11 33 4 13 45 31 -40 -50 31 103 59 -6 -11 21 15 22
1734 22 56 85 28 -31 -6 62 82 67 43 26 4 25 84 107 71 10 27 31 27 71 104 103 23 -25 28 103 105 59 52 57 28 22 73 133
1768 133 94 28 7 24 81 98 88 62 21 16 41 69 85 86 50 15 -14 26 97 108 36 -18 -2 25 44 41 61 42 -9 -37 4
1799 4 44 62 38 -20 -53 -37 36 58 31 -17 -32 -30 -33 -2 53 57 -22 -80 -51 19 47 20 4 -20 -41 -41 12 51 43 -15 -56 -40 -11
1832a1L7J8k7o3mL8M7Jl4jqm0NP2O3p5o3j5N4J8knNk9m1K3O3K8m6n2nJ3L1L6j1
1867B0l4l4K0K8j1J8K7k1o0k9P1P9k0p7l3M2J5j1PL0j0n3m0O0N0J3m9m0k1L7L0
1898DJ1j8j2orqL0M6j3o8l9K2O8J4m5k5PJ4j8KK8K0k2m3k4M8N3j5o9j9J8N2j0
1931b6r%Ql0l6L0O8K6o2n3QN8J8Nk5j2j7KRK9L9No6n9K6R7L2p0m7J8M7k8j5M5
1965A5N5n8p5J4Q7M4o2n5QJ9J5K3mpOk3pNO3K7l2r3l2J13Q5o8q3K5M8k2m7M5R9
1998A28j5j09m9O2R8jm3n3KK2K9LnkJ1l9n4M0J07K6j07q0L9R6j1o7J2M5k5o1o
2029gR4K6n4p7LP8K1k6j7m1NK4QoJ5Rk2o4rR8N7n3j02kP7J1m7J1M8k5q9j1P0P8
2063H1l0p3j9K6J4RMJJk1k9nL9N2Nr0m2O6Q3l7p3qO7Nq0J2N4K0n7n6L7P1J5o6
$$ plain form
1832 -11 26 44 17 -46 -50 -12 35 36 2 1 -7 -47 -42 30 93 18 -45 -60 -6 12 10 5 10 -19 -60 -37 26 54 8 -44 -49 -36 -5 31 20
1867 20 -14 -48 -28 0 -11 7 34 13 -47 -76 -5 74 54 -23 -56 -14 1 -10 -3 27 17 -36 -76 -16 34 47 -2 -42 -63 -26 4
1898 4 15 -3 -15 -21 -30 -38 -8 38 25 -43 -82 -60 8 22 -23 -48 -41 -27 -45 -43 -15 5 -17 -60 -84 -36 17 2 -67 -86 -68 -16 -26
1931 -26 -35 -35 -27 -57 -93 -63 5 31 -31 -84 -76 -18 0 5 -20 -32 -49 -47 -38 -9 30 35 -31 -90 -64 33 65 -5 -52 -34 13 -15 -30 15
1965 15 70 12 -63 -49 38 82 20 -35 -27 -8 7 30 26 19 25 2 -5 0 63 90 58 -35 -67 46 131 63 -20 5 53 31 -16 29 128
1998 128 113 4 -45 17 115 114 71 18 20 42 71 74 69 67 78 39 -15 25 132 158 51 -29 10 106 95 28 40 85 60 -1 -7
2029 -7 87 113 59 -18 -15 63 84 58 41 0 5 29 37 31 46 55 33 -31 -40 58 115 62 -40 -42 35 46 -1 10 58 33 -56 -67 3 81
2063 81 51 -22 -41 -15 -1 8 12 13 14 -7 -36 -41 -2 50 55 -35 -77 -11 72 35 -38 -46 21 26 -54 -42 12 32 -25 -81 -44 27 42 -24
2097b4m7%N6L5om4J3K1k9l7K1R4K3j17o6N0J00J2p1k9M6Mp0J2Q7K7m7o2k3M3O3
2128C5Ll0l5KK6kqj3O2lp2k9P0P2n6q8J2R8J4p6k1M5J5n5k6O7O9n4q4k2N5N3%
2161B4j4m4l5K8K1Qj0L9Mq2m1N9J01J1j02n0O6L5m5j5N1N0q9o9M3Q6J5n1n0J6
2191d0K4J1Rj8K%Lj0k1N1L8m7o1j4J06M5p3p5L1O6k0m2M6N1m2r1j6J08N5k5o2
2222a1k5KK2L2J8nk6%k6j9N5O5Pq8o5O4P9j3n2QM1j1o3L5O7K4p8n1K9P3j0k5l1
2255B2PQj0M7j4Ok0j4k9K0N9L1n1q6J8Q2J2m1qM4k8o8MR4L0n2o6pL4K9jj2j1j8
2289A1pONL8Kj8m9j7L9N8j4n5nL1J3l2ML7j0m7j5L1M0j7k1j1rJ8PLnk8Mj7OJ8
2325fK1Mm8m5L5O5j2m5QRnm1K2N3Mp1k4K0M7Qj1j6j2j2J2L4j6oJ1Lm5QN5K7m5
$$ plain form
2097 -24 -71 -71 -15 20 14 -30 -17 4 -25 -62 -41 53 76 -41 -107 -57 43 55 -16 -45 1 5 -65 -53 34 61 14 -48 -71 -28 35
2128 35 38 8 -27 -25 1 -1 -9 -22 40 37 -35 -64 6 78 22 -66 -54 44 58 -18 -39 6 21 -34 -60 7 76 22 -62 -84 -29 24 24
2161 24 10 -34 -69 -41 -20 -12 -22 17 21 -61 -102 -43 58 69 -33 -83 -17 18 -27 -42 9 59 -30 -99 -56 30 45 -6 -56 -40
2191 -40 -16 -5 4 -14 -12 -12 -9 -19 -40 11 49 2 -59 -73 33 78 5 -70 -39 27 7 -35 11 62 20 -71 -87 21 76 51 -11
2222 -11 -36 -34 -12 20 38 33 7 7 -19 -38 17 82 89 1 -64 0 79 66 14 22 63 52 -11 24 91 115 37 -14 15 88 78 53 22
2255 22 29 37 27 74 60 66 46 32 3 23 82 113 62 -24 -6 76 88 47 39 83 55 -13 -9 85 115 63 -3 -10 24 53 52 40 29 11
2289 11 4 10 15 53 55 37 -12 -29 10 68 54 -1 -6 25 38 6 10 47 37 -10 -25 6 46 29 8 -3 -12 6 13 16 11 -17 -13 -30 -24 -6
2325 -6 15 19 -29 -74 -39 26 14 -31 -23 -14 -19 -60 -38 15 19 -52 -76 -56 -9 -1 -12 -28 -40 -52 -40 -6 -22 -28 -17 -14 -59 -51 4 31 -14
2360a4o1J3O6mk2J0J3j9l9J2N9K6n1m5J4L3L0Mj1k5k3PK5J1r%Mm6oL9O0k9n3j0
2394d1K6K8k1KK7j6m7lN5L3j6m7Rj3J6J1K3pl4nLJ7NJ6J2m6k2K7M9Ll9l9J6K1
2428CnMK0Rm8k3K4L7Rk6j4Jj0K0J6J0k3k0MoJ5K6nj3l1kK4J7moj7rNJ3K3J1k1
2465Hk9j5L0K7KMk6okK1J9Jj0pk6OM3Mpk9%J3qJ4L9j3k8k0QK5K7k0nk0lOK8K3
2503G4k9kk9NK3J8J6k5l9KL0Q%qknk8LL3M2m5m2NK5L2j0k3Pj7kPL3Kj3kk7KJ5
2541C4L5rm2k3M1J7j2j6J7Ol9j8L5L4mo0j6K7QJ3j5%j7qnRK6Jj5k9l5K9N0J2m9
2576a8l3L4Mj6PK2J1l1l6%N5J0l3k9mK9JKJ7k0Jk7QJ5M2ll4l9K6L2KKk4QRk6P
2613b9L2K2j1o1j8L5M8kl9j3J5ONmJ3Ok0m4J7M8K3k5l3qJ7K5j6KJ8j4k5nK4M9
$$ plain form
2360 -14 -75 -62 4 0 -22 -12 1 -18 -57 -45 14 40 -11 -56 -42 -9 21 25 14 -11 -34 -27 -2 9 0 0 4 -42 -48 -9 51 22 -31 -41
2394 -41 -15 13 -8 -6 21 5 -42 -45 10 43 27 -20 -11 -24 -8 3 26 19 -15 -20 -17 0 5 21 33 -13 -35 -8 41 44 5 -34 -18 3
2428 3 -2 2 22 31 -17 -40 -16 21 30 4 -10 -9 -19 1 17 27 4 -16 -12 -18 -3 23 18 5 -26 -28 -4 13 9 3 -14 -23 -18 -5 18 29 8
2465 8 -21 -36 -6 21 23 27 1 -5 -7 14 33 34 24 17 -9 -3 40 44 37 8 8 21 13 27 66 53 25 5 13 38 65 45 40 20 17 23 51 74
2503 74 45 43 14 19 42 60 76 51 12 14 44 52 52 44 42 37 9 12 45 87 42 0 5 30 62 52 29 36 19 17 24 57 59 46 44 17 19 34
2541 34 69 60 18 -5 36 53 41 25 42 48 9 -9 26 60 56 -4 -20 7 15 28 13 13 -4 -12 -17 -8 18 19 4 -25 -60 -31 19 31 -18
2576 -18 -51 -17 -13 -29 -22 0 11 -20 -56 -56 -1 9 -24 -53 -57 -28 -27 -25 -8 -28 -27 -54 -46 -31 11 8 -26 -65 -39 -7 -5 -3 -27 -19 -10 -36 -29
2613 -29 3 25 14 -47 -65 -30 18 16 -23 -36 -21 -15 -10 -14 -1 5 -15 -59 -42 6 29 4 -29 -37 -20 5 -11 -9 9 -5 -30 -35 -11 38
2647C8Ll9l4pM0K8j9lrJ5k3j2K2M7j1n5k0M5N0j8m4jOJ0mJ3L2j8j7l0OL1L7k2
2681C7m5j6J8L5mj9mK3j1n7J5P2J9o4m2PN4J3l1lKJ8l0rL8J2Jl2l1J7M1J5k9l6
2715b6K6K2j2r%M2j6n3J2K3N2l7l2mL2K6k6LkNj1j0J2K4K5l4m9jM8L8l2l4J6K4
2749D2k4k6J5N8Mp1k2M0M2Km5j2J2KJlK3mJ0k2j3QM4J0o6k1N0M3l2m6NO0j4m0
2783A0KN8Ln6m3K9M9Rl2kj9KJ8J8j3j2K0k3l0%M6L9m6o4J7N6Jm6KL9%o0k9N5N0
2818D8l4m3j2L9Oj4mplPPnj0J7Rl7j2L2N6k7o5j2O6J8m4j2L7J5o5j0L0O1k7l2
2852b7k6K5J6j4J6kmnj4LJ2J5K4k7o7J8O4Mm0mK0J5l9pL5K2j8m8ON5lj2j7Oj5
2887c3L0k0J1pJ3lpQJ6L5k3o1J3M4K4j0l9J4K1k8j8L9M7j2p2rK8L7j0kj1Pj8o
$$ plain form
2647 38 41 2 -32 -39 1 29 10 7 -2 13 -10 -22 0 47 36 -19 -39 6 56 38 -6 -7 -1 9 5 18 50 32 15 -15 -9 22 59 37
2681 37 -8 -24 -6 29 25 6 2 25 14 -43 -28 44 63 -1 -43 -36 18 31 0 -3 -1 17 -13 -22 16 28 29 -3 -34 -17 24 39 10 -26
2715 -26 0 22 10 1 1 43 27 -26 -14 9 61 24 -8 -12 20 46 20 23 21 26 15 5 17 41 66 32 -17 -18 30 68 36 2 18 42
2749 42 18 -8 7 65 69 -2 -24 16 58 60 15 3 15 17 18 15 38 34 44 22 9 17 61 71 5 -16 34 77 45 -1 4 64 50 10
2783 10 12 70 73 17 -26 3 52 61 29 27 8 10 28 46 33 21 41 18 -12 -12 34 73 27 -37 -20 36 37 -9 -7 32 32 -28 -57 -2 48
2818 48 14 -29 -41 -2 4 -10 -14 -21 -24 -17 -10 -15 -25 -8 1 -36 -48 -16 40 13 -52 -64 2 20 -24 -36 1 16 -49 -59 -29 32 5 -27
2852 -27 -53 -28 -12 -26 -10 -12 -16 -21 -35 -32 -20 -5 19 -8 -75 -57 7 11 -29 -33 -13 2 -37 -44 -9 13 -5 -53 -47 8 5 -7 -24 -18 -33
2887 -33 -3 -23 -12 -19 -6 -9 -16 -8 8 43 20 -41 -28 16 40 30 -9 5 26 -2 -20 19 66 54 -18 -27 1 38 28 26 15 22 4 -2
2921bJ3J0J3ol3k0J6M8kl8k3L0K7k1j7J6L1l1k8K0M2rl4k9K2K6Nk5RoolPOJ3R
2957C0l7j6J6O0Km1k1J0K4ok8K9L0j9n3J3L2J8rk8qOPjkJ3jnj3LJ2J0%k7l3N1
2993A8K3k2l8J0K6j5k4K8M1j2m7j2M9J4mk3lkJQKRnlj0j2KM2J4l9l3J6L0Nk1O
3029A9J2jl4mN0J2k6l3QK9LrrMrrJ7oLKpk7pK9K4qm6j1L7Pk5RJ5j4k5NL1J3j7
3068Bk2%J2pRNOk6rMJ0J2j6J4j1j7LL0%k2j4J4Okj7J5K0j5k4J5L5j8j3j9J4Jj
3105b6KJ4qj1j0RPPMk1j0lJ8J8k4J4rkqMJ9K3l1j7LK7%NKlrmJ2J8Mj5krMJ8Oj2
3147Dj6J2Rj3PQLj5j2KK6K4k5k0MJ6lJNJrjj0J0J6Ok0%jMJ6Nk4pJ1j4oK5K4j8
3187B5k8%L2npj6J2JoLJ0Nmk1J2PLJ4j0j4j7J7J9k3KoK1k1j7J9J8Pn0MJ8J9j1
$$ plain form
2921 -2 11 21 34 28 -5 -25 -9 39 37 -1 -24 6 33 12 -5 11 42 11 -17 3 45 36 2 -27 -5 21 26 1 10 4 -2 -5 2 8 21 30
2957 30 -7 -23 -7 53 55 14 -7 3 27 21 -7 22 52 33 -20 -7 25 43 34 6 -2 4 11 10 8 21 20 15 2 5 17 27 27 0 -33 18
2993 18 41 19 -19 -9 17 2 -22 6 47 35 -12 -24 25 39 35 12 9 7 8 16 18 27 22 19 9 -3 -1 41 55 16 -17 -1 29 34 13 19
3029 19 31 30 -4 -8 42 54 28 -5 3 32 35 26 17 21 12 3 20 14 17 19 12 -15 -22 7 31 23 -23 -34 3 10 -15 -6 9 -5 -30 -25 6 19 2
3068 2 -20 -20 -8 -15 -6 -1 5 -21 -30 -26 -16 -4 -20 -6 -17 -34 -31 -1 -1 -23 -37 -23 -17 -19 -36 -21 -1 -16 -40 -25 10 -8 -21 -40 -26 -25 -26
3105 -26 -24 -10 -18 -29 -39 -30 -23 -16 -12 -33 -43 -46 -28 -10 -34 -20 -29 -31 -39 -35 -16 7 -24 -41 -38 -11 -11 -6 -4 -7 -16 -20 -8 10 14 -1 -3 -12 -8 10 16 4
3147 4 -12 0 9 -4 3 11 14 -1 -13 -11 15 39 14 -6 -2 14 11 12 17 18 9 8 -2 8 24 30 10 10 9 13 29 34 10 3 14 0 -6 19 43 25
3187 25 -3 -3 29 24 17 1 13 14 8 11 21 26 22 1 13 20 23 37 27 13 -4 13 32 9 11 5 26 5 -12 7 25 32 -18 -14 4 23 12
3224A2j7J9j3lj3J6K8j0j8pOlJ6Ork1NJ4Lj4QJ7k5j7RJ9J2j6j4RJ8Jj1J1J1k6
3260Cj3J5J3J0lj1nL%J0om%Qj1NRJ1j2k9MK0J3j2j9oJ0Qj6MJ8lk5J0j0K1K7k8
3298Ik1kJ7Lj0PJ1mk9KK1L6j5l6j4OM3j3j7lJ9j3pKJ0Nj2k0rK7J1Lj8j0J1klj
3336a6J8Jj4l3QM1Mk5j4J1J3j0qlJ9Kl2j0K0J7jk0k8K6K6nj0j7J9Oj6j4K6J7q
3371a0l9J1J6L4j2l1KJ8Pj4J3J7j1j2l5J4L3K3k6j3j6L0Lj2MPK0k0k7J6L5Nl4
3404dk1J2L1Kj8kKJ5j6lPJ9jl9qK8L3j9k8LJ8Pj2QRKnj6LK4J7j7l2JK2%Qj5J2
3443B7J7j3l1J8K1Ql4j7L0J4j9Kj4J3Klj6LK4j5j6oJ5K0Kl3j4K6K1pl0JL5j1m1
3478b1OL0K6n0j7RK1PpPOj4j3lJ4jJ6j5j7%L6Jk0J%K0Jl8NL3Rk8k3K6K5k6k3l
$$ plain form
3224 12 -5 14 1 -2 -15 1 29 19 1 -6 0 -3 13 19 10 -11 -6 8 11 -3 5 22 -3 -20 -11 8 20 4 -10 -1 17 18 7 18 29 3
3260 3 -10 5 18 28 25 14 9 12 12 22 16 12 12 20 9 14 23 34 22 -7 -3 17 30 18 -1 -7 3 11 -5 -1 17 14 -11 -1 -11 10 37 9
3298 9 -12 -14 3 6 -4 3 14 10 -19 -17 4 40 25 -11 -25 -19 24 11 -6 -9 10 -3 -10 -8 2 7 -5 -25 -34 -7 4 7 -11 -21 -10 -12 -15 -16
3336 -16 2 3 -11 -44 -36 5 9 -16 -30 -19 -6 -16 -24 -27 -8 -6 -38 -48 -28 -11 -12 -32 -60 -34 -8 -13 -23 -40 -21 -15 -31 -45 -19 -2 -10
3371 -10 -49 -38 -22 12 0 -31 -29 -11 -4 -18 -5 12 1 -11 -46 -32 1 24 -2 -15 -31 -1 2 -10 -6 1 21 1 -26 -10 25 30 -4
3404 -4 -25 -13 18 20 2 0 2 17 1 -2 5 24 23 -16 -24 4 37 18 -10 -7 11 18 6 14 23 25 20 4 7 31 48 31 -1 0 22 22 30 15 27
3443 27 44 31 0 18 39 47 13 -4 26 40 21 23 9 22 24 21 5 8 32 17 1 -5 10 30 32 -1 -15 11 32 25 -5 -4 31 20 -21
3478 -21 -15 15 41 -9 -26 -17 4 11 4 11 17 3 -10 -13 1 0 16 1 -16 -16 20 21 1 2 2 22 23 -15 -10 23 32 4 -19 7 32 6 -17 -20
3516b0M0Ql1nQJ1j6LpJ3Kqj6j0K1K6Ok9j2K9jl0j3O3Om2l0K1M0mk9NPp%%J2jj1
3555anpJ1J9Omk9J1K3kl0kL1J4l7j6L0Oj6k2mK9J2j9nKKkpRj5J4kk6j0K2K6Ln1
3594d2KM0Jk1qK4K1l9l2L2L5rk4qJ7Onj2J4MkLkoj1J4nj3KL8jl6kK2J2k0j5J5
3632a1J5rj5J4J6oj5mORoJ3Qk0JloPjJ7Ol5kJ8K5j8j0J3J3j4qJ4K8ql4J6NRmp
3672A7lOLj9K1j0Q%rMPKKmk0J8K5k0j1J0Jrj3J1K8lk2j9K3POj1mlj0OJQJqoql
3715@RJ0Ok9mK2Kk5QJ8mj4pJ5J2kk1J5LQj4mJ6j3LrJ3Pkoj0mJ1Nqj6RNj2MnJ7
3757Ijj2j3J3J9pj4jpJ2%LkOorNL%mJj3RJ7%j6j2J7j3J1j3J4K2l0pJ6J8j0Nj1
3797aOOj4J1lkojRPkNlj2pJ8pqMKrKj0QJ1k3JmJ1MnkrJ4rPoJ0j%j7J7jJ0mpLj2
$$ plain form
3516 -20 20 28 -3 -8 0 11 -5 -2 -9 4 6 -2 -18 -28 -7 19 25 -4 -16 13 12 -18 -31 32 38 -4 -34 -13 27 23 -6 -1 6 -1 -1 -1 11 10 -1
3555 -1 -6 -13 -2 17 23 19 -10 1 24 22 -8 -10 21 35 -2 -18 12 18 2 -20 -24 5 17 -2 -7 -5 -3 -5 -12 -3 -18 -4 -6 -32 -42 -20 6 9 -42
3594 -42 -40 0 1 -20 -28 -4 17 -22 -54 -22 13 4 -20 -28 -11 -5 -10 -22 -8 -4 -6 -3 -5 -11 -22 -8 -13 -26 -24 14 13 -23 -25 -3 9 -11 -26 -11
3632 -11 4 -5 -20 -6 10 4 -11 -15 -9 0 -6 7 15 -5 -4 -7 -13 -6 -7 10 16 -19 -21 -3 22 4 -6 7 20 6 -2 12 40 32 -2 14 19 28 24 17
3672 17 14 20 23 4 25 15 23 23 14 18 25 27 29 25 5 23 48 28 17 27 28 19 6 17 45 42 20 1 24 31 37 26 22 19 9 15 16 24 25 17 11 3 0
3715 0 9 19 25 -4 -8 14 16 -9 -1 17 13 -1 -8 7 19 17 -4 11 14 22 8 4 20 7 10 1 14 21 19 13 3 -1 10 15 7 -9 0 5 -7 -3 -8 9
3757 9 8 -4 -17 -4 15 8 -6 -7 -14 -2 -2 1 -1 5 -1 -10 -5 -2 -2 -6 -5 -18 -9 8 8 -8 -20 -3 -16 -5 -18 -4 18 -12 -19 -3 15 5 10 -1
3797 -1 5 11 -3 8 5 3 -3 -4 5 12 10 15 12 0 -7 11 4 -4 0 2 -7 -5 -15 -7 4 -19 -18 -22 -11 -7 -12 -14 -23 -9 -18 -11 -17 -7 -8 -8 -25 -8 -9 1 -3 -10 -7 -19
3845a9oROlOr%JLJ1j0kKj0NLLlpjJ9j3JMKKj3PJjj0OJRj2J1rnJJ0Jj1Rj7K3rm
3892a8jK4mj0rNK1j5RnJNpJ1J0k0LQj7J7MJ2rj9K1J9k3rNJ2kk0QOJ4%k5J6kJ0
3932B6%pkJnjjPQj2oJJ2Nk3lJ2%%j8RRJ1j5rK0qNnkJ2pko%NRj1oJ0J1rrmNK2k3
3979FkjQj1mJ7kJj9lJ8nLj0oNNrj1J3MK1j3j5lJ7Kj5j6K2JLj7J8j0nj3LK5lkm
4021gpKK%OrJMjJLQj9MmJ9Pj0j8J2J9rj4RRlj3j0J2J0%qk0J3J5pOk4K1mljkK0
4065A0j0j4JpL4lk2QJ4rk4%K4rj2lQL0qj9MJNjoNrJ8j4j5J5J9Jk3LKK3kk5kJ5
4106Cjj7kK2J4j2j9mL0Nk9MkJ1omj3LJ2Lj7j3K0J1kNj6J9nj7jJ9K1rk0rK0J3k3
4145fnJ2J3rk0J1K4rqloL2qj8kLK3ooj2J4Onj3NJ7pj7kK8Pnl6J1K2kl3J1J7nK
$$ plain form
3845 -19 -25 -16 -10 -13 -7 -16 -16 -15 -12 -1 -11 -13 -11 -21 -16 -13 -10 -13 -20 -21 -2 -15 -14 -10 -8 -6 -19 -12 -11 -12 -22 -16 -15 -6 -18 -7 -16 -21 -20 -10 -9 -20 -11 -28 -5 -14 -18
3892 -18 -19 5 1 -9 -18 -13 8 -7 2 -3 -2 3 -4 7 17 -3 0 8 -9 8 12 24 15 -4 17 36 13 4 9 21 19 -1 7 13 27 27 2 18 16 26
3932 26 26 19 17 18 13 12 11 18 26 14 8 9 21 26 3 0 12 12 12 -6 3 12 23 8 -1 19 11 16 11 9 21 14 12 6 6 11 20 9 3 13 24 15 6 2 7 29 6
3979 6 4 3 11 0 -4 13 11 12 -7 -10 8 3 6 -4 -10 -5 0 -9 -20 -7 -3 18 5 -10 -13 4 6 -9 -25 -3 -2 1 -16 2 -8 -13 -26 -23 2 -1 -3 -7
4021 -7 -14 -12 -10 -10 -4 -13 -12 -8 -9 -8 -5 3 -16 -12 -16 3 10 0 -18 -6 13 4 -10 -1 8 5 -8 -18 -6 4 4 -4 -24 -11 4 -3 3 -21 0 -4 -7 -8 -10 10
4065 10 0 -14 -13 -20 14 11 -11 -3 11 2 -22 -22 2 -7 -19 -22 -14 16 8 -11 -7 -6 -1 -2 -8 -3 -12 6 -8 -23 -8 11 12 -11 -8 -6 17 15 -10 -12 3
4106 3 2 -15 -17 5 19 7 -12 -16 14 19 -10 -6 -8 3 -3 -7 -20 -17 -5 -2 -19 -32 -12 -1 -3 2 -14 5 0 -17 -18 1 22 13 -7 -16 4 17 -6
4145 -6 -11 1 14 5 -15 -4 20 11 3 0 -6 26 18 0 -2 1 24 18 12 0 14 20 15 2 7 24 17 0 -2 26 33 28 -8 3 25 23 -10 1 18 13 15
4186A5k0J4lJ8j8OjJ3j5Lk0K4J2Kj7j7K5Npj9J6J9j2k1JJ9lNMj0J7j7j7NJ6%o
4223A6rj1J1J5oj5QMMk3mK3Kj1j0PllrkJ6Pk4J0jjjrK1j5KJ5rj6KJ3k%j2QK0k3
4265a5lJ3K0j7k4J6KJ5jj8K3j1k1J9QmqlqLlJ6Mj9nJ6kj7%K1Nj2j7J6K0mk0lK2
4304DPk0oK2j9MJMj4J9j5mlRNJ1k6lK2%lj2J8Prk4J8J7Pj4oOJ1klKKKrqJ6j0Q
4347A2lKk4K3Kj6j1J4J6j0k8K0J7j4j3%J3kqMOqNoLNknjLpJ3Lj0rJ8%%poK4nk8
4390b0J0J6Qpj4K4j1J0j1QJ%%j0JKMMj5OOkKq%J2pj0KRkj5mK2j3PqKNPMpRj4J
4435DNJ1j7K0oJrOJ4j0k5K1j3J0kLPkj1LjKMoQMpoRMj5LKLkQLj3Pj6J6j1jRmm
4481Fj1JJ0Rj9lJ1pKmMj0Lj0J2OplJ4Jj0NQkj0J3oj6OJ2qlJkQNnj4jQJp%QpJJ
$$ plain form
4186 15 -5 9 6 24 6 12 11 24 9 12 -8 16 28 30 13 -4 21 26 19 0 16 35 23 2 3 22 19 24 28 18 35 18 1 6 22 22 16
4223 16 7 -4 7 22 16 1 9 13 17 -6 -10 13 15 4 -6 1 -2 -5 -14 -16 0 7 -17 -7 -8 -9 -10 -19 2 -13 -11 4 -5 -21 -19 -6 -8 -8 -20 -12 8 -15
4265 -15 -18 -5 15 -2 -26 -10 -8 7 6 -12 11 0 -21 -2 6 2 -6 -9 -17 -14 -17 -1 3 -16 -21 -5 -7 -24 -24 -3 2 -10 -27 -11 9 5 -15 -18 4
4304 4 11 -9 -15 7 -12 -8 -7 -3 -17 2 -13 -17 -20 -11 -6 5 -21 -24 -2 -2 -5 -17 1 8 -1 -25 -7 10 17 3 -3 3 14 12 9 11 13 15 6 -2 14 4 12
4347 12 9 11 -13 10 12 -4 -15 -1 15 5 -23 -3 14 0 -13 -13 0 -2 -10 -6 0 -8 -3 -9 -6 -1 -3 -8 -9 -6 -13 0 3 -7 -16 2 2 2 -5 -11 13 8 -20
4390 -20 -10 6 14 7 -7 17 6 16 5 13 14 14 14 4 5 7 11 15 0 6 12 10 12 4 4 16 9 -1 1 10 8 -7 -11 11 -2 5 -3 -1 4 11 15 8 17 3 4
4435 4 9 20 3 23 17 18 9 15 29 19 -6 15 2 12 10 13 20 18 7 10 9 11 15 9 17 21 14 8 17 21 6 9 11 14 12 20 23 10 17 1 17 6 5 14 10 6
4481 6 -5 -4 6 15 -4 -7 4 -3 -1 -5 -1 -11 -8 -18 -6 0 -7 -10 4 5 -5 0 8 6 -4 9 3 -13 -7 5 -3 -6 -5 -7 1 6 1 -13 -14 -6 -5 -12 -12 -4 -11 -10 -9
4528iKMrQRj3mJJ6j1%pKRo%LnLm%J0j8RJ1qlj4J8Ljj3J6KlJ2pmLJ3mmPmj2J3j8
4575gK3mjkLlkj0QLmlrQLlMKmLjMmJ1j2KKKom%LRj0%j4J4j1MOQMqj8J2J7kj0p
4624dkK6q%oJ3ooNKLlj1MPrJ1%j0KNlqj%J1j9J4JKr%OJ2k2%J8j0MkMk0J7KOKq
4671A0nJ2j5OOLonKKj1J0rnK0J0j8PnJ0mmQQKk8NJ5Nnj4PJ1jLj3kJ3j5kj4K3p
4714A0nqLJ3mJj6OkPrJ0%Pj9Oj3J8Nj6pQJ9j8RlJ7Mk4j8K4J3j7kj0NOJqJJ4n%
4757Cj1PK0j1j8NLJ7j6j2RJ7kk3J7j2Qj2pJ1NOk4jJ4KolMJ3nj0%qJ6kMj2rK5j0
4798hJ0j0O%rkJ4Qnj2ONQj0j2J0NNj1mNJ3m%KLPrj4nJ4jpJLJ5j1knNPj1J%J5q
4844Hj0OJllnJJ1lj0Nj0K4Nj5jK7j1qqJ1J4qk0MJ6%LkjlOj1kOOj1j2J0J0Lj8o
$$ plain form
4528 -9 -7 -3 -12 -4 5 -8 -12 -11 5 -6 -6 -13 -11 -2 -8 -8 -5 -10 -7 -11 -11 -1 -19 -10 1 -7 -10 -24 -6 -3 -4 -17 -1 1 -2 10 3 -1 2 15 11 7 14 10 -2 11 -7
4575 -7 16 12 11 9 12 9 7 -3 5 8 4 1 -8 0 3 0 4 6 2 5 4 8 4 15 3 5 7 9 3 -1 -1 2 11 1 1 -13 1 -10 -6 0 8 12 4 -14 -2 15 13 3 -4
4624 -4 -6 20 12 12 6 19 13 7 12 14 17 14 3 7 14 5 16 16 6 8 13 10 2 1 1 12 -7 7 8 10 1 1 7 19 -3 -3 15 5 9 7 11 -9 8 10 16 18 10
4671 10 5 17 2 8 14 17 11 6 8 10 -1 9 0 -5 15 25 7 14 9 19 15 11 19 27 29 1 6 21 26 21 7 14 25 24 27 14 12 25 10 8 -6 17 10
4714 10 5 -3 0 13 9 10 -6 0 -2 5 -4 6 6 13 -6 0 -13 5 10 -6 -13 -5 14 -4 5 2 19 23 -1 -19 5 18 1 -1 -11 -6 0 1 -7 -6 8 3 3
4757 3 -8 -1 19 8 -10 -5 -2 15 -1 -13 -4 13 11 -12 5 -7 1 -11 -18 -7 -2 4 -20 -21 -7 -5 -11 -14 -10 3 -2 -12 -12 -20 -4 -6 -2 -14 -23 2 -8
4798 -8 2 -8 -2 -2 -11 -13 1 9 4 -8 -2 3 11 1 -11 -1 4 9 -2 -6 -1 12 8 8 10 13 20 11 -3 -8 6 5 -2 -1 2 17 6 4 -1 4 11 0 1 1 16 8
4844 8 -2 4 5 2 -1 -6 -5 6 3 -7 -2 -12 12 17 2 1 28 17 9 1 12 26 18 -2 2 18 18 21 19 18 15 21 10 8 14 20 9 -3 7 17 20 2 -4
4887dJ3lpNl%Oj2mRJ1Mk4MRJ1k%j7J4jk0LJ0Mpj3K0JN%j9J2lONj5NJ3j3Lj0J6
4930A2Nj3OKQMj7LOkjoJ1LqqLnJ3plj3KJ9loj7J5Lj6pJ5J8k3pJ0OJ3oj7K3jj0
4973DLqJ2jOj3%J3j6OOmNQj1rQJ0j3j1J4J0lrn%RLk3J4Oj3mJ3Mj3NKk8K1OkLj1
5017fJjkk1MK3pqpJ7J5k2jMQOj2QJj5OnJ5j0J1lKLmNj3rJ3Pj3mPJ0j1o%J9Nrr
5062hJ1kpoPJ0Pk2LOlJ3n%j9Q%k%jOJ2j5LlJ5j8rPK2roOQKk0J9nJjjjjJ5jj0P
5109A3oK0qj8OJ9j5j2kJ3JnNJ2j4%kQk3ORKnkJ3oLOrKoj4QJ4rj1J3lNj3J0LoN
5153Gj2J4Jj4mJ7j%Jj2PqK3%qPqnMOj3J6Pk5MJ9j2llnJ2lJj3J1%j6J0NRj7J0l
5196FpJPoPqpLlJ2l%mLjjpJ2kp%lN%PrMQ%j3J4MKj0kNJ2oJkm%K%lkplQNMpmkR
$$ plain form
4887 -4 9 6 -1 4 1 1 7 -5 -9 0 11 15 -9 -5 4 15 13 13 -4 10 9 -11 -8 2 6 -1 -14 6 7 12 12 -7 5 2 8 13 -2 3 16 3 6 -4 12
4930 12 17 4 10 12 20 24 7 10 16 14 13 7 18 21 13 5 8 3 16 9 6 -7 -5 14 11 5 -12 3 6 -10 -17 -2 16 -7 -14 -4 2 15 9 -8 15 14 4
4973 4 7 -1 11 10 16 3 3 16 0 6 12 8 13 21 10 1 9 19 6 -5 9 19 16 7 2 2 11 14 -9 5 11 -2 -6 7 11 -2 3 5 -23 -2 4 2 5 -6
5017 -6 -5 -6 -8 -29 -25 -2 -9 -17 -24 -7 8 -14 -15 -11 -3 3 -9 -1 0 -15 -9 -14 1 -9 2 -1 1 4 0 5 -8 -17 -4 3 -10 -14 -7 3 -8 -14 -14 5 10 1 -8
5062 -8 3 1 -6 -12 -5 5 12 -10 -7 -1 -4 9 4 4 -15 -7 -7 -9 -9 -10 -4 8 -7 -4 -7 8 -10 -19 -12 10 1 -5 1 9 11 -9 10 5 6 5 4 3 2 17 16 6 13
5109 13 7 27 19 1 7 26 11 -1 -3 10 11 6 11 23 9 9 7 15 -8 -2 7 9 4 2 15 9 12 18 9 11 5 -9 -1 13 4 -7 6 3 8 -5 5 8 2 7
5153 7 -5 9 10 -4 -8 9 8 8 9 -3 4 -4 19 19 11 18 10 5 9 15 2 18 25 0 4 23 11 8 5 0 12 9 10 -3 8 8 -8 2 7 16 -1 9 6
5196 6 -1 0 7 1 8 0 -7 -4 -7 5 2 2 -2 1 0 -1 -8 4 2 -5 -5 -8 -3 -3 4 -5 -1 7 7 -6 8 12 14 4 2 7 19 13 14 12 8 8 10 10 7 5 -2 -5 3 8 12 5 1 -1 8
5251HkNj7PNpnO%lj0MLrK4j2NrpJ6Nk2kK4opj0QKrMNJ3rmj%KPj1PoJ0o%P%Moj9
5301a8J9LpknPoLQlj7RpMQjmj1J7j4lK0lj3J6pmLMnKPjmJ6%mnRoMKKknrJK9k2
5350ERpJRj1Oj9J6PrKJ3nj2KmQJkmNMj8MKJ1Kj2lMj2PkljPnjQj0J7npMJ2n%pJ
5399CLQj3NlQkoJ0jKk0JOk%JJ4j5nJRKJj1PnQj4KMP%ojj0JJ2jj5QJ1mj3J0rJ0
5446bpNjJj1J6jkJKljoK0rlLmJ6j0oJ0OopNJ2j4jPj1N%j5J3nJ0qlj2OPLj2NRj1
5493i%J2kj0%JJ1Jjj9PJ4lr%M%q%mJ5PjJprPljMmJ1j7J1J3k0J1j4PPNjplJ1Pk3
5540hJ7j6J7j1mpRkjqQJ3j7kkJ3rJ2rJQj6MRllNpK0plKnJ5j2MOk3J6Mklj1J8J
5585A1lM%Nj5jKJ0j1OLOoknOPj0Mj1QJ3Lj8qJ3Kpj1J1jNrrJ4lknQqK0j3j3J4j
$$ plain form
5251 8 6 11 -6 1 6 -1 -6 0 0 -3 -13 -9 -6 -15 9 -3 2 -7 -14 2 7 -15 -17 7 1 -6 -16 -8 -6 -15 -11 -6 7 -2 -6 -7 -7 -5 2 -9 -2 -8 2 -4 -4 3 3 7 1 -18
5301 -18 1 4 -3 -5 -10 -3 -9 -6 2 -1 -18 -9 -16 -12 -4 -5 -9 -20 -3 -17 -20 0 -3 -16 0 -7 -11 -8 -4 -9 -7 0 -1 -5 11 11 7 2 11 5 9 11 13 11 6 -3 -2 27 5
5350 5 14 7 8 17 6 12 -7 9 16 7 9 22 17 5 7 3 11 12 10 6 11 15 -3 1 3 14 16 4 1 5 -7 0 -2 -5 -6 1 -4 -5 3 -7 10 5 -2 2 14 9 9 2 3
5399 3 6 14 1 6 3 11 9 3 13 12 14 -6 -5 1 -1 -1 0 14 -1 -6 -5 4 6 7 -4 3 -2 6 -8 -6 -2 5 5 -1 -2 -12 -11 1 0 -15 -7 4 0 -13 -3 -12 -2
5446 -2 -9 -4 -5 -4 -15 1 0 -2 -1 1 -2 -3 -9 11 2 -1 2 -2 14 4 -2 8 14 8 1 6 18 4 3 10 -1 4 4 -11 2 -3 7 -1 -4 -16 -10 -3 0 -12 -7 2 -9
5493 -9 -9 3 1 -9 -9 -8 3 4 3 -16 -9 5 2 -7 -7 -3 -3 -11 -11 -15 0 7 6 7 0 -9 -2 -5 -6 -2 -6 5 -12 -1 12 -8 3 -11 -4 3 8 7 0 -3 8 15 -8
5540 -8 9 -7 10 -1 -5 -12 -3 -5 -6 -14 -6 7 -10 -12 -14 -1 -10 2 -7 -6 2 -14 -10 -1 -4 -7 -2 -9 11 4 1 3 -2 13 1 5 11 -12 4 8 6 3 -8 10 11
5585 11 8 12 12 17 2 1 3 13 2 8 11 17 11 9 4 10 17 7 11 0 8 21 24 6 -2 11 13 6 -5 6 5 10 1 -8 6 3 1 -4 4 -4 16 3 -10 4 3
5630CJ3jj0Qj0RoLJ3mJj3QjpMj0LRLnnK2j0oj4J0mMonjJ4knLQrQj9QQmmKJkjN
5679Fj5J3j1PmMJ4k7J8j0NKRnoJ2pq%J3Mj4MlJ1mqOj7K1pQj0kQj6P%Mpj1J7k%
5723aqJ0klKLRomKlLrLPlj1J7pkoJ8pj1mJ0J0j4qJ2nLJ9k4J4J0j1JmLqMQqJ8j7
5769@LJ1lKooKqJ5mk0K1j4PnOrPJj8J2JnRpRrJKj0OJqK0j5J2Jlj8J0N%jLnMLm
5817dRomJj1J7j1NRMMo%%noRrJ5j7J8%pqkK%NkLJj0QOokKPprK0j6J5qnJ2nNrJ8
5867B0j2nQj3J3jKnLKKmj3J0mRJkmMjoJ3lqRklomJ4Lj0nRkmmlQQj7lLPkj6J6j
5916Ao%MJKKj0kJ6k1J7mJkKoRKoJKMpJ0oPj3LlN%lMnqJ7ollnLJ2JpMj2JMJ4j1
5966@oKJ5j1%j1Pj3J1oNnPRl0K5JoQk3K3mPj5ONpjQoJ6pJ0j5JNjklOJKnPj6MO
$$ plain form
5630 3 16 15 5 13 3 12 6 9 22 18 19 6 14 13 6 10 0 3 12 15 10 5 27 17 11 -3 7 3 7 1 -4 -5 9 7 2 5 13 4 12 -7 1 9 5 1 3 4 2 1 6
5679 6 -9 4 -7 0 -4 0 14 -13 5 -5 0 2 11 6 0 12 5 -3 -3 10 14 0 4 1 12 8 0 6 -11 10 3 11 1 -1 7 -9 -2 -2 2 -5 -16 1 -1 -1
5723 -1 -9 1 -1 -4 -2 1 10 4 0 2 -1 2 -7 -4 3 0 -11 6 -1 -3 -9 9 2 -9 -13 -3 7 -7 -15 -3 -8 -5 14 -10 4 14 3 4 0 3 -5 -1 7 -1 17 0
5769 0 3 14 11 13 7 1 3 -5 10 6 -14 7 -7 0 -5 1 -8 -1 0 -18 -6 -5 -10 -1 -8 1 -8 -7 -5 -15 -9 -8 -16 4 -11 1 2 -1 -19 -9 -4 -4 -5 -2 -7 -3 0 -4
5817 -4 5 -1 -5 -4 -15 2 -9 -4 5 9 13 7 7 7 2 -4 5 -4 11 -6 12 12 5 -3 -5 -3 -3 2 0 3 4 -6 2 8 2 0 2 9 2 -7 13 -3 12 4 -1 11 6 11 2 20
5867 20 8 3 11 -2 11 10 12 7 10 12 14 10 -3 7 3 12 13 11 7 11 10 4 17 14 6 15 13 10 4 0 14 17 7 2 11 9 5 1 -2 6 14 -3 -6 -3 4 2 -14 2 1
5916 1 -5 -5 -1 0 2 4 -6 -8 8 -13 4 0 1 -1 1 -5 4 6 0 1 3 7 0 10 4 11 -2 1 -2 3 3 0 4 -1 -9 8 2 -1 -4 -9 -6 6 7 0 4 -8 -7 -3 11 0
5966 0 -6 -4 11 0 0 -11 -4 -17 -6 -12 -7 -12 -5 4 -26 -1 0 -6 2 -21 2 -2 5 -10 -4 1 -6 -7 1 -5 11 4 14 -1 0 5 4 2 -1 5 6 8 3 10 -6 -2 4
6013DJlLj0LQj0J3lj5LmkJ2mkMJ2j0Jl%J%JpMPpJ0pkj4J3NKKj1N%Mkj4ORNqjK
6062AkMlqJ6Jjj4J3jkNKKjj1oLJ4lj3jmJ8rLj0J2jomjO%pQQmj%MqNkMJ5j5Mkk
6112FkkkjQj1J5kloj2J4j0J0J4ljPj1QrJ1j0J4j3OlKpknpJ5j3J0r%LJ3l1K0o%
6155emJ8j2OOj8KoJ8OmkoMnOm%Q%qJ%Pj3JJ0qNjlPOrlJ0k3J7j1J4J0oj0%MOpn
6203aJMJrRj2qMOnkKPpkKKLj3J0%lJjJ4pLKj0J5lJLlNnmpJ5oqNmOmqOkJ2Pj7R
6255DOrklQmMqNpRrj2J2npJ9LqJ1jj3oLQj4jJ5Mj2Rj3J3kj4J3MJ3j1%MJPj3PJ0
6301A8%lj0Plkj4J0kNkjrkJ4jj4LQkkj0K3j0qoNJ5j5KOljLNkqM%Oj1J6qllJJ0
6348FlkPmk%NnJ4j5LnNPoJJ3mrJ0qNJ5j6LoJOKj0lJ2jj7KpJ0Pk1JJ4j5J7okJ1
$$ plain form
6013 4 5 2 5 -5 -2 6 -4 9 6 -9 -6 -10 -12 0 -4 -6 -2 10 0 1 -2 -2 -1 -1 0 -7 -3 4 -3 7 0 -2 -16 -3 2 4 6 -5 0 0 4 2 -12 -6 3 8 0 -1 1
6062 1 -1 3 0 -8 8 9 8 -6 7 6 4 9 11 13 12 1 -5 -2 12 9 -4 -5 -9 9 0 3 -7 5 4 -2 -6 -7 -1 -1 -8 0 8 4 3 3 7 -1 4 2 6 21 6 10 8 6
6112 6 4 2 0 -1 7 -4 11 9 6 0 -12 2 -8 2 16 13 12 19 8 16 7 18 8 22 9 15 12 14 7 5 0 -7 8 -5 5 -4 -4 -1 12 -19 1 -5 -5
6155 -5 -9 9 -3 3 9 -9 -7 -13 5 11 7 5 -1 3 -2 4 0 0 8 8 0 1 1 8 -5 -4 6 -2 3 2 -1 6 12 3 0 10 -13 4 -7 7 17 11 1 1 5 11 4 -1
6203 -1 0 4 5 -4 5 -7 -15 -11 -5 -10 -12 -10 -3 -10 -12 -10 -8 -5 -18 -8 -8 -11 -10 -11 3 -4 -1 1 -9 6 3 4 7 4 9 4 0 -7 8 2 -6 -1 -5 1 -3 -11 -5 -7 5 12 -5 4
6255 4 10 1 -1 -4 4 0 4 -4 1 -6 3 -6 -18 -6 -11 -18 1 4 -4 7 6 -7 -13 -10 -2 -16 -17 -2 2 -10 -1 -14 -1 -3 -17 -4 0 13 2 2 6 7 14 1 8 18
6301 18 18 15 5 12 9 7 -7 3 1 6 4 3 -6 -8 6 5 -9 -6 2 0 -2 -12 11 1 -7 -13 -8 7 -8 -6 0 -3 -4 -1 4 2 -6 -2 -2 4 -7 9 1 -2 -5 -4 6
6348 6 3 1 8 4 2 2 7 2 16 1 4 -1 4 11 5 6 19 15 6 16 8 13 28 12 15 9 10 16 18 8 5 17 16 -1 1 -6 4 11 -10 -9 5 -10 7 1 -1 10
6394A0plRj3QKmj2J2j0KKkKONj4JJ0mnJ4nnoJMkJ4ojMJj2LkJoLPlJ0%plNkj5Q
6443enj2PRkRrj2NjOklKmJ4oKrJ3mJQmqMOjMj5J6j1MJ4Lj6MLoQj9K3j0Mj0jQJ0
6491A2j7QJQrQpKmm%lJ2nmknLJ6j0noRlqKNMj9K7kqkjJ5%jKMk6J5JjMj4J2JNj3
6540cJPj1PkQlojJPj7K2nLj4JQj7K2j7PkNjNNj5MnNL%qJPpjOkkJmlRkpNmJ6J7
6591B4k8RNlJlQmpkOPk1J2NpQpkK%J1Nj1rQLj6J0j4J8Jj9J1kKOj8OJ0kllJ5j3
6636ajNj2KpJ4j0K1mj0KjJlmPjRNmLlnKlnMQL%lqJ5krmJ1j0Knl%Mj6OJ0j0J2k
6685@j9J5j0J8qoj1J6qJ7lRj4J1j5M%NLj4Rj2J2Mj1MJqKLpPrJ3Kj1LNj1K7j3l
6727cQLj1Kj1J8kJ0j4lRokm%JllkJ4j2j0J3QNqnkNLkoONrJ6oNj%ojJ4mkoKjkJ7
$$ plain form
6394 10 3 0 9 -4 4 6 2 -10 2 -8 -6 -4 -6 -4 2 7 -7 -6 4 0 -5 9 4 -1 -7 -6 -2 -4 10 4 3 7 8 -4 -1 -3 -2 -8 -5 2 -1 9 9 2 -1 4 2 -13 -5
6443 -5 -10 -22 -15 -6 -8 1 -8 -20 -15 -16 -10 -12 -15 -13 -17 -3 -9 -7 -16 -3 -7 -6 2 -2 -10 -6 0 -1 3 -12 4 -7 -3 11 14 -2 2 5 -1 7 -12 11 1 5 -5 -6 2 12
6491 12 -5 3 4 12 3 11 4 6 2 -2 -2 -5 7 2 -2 -4 -9 -6 10 0 -5 -11 -2 -5 -13 -11 -6 -2 -21 6 4 -4 -6 -7 8 8 7 9 13 -13 2 3 2 6 -8 4 5 10 -3
6540 -3 -2 5 -6 1 -1 7 4 -2 -3 -2 5 -12 10 5 8 -6 -5 3 -14 8 -9 -2 -4 1 0 5 10 -5 -1 -6 -1 2 2 -6 -5 2 -5 -6 0 -2 -4 -3 -7 -10 -1 -3 -10 -5 -9 7 24
6591 24 -4 5 10 7 8 5 13 9 2 0 6 13 -8 4 9 2 10 3 1 3 3 14 19 8 -1 7 10 -6 4 -10 8 9 -10 1 -1 1 7 -11 -5 5 3 0 -3 12 -1
6636 -1 -2 3 -9 -7 -14 0 -10 11 7 -3 -1 -2 -1 -4 -8 -1 -2 7 12 8 11 8 3 5 2 -3 1 9 12 12 9 1 16 14 5 1 12 2 4 -1 -4 -4 0 -16 -10 0 -10 2 0
6685 0 -19 -4 -14 4 -4 -10 -21 -5 -13 4 1 10 -4 7 -8 -4 -4 1 4 -10 -1 -13 -1 3 -8 -4 -3 -11 -9 -6 -13 -6 -15 -2 0 -11 -8 -3 -14 13 0 -3
6727 -3 5 8 -3 -1 -12 6 4 14 0 -3 6 0 -2 -6 -6 -5 -8 -11 -13 1 -11 -21 -8 0 5 -3 -8 -10 -5 -2 -4 -10 -4 1 -8 8 2 7 6 6 0 -1 13 9 7 1 3 2 0 17
6777A7k4QOjn%OJpOJKkjl%Nj1RmOj2PokJ4k1J6loOkmNQj4jj1J5j%qmQJ4nj4J2
6825@J2ljlnNqJQQj1LRjorRknQMj7NJQnj0%J5qjj3K1pj0KLPPj0nJ3mnqjJ5qJ9
6874A7j3nmRNpqJ2j4lNJ5qpJ4K%KOj8J0MKKJjj4lQkmmJ0j0MLNj3JllkOQpjJjM
6923Amkn%R%kpONJ0j4J6njnj2MJ0okmjJ1kJqPpj0J0J5r%pKPk%LjJ0Nj1mkNLnl
6973aKj2lMnK3j3j2OmOJlpJ9njl%mJ0rJ0MlJj8J7LnNnLrJ9mrJ7k2J1jkOkQmq%
7021ALqPQjNnj0MJJ0j3J0%qKmNpn%KQj1nJ3RmonmPjMNnMojnQnKnJ9mrlR%LnnJ9
7075A8nj3nK0j5rPNmJJ%KQjj0Jj4J6kmKkQrJPppK0k3J5JnOj1J5k3J0RLj8NjKR
7121DlpNmMRJ0j1j3RJ6j2NmMrj6J9mPJJj1LqJ0lOjj1PpJ1Nj6Nj2RoJ0oPlpRj1
$$ plain form
6777 17 -7 1 7 6 1 1 7 8 1 7 8 10 8 7 4 4 9 -2 7 3 9 -3 4 -2 -4 10 -11 5 2 -4 2 0 -4 1 9 -5 -6 -17 -2 -3 -3 -11 -15 -7 7 2 -12 0
6825 0 12 9 8 5 0 5 -3 -2 6 14 3 6 15 14 8 -1 8 6 1 9 13 -4 1 2 10 5 -5 -5 10 2 1 -12 9 2 -8 -6 -3 4 11 1 -4 9 5 0 -8 -9 6 -2 17
6874 17 4 -1 -5 4 9 2 -6 6 -8 -11 -6 9 1 -6 8 10 10 12 18 0 10 14 16 18 19 18 4 1 9 7 3 -1 9 -1 3 6 11 -2 -1 -4 -7 -9 -3 5 -2 -3 -2 -3 1
6923 1 -3 -5 -10 -10 -1 -1 -3 -10 -4 1 11 -3 13 8 7 2 -10 -6 4 -2 -4 -8 -9 2 0 1 -7 0 -7 -17 -7 8 -1 -1 -8 -6 1 -1 -1 2 1 11 16 5 1 -1 4 7 2 -1
6973 -1 1 -11 -14 -10 -15 8 -5 -17 -11 -15 -9 -8 -11 -18 1 -4 -5 -8 -8 -12 -2 -11 -1 3 0 1 -17 0 3 -2 3 -2 1 -8 11 7 -2 15 -7 4 3 1 7 5 13 9 1 1
7021 1 4 -4 3 11 10 15 10 0 4 5 15 2 12 12 4 6 2 7 0 -5 -5 -3 5 -6 -11 2 11 7 1 -4 -8 -1 -2 2 7 2 6 0 -1 -6 2 -3 -1 -6 13 9 0 -3 6 6 9 4 -1 18
7075 18 13 0 -5 15 0 -9 -2 3 -1 0 1 1 3 11 10 0 1 -13 3 1 -3 -1 -3 5 -4 -3 4 -3 -10 10 -13 2 3 -2 4 -7 8 -15 -5 4 7 -11 -6 -7 -5 4
7121 4 1 -6 -1 -5 -1 8 18 7 -6 3 19 7 12 8 12 3 -13 6 2 9 10 11 0 3 -5 5 2 8 7 -4 3 -4 7 12 -4 1 -11 -2 -8 2 -4 3 0 -7 2 -9
7167iMkM%OoMpLJ0j2kjlJ4nKk%JMLpjkJ8j7KJMJ2r%kj5LK2orNkJ3j7lLNj2kK%
7217hkO%JmkjqJ4lJ1j2MPnpPPjoMnj0Nj0K2jJo%mRjJmJ0qj2JK7j0lJPlqRknLR
7268A5j9NQj1jLJlLlMmjqLnNJ1qJ4j1LJj0RLOqnJ1JnLNj0QNoj5J5lJ1j2OrNJj
7316GjJ2j3nKjlJ3Jj2KmkJ3Qj6mQkJLlJJJj5%OpNkpJ3j1QPnQj3J0Jj3nK2j2J1
7362HmOj1JlLJ8j5PpMjjqjJ2mjpRMj1PmJnLJ0Lj3JRojjj3NMRJqj2J0Lj2MnPJ2
7411Gk3MMnkKQKpkJ0mMOJnoQMj4KJ4oJ3j8mJ7j5KJ5j3jMjloJJRpNljMmjnlMNP
7462Dj2RQk7J1J2j1Oj3PQoOlnKQnnKRj0J2j5OqK0loLnRjj5NPj2RJKJ5j3oNp%N
7509CqjkmJ5kj3J0qMnmL%QKJ1rqmJ1MmNmjPmj6OJ1KLrNnJ8k1KJ4pjrKJ7qj0J2
$$ plain form
7167 -9 -5 -7 -3 -3 3 -3 1 -6 -3 7 -5 -7 -8 -11 3 -2 0 -2 -2 -1 3 6 -1 -2 -4 14 -3 -1 0 4 16 7 7 5 -10 -7 15 9 0 5 3 16 -1 -4 -1 4 -8 -10 -8 -8
7217 -8 -10 -4 -4 -3 -7 -9 -10 -18 -4 -7 4 -8 -4 3 -2 -9 -2 5 4 -2 2 -3 -13 -8 -18 4 3 4 -2 -2 -6 3 2 3 -1 9 1 -11 -10 17 7 4 5 12 9 1 10 8 3 6 15
7268 15 -4 1 9 -2 -3 0 1 -2 1 -2 2 -2 -3 -11 -8 -13 -8 3 -5 9 -2 1 2 -8 1 4 10 2 -3 8 9 4 7 12 2 10 15 9 -6 9 6 17 5 11 2 7 8 7
7316 7 6 18 5 0 2 1 -2 11 12 0 2 -2 -4 9 17 1 -3 5 3 4 7 4 5 6 7 -8 -8 -2 -9 -4 -6 -13 0 -11 -3 4 -1 7 -6 4 5 -8 -13 9 -3 8
7362 8 4 10 -1 0 -3 0 18 3 10 3 7 6 5 -3 -4 8 4 3 -4 5 9 -2 5 1 2 -3 0 10 13 0 1 10 4 3 2 -11 -6 -2 7 8 0 -12 -2 1 -11 -7 -12 -5 7
7411 7 -16 -12 -8 -13 -15 -13 -5 -3 -10 -12 -2 -6 -2 4 5 0 -6 2 6 -8 -6 8 2 15 -3 -7 10 -5 -3 12 -1 -2 2 1 -2 -8 -7 -6 3 -4 1 -2 -3 1 -3 -4 -9 -12 -8 -3 4
7462 4 -8 1 9 -18 -7 5 -6 0 -13 -6 2 -4 2 -1 -6 -4 4 -1 -6 -4 5 -5 7 -8 -2 -10 10 7 1 4 -1 8 7 -8 -3 4 -8 1 2 4 19 6 0 5 -2 -2 3
7509 3 -5 -6 -8 -12 3 1 -12 -2 -10 -6 -11 -15 -12 -12 -4 -2 9 0 -8 -12 -1 3 -1 4 0 -1 6 2 -14 -8 3 5 8 -1 4 -1 17 -4 -2 12 5 4 -5 -3 14 6 -4 8
7557HRo%njJMQJk0NOlnkJ0j4MmJ9j3Klo%Rj0mJ1qOkOJM%nNooLJ5%j4KQk1K3kl
7607GNnmlJ0kkjrJJ1qKJjMj6NJ2KpkKJj3J7qLkQk0QL%lj1OPNj8LmJ4oPPrj4K1
7656Dj7J4nKlLOpJ2j0ROj5J2j1JlJ3j5J0ooLJ1k4J3OKj0Ljl%Nj2J6qJJ0pKqJq
7700a4PpJ1Qj1J0Lmj5J1Mj8J7qKkL%RnKlPj4PNk%LJ0j7J0Nj1PkqmQj1KmLJ2k4
7745a8J4Mj7J5O%pj0QmLlLj1J4kMJ0kLj3qRKjQj5LLPoKrLPkLj0R%j0J2MK%Jj1
7792@J6j9OkMMjmkJ3q%Jj5J1njoQJ4j9jJ1mkMpNj4J5LmpJ0jlMJ5j8pM%nnlJ3j
7839crQKjRnJ3j2JJmKQpJ5j2j1%J1Qqj7QJ6rJomJ2%pJmLj5J0NloNkjLlmNPpKl
7889gJ1qLnJJ3qRojpJ4j6PLkJkQj0NJnOj0OJ5j5MnmJ5j0pK2rq%jkLLLnOonP%j
$$ plain form
7557 8 17 11 11 6 5 6 10 18 19 -1 4 10 7 2 0 10 -4 0 -4 15 2 4 1 -5 -5 4 -6 -10 1 -7 -1 -3 3 4 8 8 3 8 2 -4 -1 14 14 0 2 10 -11 12 10 7
7607 7 12 7 3 0 10 8 6 5 -4 -3 8 0 2 3 2 6 -10 -5 7 9 2 0 2 3 -10 7 -1 2 0 8 -12 -4 -1 -1 -4 -15 -9 -2 3 -15 -12 -16 -2 -8 -1 6 -3 -17 4
7656 4 -13 1 -4 -2 -5 -2 4 -3 9 -1 8 14 -1 11 0 1 -2 11 -4 6 0 -6 -3 8 -16 -3 3 5 -5 -2 -3 -6 -6 -1 -13 3 -5 -4 6 -1 1 -7 -6 -14
7700 -14 -7 -14 -3 5 -6 4 7 3 -12 -1 3 -15 2 -6 -4 -6 -3 -3 6 1 3 0 7 -7 0 5 3 3 6 16 -1 9 14 3 10 8 0 -4 4 -7 -5 -9 -6 6 -18
7745 -18 -4 0 -17 -2 4 4 -3 -13 -5 -9 -6 -9 -6 -17 -3 -5 -1 9 7 10 -3 -11 -2 0 -1 7 -8 -5 -2 5 -1 1 -8 -5 2 0 3 -7 2 2 -8 4 8 10 10 11 0
7792 0 16 -3 3 1 5 9 8 4 2 15 7 7 8 -7 4 -1 -2 -8 0 14 -5 -6 5 1 -1 3 -4 1 -13 2 5 1 -6 4 3 0 4 19 1 -6 -2 -2 -7 -12 -15 -2 -3
7839 -3 -12 -4 -2 -3 6 1 14 2 3 4 0 2 10 3 18 6 -5 -5 6 14 6 -11 -3 13 4 5 -1 -5 7 7 0 1 -3 0 -15 -5 0 -3 -9 -4 -6 -7 -4 -7 -11 -6 1 -6 -4 -7
7889 -7 4 -4 -1 -6 -5 8 0 9 3 2 -5 9 -7 0 3 1 2 0 8 -2 3 4 -1 5 -5 1 16 1 5 0 -4 11 1 -6 16 7 -1 -1 -2 -4 -1 2 5 0 6 0 -5 2 2 1
7939AlpJ5p%j2kNNkJ0nnj0K6j5P%KjOLPj0oJ1j8QOLOqmJrnJ4j5J8nmJ0pmKJ%l
7987@KkLJk1QJ5pJ0j5RjmkMllJ2j3J1oLj4J5k0J3JnJ4lj6RJ0j3J3LLlOoJ6j8M
8030A0j2J8%jkj2J3oj3NkQj2J2Pj6KjKNqKqJ8pj5J6k0K3j3OKkPrLj3J4J2j0pR
8072EqQLj7QOqj0J3mNqJ0L%pNj2K3lMoj7J7lj1KLOj1Rj0MJ1j3J1j6jmLLnllN%
8118a3jkmJ2Kj2J5%MrJ1JnRrKLj1jOklQJmMnNlj6K1j0%NKLojRknnMPorK0j4J1
8167GKj5OJ2mj9OmJ3ooJ0j8J1kJ1pM%rKoOj
$$ plain form
7939 1 -2 -9 6 -1 -1 -13 -15 -10 -5 -7 3 -2 -7 -17 9 -6 1 1 3 2 8 11 18 8 2 13 -5 3 9 12 18 10 6 7 -2 -7 7 -8 10 5 1 11 4 0 2 3 3 0
7987 0 2 0 3 4 -17 -9 6 -1 9 -6 3 2 -2 -4 0 -3 -6 6 -7 4 -2 1 -13 2 -18 -5 -4 -9 5 2 -14 -5 5 -8 5 8 11 8 14 8 24 6 10
8030 10 -2 16 16 15 13 1 14 8 -5 0 -2 6 -6 6 13 -3 -1 -2 0 5 -3 -1 -9 9 2 -13 3 -17 6 -7 -1 1 -1 6 -3 0 -13 1 13 3 -4 5
8072 5 -3 5 8 -9 -1 5 -3 -13 0 -4 1 -7 3 6 6 -1 4 -8 15 12 16 10 -7 10 7 -4 -2 1 7 -4 5 -5 -1 10 -3 8 -8 -9 -13 -10 -7 -12 -15 -18 -13 -13
8118 -13 -14 -16 -20 -8 -6 -18 -3 -3 1 -8 3 4 -1 8 -1 1 4 -7 -8 -2 -4 -7 1 2 -2 2 -3 2 -1 -17 4 -6 -6 -1 1 4 -2 -3 6 4 -1 -6 -2 5 -1 -10 10 -4 7
8167 7 9 -6 0 12 8 -11 -5 -9 4 -2 -8 2 -16 -5 -7 4 -3 1 1 -8 -6 -12 -6 -7
8191g
$$ Imaginary data points
##PAGE= N=2
##DATA TABLE= (X++(I..I)), XYDATA
0@%%%%%%%%%%%%%%%%%%%%%%%%Qj6J6j6J6j6J6j6J9k7L2l2L2m0M8m8N1n9O4p2Q0
45D0q8R9j07J20j36J52j72J96k25K65l15L84m89O65j037L175n697n260R609M227
65E406n408l568N853J933o432l564O472M675m166m689K626K702k595j629M140
80A756K185m453l714L364L935j954l083J926K402k533l027K486L861j429m038
95b316J66L131K24k214K33K005p00k589K62K739O09j931o73J020j81j091Q84J902
113A480n25k259k41J711L76r22L30R18j037j695Q18K144j76j738J21J315p65j751
131a896R05K544j51k623o81K013R20j437o20J280M99j309o04J190P79p95n77N91
149B8J23q10R5J314J63j598o08J533R40j315j136J112J249r87j382Q32J606n39
$$ plain form
0 0 0 0 0 0 0 0 0 0 0 0 0 0 0 0 0 0 0 0 0 0 0 0 0 0 8 -8 8 -8 8 -8 8 -8 11 -16 16 -16 16 -24 24 -24 27 -32 32 -40 40
45 40 -48 51 -56 64 -72 80 -92 104 -121 144 -171 213 -276 389 -648 2527 -3170 -8430 1179 5406
65 5406 -2 -3570 2283 4216 -2216 -5780 692 5367 1201 -3488 -862 1840 -755 -2384 1756
80 1756 3941 -512 -4226 -862 3073 1119 -1964 -38 2364 -169 -3196 -710 3151 1722 -2316
95 -2316 -2150 981 1205 -1009 -776 1229 529 -2060 -1798 941 1550 -381 -1054 -34 -215 -1306 -422 1480
113 1480 955 -1304 -1545 166 542 -380 -50 868 -169 -1864 -1046 1098 922 -816 -695 620 -145 -1896
131 -1896 -991 1553 1402 -1221 -1902 111 1031 -406 -1026 254 753 -556 -1160 30 809 14 -563 28
149 28 151 -659 -564 750 913 -685 -1293 240 1180 -135 -1271 -159 1090 103 -1279 -447 1159 620
167F20j725M7J538L73j032l85O09J40m78M8N39p4m38J00K75l03k46O20N08p49
187a3q62M80J008j40q62M1O82j11o96P6P25P9o60j87N13J87l09p5K55j07m26J34
209b68O16J28n37k93K95J36j99R4M16j33o68r1O81L19n23k89L73Q6n28o6Q31L85
231G65q50p89M97Q38j26n39J16L69k93m96K81O88N3n37l22J20K07J87K33r9m48
252a45k30L20L21j22j13K62J9n37l11N86P09k00p28k47L97L07m1j1J14j45l09
273a04j10K93L55J06j51l65l08J65N52K48l85m28P4K70n4o8K93J80m36n31K20
294a84O52J60l86k53M1j1l9K27L01q8m05j74J35J91J66J22j28m23k09L13M38k1
316D25k93j09L4j50n7L46L45k07n81j35L59K85n6q2oj73k47Q1M30K01k75l33p3
$$ plain form
167 620 -1105 -1058 480 853 -179 -564 45 185 -293 -245 294 220 -218 -118 157 -146 -392 228 736 -13
187 -13 -875 -395 613 473 -389 -348 334 223 -473 -397 328 407 -253 -440 73 260 -49 -124 131 24 -402 -268
209 -268 348 476 -61 -354 -59 77 -122 -28 388 255 -413 -504 177 496 -27 -316 57 143 -385 -451 380 765
231 765 -85 -874 -377 461 335 -204 -88 281 -12 -508 -227 461 514 -23 -345 -225 -18 169 402 303 -145
252 -145 -375 -55 266 144 31 293 312 -225 -536 50 759 559 -169 -416 -19 288 247 236 350 205 -104
273 -104 -214 79 434 540 389 24 -284 -119 433 681 296 -132 -58 212 158 90 383 563 127 -404 -184
294 -184 468 628 242 -11 30 19 -20 207 508 420 15 -159 -24 167 333 455 327 -96 -305 8 446 425
316 425 132 23 57 -93 -150 196 541 334 -247 -382 -23 262 206 124 118 -55 -302 -221 209 410 135 -198 -271
339b71J10J24K00J03k24l55n2L01J91r0j03J4j57k23J60M57P0m55l40J92K86l
361f5n7R2l0l35j27L39L77j21l39r3J01L3O4J94M1k72k32J07K72O8p3m0r8j96
385c90K0L37K42j99l27o2J98R9k1R3Q0j76l02L9L90K31j93l00j8J18L5O1J65K0
409A40k72k53J50L13J24j09j46j24j05J02L21J71k36l17qJ60O0O5K27l4m28k71
431d70L23N10Rl69j58J04on4K23L11j43n00j59L51L31kj42j24j67j38J93L86P8
454C87k87k45j1M1P4K54K26k58n43q4N02L61j82k64K2j7k17M0M66K64l79n03J3
477c40L61J83l3K2r0l05j71L04L74Jk64j70m1k8J25L38J48l52l89Q0L25J04n0
500A32O0kl12k59L03N09K8m11k90J18J65N5Q3J62j26l75j79K86L88P3k28k51j24
$$ plain form
339 -271 -161 -37 163 266 42 -313 -365 -64 127 37 -66 -52 -209 -432 -272 185 255 -200 -540 -348 -62 -65
361 -65 -122 -30 -60 -395 -522 -183 194 73 -266 -359 -258 -225 -161 33 74 -198 -430 -323 -51 17 -56 -96 -194 -390
385 -390 -370 -33 209 10 -317 -379 -181 -82 -103 -10 70 -106 -408 -369 21 252 59 -241 -259 -141 -106 -45 120 140
409 140 -132 -385 -235 78 202 93 -53 -177 -282 -180 141 312 76 -241 -249 -89 -29 36 263 229 -199 -470
431 -470 -147 363 372 3 -155 -51 -57 -111 112 423 280 -220 -379 -28 303 301 159 35 -132 -270 -77 309 387
454 387 100 -145 -156 -115 -41 213 439 181 -362 -446 56 417 235 -29 -7 -24 -241 -201 265 529 150 -353 -340
477 -340 21 204 171 193 103 -202 -373 -69 305 306 42 -128 -169 -197 -72 266 414 62 -327 -247 78 182 132
500 132 192 190 -122 -381 -78 431 459 48 -242 -124 41 96 179 341 215 -160 -339 -53 335 408 180 -71 -195
523a95O2K40K32l1k51j38L6M5P2J83J54k08m23o9M30L37j72l11k6J47p1q1J69
546A31K53r6l61j30K13K68M4j64j61o4O5J61N8o3o3J3o6j04P9K73Q8l12l06J42
570a02L51N5k16r8N6k3j12Q4K34L1k61k02M0J92J17k2j20j06j7L3N6K0N0J6j35
595g9j94P7K77P1k48j51J14J39p3j06Q5J11r7j71K7J73Q4j46j79J2J88J45r4k12
619b47n9J62J15r0q6J14J17j65k66Q1L88J65l13l33Q1L15Q3j68q3J25O4j98j59
642c57J57L04N7k74k97Q2L12J43j63k03L9J75Pj81RK59R2k88k57K25L98l2l60
665a53j35K27J61p7o5Q3J5j44r2J40J70M9q4j55j70Q7K97J87j80k97J8J34ml4
689b2K27J81k52m40M1M44J99k17j56O2l1j88N0L65J56k95l37M5K21J33j5m2r6
$$ plain form
523 -195 -133 107 339 308 57 -81 -45 0 72 255 409 201 -222 -291 139 476 304 -7 -33 114 43 -38 131
546 131 384 288 -73 -203 10 278 322 158 -3 -67 -2 159 217 154 91 104 38 -66 13 286 374 62 -244 -102
570 -102 249 304 88 -10 46 23 -89 -5 229 260 -1 -203 -163 29 146 124 4 -102 -119 -86 -30 -10 40 56 -79
595 -79 -273 -196 81 152 -96 -247 -133 6 -67 -173 -88 23 -74 -245 -218 -45 39 -107 -286 -274 -86 59 -35 -247
619 -247 -306 -144 -29 -119 -205 -91 26 -139 -405 -324 64 229 -84 -417 -336 -21 62 -106 -189 -64 0 -198 -357
642 -357 -200 104 161 -113 -410 -328 -16 127 -36 -239 -200 -25 -18 -199 -190 69 161 -127 -384 -159 239 207 -153
665 -153 -288 -61 100 23 -42 41 56 -88 -180 -40 130 179 95 -60 -230 -143 154 341 161 -136 -118 16 12 -22
689 -22 205 386 134 -306 -265 179 378 161 5 67 36 -152 -102 263 419 124 -213 -168 53 186 171 129 33
712C3r9j8J12R1L3lq0j99p0K64L22j12m24j36K99K65j52j72J14J13k35k18K39
735c3M11Mm25k95J47L27J31n2j58j38m3Q6O8O8J13M6k29l63N3N13K79l32m26O8
759a80L01j4j70J13K50j24l81o6L28K58j27k17p7L1Q8J06N3j09j01J1M3k4N4J66
783B12j7k82j77K46L16l1k69o3J05j2o1J41K17j02l17j24K07K52K3j44r9n7qO8
807B4J04N8or1j53j04J75K79K6l16j83J60K07r1j29J01J28j50k27Q9L02N7k60
830@j91P2J53J18l6j45j15N4J47l9j06R8J37j49l33N8M47J63l61l27J46K67l2
853B6j08O6Q9j35j91L6J91J14rj16j95p2K12K44q4k53m0J76j4j38N8K47m2l33
877b71j30K88K87j58k48KJ34k2l1J08P1j27j79J8J63J13nn6j33j45R4K59Q7j72
$$ plain form
712 33 -66 -84 28 119 152 149 69 -130 -200 64 386 274 -150 -286 13 278 126 -46 68 181 -54 -272 -33
735 -33 378 382 -43 -338 -191 136 267 215 57 -81 -124 -38 30 98 211 257 28 -335 -282 231 510 178 -248 -180
759 -180 121 107 -63 50 300 176 -205 -271 57 315 188 -29 -106 -75 13 119 172 63 -38 -27 16 -8 46 212
783 212 195 -87 -264 -18 298 267 -2 -65 40 28 -33 108 325 223 -94 -218 -11 241 264 120 21 -36 -44 24
807 24 128 186 180 89 -64 -168 7 286 312 -4 -187 -27 180 89 -40 61 189 39 -188 -99 203 260 0
830 0 -191 -119 34 152 116 -29 -144 -90 57 18 -88 10 147 -2 -335 -277 170 333 -28 -355 -209 58 26
853 26 -82 -16 73 -62 -253 -217 -26 88 79 -37 -232 -304 -92 152 68 -185 -225 -49 -63 -201 -143 104 62 -271
877 -271 -401 -113 174 16 -232 -230 -96 -118 -149 -41 30 -97 -276 -258 -95 18 13 -43 -176 -321 -227 32 119 -53
901e3j46M5M1p7P0K60L9l24k55K11L16k1j65JM9j03q2J51K51n7k17j13O7J02J05
926I5O9q5j89l5J59J14o0l1O9p2j49jK55J79j91k71PK24P2m4k8Oq0q7M2J69J01
953B38q3j66r0M1J62J32l4j54j00M4N3M3N6O5q0j94n5J63J98nj52j11K2M9M7N8
979A47J8n7j05n0L6J36J05q2j64p1J07J19j0m9k3np1l4J16J34o4j89m9J04R0J4
1005A03l0n8n9j7O0O6Rj8l9p3m5P7J63J6j74j14O3J31mj9OQj01p5R2J71J8j38
1033A9j00K8O5M9L5rp3o7K4P1N4Nk9p3o8K4J40Q1r8j37LJ00L1l5L8K1q8j16M3
1062f2J58P7j11j03l0M7N5M2K3n1r2m2M5Q0N0kq2j06oJ17R7k0r0n4nJN9O5M3q6
1092A7j31l1R2J30L6q8j06m4N5O1M3J7j8j25q2O1J42O5p7j20m6J7P2P6L1n4j22
$$ plain form
901 -53 -199 -154 -113 -190 -120 140 179 -145 -400 -189 127 106 -59 -58 -9 -112 -194 -43 208 151 -66 -179 -112 -10 95
926 95 164 79 -110 -145 14 128 68 37 106 34 -115 -116 139 318 127 -144 -137 87 159 115 87 93 13 -74 -32 137 238
953 238 155 -11 -101 -60 102 234 200 46 -54 -10 43 86 142 207 127 -67 -122 41 239 234 82 -29 -7 42 89 147
979 147 165 108 3 -47 -11 125 230 148 -16 -87 20 139 129 80 57 52 -19 -53 63 197 133 -56 -105 -1 89 103
1005 103 73 15 -44 -61 -1 65 74 56 17 -56 -101 -24 139 155 -19 -133 -70 61 57 38 44 52 -49 -124 -32 139 157 19
1033 19 -81 -53 12 61 96 87 14 -53 -29 42 96 101 72 -1 -69 -45 95 176 78 -59 -56 44 75 40 78 99 11 -105 -62
1062 -62 96 173 62 -41 -71 -24 31 73 96 45 -47 -89 -44 36 86 84 2 -104 -110 7 104 84 -6 -60 -65 -64 -5 60 103 17
1092 17 -114 -145 -53 77 113 25 -81 -125 -70 -9 34 51 33 -92 -174 -113 29 94 17 -103 -149 -132 -60 16 47 -7 -129
1119a29n5L6J09P5j4j11r1k7J05J09K8q2j02j5%M7J08N0r0j56l6J22J41%p8n4
1145a10l9l5N5J31P6q5j58l8R3J25L7k2p1q2k4Q3J14L1n1p9o6oR4J56Rj47j40
1172a49N1J27M3l9J7J2j05q2P4J80N7j55j29K0R0N9J9nm7o2k1M2Q6O6j0j06j15
1199h2L7J61Q3p0j37JO0K2pM7O0n1j47m9J42J57k3j40q6N2O7J8j3RQn2o9OJ21
1228A25O6m9j36n9J02J07j2p2m7K3%l7J6Q8J8q3r7oJ23P9o3j12k1P1K3k9NM0j2
1257E1r5m4R6J22k4j47m4M7P2Mj0mj9l1l3N2O4M3n3j10k7Q7Q2nq0l0L6J7l9J3
1287iP7J9j13j03P0J70Lj32q4Q0Q4l6n5L8M5o5r1K6J28O4p4j15n3P1J06M7r1p8
1315g1K4O2l0l9O7J07o1j89n1J92J63j01j60OJ04j6n0L5Q9%j43n0P8J00J9n5q1
$$ plain form
1119 -129 -184 -148 -39 36 22 -89 -180 -207 -102 7 35 -47 -149 -164 -164 -117 -9 41 -49 -205 -241 -119 22 22 -56 -110
1145 -110 -149 -184 -129 2 78 -7 -165 -203 -110 15 52 30 -41 -123 -147 -64 50 81 30 -49 -115 -121 -27 129 138 -9 -149
1172 -149 -98 29 72 33 50 62 -43 -125 -51 129 186 31 -98 -78 12 71 90 85 38 -24 -45 -3 83 149 139 33 -82
1199 -82 -45 116 199 129 -8 -7 53 75 68 115 175 124 -23 -72 70 227 204 64 -22 30 97 115 102 111 119 67 -2 4 125
1228 125 191 142 6 -53 49 156 144 72 25 48 48 11 27 115 133 50 -47 -53 70 149 86 -26 -47 24 47 18 23 63 51
1257 51 -44 -88 8 130 106 -41 -85 -38 34 38 28 24 5 -26 -59 -7 57 100 47 -63 -90 -3 79 74 -6 -36 0 17 -22 -9
1287 -9 68 87 -26 -129 -59 111 114 -18 -102 -22 62 26 -29 9 54 -11 -102 -76 52 116 42 -73 -126 -55 51 98 7 -71
1315 -71 -47 15 -15 -54 13 120 59 -130 -181 11 174 73 -87 -81 23 7 -43 -8 81 81 -62 -112 -34 66 85 30 -51
1342e1l2N7P4Rp7l0L6J6n1lJ23J2j39j33R4J73Pj41m7N1K8p6L3J16K7j58j01M8
1370a35J21N7m1n1n7k9L6O2J6nJ2p0r2K2J25J21q5j80J0J37L5q8rJ05Nj29p9J38
1398d8J50n1j67l9R8J03k1o5l9M5K9k4k2L7O0k4j21o2J28J76k4k09q6J29J18n3
1424A8p1P0O9r7j45M7K16O8j10j60k0J12Q2Lm6j4L4k2m9pJ12Q7q8j49JJ80N9j16
1452F4q4O4Q0m1o2M2P1k2r5QO3Q2m0p8m6L9P5L4n2o1ML0l0j3O8J03q5j78j1J51
1482H0Q8o7p8M3Pq1m2J08J09n0j40n6O9P8K9l1m3l5K1K5k8qN1M6q7j03O0J52Q
1511A25j77p1J43J13q8r3M4O4m8r2N2J18J0j20p1L8O9M2K5o9p6j8O1K4j5J7M9
1538E6n0j63qJ91J32j12j70J2J12qo3N1J05p2j36k7J38Q1n5n6l2PLO2M0m4m6L
$$ plain form
1342 -51 -83 -26 48 57 -20 -50 -14 2 -49 -52 71 83 -56 -189 -95 78 85 -56 -103 -52 -24 -100 -67 49 76 -82 -183 -135
1370 -135 -14 43 2 -49 -106 -135 -99 -37 -21 -26 -14 -84 -176 -154 -29 92 7 -173 -163 -26 9 -79 -88 17 22 -107 -186 -48
1398 -48 102 51 -116 -155 -57 46 25 -40 -79 -34 -5 -29 -51 -14 46 22 -99 -161 -33 143 119 -90 -176 -47 71 18
1424 18 -53 17 86 -11 -156 -109 107 175 65 -95 -115 -3 79 82 36 22 56 34 -15 -22 90 177 89 -60 -59 121 180 64
1452 64 -20 44 124 83 21 63 134 112 17 25 88 170 130 52 6 45 120 154 102 41 45 75 45 32 100 203 118 -60 -71 80
1482 80 168 101 23 66 73 -8 -50 58 167 117 -23 -79 -10 68 97 66 23 -12 9 34 6 -2 49 95 8 -95 -35 117 125
1511 125 -52 -123 20 133 45 -48 -4 60 12 -80 -28 90 100 -20 -91 -53 16 58 83 14 -62 -80 -19 5 -10 7 56
1538 56 6 -157 -165 26 158 46 -124 -112 0 -8 -71 -20 85 13 -123 -150 -12 69 14 -42 -74 -67 -64 -2 38 -6 -52 -49
1566d9K9k8RR8J6j32r5J26J39l5j39j1R8j6o3L3J18rj54o9R8J09Nn6m1k8JK7N4
1595C5Nm4ll6n0K9J08N8j05j38K1J42K0p9j7P6j7j17kJ18P5p9j00lP1K9Jk3j7
1624d2j9K1J7j3K5L9j7j00k4R0R8m1j16nO5L4m9%O2k2p5k4N6P6ln7l8j9M7M8L
1655A7l8j3PLl7L1O3Nr9n4P3Q5op2pL4rm2M0M9Jn3l7L6L3M0jm8m6K3P2K6l7m4
1689eM3mm3K1Q9L1q1p1K6P4K5m9KJ8k7k3L6O0j7n2k3J6KM1L1k3o5l4O0M6k6j8
1721F0J0%n9j0Q6M2n8p7J6N6Qj2MJ0n1m0N5N8km9l5r%M0M5jm5m5QM5j1K0J1k1
1755D9p1qP1O7l3o2j1%OOL3J6l3q0j2O3M5ml2l6l7K9L8J0jk8l1k8%N6N2k2p6m0
1789a04L7N4J9j9j0k2m0PN1L6rm0o0RM7O4Lm7m1JRK4L5J4mp8l1O1Q2on7l0pJ5
$$ plain form
1566 -49 -20 -48 -39 59 75 -57 -152 -26 113 78 -61 -72 26 10 -53 -20 98 89 -65 -134 -36 73 78 22 -19 -47 -46 -19 35
1595 35 40 -4 -7 -43 -93 -64 44 102 -3 -141 -120 22 42 -37 -54 22 5 -112 -114 4 79 0 -100 -103 -32 -3 -2 -25 -42
1624 -42 -61 -40 -23 -36 -11 28 11 -89 -113 -23 75 34 -82 -87 -22 12 -37 -37 25 3 -72 -96 -40 36 33 -24 -62 -81 -34 14 17
1655 17 -21 -34 -27 -24 -61 -30 33 38 -61 -115 -42 43 37 -35 -42 -8 -17 -59 -19 30 31 -22 -59 -23 10 50 49 1 -45 -22 50 76 39 -5
1689 -5 38 34 -9 12 101 132 51 -20 6 80 105 56 58 76 49 26 62 122 105 53 30 46 48 89 120 97 32 -2 58 104 78 60
1721 60 70 70 11 1 87 129 71 -6 10 66 74 62 66 76 25 -15 40 98 96 47 12 3 3 43 88 87 42 -3 5 50 39 59 70 49
1755 49 -22 -30 41 108 75 13 2 2 8 14 47 63 30 -50 -62 1 46 42 10 -26 -63 -34 4 14 13 -15 -46 -74 -74 -18 34 12 -64 -104
1789 -104 -67 -13 6 -13 -23 -45 -85 -78 -27 9 0 -40 -100 -91 -44 20 23 -24 -65 -64 -55 -31 4 18 14 -64 -95 -34 48 42 -15 -45 -52 -37
1823c7J1M8J3k7n5oJ3N5K8k2n2l4MN5M8l1l5jk3j2K7P3No8o6J6Q2K2l1j8jql4
1856f1L6N8%m5m8J4K4L5K4k5n2l1N0L0mJ6pj8n1QO6O1n8p5jN4K0j8pJ2j1n3J0
1889d7N0M3k2n0l6J2M9K5j4l4k6K0knK5L0l0m8l0M7Q0j7m7l1J9L1pkK2J4l3l2
1921d6LP5K4l0o7rN6L9j0k1MJ0j8l2M1O0j4o1l4M7M0L6m2j0k2MJ7MJ3J5k2n7j8
1954b5M8Q8Kr1n2O1L7ol8M4J7m5p2K9J02K5q4n7K5L9K0j2Jk1j4LjJ3L9K1m7q5
1986c6J4J20O0r7r3L2Q0k2n8M3P7m5r6l4J09P1m5p6l6L1J4L6j2j1k0lk2l4N0P2
2016F9oj09o7Q3Q0j5r5J0N8j1o8MQ1K0o9q3M8P2qk4l5%J4K4J0rnkqm5K6Q1K2p7
2050c4p8K0R0J9m5rL2j8n9mR9N3n6r5KL6M1J5k8oj4mrPM1L4l5q1j6Q0P0m5r3K0
$$ plain form
1823 -37 -26 22 35 8 -47 -53 -40 15 43 21 -31 -65 -61 -6 42 11 -24 -25 -48 -60 -33 40 45 -23 -89 -73 9 31 0 -18 -19 -27 -61
1856 -61 -25 33 33 -12 -60 -46 -22 13 37 12 -40 -71 -21 9 5 21 14 -4 -55 -47 19 80 22 -53 -54 0 20 2 -5 7 -4 -57 -47
1889 -47 3 46 24 -26 -62 -50 -1 24 10 -24 -50 -30 -32 -37 -12 18 -12 -60 -90 -43 37 20 -27 -58 -39 -8 -15 -17 5 19 -14 -46
1921 -46 -43 32 56 26 -41 -50 6 45 35 14 18 28 10 -22 19 79 65 4 -30 17 57 93 51 41 19 23 40 44 57 72 50 -7 -25
1954 -25 23 111 113 22 -30 31 68 62 24 68 85 40 -32 -3 99 124 40 -17 8 47 67 55 56 35 21 24 23 36 75 96 49 -36
1986 -36 -22 98 158 61 -32 0 80 58 0 43 120 75 -21 -55 54 125 80 4 -32 -1 13 49 37 26 6 3 -19 -53 -3 69
2016 69 63 -46 -113 -30 50 35 -60 -50 8 -3 -71 -67 14 34 -35 -118 -70 2 -6 -30 -65 -65 -51 -27 -17 -26 -31 -33 -41 -86 -60 21 43 -34
2050 -34 -112 -92 -2 17 -28 -37 -5 -23 -82 -86 13 66 10 -85 -83 -47 -6 9 -19 -25 -39 -43 -52 -45 -4 30 -5 -86 -102 -22 48 3 -90 -70
2084g0O1Jn7KO5Rp1l1O5O3j7o5l5M2M4J6j0n3nM6k0rL4N6nj06m9P8J13k6q0k1
2116c5M7ll8K2N1K7o4p0L0O3L1j5n7k0J6J9Rj0kK1nm4k4O9L7o8p5L7J00no4m2
2148f2M8L1n3j4O9L6n7p5K9O7L3j9m3k1oL0K5OnOj5o2j2P7J04l9j07l3Q3M5n0
2179A6k6N6K3p7n1O6Q1j1q0l8L5L2JNj0k2J8PJj4J8J6l5o7L9R7J8r5o0N7P1j5
2211E6n1K0N8m4q5J1R6O3p9o1mL6L6K3qjm3Lj0J7L9L0k3q4l6P3P9j5q6J0L8j3
2243D5m7K3O7rp7l5M3P5k1n9%j4J3J1MLk2j1j1lK5L7J5q0n1L3Q4ln4j8J6mk4%
2277d9Q3Qp1o3K4O7J3ok8j7j5J1K5Rlmqm9ON8L8m6n4K1K9J0k9kK4%n1qM9L8k9
2312a9m4kJ5K7Jj3k0MoOLRK8j2n0k3N7N6k2n4OK4kk6L4L5j4n2%K7L9Kj6k6%jL1
$$ plain form
2084 -70 -9 -8 -65 -63 2 11 -60 -91 -26 37 20 -45 -80 -38 6 22 12 -41 -46 0 -20 -29 5 61 56 -50 -99 -21 92 66 -14 -35
2116 -35 12 9 -29 -7 44 71 7 -63 -33 30 61 46 -11 -31 -15 4 13 3 1 22 17 -27 -51 18 55 -13 -88 -51 49 44 -20 -62
2148 -62 -14 17 -36 -50 19 55 -2 -77 -48 19 52 33 -10 -31 -37 -7 18 24 19 25 10 -52 -64 13 117 78 -29 -62 21 66 16
2179 16 -10 46 69 -8 -59 7 88 77 -3 -41 -6 26 27 32 22 0 18 25 26 12 30 46 11 -56 -17 80 98 3 -57 0 71 56
2211 56 5 25 83 39 -46 -35 61 124 45 -16 -20 16 52 75 67 66 23 26 16 33 72 102 79 -5 -41 32 111 96 10 20 58 45
2243 45 -2 21 88 79 2 -33 10 85 64 5 5 -9 4 15 19 22 0 -11 -22 -25 0 37 52 -28 -79 -46 38 35 -19 -37 -21 -25 -49 -49
2277 -49 34 42 -29 -92 -68 -1 12 6 -22 -39 -54 -43 -18 -9 -12 -16 -24 -73 -67 -9 29 -17 -71 -50 -21 -11 -40 -42 -18 -18 -69 -77 -28 10 -19
2312 -19 -63 -65 -50 -23 -22 -35 -55 -51 -57 -51 -48 -39 -11 -23 -73 -96 -39 17 -5 -59 -53 -29 -31 -57 -23 12 -2 -54 -54 -27 12 14 -2 -28 -28 -29 2
2349BK1Nk4oJKJL7J7n2m3M0N3nm8%K2rl1L2M3lm9l9K3N4%j3k8k9NJ1L1mroLk3
2387a8oM6L4k6q4J1N2J9j8oJ5ql6jO1J1l3l7J5K3NJ9%k8k2RJ9J6m%k2k4oL1M8
2422E5j3m2j9K3K4j0LJ7j4n7OL8K4nj7k7lJJ9K3qk5j7RJ5J0K8Kl9j9PL6J6j2r
2457B0j0j1%K6K6qk7k4K8K1LOj7j3rRL0nLj4k2kJ9L2lk1k7PRJ2kRj0m5kK9L8o
2495D9l7k1PRNK4Ll3j9j0J8J2J7Pl2l4MN2J1k0j6q%kKM2J0n0m5J7N5Pk2j5jo%
2532b0K4MNj9j1j0J2J4K5k1n5JL3K3k2k2LJ6l3k0N2M6m7n6J2L2K2k4%j6jKoL3
2566b4nQl1j2oL6M3j8m3j3K1J7%j6L2kk5k6J9O8ln1k2J6L9NrNNj2j4KJ6L9pn7
2602b5j2K4L6J8l4k1QQjmJ9J8k8l9nN9J5ml7j6J6J4J5j1Prqk3J5N2J6m8m9J8L7
$$ plain form
2349 2 23 28 4 -2 -1 1 2 39 56 4 -39 1 54 49 1 1 23 14 -17 15 58 55 6 -33 -10 44 44 31 3 -26 -21 -10 21 17 8 2 5 -18
2387 -18 -24 22 56 30 -54 -43 9 28 10 4 19 11 -25 -26 35 46 13 -24 -9 14 19 38 38 10 -12 -3 16 32 28 28 6 -18 -24 7 55
2422 55 42 0 -19 4 28 18 21 38 24 -33 -27 11 35 30 13 -14 -17 -16 3 26 18 -7 -24 -15 0 10 38 40 1 -18 -11 25 41 29 20
2457 20 10 -1 -1 25 51 43 16 -8 20 41 44 50 33 20 11 20 50 45 48 34 12 10 29 61 58 37 10 17 26 38 36 45 35 -10 -12 17 55 49
2495 49 12 -9 -2 7 12 36 39 6 -13 -23 -5 7 24 31 -1 -35 -31 21 32 12 -4 -12 -12 -14 -12 30 40 -10 -55 -38 17 24 2 -13 -14 -20 -20
2532 -20 4 8 13 -6 -17 -27 -15 -1 24 3 -52 -51 -18 5 -17 -39 -36 -20 -53 -73 -21 25 -22 -78 -66 -34 -12 -36 -36 -52 -53 -51 -57 -24
2566 -24 -29 -21 -52 -64 -70 -34 9 -9 -52 -65 -44 -27 -27 -43 -11 -13 -38 -64 -45 23 20 -31 -53 -37 2 7 -2 3 8 -4 -18 -16 0 39 32 -25
2602 -25 -37 -13 23 41 7 -14 -6 2 1 -3 16 34 6 -33 -38 21 36 32 -5 -21 -5 9 24 13 20 11 3 -20 -5 47 63 15 -34 -16 21
2637B1J7j2mjjj3j4M1L2om7k1J9M0J4k5l4RJ8q%J1J1j2l8j6O1L2l5m5kJ6J8lj3
2672A0J8ok3k3L4L0rj3o0lM7K4ml6J5Rk4j5K5N3mo8l7M8N2Jl1j8J7J1j1j0K4J1
2706C4j4k8j2K7M1rk8j9J9K9j1l2J6L6k3l0rN0K0l4m3J3N1Qk9j5OkrpJ1J2J4l2
2740Al3J4M8J3l5l9J2L1pk5K6L6j1o6k1O5N2k2o1kM1Rk9KKJ4Kk4nJ9L5k3l0l1
2774d2M8M1k9o0J2O0j1n5LN2Oo1l8N4N8k1m8j6J4RNRl0J5j4jk2KM7K5n5o1K9O5
2808a0nl2qM9rn4j3O9L4m9l6QN6ql0J4kpK1kmnJ8Jk3k6O5K5m2n8MP5J5m8j2M0
2844A1Om1l5P5L4k7n8lL5MQjKj6JrNRK5Om5l5M6N7k4m0k4M8J7l1j8L8L1m3l1L2
2880IL8Km1j1K6J0jLm%KJj2J3J2Ql0j8jM2K5l8l7K2J8k5j0L0L2l7m2qM8L1l5k1
$$ plain form
2637 21 38 26 22 21 20 7 -7 34 66 60 13 -8 11 51 65 40 6 15 33 25 25 36 47 35 -3 -19 42 74 39 -6 -8 8 26 23 10
2672 10 28 22 -1 -24 10 40 31 18 -42 -45 2 26 22 -14 1 10 -14 -29 -4 49 45 -23 -60 -12 40 41 10 -8 9 20 9 -1 23 34
2706 34 20 -8 -20 7 48 39 11 -8 11 40 29 -3 13 49 26 -4 -13 37 57 23 -20 -7 44 52 23 8 14 12 3 -4 7 19 33 1
2740 1 -32 -18 30 43 8 -31 -19 12 5 -20 6 42 31 -35 -56 9 61 39 -22 -24 17 26 -3 -1 1 15 17 -7 -12 7 42 19 -11 -42
2774 -42 6 47 18 -42 -30 30 19 -36 -33 19 25 -36 -74 -20 38 17 -31 -47 -33 -24 -19 -10 -40 -25 -39 -40 -62 -60 -13 12 -43 -104 -75 -10
2808 -10 -15 -47 -55 -6 -15 -69 -82 -13 21 -28 -64 -56 0 -8 -38 -24 -26 -33 -12 -14 -18 -23 -5 -4 -27 -53 12 37 -5 -63 -59 16 31 -17 -29 11
2844 11 17 -24 -59 16 50 23 -35 -38 -3 1 9 8 10 -6 -5 -14 -9 0 25 31 -14 -49 -3 54 30 -10 -34 14 31 0 -18 20 51 8 -23 9
2880 9 47 49 8 -3 23 33 32 35 31 31 33 34 22 35 47 55 25 7 6 48 73 35 -2 20 38 13 3 33 65 28 -14 -22 26 57 22 1
2916ANL%mRJ0pj4j9%K8J3jm2j2L7K8k6j3J0K7k4k3J6M4j9k5k8K2M4j3j8rkQQL
2953A7QlOl5j4K9L6Qm9k2QL2Jj4MK0j6m0j3N5J4l3k3kK5NpklJpMKJ1J8j3l9jM7
2992A5L1l4l0NM3k4j5J2K6j0l8j1M8J9pl6MP%J1Nlj4j8J9rJ3J6Pl4l2J3M7nj8
3027Cj6J0jk6LL3J5m3k1J9K8lk4j1Oj1J3jK5k7J0qpKRJ6nl8OL0J9k6k0K7Pm1J7
3064c1L2J3l0k8PJ8J5Rp%k4qJ3J4J6j9pqnJ1K0Rl1j4J0ROj2J8pk5KJ0L3j2j7K
3101a8LlJ0J%Kj1mJ3J7Lj5Ok1K0J4J6lk9J5oJJ0J2J0k3qKL6jmj9J1k0%J3K3j2
3139D1j1p%NL%j0rpJ9KlJMj9j3J9K5Jj8j9kJ7%mMnjj0jJ1NJ4k3j1jK9Mj2j5oJ4
3181A1Lj2J3J3ll1J9J0J6k2m%jlpJ4Jj8pLKJ4%j3jpNK0qj9MJ0k8PJ3J7j1l4J1
$$ plain form
2916 1 6 9 9 5 14 24 17 3 -16 -16 12 25 24 -18 -30 7 35 9 -4 6 33 9 -14 2 46 27 2 -26 -4 40 27 9 0 -2 6 14 17
2953 17 25 22 28 -7 -21 8 44 52 3 -19 -11 21 22 8 12 32 16 -24 -37 18 32 -1 -24 -26 -1 4 -3 -5 -8 -7 -14 -10 -8 3 21 8 -31 -32 15
2992 15 46 12 -18 -13 30 6 -9 3 29 19 -19 -30 18 37 30 -6 -2 5 5 16 21 18 4 -14 5 -4 9 25 32 -2 -34 -21 26 21 3
3027 3 -13 -3 -4 -30 -27 6 21 -22 -43 -24 4 1 -23 -34 -28 -39 -26 -27 -2 -29 -19 -27 -34 -32 -23 -7 -12 -50 -44 -14 5 -21 -41 -14 -7 -48 -31
3064 -31 1 14 -16 -44 -37 -19 -4 5 -2 -2 -26 -34 -21 -7 9 -10 -17 -25 -30 -19 1 10 -21 -35 -25 -16 -10 -22 -4 -11 -36 -34 -24 9 -3 -20 -18
3101 -18 -15 -18 -8 -7 -7 -5 -16 -20 -7 10 13 -2 4 -17 3 17 33 30 1 16 10 11 21 33 43 20 12 14 50 49 45 26 37 17 17 30 53 41
3139 41 30 23 23 28 31 31 21 12 5 24 26 23 24 28 9 -4 15 40 41 23 4 2 19 19 15 19 14 13 3 2 13 18 32 9 -2 -3 26 30 18 3 -3 11
3181 11 14 2 15 28 25 -6 13 23 39 17 13 13 12 9 2 16 17 -1 -8 -5 -3 11 11 -2 -3 -10 -5 15 7 -12 -8 2 -26 -19 -6 11 0 -34 -23
3220b3K2Oj5j7RJpNJ1RJj2j0J4pK3oj6OmK0pnOKlppM0j0k6rJ8J8lj6LLpjJ0J9
3262B8j0j2j9JJ4nRj2rpPLjRjrk0LK8J7k0k3J3J1lrJ6Knl0J9MJ8j6j5rJ2J4Nj4
3302a6JJ3j5jj1M1mk6kj8L2J6j2k8OJ3Lj9J0J4J0k4k1J1K2J3rk7JJ1P%k5K1Jj0
3338b2j5%M2k1j0j0J7J6Ok2OKNLj1J4K3j5k4rK7L4j3j2j8J8J4%k5J6J9j0l0NL1
3373C1K0l3j1JJ6RpmNKk8j9K2M2Lk7l5K3J8Nk5%J3%j1pPJ9Lk4j9J5J6Kk1mK3K
3411B2j5qRJ6nk4pM3K0k1l1PJ5JLNlNk1qJ6J4J5k6l2RJ8J4j8k1kK3Jk8PL1ql2
3449a6j5K5K4j8oj2OQk1NJ8LqooPJ5Lm2J1J2K4qk2rK9nl6J7M0J0m1j9K1K8Jj7
3486@KJlj1JJ9qOj4j3RJ5J6j8l0J2K6kl6ML7pk7k0M5Rk1k5J2L0ml3kJ3kjKkK2
$$ plain form
3220 -23 -1 5 -10 -27 -18 -17 -24 -19 -8 1 2 -10 -20 -6 -13 10 4 -12 -6 -10 10 3 -2 4 6 3 -4 -11 29 19 -7 -16 2 20 17 1 4 7 0 -1 9 28
3262 28 18 6 -13 -12 2 -3 6 -6 -15 -22 -15 -12 -13 -4 -5 -14 -34 -31 -3 14 -6 -29 -16 -5 -8 -17 -1 1 -4 -34 -15 -11 7 -9 -24 -33 -21 -7 -2 -16
3302 -16 -15 -2 -17 -18 -29 12 8 -18 -20 -38 -6 10 -2 -30 -24 -11 -8 -27 -17 -3 7 -17 -38 -27 -5 8 -1 -28 -27 -16 -9 -9 -34 -13 -12 -22
3338 -22 -37 -37 5 -16 -26 -36 -19 -3 3 -19 -13 -11 -6 -3 -14 0 23 8 -16 -25 2 36 23 11 -7 11 25 25 0 16 35 25 -5 0 31
3373 31 51 18 7 8 24 33 26 22 27 29 1 -18 4 46 49 22 -13 10 28 33 8 8 21 21 10 3 10 29 32 8 -11 4 20 22 1 -3 20 22
3411 22 7 -1 8 24 19 -5 -12 31 51 30 -1 6 21 22 25 30 27 32 11 3 19 33 48 22 -10 -1 17 31 13 -8 -10 13 14 -14 -7 24 16 -16
3449 -16 -31 -6 18 0 -6 -18 -12 -4 -25 -20 -2 1 -7 -13 -19 -12 3 6 -36 -25 -13 11 3 -19 -28 1 -4 -40 -23 17 27 -14 -33 -12 16 17 0
3486 0 2 3 0 -11 -10 9 1 7 -7 -20 -11 4 20 2 -28 -16 10 8 -28 -24 13 6 -21 -41 4 13 -8 -33 -21 9 5 -28 -30 -17 -19 -20 -18 -20 2
3525Brpj1lL1J0j1n0L1K2J3l0j0K6K1m4j3K3L2nk3pJ5Nk2J0J2Krj3l%J3K4l7j3
3561b8J3K3%l9JK4J3k9j4QL7k1l4K1J4Lk3qJ9mMOj0J5j4Rn%QK6k6k2J4K4Qj9q
3598a4K5Kk1%MM0j1l4J2J5pPkJoNj1J5j8J4Llj5nL5qk3j6L5Jj2nMK3k6j7J5K7
3636B9j0k9OKK1nK%n%nOLjJ0nj8RK3J9k5j2J3Lj2rJ5J7k8j0LK6Nj8kMJJm%Lj5
3678HRLJj6J0j4j3MK2%k1j2NJ3j0mMJ2Kl0KRK3k0mNnmjRjJ2rmjlQJ9k5oJ7oJ0
3721bk0J0J2ooJ1J2Pk7j8K6J7j8mOlkqmJ1PpolqRRnOj1MRk1J4nj0Oj5RK9j3j4
3763b2LJ3jJjmK0j8rJ8NqjpKJ3nLkNPj2KrK2Nj7KlJ8j0lpPrO%JKolj0KOnrRoq
3812b3J7%mMKpoONlqqOK2j3PrKlJ5JjNj1qPQmJ2qJKMJqJ4j7KMKKpQkkrjNOjpN
$$ plain form
3525 2 -7 -14 -25 -28 3 13 2 -48 -17 5 18 -12 -22 4 25 -19 -32 -9 23 18 -5 -12 3 8 -14 -4 8 10 1 -12 -15 -15 -2 22 -15 -28
3561 -28 -15 8 8 -31 -30 -6 7 -22 -36 -28 9 -12 -46 -25 -11 -8 -31 -39 -20 -24 -20 -14 -24 -9 -23 -14 -19 -19 -11 15 -11 -33 -19 5 13 -6 -14
3598 -14 11 13 -8 -8 -4 36 25 -9 3 18 11 18 16 17 11 16 5 20 2 16 19 16 1 -4 31 23 0 -16 19 20 8 3 7 30 4 -13 2 29
3636 29 19 -10 -4 -2 19 14 16 16 11 11 6 12 15 14 24 19 1 10 33 52 27 15 28 31 19 10 25 42 14 4 7 33 38 20 18 22 23 24 20 20 23 8
3678 8 17 20 21 5 15 1 -12 -8 14 14 -7 -19 -14 -1 -11 -15 -11 1 3 -27 -25 -16 7 -13 -17 -12 -17 -21 -22 -13 -14 -2 -11 -15 -16 -19 -11 8 -17 -23 -6 -12 -2
3721 -2 -22 -12 0 -6 -12 -1 11 18 -9 -27 -1 16 -2 -6 0 -3 -5 -13 -17 -6 1 -6 -12 -15 -23 -14 -5 -10 -4 -15 -11 -2 -23 -9 -14 -24 -18 -33 -24 5 -8 -22
3763 -22 -19 -6 -7 -6 -7 -11 9 -9 -18 0 5 -3 -4 -11 -9 4 -1 2 0 5 12 0 2 -7 15 20 3 5 2 20 10 7 0 7 -2 4 4 5 7 1 -2 -12 -10 -4 -9 -18 -9 -15 -23
3812 -23 -6 -6 -10 -6 -4 -11 -17 -11 -6 -9 -17 -25 -19 3 -10 -3 -12 -10 -13 2 3 2 7 -4 -12 -5 3 -1 11 3 4 6 10 11 3 17 0 2 6 8 10 3 11 9 7 -2 -3 2 8 7 0 5
3864EkPj2kQj1M%K6j2j7QOqONmkj0J9Kk0LKK7k6J4j1M2j4j8LJ4ljj5NJ5j1kQp
3906B1MpKlOOkj3LJ6j4J0j9J0Pl4NJ3J1ooj1LJ2j1klOqJ4j2KlKjoKqK3j7jkJ7
3949Fpj6J4J1j9KOjJ3j4r%K5j7JLj2J7nNqPpqj9NK8jj4rmJ1qj1J7jQj5oJ2Pj2
3991b5JpOJ6j2jnJ1Okj6%K2rj6Rj2M5k3pQLrlPRjjJnJ5pN%j2J2QoPj2J6j1j5R
4035aLJ0j8JPOmrlJ1j4j0kK3Rj1j8J1OMJj2rJ2pL%J0J2pk8JK0Rj9PKJ6jj2LJ7
4077A9mk4JJ4J2lj4nK2lRk5KQMj8LJ3jMk6jJ8Ook0kNK3k1lJ0Mj2rJK0J0j5j0R
4118eKjJoPJ5k8jJ3J5Mjk3J5QPj6pJ7LPl1J6K5ok0nJ8J8nk3NJJ5j6oMPlj8PJ3
4160B2Mj5krOJ3nj1KJ1mj6oK5Mk8lJJ8j1nNK0rj8lJ0QMr%jJ4j0oMOJ0ok1nL1j
$$ plain form
3864 5 3 10 -2 -4 4 -7 -3 -3 23 11 -6 2 8 0 6 11 7 5 -5 14 16 -4 -1 1 28 2 16 5 47 33 15 18 32 29 28 13 18 33 22 20 28 21
3906 21 25 18 20 17 23 29 27 14 17 33 19 29 10 20 27 -7 -2 11 22 16 10 -1 2 14 3 1 -2 4 -4 10 -2 0 -3 -1 -2 -8 -6 -14 9 -8 -9 -11 6
3949 6 -1 -17 -3 8 -11 -9 -3 -4 9 -5 -14 -14 11 -6 -5 -2 -14 3 -2 3 -5 2 -5 -13 -32 -27 1 0 -14 -23 -27 -16 -24 -35 -18 -19 -11 -26 -32 -20 -13 -25
3991 -25 -24 -31 -25 -9 -21 -22 -27 -16 -10 -12 -28 -28 -6 -15 -31 -22 -34 11 -12 -19 -11 -8 -17 -20 -13 -4 -5 -6 -5 -10 5 -2 3 3 -9 3 11 5 12 0 16 5 -10 -1
4035 -1 2 12 -6 -5 2 8 4 -5 -8 3 -11 -21 -23 0 9 -2 -20 -9 -3 1 2 -10 -19 -7 -14 -11 -11 -1 11 4 -24 -23 -3 6 -13 -6 -4 12 11 -1 2 19
4077 19 15 -9 -8 6 18 15 1 -4 18 15 24 -1 1 9 13 -5 -2 11 10 14 -12 -13 5 11 5 -15 -17 -12 11 -10 -13 -3 1 -11 -20 -19 1 11 -4 -14 -5
4118 -5 -3 -4 -3 -9 -2 13 -15 -16 -3 12 16 15 -8 7 15 22 6 -1 16 19 26 -5 11 36 30 10 5 23 41 36 13 18 19 34 18 12 16 23 20 2 9 22
4160 22 26 11 9 0 6 19 14 3 5 16 12 -4 -10 15 19 -9 -12 -11 7 -4 -9 -4 16 7 -11 -14 -4 4 8 -1 -1 -2 12 2 -4 0 6 16 10 -11 -16 15 14
4203A4j9nK5lmk7QK0j7L%Ljj5mNPOj3j0LOMj1lkK0%l0J0K6lpk1OJ0Pk2lK3pm%
4246b5J4Lj0J1JnJ2Kj6JMRjj4NJ5Rk2JJ3Oj7LJJ7Mj6j1JPj2OJ5jj6OmKjMJj1j2
4289b1K3lj4oK3J1k8nJ6K2k4pK2%oj0JORqQjPjj1%MkQJ3k1j4J9NJ3k5J2J7j6j2
4329D%K4Kk5LPoJpJ1orjR%JqLj0JKN%j6KJ4j3nJ1J2J0l2pK9lrj1J8O%OMnPj6O
4375ImJ1j%rrJ4J1j5nRJ1j7k%J6Qj3lJ0kjj2Rjj1mMoN%qQqJ2ojk1J4RlNr%Qj5
4421a3KJ6J4j5mK%MqJ7j0JNJNkj0nL%K3j1qlJ1lojJ3j7Oko%J0omJj9J3QjmJpk1
4467c0K8j8Pmj0kJ5jojkMLjJJ5j1Kj7J5%KOj4PonNJ3nQj1J2JqJ3pMj0J5oJmJn
4512flMjJJmNMj6J7lJ6l4JJ0%RJrlqRj0K0j5%%LPOkj1NlRJjQj1K6rlMKNp%LKN
$$ plain form
4203 14 -5 -10 15 12 8 -19 -11 9 -8 -5 -5 -2 -3 -18 -22 -17 -10 -4 -17 -27 -24 -18 -14 -25 -28 -30 -10 -10 -40 -30 -4 -7 -14 -35 -29 -19 -12 -34 -37 -14 -21 -25 -25
4246 -25 -11 -8 -18 -7 -6 -11 1 3 -13 -12 -8 1 0 -14 -9 6 15 -7 -6 7 13 -4 -1 0 17 21 5 -6 -5 2 -10 -4 11 10 -6 0 -4 -2 -3 1 2 -9 -21
4289 -21 2 -1 -15 -21 2 13 -15 -20 -4 18 -6 -13 9 9 3 -7 -6 0 9 1 9 8 15 14 3 3 7 5 13 26 5 -9 10 15 28 3 15 32 16 4
4329 4 4 28 30 5 8 15 9 10 3 14 8 -1 -2 7 7 8 0 3 -7 -6 -4 1 1 -15 -13 1 -12 -17 -6 6 16 -16 -23 6 3 -6 -17 1 7 7 13 17 12 19 3 9
4375 9 5 16 15 15 6 -3 11 22 7 2 11 22 5 3 3 19 27 14 11 21 19 18 6 15 14 3 -1 3 -3 2 2 -6 2 -6 6 0 -1 -22 -8 1 -2 3 -6 -6 2 -13
4421 -13 -11 5 19 4 0 2 2 6 -2 15 5 6 11 12 17 15 5 0 3 3 26 15 7 4 15 12 6 5 18 1 7 5 -1 -1 9 3 -1 0 -19 -6 2 1 -3 -2 -9 -30
4467 -30 -2 -20 -13 -17 -27 -29 -14 -15 -21 -22 -24 -20 -17 -18 -17 -2 -13 -11 -28 -13 -13 -11 -5 -19 -12 -18 -23 -18 -5 -10 -2 -13 -1 0 -8 5 -2 2 -8 7 1 2 -2 -1 -6
4512 -6 -9 -5 -6 -5 -4 -8 -3 1 -15 2 -1 15 -19 -18 -8 -8 1 2 -7 -10 -18 -9 -19 1 -14 -14 -14 -11 -4 2 0 -11 -6 -9 0 1 0 8 -3 23 14 11 15 17 22 15 15 18 20 25
4562B5mlj0OJ0Lj5Pj3L%nNKkj6J1LlmpRNJj1jJ3j7%J2KrL%oR%p%kJ2j0ljRPmk
4610BkQnnlJ8kj4QJOqMmK0j0rmPJJqPRnj1KjQkrKM%k0J3Pj3J1j6QJ8olj9PPK%
4659Bj4J3knQlPLj3KJKQNj6J6%j2%NJ0jqpONMjlkLqlJ9j6jpJlJ7j9nqK2kj0mR
4707eJ6j3j3qJ9Kj7rJ2J2kj6QQmQm%J2j0lj0PK0J1k7rJ6jjj4KJ4mlpK2Nj7j1N
4748iKLkNojPppJ0QppqJ1Pj7oNOQMk9K9nqLrK0j0oJ4m%KlnK2j6%J5lkJ0j4jJ2
4795A1J6nk0QJ2j0%kPJlj3J0JNpOoLj5j2J8J4lj7pJ0MnMk0J8%pljJ3jj9RjK0j7
4838doKLJ9qpLJpNNQONk2MJ3nnRk2K4nmlNJ5j8o%%KOj5MMmooJ6j1mlnJ7qqOmJ1
4888cRl8J9J9j2Kj7QJ2nj1J1LK7k2j3JNNLloJ7j1J1qLRnj7QRj2J0Qj6J9Jk2J0
$$ plain form
4562 25 21 18 8 14 24 27 12 19 6 9 9 4 9 11 9 -7 4 7 4 0 -7 2 7 8 -3 -4 9 -8 -8 4 6 -3 0 0 -6 3 3 -4 -4 -6 6 -4 -7 -8 1 8 4 2
4610 2 0 8 3 -2 -5 13 11 -3 5 6 12 4 8 4 24 14 5 1 8 9 10 2 9 18 13 2 4 3 11 9 0 2 6 6 -14 -1 6 -7 4 -12 -4 14 8 5 -14 -7 0 2 2
4659 2 -12 1 -1 -6 2 -1 6 9 -4 -2 -1 1 9 14 -2 14 14 2 2 7 17 16 8 1 7 12 16 15 12 10 13 5 2 21 5 4 -3 -2 -5 12 -7 -12 -20 2 0 -10 -14 -5
4707 -5 11 -2 -15 -23 -4 -2 -19 -28 -16 -4 -6 -22 -14 -6 -10 -2 -6 -6 6 -4 -7 -17 -10 10 21 -6 -15 1 0 -1 -15 -13 1 -3 -6 -13 9 14 -3 -14 -9
4748 -9 -7 -4 -6 -1 -7 -8 -1 -8 -15 -5 3 -4 -11 -19 -8 -1 -18 -24 -19 -13 -5 -1 -30 -1 -6 -14 -11 -20 0 -10 -16 -2 -6 -6 -4 -7 -12 10 -6 -6 9 6 4 14 0 -1 11
4795 11 27 22 2 10 22 12 12 10 17 18 15 2 12 13 18 11 17 11 14 -1 -13 5 19 16 -1 -8 2 6 1 5 -15 3 3 -4 -7 -8 5 4 -15 -6 -7 13 -4
4838 -4 -10 -8 -5 14 6 -1 2 3 -4 1 6 14 20 25 3 7 20 15 10 19 -3 21 16 12 9 14 29 11 5 5 5 7 13 -2 2 6 2 -4 -10 6 -5 -9 -12 -17 0 -8 -16 -10 -14 -3
4888 -3 6 -32 -13 6 -6 -4 -21 -13 -1 -6 -17 -6 -3 24 2 -11 -10 -5 0 3 0 -6 11 0 11 3 6 15 10 -7 1 10 -2 8 16 0 19 20 -2 8
4928HMPk9%JK0qj4J%Pm%nJ4j1oQQj7Rj0mKJ8Nk0%J5j1nmK9Mrl2J7J5LkopKnjO
4974gnJ3oLkKoJ2j0oK2Kk7%%NljRPqJj4MJ1j4lJMjmMJ7k0J2nmj8J7Rm%mJ2j3K
5020a6OJ3lj5J4JJ7k6%MJ1Jj0J9ojkjQ%j2J4j0KqJ8k1PjJ4j0j5J7J0j7j9J1J2
5058Fj1k%NQKj4J2jj7RNOj3J1Nj2pJ2OpRNj5jOJJ6Pj9nK0qqkOLLJj2J1nj1J2n
5103A2j3K0omkmNnKmOmj3lJ8j0jJ0rNj0OmJ3j0j1Qn%JQj0m%PN%LPj4Pj0QMnQJ3
5150A5nmnRmnJ2j0MPJj0mKLomOJ4k2KjQL%k2J3J1k2NnQJJmOpm%OpjKO%j5J1Ql
5199fkPqOlQKrjnOJ1jnJ1jj5LnNJ0j3ROk%mlj5OMrRl%nl%J2j3kLPoj5RJ6j1nO
5249a4%J6j2j4NnJ1OlJRkpJJ2Kk0J1KJ1jj0PpOokJ1Nj0jMPnpJMJljj0J9j0qOp
$$ plain form
4928 8 12 19 -10 -10 -9 11 3 -11 -10 -10 -3 -7 -7 -12 2 -9 -15 -7 1 -16 -7 -17 -21 -19 -1 4 -16 -16 -1 -12 -17 -21 8 12 3 -29 -12 3 6 4 -2 -9 -7 -12 -13 -7
4974 -7 -12 1 -5 -2 -4 -2 -8 4 -6 -12 10 12 -15 -15 -15 -10 -13 -14 -5 2 -6 -5 -19 -15 -4 -18 -21 -20 -16 -17 -21 -17 0 -20 -8 -13 -17 -35 -18 -9 -13 -13 -17 -5 -18 -16
5020 -16 -10 3 0 -15 -1 0 17 -9 -9 -5 6 7 -3 16 10 9 7 6 14 14 2 16 6 8 0 18 -3 4 3 17 7 -8 9 19 2 -17 -6 6
5058 6 -5 -7 -7 -2 6 8 -6 6 5 -12 -3 2 8 -5 6 11 -1 -8 4 10 3 12 17 2 1 7 8 24 31 12 7 27 19 11 9 15 18 21 22 10 21 16 5 17 12
5103 12 -1 19 13 9 7 3 8 3 5 1 7 3 -10 -13 5 -5 -6 4 -5 0 -10 -4 -8 5 -5 -16 -8 -13 -13 -12 -4 -14 -18 -18 -11 -6 -6 -3 4 -10 -3 -13 -5 -1 -6 2 15
5150 15 10 6 1 10 6 1 13 3 7 14 15 5 1 3 6 0 -4 2 16 -6 -4 -5 3 6 6 -16 -3 8 -14 -9 -14 -6 -5 -4 -8 -2 -9 -13 -13 -7 -14 -15 -13 -7 -7 -22 -11 -3 -6
5199 -6 -8 -1 -9 -3 -6 2 4 -5 -6 -11 -5 6 5 0 11 10 -5 -2 -7 -2 8 -5 4 10 8 8 4 1 -14 -8 -4 -13 -4 -7 -7 -12 -15 -15 -3 -16 -18 -15 -8 -14 -29 -20 -4 -15 -20 -14
5249 -14 -14 2 -10 -24 -19 -24 -13 -7 -10 -9 0 -2 -9 -8 4 6 -14 -3 -1 10 9 -1 6 -1 5 -1 -3 8 13 3 2 6 13 8 1 2 6 7 4 3 -7 12 2 -6 0 -7
5295gLNJ4k2NjPj7ONMj2RnJ1j2KJ4j0LLkKMj3J6qmJ6omQMrLKpkJ0nqJ3Jkj1LJ6
5342B2kmj1NkRop%J4nj1qRkNj1J2mL%j0KRj5MNj2J0j1jJ0JNKj5J5QrqJ7j1lj0
5386a1J1PnjjQMknlOmjJnpJ1Mj0k%Pj6NMj0NJ2j7K4j6j8RpJ6Kj3KMKJkJl%nJ3
5433eJkpNklJ4Oj2LJ1oo%LnMN%kP%oQLqj3J9k3K5qmj1J6Mj4lMNj1LojJ9k2LNN
5481bpPj3JjMj1PJ3%j3%pK5l0PoK1J3j2j9PK1krlJ0KJnJ0kjqkJ0kLmjnJ0J2k4
5525eK2j9PmmNLj1JlnJ5%j0lPlJoRNkj2J0%LJ4k0%lQoRjKQj2pK8olqRNLj4J0q
5573IoMkPlNmrLRJ2j0joJj2j1K3Ok1MLMj3MKLrnJ1nJNmPj3QLqJLKqJlJ1kJ1j0
5622bOQj1Nk0J9OnJKjmLkoPkL%j1QMj3oJ6nj5LROj7pJ0%Qqlk%Pj3kJ7j5J5j0o
$$ plain form
5295 -7 -4 1 15 -7 -2 -3 4 -13 -7 -2 2 -10 -1 -6 5 -7 -5 9 -1 2 5 3 5 9 -4 12 4 0 16 10 6 14 18 9 12 14 7 5 15 10 2 15 16 14 3 6 22
5342 22 20 16 5 10 8 17 11 4 4 18 13 2 -6 3 1 6 -5 7 3 6 6 -4 -2 7 -8 -4 1 -11 -1 -12 -13 -3 -2 3 5 -10 5 13 4 -4 13 2 -1 -11
5386 -11 0 7 2 1 0 8 12 10 5 2 8 4 3 4 -1 -8 3 7 -3 -5 -5 2 -14 -9 -5 -15 -10 2 -15 9 -7 -25 -16 -23 -7 -5 -18 -16 -12 -10 -9 -11 -10 -13 -13 -18 -5
5433 -5 -4 -6 -13 -8 -10 -13 1 7 -5 -2 9 3 -3 -3 0 -5 -1 4 4 2 9 9 3 11 14 6 -7 12 -11 14 6 2 -9 7 11 -3 -6 -2 3 -8 -5 -11 -12 7 -15 -12 -7 -2
5481 -2 -9 -2 -15 -14 -15 -11 -22 -15 -2 -2 -15 -15 -22 3 -27 -20 -26 -5 8 -4 -23 -16 5 3 -6 -9 1 3 4 -1 9 7 6 -2 -4 6 4 7 3 2 -3 7 19 -5
5525 -5 17 -2 5 1 -3 2 5 -6 -5 -8 -13 2 2 -8 -11 -4 -7 -6 -12 -3 2 0 -12 -2 -2 1 15 -5 -5 -8 0 -6 3 2 4 12 0 -7 21 15 12 4 13 18 21 7 17 9
5573 9 3 7 5 12 9 14 10 1 4 13 25 15 14 8 9 -3 -14 9 15 -6 -2 1 5 -8 -4 -2 1 -8 -13 -2 -7 -6 -1 -5 2 -11 -3 0 -8 -7 -4 -2 -10 -9 -12 -1 -3 8 -2
5622 -2 4 12 1 6 -14 5 11 6 7 9 8 4 7 5 -1 6 4 7 7 -4 4 8 -5 -11 5 0 -15 -12 -3 3 -14 -21 -11 -11 -3 -11 -14 -16 -16 -9 -22 -24 -7 -22 -7 -17 -23
5669b3J0%LmoOQNqoJ2qKpK1Rk5LKOmQnN%j0kJ2JmlMK%jrqJ2oLOj3Rljj1OOLno
5720a4K4j9j4PPJj1%J5j4NKlKOMlJLLJj2NOpJ5KljLkjqJ7rLMj8PllJ2LqloJ2q
5768@MnpnRllKjJ2j5%J3rNj3NK2j6j3QJLj7J2OkJ0knlJ0nnOjRkl%J3Lj3PPLrm
5816InJ9k0NMJ7pj9J5j4pK7j0jj1j1%J0kPkj%j1RJ7j5j2MOMj5QpRPlOlpJRqPj
5861HmJ0Mlj1J8rNMj2oPNqmJ9prlkJ3%j5jJ3j5MLplkpJ4j6jLJ6j5kkJ2jj6J5m
5906a2kKjKk%OOrmJ7mkmKJ6oklJ4llrPKmnPNKj0J5rkj0PnOLj3QlPj6Lj0J1%Jj0
5956a4LKMJmkNnQnNqPkMlkRjmjJ0j4NJ3j3J1j3PNjnJRj0Oj%lPjmoklJ0%MqJkM
6008DpNmMj8J6lrkOPJ%nKnPj7J6rJ5kKk1K3j3NkJ4lqOj1K0j0J5j6J5nloMJ2rn
$$ plain form
5669 -23 -13 -13 -10 -14 -20 -14 -6 -1 -9 -15 -3 -11 -9 -16 5 14 -11 -8 -6 0 -4 4 -1 4 4 -6 -8 4 5 1 -2 2 4 4 3 -6 -14 -2 -8 -5 1 -12 -3 -6 -7 -18 -12 -6 -3 -8 -14
5720 -14 10 -9 -23 -16 -9 -8 -19 -19 -4 -18 -13 -11 -14 -12 -6 -2 -5 -4 -1 2 3 -9 -4 2 -5 10 12 9 8 11 9 8 0 17 8 11 15 -3 4 1 -2 10 13 5 2 -4 8 0
5768 0 4 -1 -8 -13 -4 -7 -10 -8 -9 3 -12 -12 1 -8 -3 -16 -11 11 -5 -18 -10 -9 -6 -23 -11 -5 -7 3 1 -4 -7 3 -2 -7 -1 -2 7 5 2 2 15 18 5 12 19 22 13 9
5816 9 4 23 3 8 12 29 22 3 18 4 -3 24 14 13 2 -9 -9 1 -1 6 4 3 3 -8 1 18 3 -9 -5 1 5 -10 -2 -9 0 7 4 10 7 0 1 10 2 9 8
5861 8 4 14 18 15 4 22 13 18 22 10 4 11 16 8 4 23 16 7 4 2 15 15 0 -1 12 -3 1 4 -3 -6 -8 -15 -1 -17 -18 -15 1 -14 -16 -18 -6 -7 -23 -8 -12
5906 -12 -14 -12 -13 -11 -13 -13 -7 -1 -10 -14 3 -1 -3 -7 -5 11 5 3 0 14 11 8 -1 6 8 4 -1 6 11 13 3 18 9 7 -3 4 -1 5 8 -5 3 0 7 -9 -6 -16 -5 -5 -4 -14
5956 -14 -11 -9 -5 -4 -8 -10 -5 -10 -2 -7 -2 -10 -3 -5 -1 -4 -6 3 2 -2 -3 7 -7 -2 11 -2 9 -4 3 8 7 2 3 12 2 8 7 7 4 11 10 6 0 -2 -5 5 5 9 1 2 0 4
6008 4 -3 2 -2 2 -16 0 -3 -12 -14 -8 -1 0 0 -5 -3 -8 -1 -18 -2 -11 4 2 4 -17 6 -7 -2 -4 10 7 -1 5 -6 14 4 19 3 18 13 10 4 8 20 11 6
6053Fj0J7j3J7lpkLlKqJ2Mj3mqJ2mkJkmJ4k1J0NJoqMKLPKnj1J3%jKMj4L%JJ7k2
6100iJ1LQj5KjQLoJ5lj1Jj0KKjRj5J2KKqKj0QnJ0nqOnllJ%mj%oJ3pLQlkNkLrM
6151ipMJ5j1%JJ1o%kJ2moP%Klj5PJ2j0mnJ0J2j5MKj8J5Lj1kJnJ1j0LLPrmNkJ0
6196anj3OJ0j2rJ7%pJ6j7Mj1J4%%nLJ4mOlkRrMNmrJ0KPp%Qjj2oLOQj0kNnjKqj
6245ePlLNJj4J2j7NPMnj1J0KJj4OOj4PKQ%j5NLpLKJ0pOJ0j0j4K8kmj6J2jJPj4
6290@J7mk0QKJ9rj0lQnnJ0j0Rj3mNLPrkRjKj4MpRNjmlk%Pj6QJ2Lj7J6qMQjKPp
6339IlqJ0J3j9QMoJ6pkrJ1pMLl%okJ3rmrKjJ0lrk%Rj1LlMQj2rQoNkOj3ON%oLJ6
6390Ej4%mJ1JmoK2k3PK0j1qK0j0lLLrpJ4Mj3J0n%JpOqkpOJ1mj1OoMLjnJj6J1L
$$ plain form
6053 6 -4 13 0 17 14 7 5 8 5 7 -1 11 15 2 -2 -10 2 -2 -4 -3 -5 -9 5 -16 -6 -1 0 -6 -14 -10 -8 -5 2 4 -1 -12 1 1 0 2 6 -8 -5 -5 -4 13 -9
6100 -9 2 5 13 -2 0 -1 7 10 4 19 16 5 6 -4 -2 0 -1 8 -7 5 7 9 1 3 -7 1 -4 6 1 -7 -1 -6 -9 -12 -11 -11 -15 -16 -16 -22 -9 -16 -13 -5 -8 -10 -5 -7 -4 -13 -9
6151 -9 -16 -12 3 -8 -8 -7 4 -2 -2 -4 8 4 -2 5 5 7 4 -11 -4 8 -2 -6 -11 -1 11 -4 0 2 -16 -1 2 -9 -11 -10 -15 -4 -14 -11 -8 -1 -10 -14 -9 -11 -1
6196 -1 -6 -19 -13 -3 -15 -24 -7 -7 -14 2 -15 -11 -22 -8 -8 -8 -13 -10 4 0 6 3 1 10 1 5 10 6 -3 7 9 16 9 9 17 16 4 -2 1 7 15 5 3 8 3 2 4 -4 -5
6245 -5 2 -1 2 7 8 -6 6 -11 -6 1 5 0 -11 -1 1 2 -12 -6 0 -14 -7 -5 3 3 -12 -7 -4 -11 -8 -6 4 -3 3 13 3 -11 17 15 11 -5 7 6 7 14 0
6290 0 17 13 -7 1 3 22 13 3 0 8 3 -2 8 -2 7 -6 -10 -5 -2 5 -4 -6 3 2 4 -10 -6 -13 -4 1 0 -4 -7 -9 -9 -2 -18 -10 2 5 -12 4 -4 0 8 7 9 16 9
6339 9 6 -2 8 21 2 10 14 8 24 17 15 6 17 10 14 17 14 14 8 6 19 10 6 -3 -1 -2 8 5 -4 -6 -6 3 -8 -5 -8 -4 4 -8 -17 -9 -15 -10 -12 -6 -19 -13 -8 -8 -14 -11 5
6390 5 -9 -9 -13 -2 -1 -5 -11 11 -12 -5 15 4 -4 16 6 3 6 9 0 -7 7 11 -2 8 3 3 4 -3 3 -5 -7 -14 -8 3 -1 -12 -6 -12 -8 -5 -6 -11 -10 -26 -15 -12
6436a2LnlJ3j4jLRkO%nNKJ0k3OJ6j3KLPoKJ0loKJ3j0lJ5j0lJ2j3OmoLlpOMNqn
6483bjRjJkj2J3k0QkKoKQJL%mj1pJ9mj6J9j1QPlM%nqJ3JrJ1MM%LplJ4jJoj0LN
6532A2m%j6J8Pj5MLkj0JJ5j1rJ4nm%kKJJl%lkqLK1j5mLJ2Jp%NoL%JMLmlJ3omJ4
6581A8kj4K0pqj1OQj1OrJ2%oJ1j0nPm%lkJQnrLO%omj9J6LkkJ5mj3J4lKknkJ3O
6628GnnmJ1qOPJjpLN%MqrJ2%nJkJnjKOqKQnlKMj2mRNj7J1p%kj3QMNqoJ2pkJ8q
6681hqKJ0j0jJ2rONKnJ1%nMj3KORj7J5k4J4PoQj8K7j6NjLJnj0LJ0K%%Lj8LJ%O
6727Cj2qJJ0JLrnJ3Ok0J3MjKnJkQkpmJ5LjjjLj0J2mPmj0J3qKmK0j2%nLmOkj4K0
6775A4pk4J5KMkmLj0J0MjpnPj2PRj2lnNMrRjJ0lkmoJ1pOJJKj0PQLRqMrK0j7Jj0
$$ plain form
6436 -12 -9 -14 -17 -4 -18 -19 -16 -7 -9 -3 -3 -8 -3 -1 9 -14 -8 8 -5 -3 0 7 1 3 13 10 4 6 19 9 6 21 11 8 20 7 13 9 3 6 3 -4 2 6 11 3 -2
6483 -2 -3 6 5 6 4 -8 5 -15 -7 -9 -7 -13 -11 -3 -2 1 1 -3 -14 -21 -2 -6 -22 -3 -14 -6 1 -2 2 2 -3 -11 2 3 -6 5 9 13 13 16 9 6 20 19 20 14 4 7 12
6532 12 8 8 -8 10 17 2 6 9 7 -3 -2 13 2 -7 7 2 -2 -2 -4 -2 -1 0 -3 -3 -6 -8 -16 -13 8 -7 -11 -8 4 5 -2 -2 3 -3 0 0 1 5 8 4 1 14 8 4 18
6581 18 16 2 22 15 7 -4 2 10 -1 5 -4 8 8 2 13 3 -2 5 1 1 -2 -4 -3 5 0 -9 -6 0 0 -6 -10 -29 -13 -10 -12 -14 1 -3 -16 -2 -5 -3 -5 -10 -12 1 7
6628 7 2 -3 -7 4 -4 2 9 10 9 2 5 10 10 14 6 -3 9 9 4 5 3 4 -1 -2 0 6 -2 0 8 3 0 2 6 -6 -10 -1 4 -13 -2 -9 -9 -11 -24 -16 -12 -7 -15 -21 -9 -16 -18 0 -8
6681 -8 -16 -14 -4 -14 -15 -3 -12 -6 -1 1 -4 7 7 2 6 -7 -5 1 10 -7 8 -16 -2 5 -1 7 -11 16 0 5 4 7 8 3 -7 -4 6 8 8 8 11 -7 -4 -3 -3 3
6727 3 -9 -17 -16 -6 -5 -2 -11 -16 -3 3 -17 -4 0 -1 1 -4 -3 -5 3 1 -6 -10 5 8 7 6 5 8 -2 10 6 13 9 -1 12 4 6 2 22 10 10 5 8 4 10 8 -6 14
6775 14 7 -17 -2 0 4 2 -2 1 -9 1 5 4 -3 -8 -1 -13 -6 3 -9 -12 -17 -12 -8 -17 -8 -9 1 -2 -4 -8 -14 -3 -10 -4 -3 -2 0 -10 -3 5 8 17 9 13 4 24 7 8 -2
6824bJ9j9J6JOmlj2lJ3qNj5J2pqMrJ9OpJj0MmnMJ0j1rJ3PpPj2MmOjoJ0MrnRmJ0
6871FMjknKlM%qJ7JlKqJnRj4MJj3K0nNppL%l%pJ3Nmj0%j5J7Kpp%J3nqJ0koKJJ7
6922Dj0pJ4%jqjOOj0jMJ4jj1mPjNRmrJ1KqKJJ%j0J2j0Qj2JONpKQj0KmJj2NMlO
6971BLjJmkJQjj4J0Oj4mRKj0nK2K%llRnloJ4pNnRKNj1Pkjj1JJ3j1lKJ2j2L%j6
7019fRjLq%nNJ3j5OnJjljPj1jJ3mj2LJ1OqjPKRj6J7q%%lLRKk0PNnJQj%Rj0jJ0
7069B0pmKOpplNRJk1PLLj6mNKLj0OJ1j0kLJnKpQnMmMnJNJMlnJ0NomJ4jj6J3J6
7119B2j0MOqLj1J0pjMoJqrK6j0NJrOqoL%mJ1j8Pjlkj%pJ8j2MNLOjrJ3j5P%LoO
7168Bj0J2j6K5j0Kj0J7j3J0kQqljQljNol%Jj6K7ppnMmqNJ4qjkkmQJj0MKqoJ3n
$$ plain form
6824 -2 17 -2 14 15 21 17 14 2 -1 12 4 9 -6 6 -1 -9 -5 -14 5 11 4 5 -5 -1 -5 -10 -6 4 -7 -16 -3 4 -3 4 -8 -4 -8 -2 -3 -9 1 5 -4 -9 0 -4 6
6871 6 10 9 7 2 4 1 5 5 -3 14 15 12 14 6 7 2 11 -3 1 2 -11 9 4 9 2 -5 -2 -2 -5 -5 -12 1 6 2 -8 -8 -23 -6 -4 -11 -18 -18 -5 -10 -18 -8 -10 -16 -14 -13 4
6922 4 -6 -13 1 1 0 -8 -9 -3 3 -7 -8 -4 10 9 -2 -6 1 0 5 14 10 1 12 14 6 8 9 10 10 0 12 2 10 -2 -1 5 10 3 5 13 3 5 1 2 -10 -5 -1 -4 2
6971 2 5 4 5 1 -1 0 8 7 -7 3 9 -5 -9 0 2 -8 -13 9 11 11 8 5 14 9 6 0 14 7 12 7 16 18 23 12 19 17 16 5 6 19 8 5 7 19 7 10 10 -6
7019 -6 3 2 5 -3 -3 -8 -3 10 -5 1 -4 -3 -4 -7 -8 -1 -12 -13 0 -4 -16 -13 -2 4 -4 -5 2 4 13 -3 14 6 6 6 3 6 15 17 -3 4 9 4 5 13 12 12 21 11 10 20
7069 20 13 9 11 17 10 3 0 5 14 15 -6 1 4 7 -9 -13 -8 -6 -3 -13 -7 4 -6 -8 -5 -4 -9 -7 -14 -6 -11 -7 -11 -7 -12 -11 -6 -5 -1 -4 -9 1 6 0 -4 10 9 -7 6 22
7119 22 12 16 22 14 17 6 16 9 8 12 6 7 -1 -10 16 6 11 12 3 9 1 -5 -2 -2 -6 5 -13 -6 -7 -10 -12 -13 -13 -20 -2 -14 -10 -5 -2 4 3 -6 7 -8 -1 -1 2 -4 2
7168 2 -8 4 -12 13 3 5 -5 12 -1 9 7 15 7 4 3 11 8 7 12 6 3 3 4 -12 15 8 1 -4 0 -4 -12 -7 7 -1 -2 -4 -6 -10 -2 -1 -11 -7 -5 -13 -19 -6 -11
7215a1KJ5j6LQJqPlj0J2JkJ0nMj9KJ6qJ7jlk%O%%kpJ3j3J4oj2K7k3J0%rjj%Mj4
7260djLJ1lj2JjJ6j7MROk5NJ5pnONnJ0j4J0Nj8PNj1NQjkjJJ2j7J8j7Q%mJ2j0q
7304aNJ4j6J2poO%r%J0ll%oJRJ0j7jJojjOj6J3oJ7qMj2Oj1J1NnoPojKRnLMQj0
7352@RMRmjj3NJpRQonMlpJPj9J5nPqnNq%KJ0oJ0qLj8ORJloNppMKoK2qj0PJ0j9
7403a4J7mpQLnJ0kQjj1KJ%ONlJ0k2J0PmJ1orjlj2J0Lj2J4mj3LMjKojnMRkMpmJ1
7451CrKkLnKkkPPJj0J5j1L%JJ3k3J2pKJ1%KqJL%pMPrjNlJ4rpjJ0%mppLJ0Npjk
7502BlJ2k1jJ1j0%nQLl%LQp%OnkRJj3J0JPj1PKPJj3PmK%%pQJpMKjNLrOpkJ0Jk
7554A4ooj0PoRj0PjooKnjJ4poOJQk1J3PpRmRkrRmqJ1oJJ0pPKjKjMpPrLjOqkmJ1
$$ plain form
7215 -11 -9 6 -10 -7 1 2 -6 1 -2 -12 0 1 -1 9 4 8 -11 -9 7 -1 16 15 12 10 10 16 16 16 14 7 20 7 21 15 3 30 7 17 17 8 7 6 6 10 -4
7260 -4 -5 -2 9 6 -6 -5 -6 10 -7 -3 6 12 -13 -8 7 0 -5 1 6 1 11 -3 7 12 -6 1 6 -5 0 8 7 5 4 5 17 0 18 1 9 9 5 17 7 -1
7304 -1 4 18 2 14 7 1 7 7 -2 -2 8 5 2 2 -4 -3 6 16 -1 -2 -1 -7 -8 -9 -3 -19 -6 -12 5 -3 1 -11 -5 -16 -5 0 -5 -11 -4 -10 -11 -9 0 -5 -2 2 10 0
7352 0 9 13 22 18 17 4 9 10 3 12 20 14 9 13 10 3 4 11 -8 7 2 9 1 -4 1 -7 -7 -5 5 -1 9 1 4 -14 -8 1 2 -1 -7 -2 -9 -16 -12 -10 -16 6 -2 -12 -5 5 -14
7403 -14 3 -1 -8 0 3 -2 8 6 14 13 2 4 5 5 11 16 13 23 1 11 18 14 25 19 10 9 6 -6 4 7 -5 9 5 -8 -5 -1 -2 0 -6 -7 -12 -8 1 -1 3 -4 -8 3
7451 3 -6 -4 -6 -3 -8 -6 -8 -10 -3 4 5 -5 10 -1 2 2 3 16 -7 5 -2 0 11 11 13 5 6 9 9 2 6 13 4 3 8 5 19 10 3 2 12 12 8 1 -6 -3 7 12 5 4 2
7502 2 -1 11 -10 -11 0 -10 -10 -15 -7 -4 -7 -7 -4 4 -3 -3 3 -2 -4 5 6 -7 3 4 11 0 7 9 16 17 4 11 7 9 9 9 2 10 11 4 8 10 9 14 17 8 14 7 5 15 16 14
7554 14 8 2 -8 -1 -7 2 -8 -1 -2 -8 -14 -12 -17 -18 -4 -11 -17 -11 -10 -2 -23 -10 -3 -10 -1 -5 4 2 -7 2 -2 -10 1 -5 -4 6 -1 6 8 7 9 8 12 5 12 3 6 5 11 3 1 -3 8
7607HqPj1LmmJ8rLlQj1kOJ1j5j4J6j3J8pmj1LK3j0qnOKLLJlLj2J4jJ1onkPnjJ4
7653A4%MlkRj2%mPn%jNoKMrLolMKqK6j7mrJ3mnN%mj0Rmj4J5jj7J8%Mj1J0j1LJ7
7701DmOj0JnQKMj%%Nj1QpJ0Qj2J8j4KlkQL%pj2jM%jlJ0k2K0j1lLKJ0j2J3j6%p
7747a5OLj7K8j3J0j6J7k0QmJ1m%JJ3j5J1%lm%KNnPKNKlmJ0j4PpK0j6pKLJ0j2N
7790IklnpJ4j0Rj0j2QJ1j0kmOrLPm%Ll%QnMLmj0J5%j0KJ1lJ2j6RrPjMjKkj4JJ7
7838IkKnlQnjjjqJ2poRpKNjmJj3J0qRpkQnJj0lJ0LMnj4K2lOplkM%J8j2LmjRqm
7890gK0pj2J1J0noRj2LQrkMJJ6k0LnPmj2J6j0OmkKmjNj8OMLKNk2%J5qJ2jLMNj0
7937a%K%JKkNMOk5J4jLJ%K%rPJ1j2jRrJ4pj3%JK%kJj0kQjKmjKLLnj5QJmOrOPj3
$$ plain form
7607 8 0 7 -4 -1 -5 -9 9 0 3 0 8 -3 -5 1 12 -3 -17 -1 -14 4 -3 -7 -18 -15 8 -2 -10 -15 -9 -7 -4 -1 0 -3 0 -12 2 1 12 6 1 -1 6 1 0 14
7653 14 14 18 15 13 22 10 10 6 13 8 8 7 12 6 8 12 3 6 0 -3 1 3 -5 21 4 0 -9 4 0 -5 0 0 -4 -14 -5 -9 -23 -8 -9 -26 -8 -8 -4 -15 -5 -16 -13 4
7701 4 0 6 -4 -3 -8 0 2 6 5 5 5 10 -1 7 0 10 18 6 24 10 12 9 7 15 18 18 11 -1 -2 2 2 1 -2 8 -14 6 -5 -8 -5 -3 7 -5 8 -8 -8 -15
7747 -15 -9 -6 -23 5 -8 2 -14 3 -17 -9 -13 -2 -6 -6 -5 8 -7 4 4 1 -3 -3 -1 4 -1 6 8 13 15 12 8 18 4 11 4 24 8 1 3 6 16 4 9
7790 9 7 4 -1 -8 6 -4 5 -5 -17 -9 2 -8 -10 -14 -8 -17 -14 -7 -11 -11 -8 -11 -11 -3 -8 -4 -1 -5 -15 0 0 -10 -8 3 0 12 -4 5 -4 3 2 6 5 7 5 -9 -8 9
7838 9 7 9 4 1 9 4 3 2 1 -7 5 -2 -8 1 -6 -4 1 0 -4 -3 -16 -6 -14 -5 -12 -14 -6 -11 -10 -20 -23 -13 -10 -6 -11 -25 -3 -6 0 -7 -10 -12 -8 -8 10 -2 1 -3 -4 5 -3 -7
7890 -7 13 6 -6 5 15 10 4 13 1 4 12 3 1 5 6 22 2 5 0 7 3 -9 7 -3 3 -1 -3 -1 -5 -6 -1 -19 -13 -9 -6 -4 1 -21 -21 -6 -14 -2 -3 0 4 9 -1
7937 -1 -1 1 1 2 4 2 7 11 17 -8 6 5 8 9 9 11 11 2 9 20 8 7 16 7 21 14 1 1 2 4 4 2 3 -7 -9 -1 -2 0 -4 -5 -3 0 3 -2 -17 -9 -8 -12 -6 -15 -9 -2 -15
7990a5J0Mj3LnKKNJ3p%qRmQqJ1kQpjlJ0rMRj0pOmJ4nj0NOllkj0OOLj0KrRj5J8
8038CpllJ1j7LJkKmmqJ0mLMPJ%qJ8mNq%J0j3MlM%Nn%J0KkPk1J8oLQj1pMj1J6q
8087@jNqoQmMMj4j1J2J0qPk0RLJm%jJmRMj2NJ2mLqKjLQNj4%RLj1J1%qJ0jkNKo
8137GrLQOqNmj1J4nJ3j9JkjJ4k0%J9j9KjNJj5J0Oj0PpJOp%P%jJmjRpNpMJ6j4m
8185fK2j6Jj%J3
$$ plain form
7990 -15 -5 -1 -14 -11 -16 -14 -12 -7 6 -1 -1 -9 0 -4 4 -4 7 5 13 6 5 2 12 3 7 16 6 -1 5 1 15 10 0 5 11 8 5 3 -7 -1 5 8 -2 0 -9 0 -15 3
8038 3 -4 -7 -10 1 -16 -13 -12 -14 -12 -16 -20 -28 -18 -22 -19 -15 -8 -7 -7 -15 3 -1 4 -4 -4 6 -7 -3 -6 -2 -2 3 -2 -2 8 10 8 15 -6 12 6 9 17 6 -1 3 -8 8 0
8087 0 -1 4 -4 -10 -2 -6 -2 2 -12 -23 -11 -1 -9 -2 -22 -13 -10 -9 -13 -13 -14 -13 -17 -8 -4 -16 -11 1 -3 0 -8 -6 -7 -4 4 9 -5 -5 4 7 -4 7 7 -1 9 8 6 11 13 7
8137 7 -2 1 9 15 7 12 8 -3 11 6 19 0 1 -1 -2 12 -8 -8 11 -8 -6 -7 -2 -1 -16 -6 0 -10 -3 -10 -9 -3 -10 -10 -3 -3 -4 -3 -7 -8 1 -6 -1 -8 -4 12 -2 -6
8185 -6 16 0 1 0 0 13
8191A3
##END NTUPLES=NMR FID
##END=
