##TITLE=1H_Lac-DMe-B1-f10
 CDCl3, 8 sc, 
 22.11.2019
##JCAMPDX= 6.0         $$ Bruker NMR JCAMP-DX V2.0
##DATA TYPE= NMR FID
##DATA CLASS= NTUPLES
##ORIGIN= UXNMR, Bruker Analytische Messtechnik GmbH
##OWNER= root
$$ XWIN-NMR		Version 3.5
$$ Fri Nov 22 14:42:30 2019 Russian Standard Time (UT+4h)  she@DPX200
##.OBSERVE FREQUENCY= 200.1315
##.OBSERVE NUCLEUS= ^1H
##.DELAY= (6, 6)
##.ACQUISITION MODE= SIMULTANEOUS
##.ACQUISITION SCHEME= undefined
##.AVERAGES= 8
##.DIGITISER RES= 18
##SPECTROMETER/DATA SYSTEM= spect
##.PULSE SEQUENCE= zg30
##.SOLVENT NAME= CDCl3
##.SHIFT REFERENCE= (INTERNAL, CDCl3, 0, 15.7039)
##AUDIT TRAIL= $$ (NUMBER, WHEN, WHO, WHERE, WHAT)
$$ ##TITLE= Audit trail, XWIN-NMR		Version 3.5
$$ ##JCAMPDX= 5.01
$$ ##ORIGIN= Bruker BioSpin GmbH
$$ ##OWNER= she
$$ F:/spectra/data/she/nmr/H-F/1/audita.txt
$$ ##AUDIT TRAIL=  $$ (NUMBER, WHEN, WHO, WHERE, WHAT)
(   1,<2019-11-22 14:41:31.95 +0400>,<she>,<DPX200>,
      <created by zg, POWCHK disabled, PULCHK disabled
       configuration hash MD5:
       00 E9 B6 7A A2 85 ED C7 34 08 36 98 17 FE 4E 26
       data hash MD5: 16K
       B1 18 A5 6B D0 F5 EB EF 50 4A 47 4C E9 43 4E 4C>)
$$ ##END=
$$ 
$$ hash MD5
$$ F5 19 B0 1B 64 3C 29 83 76 5B 69 05 12 6C A9 D7
##$RELAX= 
##$RELAX= 
##$RELAX= 
##$RELAX= 
##$RELAX= 
##$RELAX= 
$$ Bruker specific parameters
$$ --------------------------
##$DU= <F:/spectra>
##$EXPNO= 1
##$NAME= <H-F>
##$PROCNO= 1
##$TYPE= <nmr>
##$USER= <she>
##$AMP= (0..31)
100 100 100 100 100 100 100 100 100 100 100 100 100 100 100 100 100 100 
100 100 100 100 100 100 100 100 100 100 100 100 100 100 
##$AQSEQ= 0
##$AQ_mod= 1
##$AUNM= <au_zg>
##$AUTOPOS= <>
##$BF1= 200.13
##$BF2= 200.13
##$BF3= 200.13
##$BF4= 200.13
##$BF5= 200.13
##$BF6= 200.13
##$BF7= 200.13
##$BF8= 200.13
##$BYTORDA= 1
##$CFDGTYP= 0
##$CFRGTYP= 5
##$CHEMSTR= <none>
##$CNST= (0..31)
1 1 145 1 1 1 1 1 1 1 1 1 1 1 1 1 1 1 1 1 1 1 1 1 1 1 1 1 1 1 1 1 
##$CPDPRG= <>
##$CPDPRG1= <>
##$CPDPRG2= <>
##$CPDPRG3= <>
##$CPDPRG4= <mlev>
##$CPDPRG5= <mlev>
##$CPDPRG6= <mlev>
##$CPDPRG7= <mlev>
##$CPDPRG8= <mlev>
##$CPDPRGB= <>
##$CPDPRGT= <>
##$D= (0..31)
0 1.2 0 0 0 0 0 0 0 0.06 0 0.03 0 0 0 0 0.0002 0 0 0 0 0 0 0 0 0 0 0 0 
0 0 0 
##$DATE= 1574419291
##$DBL= (0..7)
120 120 120 120 120 120 120 120 
##$DBP= (0..7)
150 150 150 150 150 150 150 150 
##$DBP07= 0
##$DBPNAM0= <>
##$DBPNAM1= <>
##$DBPNAM2= <>
##$DBPNAM3= <>
##$DBPNAM4= <>
##$DBPNAM5= <>
##$DBPNAM6= <>
##$DBPNAM7= <>
##$DBPOAL= (0..7)
0.5 0.5 0.5 0.5 0.5 0.5 0.5 0.5 
##$DBPOFFS= (0..7)
0 0 0 0 0 0 0 0 
##$DE= 6
##$DECBNUC= <off>
##$DECIM= 24
##$DECNUC= <off>
##$DECSTAT= 4
##$DIGMOD= 1
##$DIGTYP= 9
##$DL= (0..7)
0 120 120 120 120 120 120 120 
##$DP= (0..7)
150 150 150 150 150 150 150 150 
##$DP07= 0
##$DPNAME0= <>
##$DPNAME1= <>
##$DPNAME2= <>
##$DPNAME3= <>
##$DPNAME4= <>
##$DPNAME5= <>
##$DPNAME6= <>
##$DPNAME7= <>
##$DPOAL= (0..7)
0.5 0.5 0.5 0.5 0.5 0.5 0.5 0.5 
##$DPOFFS= (0..7)
0 0 0 0 0 0 0 0 
##$DQDMODE= 0
##$DR= 18
##$DS= 0
##$DSLIST= <SSSSSSSSSSSSSSS>
$$ [...]
##$SUBNAM2= <"">
##$SUBNAM3= <"">
##$SUBNAM4= <"">
##$SUBNAM5= <"">
##$SUBNAM6= <"">
##$SUBNAM7= <"">
##$SUBNAM8= <"">
##$SUBNAM9= <"">
##$SW= 24.9337058887773
##$SWIBOX= (0..15)
0 0 2 0 0 0 0 0 0 0 0 0 0 0 0 0 
##$SW_h= 4990.01996007984
##$TD= 16384
##$TD0= 1
##$TE= 0
##$TE2= 300
##$TE3= 300
##$TEG= 300
##$TL= (0..7)
0 120 120 120 120 120 120 120 
##$TP= (0..7)
150 150 150 150 150 150 150 150 
##$TP07= 0
##$TPNAME0= <>
##$TPNAME1= <>
##$TPNAME2= <>
##$TPNAME3= <>
##$TPNAME4= <>
##$TPNAME5= <>
##$TPNAME6= <>
##$TPNAME7= <>
##$TPOAL= (0..7)
0.5 0.5 0.5 0.5 0.5 0.5 0.5 0.5 
##$TPOFFS= (0..7)
0 0 0 0 0 0 0 0 
##$TUNHIN= 0
##$TUNHOUT= 0
##$TUNXOUT= 0
##$USERA1= <user>
##$USERA2= <user>
##$USERA3= <user>
##$USERA4= <user>
##$USERA5= <user>
##$V9= 5
##$VALIST= <valist>
##$VCLIST= <CCCCCCCCCCCCCCC>
##$VD= 0
##$VDLIST= <DDDDDDDDDDDDDDD>
##$VPLIST= <PPPPPPPPPPPPPPP>
##$VTLIST= <TTTTTTTTTTTTTTT>
##$WBST= 1024
##$WBSW= 4
##$XGAIN= (0..3)
0 0 0 0 
##$XL= 0
##$YL= 0
##$YMAX_a= 448060
##$YMIN_a= -359414
##$ZGOPTNS= <>
##$ZL1= 120
##$ZL2= 120
##$ZL3= 120
##$ZL4= 120
##$ABSF1= 10
##$ABSF2= 0
##$ABSG= 5
##$ABSL= 3
##$ALPHA= 0
##$AQORDER= 0
##$ASSFAC= 0
##$ASSFACI= 0
##$ASSFACX= 0
##$ASSWID= 0
##$AUNMP= <proc_1d>
##$AZFE= 0.1
##$AZFW= 0.1
##$BCFW= 1
##$BC_mod= 2
##$BYTORDP= 1
##$COROFFS= 0
##$CY= 11.3945322036743
##$DATMOD= 1
##$DC= 2
##$DFILT= <>
##$DTYPP= 0
##$F1P= 16.9975609425685
##$F2P= -3.02152046262296
##$FCOR= 0.5
##$FTSIZE= 0
##$FT_mod= 4
##$GAMMA= 1
##$GB= 0.15
##$INTBC= 1
##$INTSCL= 1
##$ISEN= 128
##$LB= 0.24
##$LEV0= 0
##$LPBIN= 0
##$MAXI= 10000
##$MC2= 0
##$MEAN= 0
##$ME_mod= 0
##$MI= 1.114404
##$NCOEF= 0
##$NC_proc= 0
##$NLEV= 6
##$NOISF1= 3.799351
##$NOISF2= 2.8
##$NSP= 1
##$NTH_PI= 0
##$NZP= 0
##$OFFSET= 15.70392
##$PC= 1
##$PHC0= -9789.908
##$PHC1= 17.60086
##$PH_mod= 1
##$PKNL= yes
##$PPARMOD= 0
##$PSCAL= 0
##$PSIGN= 0
##$REVERSE= no
##$SF= 200.130013532006
##$SI= 16384
##$SIGF1= 3
##$SIGF2= 2
##$SINO= 400
##$SIOLD= 16384
##$SREGLST= <1H.CDCl3>
##$SSB= 0
##$STSI= 0
##$STSR= 0
##$SW_p= 3612.71676300578
##$SYMM= 0
##$S_DEV= 0
##$TDeff= 0
##$TDoff= 0
##$TI= <>
##$TILT= no
##$TM1= 0
##$TM2= 0
##$TOPLEV= 0
##$USERP1= <user>
##$USERP2= <user>
##$USERP3= <user>
##$USERP4= <user>
##$USERP5= <user>
##$WDW= 1
##$XDIM= 8192
##$YMAX_p= 0
##$YMIN_p= 0
$$ End of Bruker specific parameters
$$ ---------------------------------
##NTUPLES= NMR FID
##VAR_NAME=  TIME,          FID/REAL,        FID/IMAG
##SYMBOL=    X,             R,               I
##VAR_TYPE=  INDEPENDENT,   DEPENDENT,       DEPENDENT
##VAR_FORM=  AFFN,          ASDF,            ASDF
##VAR_DIM=   8192,          8192,            8192
##UNITS=     SECONDS,       ARBITRARY UNITS, ARBITRARY UNITS
##FACTOR=    0.0002004,     1,               1
##FIRST=     0,             0,               0
##LAST=      1.6414764,     0,               0
##MIN=       0,             -359414,         0
##MAX=       1.6414764,     448060,          0
$$ Real data points
##PAGE= N=1
##DATA TABLE= (X++(R..R)), XYDATA
0 0 0 0 0 0 0 8 0 8 -8 16 -16 16 -24 32 -32 41 -56 64 -73 88 -105 121 -140 163 -190 215 -246 279 -319 359
30 359 -406 459 -515 574 -641 716 -800 886 -983 1090 -1209 1338 -1480 1640 -1816 2013
46 2013 -2234 2486 -2773 3105 -3493 3954 -4514 5207 -6098 7285 -8954 11485 -15803 25028
60 25028 -84982 290716 436792 -162961 -310706 78763 221636 -149505 -204115 185969
70 185969 288361 -135614 -299971 50862 260402 -13102 -175003 56528 174256 -101295
80 -101295 -232265 59790 266262 20330 -217836 -60113 144303 15357 -141602 13948
90 13948 189641 18439 -213255 -90673 178562 144702 -87028 -110675 46188 56722 -53959
101 -53959 -13595 118778 63115 -109659 -93143 74850 90446 -39774 -46561 65557 41918
112 41918 -91813 -72693 83683 99756 -41882 -84282 11180 34230 -35755 -13162 81870
123 81870 50110 -77833 -78569 39960 62809 -16151 -12212 58525 16865 -89426 -48220 94320
135 94320 88894 -59738 -92398 32421 79196 -22692 -69032 21771 66850 -20746 -76313 -5216
147 -5216 52391 3656 -33975 12829 28388 -42169 -61331 32526 79689 -12740 -84481 -9204
159 -9204 72151 15203 -61455 -11427 60164 5215 -74891 -19785 79014 42119 -66354 -59945
171 -59945 32841 43101 -24933 -31459 21784 17776 -35859 -29164 25309 22413 -24538 -17866 22182
184 22182 4152 -43187 -18430 49662 40803 -34545 -51352 8017 35458 -1441 -17728 13740
196 13740 19247 -21109 -30032 16360 36988 -4656 -33774 -4390 21496 -548 -15516 13290
208 13290 25567 -16048 -40754 2532 40932 8554 -30045 -3055 32553 2940 -36237 -5125
220 -5125 43783 21054 -31930 -22864 22842 23387 -4933 -46 16608 -8658 -33334 3978 50019
233 50019 23923 -32823 -28756 17015 19375 -13317 -6899 27823 19276 -26196 -31671 12461 35688
246 35688 10469 -15394 -9077 3566 -1119 -4535 9650 21267 8841 -14499 -20888 -5102 14598
259 14598 21225 10587 -7676 -20591 -16021 6226 24703 17438 -9282 -23328 -11196 5409 6617
272 6617 3822 8175 6865 -13209 -27563 -9777 21415 24061 -4092 -22865 -12988 2561 2876 1278
286 1278 8429 7260 -14122 -28374 -7352 23475 22395 -5645 -22000 -14432 -5714 -1653 11196
299 11196 21471 2318 -29463 -28766 4301 21417 6247 -5309 -2137 -8811 -23417 -9588 24028
312 24028 25872 -9518 -28815 -10205 5224 -71 3868 20157 9431 -27615 -34248 6488 34752
325 34752 14288 -13379 -10958 -3299 -11258 -7831 20626 30809 -2856 -34815 -19823 14187 19732
338 19732 4712 2088 2322 -13183 -21039 3604 30794 18139 -14044 -17964 1305 5326 30
351 30 12352 25238 1400 -32919 -20385 23955 34163 2678 -13827 -672 178 -14347 -1657
364 -1657 31999 27691 -18110 -34929 -581 25593 11195 -2831 6101 3818 -18769 -17211 18211
377 18211 33020 3267 -21172 -8676 6213 -883 60 20911 20327 -15625 -33855 -3570 28564
390 28564 17642 -7667 -5980 2814 -11105 -18855 9197 34767 11097 -31146 -28156 9053 20536
403 20536 603 -4671 7739 -1540 -25267 -15152 22658 28646 -6807 -25401 -7257 4208 -5262
416 -5262 497 22609 12928 -28562 -35170 6322 29026 4863 -14164 -321 1723 -23243 -21141
429 -21141 21628 36736 -7248 -40571 -14337 18493 7989 -8844 5412 14372 -14591 -34284
441 -34284 -2788 33514 18982 -15967 -18270 -1868 -4133 -8969 12109 27968 913 -34254 -22564
454 -22564 15173 19995 -1434 -3458 7788 -6203 -28528 -8648 34276 30588 -16694 -33899 -1842
467 -1842 18672 1780 -3842 17381 15303 -21585 -32071 8778 37115 12431 -16981 -8243 4693
480 4693 -7507 -9588 19164 30832 -4548 -31640 -10033 18488 10684 -3258 9766 15256 -13584
493 -13584 -30526 3355 37566 18380 -18465 -15128 7520 3835 -8185 9830 28826 4748
505 4748 -31508 -21213 18470 26334 1047 -7869 3474 -2458 -19925 -7269 26178 26188 -10314
518 -10314 -27691 -6310 11394 4345 1270 11962 5676 -19834 -21352 10120 26139 5108 -14514
531 -14514 -5085 2431 -10025 -9382 17312 24560 -8489 -33562 -10932 19286 11100 -10156 -3918
544 -3918 8182 -6149 -23403 -5626 22112 14523 -14273 -19061 -2022 3909 -774 4567 9971
557 9971 -4910 -20200 -7944 13995 10579 -7266 -6809 3397 -2837 -14575 -2320 19084 10882
570 10882 -17802 -21679 1978 14273 1449 -6541 474 1382 -9847 -10606 5322 12897 1821 -9107
584 -9107 -5153 1232 465 874 6530 5659 -4661 -10281 -1180 10335 8223 -1502 -5870 -1279 1797
599 1797 294 514 4687 5295 -2363 -7481 -1843 7156 6767 -915 -2284 392 -209 -827 6868 10421
615 10421 -998 -11464 -2146 13619 9766 -4718 -2944 8758 3587 -10351 -4033 16927 16514
628 16514 -7153 -16066 -770 10896 5566 976 4261 422 -9246 -5715 7981 10024 98 -1226
642 -1226 3309 -3004 -12002 129 20493 14644 -13748 -20985 2745 17634 4520 -7980 574
655 574 7685 -5729 -15593 459 19227 10686 -11669 -15860 -2723 4719 3546 5347 4184 -8463
669 -8463 -17467 -3950 14707 9948 -7684 -9230 913 -3021 -11927 952 21088 10459 -21457
682 -21457 -25381 3223 18691 4872 -6414 -511 -2164 -15602 -11481 13078 19814 -2426 -18753
695 -18753 -9314 511 -2476 1088 14177 8956 -16875 -25005 -1657 19086 11263 -5335 -6700 -2900
709 -2900 -7456 -6889 6939 15701 4755 -11002 -12775 -3365 4504 9074 10161 2487 -12223 -15837
723 -15837 -500 15150 12523 -1754 -8596 -3384 -991 -2693 2420 12614 11329 -7371 -19221
736 -19221 -5790 15985 17599 1569 -9044 -6448 -2362 760 7615 13057 6242 -7551 -10722 -2747
750 -2747 4407 7973 12744 8238 -9809 -20696 -3352 21099 18768 -4644 -12468 -841 2058 -5807
764 -5807 842 18837 15033 -12713 -23786 -2715 17519 12271 595 -504 -4015 -13490 -8219 14279
778 14279 21903 483 -17661 -8675 4110 860 -253 12206 12354 -12192 -26715 -4286 22339
791 22339 15296 -7519 -10437 -2273 -5674 -8038 7866 19416 1073 -21547 -13725 8001 9422
804 9422 -1794 235 6639 -7541 -21513 -5552 21237 17309 -11389 -20396 -4079 6052 453
817 453 443 7399 2022 -14145 -14449 3659 13183 4208 -5017 -4976 -6059 -9303 470 15547 11332 -11571
833 -11571 -19853 -2622 11604 4822 -4283 1914 5505 -7862 -16136 539 19680 11376 -10807
846 -10807 -14182 -506 5750 2567 3979 6756 -1796 -12059 -5718 8333 9391 374 -1186 1455
860 1455 -4575 -9065 3013 17243 8864 -11254 -12437 3947 10748 2592 -1443 4459 3259 -7508
874 -7508 -7284 7679 15335 4048 -8429 -6026 1695 3326 3446 7199 6113 -4864 -11586 -1365
888 -1365 12288 11120 -1361 -5927 -1896 -1739 -2779 5124 13910 6151 -11470 -13609 1578 11046
902 11046 6594 1841 1641 -4158 -11982 -5036 13609 15905 -2316 -13903 -5178 3717 455 415 9177
917 9177 7005 -11473 -18752 -117 17082 8667 -7184 -7727 -1971 -4082 -4673 6527 12183 -876
931 -876 -15649 -10143 5109 7266 819 595 439 -9304 -13711 1053 16889 8208 -11722 -13597 -290
946 -290 2767 -2255 2043 9334 -393 -17493 -13857 7702 15384 2102 -8840 -6247 -3423 -5479
960 -5479 -133 10864 8748 -7763 -15695 -4719 6663 5866 2048 1808 -2135 -10505 -8671 6165
974 6165 13982 3502 -8919 -6979 -307 341 704 6991 8569 -3895 -14340 -5318 10759 11400 -713
989 -713 -5385 -855 -329 -3892 1503 11253 7878 -6739 -11533 -436 8885 6108 1527 1147 -1864
1004 -1864 -6787 -3102 8983 12005 961 -7422 -3735 1460 1863 4077 8849 4933 -7625 -11256
1018 -11256 1117 12385 7834 -2043 -4417 -1048 -1586 -1908 5463 11292 3560 -9547 -9949 2076
1032 2076 9510 5620 -173 -1421 -3146 -5897 -1779 8131 9628 -745 -9411 -5817 1695 3026 2951
1047 2951 4814 1072 -8886 -10614 2085 11578 4510 -6087 -5692 -1113 -3322 -3193 6051 10593 -2045
1062 -2045 -15425 -8967 6381 8869 43 -3691 -1452 -4456 -8583 -740 10574 7997 -6275 -12326
1076 -12326 -4399 2621 3275 3488 3515 -3673 -11724 -7849 5604 10401 2040 -6126 -5309 -2914 -4124 118
1092 118 9697 8854 -6062 -15557 -5036 8777 8267 -1 -1559 -135 -6067 -9033 2502 14412
1106 14412 7599 -8742 -11305 -595 5219 2862 4414 6296 -2490 -12037 -5831 9471 12047 1492
1120 1492 -4152 -2140 -3023 -4977 3654 14423 7952 -9051 -12753 476 9083 5249 1709 3608
1134 3608 -609 -9411 -6952 8740 15223 3577 -8697 -6915 783 2860 3446 7895 6630 -5080
1148 -5080 -11984 -3211 9563 10127 1887 -2423 -3103 -5520 -3686 6229 13069 4384 -9076 -9879 505
1163 505 5983 3410 3040 4024 -3035 -11210 -5410 9232 12016 274 -8608 -5204 -739 -1393 1354
1178 1354 8284 5698 -7736 -13582 -2735 9151 6881 -1287 -3702 -3425 -5891 -4815 4417 9475
1192 9475 1561 -9176 -8091 -926 2015 1759 3938 2093 -6608 -11884 -2563 9369 6756 -4352
1206 -4352 -6715 -2012 -1628 -4459 1025 8885 4070 -9819 -12579 593 9006 3861 -3378 -2645 -1314
1221 -1314 -4637 -4399 4213 8038 857 -7613 -5821 29 1912 2449 4552 1745 -6815 -9005 1986
1236 1986 10296 3922 -5639 -3791 2772 128 -4358 2140 10336 3583 -9983 -8344 5749 9492
1250 9492 360 -3004 1261 1001 -4490 -1716 7990 7499 -3833 -6797 1296 4949 501 298 5634
1265 5634 2753 -7157 -5981 6551 10480 604 -5697 -660 3322 -967 -1226 6171 6783 -3502 -8438
1280 -8438 188 7277 3234 -1750 560 1870 -3835 -5257 4033 10004 1829 -8630 -5189 4299 5109
1295 5109 -159 -737 2028 -536 -5613 -2499 5860 6394 -1096 -5470 -3053 -497 523 3275 4756
1310 4756 -681 -7912 -5781 3373 5759 -147 -3787 -680 133 -4715 -4205 4823 8138 -1687 -10855
1325 -10855 -6110 4115 5706 267 -2254 -1493 -2969 -4735 -814 4858 3677 -2412 -5470 -3430 -1338
1340 -1338 72 3840 4328 -2020 -9283 -5621 4434 7082 125 -5035 -1992 -92 -3115 -1881 5469
1355 5469 7149 -1956 -9404 -4344 4060 4924 1444 634 -546 -5140 -5486 2715 9016 4038 -4771 -4510
1371 -4510 -21 301 -706 4048 7787 519 -9283 -5723 5623 8681 1892 -2122 -790 -1370 -3390
1386 -3390 1505 8539 5942 -3836 -6595 -508 3380 1609 3139 6216 863 -8898 -7313 6488 12610
1401 12610 2038 -7344 -3752 2642 863 -646 5203 7167 -1739 -9397 -3394 6496 7545 2317
1415 2317 -673 -2697 -6221 -3337 7167 10628 504 -8600 -4605 2082 1030 -900 4187 6139
1429 6139 -3110 -11775 -4699 8531 8835 -1016 -6105 -3483 -908 -648 1812 4739 1682 -4778 -5493
1444 -5493 -1236 2355 2495 1805 -302 -4116 -6155 -1566 5395 4992 -2219 -6382 -3580 484 971 219
1460 219 713 447 -3557 -5944 -2284 3582 3825 -1309 -4436 -3186 -886 -34 1567 3186 201 -5089
1476 -5089 -5803 473 4724 2236 -1640 -1344 -1156 -3536 -3544 2457 6849 1654 -6151 -5116 646 2633
1492 2633 866 1550 1793 -1993 -4863 -1300 5012 3480 -805 -1353 641 -1324 -2789 2338 7949 2380
1508 2380 -6724 -5462 3946 6610 407 -2404 1882 2092 -3559 -3130 5062 8105 361 -5955 -2138
1523 -2138 3126 2800 1384 3012 1455 -4428 -4906 3493 8134 2372 -3557 -1338 1506 -1694 -1507 5810
1539 5810 8722 -1352 -9658 -3702 6498 6237 -423 -476 1844 -2176 -6228 161 8923 4862 -4840
1554 -4840 -5744 440 2009 -440 1755 4905 -509 -7764 -4214 5266 6298 -1342 -3822 182 -723
1569 -723 -3918 -668 6319 3608 -5970 -6906 815 4173 -334 -1762 1598 -81 -6121 -4749 4074
1584 4074 6409 -860 -6639 -3491 998 -206 -1042 2118 2475 -3153 -6884 -2216 3364 3488 -731 -1989
1600 -1989 -2241 -3102 -2386 1925 4572 765 -4724 -4427 257 1375 164 891 2454 -808 -6043 -3779
1616 -3779 3891 5981 62 -4672 -1805 940 -687 -398 3158 3967 -1928 -5654 -1771 3904 3840 296
1632 296 -1218 -733 -1819 -1613 2558 5499 1914 -3106 -2715 1039 2090 827 2215 2533 -876 -4757
1648 -4757 -1306 5132 5618 -493 -3559 -201 1600 -143 586 4468 3600 -2876 -5613 598 6319 3593
1664 3593 -1199 -1136 514 -1187 -1804 2998 5823 1285 -4681 -2961 2063 2588 792 1594 1930 -2721
1680 -2721 -5268 384 5751 3177 -3419 -3594 528 152 -1896 970 5028 834 -6449 -5367 3263
1695 3263 5330 -150 -3178 -559 95 -2799 -1734 3837 4220 -2885 -6127 -1231 2607 636 -1162
1710 -1162 491 -389 -4659 -4251 1971 4901 -122 -4932 -2765 269 -912 -1324 2488 3027 -2900 -6672
1726 -6672 -1815 4707 3001 -1652 -2425 -115 -1809 -3448 607 5297 2199 -5457 -5379 612 3620 624
1742 624 -804 789 -1457 -4924 -2647 3980 4977 -494 -3923 -2432 -153 273 1614 4593 2097 -4348
1758 -4348 -5158 1247 5593 2575 -1076 -263 -161 -2239 -1865 3840 6706 829 -5518 -3664 2457 4374
1774 4374 1555 1196 818 -1635 -4130 -237 5513 5646 -85 -3415 -1971 190 1556 3719 5010 720
1790 720 -4499 -3980 2551 5293 2546 -136 -266 -1344 -2951 -454 5442 6377 -1020 -6325 -3121 2533
1806 2533 3678 1204 1330 708 -3317 -4807 -309 6386 4558 -1747 -4310 -2279 -155 874 3054
1821 3054 4086 -322 -5923 -4272 2272 4478 1367 -624 -1248 -2617 -4310 -344 5706 3866 -3458
1836 -3458 -7120 -2562 2150 1548 471 1520 -205 -5268 -5589 1051 6029 2710 -3302 -4139 -1386 -1037
1852 -1037 -460 2887 3574 -1704 -6083 -3619 2560 3385 461 -1076 -1361 -3029 -3676 898 5143 2747
1868 2747 -3686 -4812 -941 1245 529 1554 2942 -802 -5729 -3632 3380 5857 798 -3046 -1461
1883 -1461 171 -1143 -115 3962 4105 -1854 -5371 -1794 3620 3748 514 -309 -789 -2186 -1672 2350
1899 2350 4948 1385 -2762 -2285 354 1310 994 3006 2973 -1447 -5131 -820 4772 4591 -636 -2480
1915 -2480 112 1054 -774 324 4202 2928 -2436 -4098 118 3834 2623 127 -201 -646 -1597 -579
1931 -579 3079 3968 -119 -3322 -1549 1330 1029 706 1910 1621 -2119 -4308 -210 4464 3124 -1874
1947 -1874 -2600 -629 178 -583 862 3027 328 -4547 -3803 1434 3535 118 -1754 -583 -688 -2921
1963 -2921 -1754 2987 3597 -2041 -5405 -1782 1743 1162 -796 18 63 -2782 -4059 723 3728 1073
1979 1073 -2575 -1995 -480 -1731 -916 2889 3452 -2471 -6341 -1700 4288 2411 -2066 -1168 1066 -1083
1995 -1083 -4357 -643 5391 3698 -3756 -5351 -883 2225 1543 916 1368 -1388 -3850 -1870 3256 3563
2011 3563 -45 -1346 -130 -807 -2154 1603 5642 3193 -3817 -5339 753 4922 2146 -662 562
2026 562 558 -2087 -2225 2785 5214 1624 -3279 -3126 386 2237 1979 2499 1560 -2058 -3715 621 5272
2043 5272 3533 -453 -1748 -597 -488 -73 2654 4685 1206 -3736 -3537 1249 3661 2283 778 -75
2059 -75 -1965 -2936 -321 4212 3983 -824 -3270 -1643 581 558 1237 2405 970 -2788 -3656 -373 3653
2076 3653 3120 -679 -2631 -1807 -722 482 1410 1866 276 -2268 -2786 -456 1573 1387 297 -985
2092 -985 -2776 -3185 -782 2810 2717 -1471 -4359 -1756 1180 495 -635 895 1401 -2724 -4855 -833
2108 -833 4348 3162 -2445 -3767 -1486 -498 -959 1003 2933 313 -4642 -3554 973 2197 208 -16
2124 -16 567 -2231 -4540 -917 4777 3447 -2960 -4026 -449 1666 -381 419 2741 1021 -4463 -3790
2140 -3790 2446 5058 1018 -2290 -1115 24 -1524 -45 4185 3773 -2203 -5031 -327 3662 2051
2155 2051 -152 382 536 -2237 -2167 2815 5244 1334 -3236 -2200 1095 1248 1207 3304 2221 -2629 -4858
2172 -4858 181 5502 3562 -1418 -1626 210 -513 -1456 1829 4883 1804 -3799 -3754 927 3513 1687
2188 1687 403 75 -1152 -1976 11 3475 2976 -754 -2452 -968 -96 241 1608 2498 192 -3835
2204 -3835 -3383 1559 3759 1067 -1911 -1029 -504 -1488 -910 1889 2892 -418 -3669 -2818 691 2245
2220 2245 1011 -368 -946 -1908 -1998 -221 2260 1944 -882 -2805 -2304 -752 401 1200 1147 -551 -3064
2237 -3064 -3199 -40 2776 1222 -1209 -1850 -1220 -1536 -494 1960 3028 -440 -4230 -2893 1293 2614
2253 2614 493 -365 -101 -1591 -3020 -595 3690 3232 -1022 -3589 -1462 1015 842 1021 2202 96
2269 96 -3345 -2668 1213 3774 1673 -1074 -960 -697 -1532 458 3790 3398 -1855 -3840 -904 2946 2047
2286 2047 143 898 639 -2300 -2987 1675 5082 2047 -2536 -2751 332 1454 655 1930 2756 -714
2302 -714 -3560 -1356 3495 3645 -21 -852 125 -681 -1181 1371 4137 1742 -3008 -2670 991 2278 438
2319 438 601 1225 -99 -3246 -1454 3105 3783 -428 -2616 -976 862 -115 -128 1752 1535 -1447 -3041
2336 -3041 -401 2079 1268 -557 -950 -409 -1001 -566 1374 1928 -359 -2556 -1673 395 473 -293 294 270
2354 270 -1636 -2765 -825 2359 1456 -1831 -2666 -431 12 -687 -84 1126 442 -1951 -2759 258 2354
2371 2354 528 -1263 -1323 -1023 -1005 -513 1123 1573 -885 -2536 -1516 622 732 -31 397 218 -1403 -2325
2389 -2325 453 2777 1483 -1904 -1801 -53 577 -584 669 1973 524 -2724 -2185 1592 3042 366
2405 366 -1402 -324 65 -486 -255 2455 2359 -682 -2521 -440 1910 1647 499 429 -42 -1562 -1201 1908
2423 1908 3380 657 -1964 -1063 784 439 362 1795 2311 -930 -3271 -499 3261 3019 -475 -1339 320
2440 320 191 -969 409 3134 1777 -1908 -2655 170 2021 1348 409 470 -540 -1968 -960 2065 2629
2457 2629 -207 -1765 -1098 -223 -662 391 2199 1510 -2590 -3412 -75 2630 1294 -1019 -673 71 -1677
2474 -1677 -1924 1181 3081 560 -3134 -2617 380 1048 569 79 -16 -1542 -2661 -842 1751 1879 -793
2491 -793 -2030 -1444 -756 -420 965 1886 198 -3001 -3073 279 2188 641 -519 -583 -761 -2048 -1174 2047
2509 2047 2722 -231 -3144 -1955 555 1185 161 670 672 -1132 -2809 -311 2441 2157 -652 -1978 -834
2526 -834 63 -57 1235 2260 177 -2239 -1870 1035 1962 1149 176 261 -631 -1446 -259 2912 2812 -706
2544 -706 -2392 -382 1585 740 444 1953 1108 -1951 -2378 589 3801 2002 -1497 -1106 524 296 3
2561 3 1537 2052 370 -1882 -1153 1364 1951 886 528 239 -1284 -1783 922 2960 1459 -1669 -1558
2578 -1558 404 876 -116 575 1806 102 -2701 -2329 1689 2713 471 -1580 -1068 170 -122 -39 1152
2595 1152 1246 -1033 -2711 -1055 1175 1381 128 -153 -875 -1721 -1730 776 2200 70 -2641 -1728 175
2612 175 -54 -669 484 1201 -951 -2953 -1497 1980 1817 -1017 -2005 -617 -481 -872 -185 1873 799
2629 799 -2077 -2587 -88 1323 1020 -62 -165 -1135 -1781 -887 1669 1969 -435 -2174 -1423 -153 208
2646 208 533 1118 383 -1989 -2415 313 2254 1183 -804 -788 -15 -620 -737 1241 2560 288 -2250
2663 -2250 -1701 1014 2320 1298 -324 -640 -163 -953 -43 1863 2120 209 -1436 -1114 449 1295 1555
2680 1555 1509 -179 -1696 -1652 979 2701 668 -358 -202 36 -300 -196 2149 2628 400 -2604 -1572
2697 -1572 1786 2240 607 -148 169 -487 -1096 68 2377 1963 -621 -1984 -648 615 950 775 1224
2714 1224 14 -2159 -1526 1107 2371 601 -853 -685 -672 -1085 -201 1466 1719 -1138 -2885 -1043 1301
2731 1301 1081 -151 -31 -70 -1726 -2083 468 2648 863 -2287 -2404 -134 454 -14 692 1419 -675
2748 -675 -2643 -2008 999 2035 -153 -1119 -1236 -1074 -1311 294 2166 875 -2065 -2160 -213 470 -347
2765 -347 -177 949 -452 -2510 -1506 1472 3054 38 -2471 -1109 442 232 -159 994 839 -1209
2781 -1209 -2008 -320 1707 1490 -36 -482 -701 -834 59 1435 2191 -269 -1767 -584 1015 1205 279
2798 279 635 717 -752 -1492 -95 2214 1883 -384 -1261 -307 875 686 730 1184 771 -695 -1117 346
2816 346 1463 1452 -306 -82 -98 100 119 907 1507 348 -1012 -530 720 1014 157 122 194 -372 -1019 225
2836 225 1950 1250 -573 -1080 -4 481 318 201 1124 445 -1907 -1775 594 2140 556 -1186 -755
2853 -755 -75 -531 -758 1129 1913 -379 -2077 -1561 619 817 -88 86 -179 -1359 -1987 106 1939 582
2871 582 -1555 -1703 -256 -270 -746 701 1377 -340 -3135 -1961 1313 1962 -850 -1672 -606 -649 -1444 -42
2889 -42 2083 1282 -1974 -2792 -292 1133 557 56 172 -686 -2034 -1294 1486 2349 -177 -2083 -1079
2906 -1079 22 -174 743 2057 972 -2008 -2716 -229 2424 1299 -617 -567 122 -1212 -598 1608 2463
2923 2463 330 -2116 -1471 1048 1653 830 635 177 -760 -1376 161 1951 1930 -144 -780 -316 -84 442
2941 442 1776 1738 -26 -1746 -733 1375 1697 955 160 71 -407 -944 273 1928 1955 53 -1661 -876
2959 -876 438 1211 827 856 -64 -553 -966 -58 1331 1306 314 -1171 -1092 -323 777 1066 1210 291 -1298
2978 -1298 -1341 213 909 1090 -63 -303 -548 -1209 -194 1126 1567 -260 -2054 -1516 465 516 353 165
2996 165 503 -1156 -2253 -629 1652 1126 -1113 -2063 -786 203 75 51 1111 -300 -2364 -1550 436
3013 436 1739 211 -612 -635 -1171 -1474 118 2104 1532 -1602 -2671 -454 891 370 28 940 33 -2361
3031 -2361 -1913 922 2608 727 -1609 -1310 -50 -116 -52 1248 1365 -906 -2014 -407 1307 1217 -16
3048 -16 36 93 -1039 -867 1417 2280 394 -1860 -783 767 695 228 653 1222 -447 -1719 -239 2203
3066 2203 2047 -320 -1065 7 175 34 633 1745 863 -1419 -1598 730 1533 1105 -27 -92 -356 -819
3084 -819 -60 1525 1754 -108 -1152 -771 751 404 740 968 236 -1064 -1362 468 1472 1206 -572
3101 -572 -494 -236 -449 -207 954 1300 177 -1886 -1787 601 1443 604 -395 -457 -287 -872 -171 1005 1252
3120 1252 -592 -1800 -1401 -287 389 509 171 -387 -1648 -1293 344 1454 751 -1263 -1111 -431 -653
3137 -653 -577 813 946 -435 -2245 -1619 472 1284 419 -923 -541 -534 -1307 -291 1047 846 -1106 -1767
3155 -1767 -863 322 775 387 230 -249 -1656 -870 820 1927 304 -710 -747 -245 -471 118 1324 1595
3173 1595 -544 -1859 -626 1490 1328 -103 -39 143 -716 -853 410 1862 1098 -816 -1139 334 804
3190 804 596 512 862 -90 -865 -303 1265 1724 215 -487 73 205 -312 617 2188 925 -1162 -1262 548
3209 548 1233 728 78 619 152 -993 -500 1331 2107 420 -1688 -989 380 711 282 541 564 -562
3227 -562 -1112 84 1247 1012 -341 -578 -263 -407 -415 679 1024 -24 -1245 -779 419 901 -102 -423
3245 -423 -54 -479 -1327 -299 1088 601 -1183 -1719 -584 449 -44 -276 129 49 -1017 -1441 -10 1193
3263 1193 233 -755 -839 -550 -330 -302 580 415 -934 -1662 -534 650 601 -3 -332 -105 -1117 -935 397
3282 397 1235 616 -1121 -1305 -379 443 232 -131 238 -158 -1124 -820 752 1367 402 -809 -620 -188 30
3301 30 276 585 981 -758 -1488 -222 1178 817 166 234 -386 -529 -532 1142 1565 749 -1051 -711 426
3320 426 593 635 698 844 -660 -1474 -238 1743 1584 -372 -777 49 188 -190 479 1462 945 -797 -1373
3339 -1373 72 1396 994 159 345 -435 -693 -62 1250 1395 151 -1014 -400 103 97 596 1185 905 -967
3358 -967 -1567 -108 1744 955 -511 -965 -202 -455 -223 421 1466 592 -1117 -1482 -139 583 717 -128
3376 -128 -645 -847 -1296 -189 851 954 -591 -790 -867 -200 -37 822 827 61 -1429 -1590 96 626 330
3395 330 -414 -682 -910 -793 -446 619 1177 126 -1593 -1327 -28 763 418 134 -271 -895 -710 -273 915
3414 915 736 -431 -978 -551 19 128 468 711 30 -1277 -827 304 948 600 -177 -250 -470 -580 -258
3433 -258 826 1116 -15 -890 -370 619 825 339 374 663 -107 -1050 -48 1231 1099 -252 -791 186 506
3452 506 224 534 669 383 -707 -482 726 1157 328 -143 306 62 -380 -116 1290 1400 -456 -1224 110
3471 110 937 423 -237 422 673 -589 -1334 935 1767 382 -855 -653 94 11 -449 961 1041 -372 -1277
3490 -1277 -529 713 881 -288 -124 -109 -579 -865 384 1512 64 -1536 -1005 398 249 -338 294 281
3508 281 -797 -1543 -490 1144 899 -1062 -846 -75 -86 -345 -148 908 238 -1369 -1399 94 951 78
3526 78 -512 -496 -752 -867 -77 689 692 -845 -1404 -120 270 346 157 601 -55 -947 -1076 305 1120 571 -870
3547 -870 -518 144 -176 75 335 554 -78 -737 -686 417 620 364 -421 -355 -238 4 667 665 66 -302 -338
3568 -338 -154 377 599 690 441 -145 -237 -412 783 964 524 -393 -137 -22 115 298 206 622 -288 -354 -395
3589 -395 816 1388 769 -84 -374 89 -13 256 911 1085 183 -1039 -465 437 800 284 271 -107 -402 -649
3609 -649 269 1118 439 -781 -676 241 -109 -285 637 1361 -230 -1428 -721 1160 945 -225 -328 -219
3627 -219 -111 -1029 86 1380 822 -1021 -1279 -172 647 248 396 78 -438 -1313 -898 1046 873 -430
3645 -430 -967 -781 -367 -548 196 1037 585 -1197 -1490 342 1111 140 -605 -255 -164 -893 -816 757 1018 -299
3665 -299 -1524 -589 -6 201 -380 316 265 -874 -1006 173 912 463 -659 -350 -350 -32 -236 609 977 -58
3685 -58 -778 -389 879 329 -60 1 267 -292 -805 241 1376 768 -91 -612 39 371 515 408 466 314
3705 314 -368 -469 335 881 612 -110 -185 -63 -122 465 531 376 168 -444 -336 179 571 676 374 352 -143
3726 -143 -369 358 953 674 -162 -654 -89 513 328 292 508 416 -575 -737 143 822 736 -566 -686 -182 -152
3747 -152 325 359 458 -89 -1033 -732 127 657 233 -139 -407 -451 -719 249 1033 333 -680 -890 -377 120 -188
3768 -188 -108 387 -258 -1578 -1135 529 1215 -160 -751 -302 -150 -361 124 626 166 -795 -1179 -262 383
3787 383 367 -257 50 -703 -913 -650 527 788 24 -816 -428 -83 152 -179 333 488 -881 -1567 -251
3806 -251 986 557 -493 -635 -161 -591 -350 146 915 323 -657 -649 195 565 380 197 262 -109 -608 -27
3826 -27 786 738 98 -383 -20 61 61 325 1097 291 -428 -655 151 1207 473 92 241 110 -212 -83 610
3847 610 970 537 -701 -302 325 506 665 223 280 189 -425 -341 1034 939 82 -343 26 144 236 593 615
3868 615 129 -327 -567 163 571 402 -187 -282 -348 -664 -88 580 550 -321 -699 -222 70 272 207 -77 -17 -569
3890 -569 -777 -109 729 453 -395 -841 -295 42 -43 -84 293 -199 -812 -695 193 437 140 -376 -425 -386 -492
3911 -492 -37 753 156 -648 -899 -16 484 -283 -390 4 -61 -696 -778 270 719 4 -612 -630 42 383 -250
3932 -250 173 108 -320 -664 -257 471 340 -102 -73 -339 -188 -178 439 787 103 -692 -318 106 565 207 182
3953 182 -5 83 -377 -310 638 1095 -130 -564 -6 490 506 281 427 295 -552 -456 124 899 584 -324 -38
3974 -38 -426 -87 61 1104 781 -99 -951 -458 592 550 109 559 74 -488 -578 65 1236 728 -422 -951
3994 -951 -129 302 305 388 297 11 -608 -732 385 776 37 -496 -454 -164 -160 4 476 658 -504 -989 -565 147
4016 147 379 -95 -178 -97 -697 -707 89 700 457 -723 -660 -339 -155 -206 10 487 -441 -1086 -910 351 879
4037 879 205 -565 -636 -620 -384 75 426 105 -647 -820 -551 246 594 388 56 -589 -789 -452 558 732
4057 732 250 -400 -704 66 49 418 376 380 -249 -1285 -530 701 498 -197 -318 -360 -536 -351 359 1005 227
4078 227 -727 -794 27 636 348 -16 228 -83 -564 -425 893 980 191 -533 -457 174 -110 309 820 503 -337
4099 -337 -622 466 943 575 264 174 72 -238 -131 999 982 260 -878 -410 189 715 307 209 419 151
4119 151 -446 -35 1019 656 -32 -311 -316 -247 -98 558 750 -9 -715 -411 153 227 -254 79 94 -268 -513
4140 -513 -500 720 443 -171 -920 -475 157 132 -63 241 -325 -422 -819 -117 381 57 -226 -166 -126 -414 66
4161 66 194 190 -277 -751 -251 149 171 -49 -142 60 -577 -450 -326 471 239 -204 -688 -253 -22 -1 87 37 -71
4184 -71 -302 -658 155 564 84 -312 -706 -290 -119 -292 170 394 6 -364 -174 573 509 32 -57 59 -67
4205 -67 -300 308 587 308 -487 -333 292 406 208 -95 464 492 -356 -149 362 653 115 -401 -179 195 100
4226 100 71 578 739 47 -676 -228 540 366 194 227 -49 -97 -273 579 918 279 -427 -276 73 565 -90
4247 -90 496 431 -127 -545 -173 758 717 -122 -613 -16 307 -63 335 759 -286 -610 -723 405 631 115
4267 115 -250 -20 -281 -324 -121 496 330 -584 -740 -385 183 12 181 342 -156 -674 -544 470 315 -69
4287 -69 -525 -306 -362 -401 -256 189 151 -295 -637 -912 93 175 -7 -214 -356 24 -442 -40 -37 270 -542 -401
4309 -401 -303 60 289 477 -137 -279 -170 -380 55 10 126 -326 -148 -1 -135 48 84 570 -138 -377 -239
4330 -239 327 314 -215 -161 118 262 -145 27 508 347 -277 -506 146 124 236 281 217 89 -46 -475 392 472
4352 472 237 -34 59 386 84 413 723 530 -270 -803 194 801 299 99 203 436 28 -534 459 802
4372 802 503 -565 -492 465 141 -113 188 371 -426 -697 -168 565 491 39 -245 106 -210 -223 410 709 329
4393 329 -630 -700 535 471 30 -182 83 -321 -516 -362 453 729 -556 -1018 -118 202 381 65 245 -302
4413 -302 -848 -491 -25 328 -141 -628 -615 -438 -682 -60 593 237 -698 -680 -333 -1 74 71 55 -55 -303 -463
4435 -463 247 633 178 -288 -424 -176 -95 -78 294 87 -329 -575 -370 -81 408 289 12 -344 -443 -139 -158
4456 -158 230 336 -6 -481 -180 127 413 185 176 69 -394 -262 131 449 356 117 -397 -3 223 254 432
4477 432 644 -52 -444 -445 305 688 561 27 69 183 131 127 298 484 166 -450 -22 125 692 269 116 181
4499 181 -333 -195 -39 593 356 -294 -333 -284 -258 281 337 649 -267 -844 -453 519 322 -11 -86 -357 -120 -397
4521 -397 83 464 154 -106 -840 -2 161 -134 164 26 -168 -514 -337 205 537 -64 -385 -287 23 -292
4541 -292 -219 277 399 -258 -597 -157 165 -215 -323 -162 -82 115 -411 -46 467 72 -581 -603 -37 -90 -2 -161
4563 -161 -337 -265 -527 -338 356 160 -403 -247 -184 -163 -54 95 328 -197 -271 -471 110 296 -46 -348 152
4584 152 59 -150 135 316 412 208 -140 -134 343 228 7 -8 477 -125 -133 -243 561 294 84 -86 64 43 294
4607 294 -16 154 12 -140 -261 95 128 56 -141 -42 -21 -30 78 455 445 -136 -287 15 405 287 29 249
4629 249 332 -172 -198 358 327 91 -287 -234 293 -13 269 93 57 -229 -151 -121 289 429 111 -418 11 14 -305
4652 -305 159 392 208 -524 -278 -74 212 -50 50 -49 -257 -316 -183 454 368 -14 -438 -516 224 -113 -63 -79
4674 -79 114 -448 -467 -83 370 179 -360 -392 -75 -168 35 -235 459 183 -164 -627 285 9 -22 -58 50 -422
4696 -422 -846 -87 258 248 -184 -290 -384 159 64 369 175 260 -358 -529 250 320 322 11 -268 -204 54 225 194
4719 194 315 -124 -434 -360 -63 8 352 112 -19 -432 -230 70 699 536 80 -99 252 181 -47 366 739
4740 739 169 -573 -387 182 647 287 -132 -108 -256 -297 198 554 306 -82 -409 -268 314 66 255 319 39
4761 39 -444 -33 133 684 160 -130 39 -172 -190 94 477 249 -283 -480 -266 103 272 1 102 148 -263
4782 -263 -281 18 560 228 -15 -330 -281 14 -85 248 91 -361 -493 110 341 403 -88 -184 -103 -401 -342 222
4804 222 257 96 -223 -521 -99 244 114 -283 -83 -22 -527 -339 -163 350 -247 -414 -515 -308 -78 90 35
4825 35 -109 -267 -251 -239 328 249 126 -314 -10 -322 -128 337 290 8 -489 -531 186 321 -50 -17 91 65 -410
4848 -410 -208 155 559 -55 -233 -106 331 37 275 369 235 -263 -599 259 486 381 3 -260 153 -81
4868 -81 28 403 450 185 -135 -151 286 516 144 361 -141 -131 -439 340 371 221 203 -179 88 -4 -13 333 -128
4891 -128 -59 8 -298 434 98 271 -151 -240 3 282 205 169 -84 -158 -153 -254 99 337 -127 25 135 -519 -29
4914 -29 65 211 5 -467 -345 -149 345 -206 -199 -87 278 -435 -414 175 338 187 155 -136 235 -93 -263 1
4936 1 55 -19 -154 -381 -263 221 -144 -175 -3 -312 -250 -77 522 420 -353 -95 -20 -63 -155 22 199 -181 -408
4959 -408 -194 16 582 -60 -201 74 -78 -282 -31 339 269 -110 -548 343 152 97 -52 498 51 -238 -261
4980 -261 158 631 111 -358 20 218 55 -98 539 366 -180 -465 228 318 211 64 21 198 93 246 368
5001 368 503 -138 -90 -164 783 395 295 9 -3 -166 99 -6 330 410 -60 2 107 -54 99 111 180 1
5023 1 -424 45 237 298 -186 38 289 251 9 7 193 127 -189 -22 -100 293 -180 2 3 -264 -78 -241 293
5046 293 182 -305 -394 -150 -359 32 228 -145 -133 -458 -96 158 -144 163 -346 33 -314 -120 -102 149 314
5067 314 -47 -106 -355 -114 153 2 -128 -147 -175 -120 -230 45 400 388 -316 -305 69 32 -137 -167 170 -235 -546
5090 -546 -208 -270 439 -120 13 -305 -164 25 -37 444 139 -78 -414 -164 84 344 -128 48 -351 -120 -205
5111 -205 210 465 524 -45 -375 142 193 5 254 372 -179 -157 91 491 474 185 -215 -141 -105 -159 467 700
5133 700 20 -300 -373 110 323 129 -12 476 -50 -352 -127 554 404 -156 -195 -54 35 -86 495 446 432 -135
5155 -135 -204 105 210 -211 110 -87 5 -369 -113 501 76 -17 -288 -240 -26 -91 -197 219 25 -533 -233 30
5177 30 448 261 13 -408 -33 16 -24 349 23 -104 -336 -123 -107 202 226 85 -69 15 -182 -229 175 224 -258
5200 -258 -242 -354 -299 -211 29 -35 52 -653 -279 -56 483 -11 -88 40 -154 26 -206 -30 -22 -51 -259 -304 14
5223 14 242 242 115 -156 -314 -214 -13 112 429 142 -114 51 133 268 359 173 -237 -83 -171 249 178 233 3
5246 3 71 126 108 -55 140 240 -9 -141 102 307 351 209 208 192 126 133 -95 118 243 82 -121 -115 42 -173 126
5271 126 106 150 113 195 400 538 -233 -332 223 54 54 166 443 216 -96 2 -173 170 -8 114 -72 27 -222
5294 -222 -47 -4 194 -137 -4 240 111 100 -49 -141 89 -275 16 -24 86 127 2 -108 -261 90 -7 -111
5316 -111 142 26 -185 -186 -27 145 -124 -197 -105 161 -317 -315 285 124 -181 -257 -321 55 215 -286 -217 -26 -432
5339 -432 -231 -105 155 -159 -261 -215 -71 -38 6 383 83 -166 -412 -256 436 283 6 3 141 -181 -146 250
5361 250 41 288 -189 -217 262 214 102 -124 16 -111 -100 48 207 258 30 -518 -51 -109 -5 441 166 256
5383 256 -97 -323 -68 395 69 357 -17 -86 -273 120 -54 138 122 -159 -172 138 350 105 294 131 -126
5404 -126 -470 -147 287 163 108 -186 -357 56 89 348 36 505 -184 -439 -19 404 383 -178 5 -24 58 -74
5426 -74 136 49 121 -47 -121 -265 -156 183 -6 -31 -284 -319 -115 362 -68 -253 -10 -111 -323 -557 -224 349
5448 349 -114 -162 -570 520 59 -165 -251 -226 -145 -409 -492 -14 73 -339 83 -113 -129 126 -189 -63 -282 -160
5470 -160 -174 -145 278 -276 -154 -189 147 -223 -46 396 157 81 -341 -85 80 538 -106 188 104 45 -12 -86 191
5493 191 392 74 -216 -95 57 53 175 109 -49 -118 129 402 226 223 27 -215 -235 259 75 299 139 -140
5515 -140 149 187 258 167 88 69 -154 256 233 250 232 157 126 -316 -288 87 315 139 235 28 -9 -85 178 149 -84
5540 -84 -43 -241 -243 -203 5 375 169 32 -90 -17 219 57 76 277 -41 -205 -465 20 316 250 -285 -178 -54
5563 -54 -29 -356 69 -36 20 -317 -177 -1 209 186 -190 84 -151 -305 -8 54 66 -488 -482 264 113 43 -25
5586 -25 54 -102 -348 -447 244 155 15 -210 28 220 -356 -37 126 271 -135 -121 -14 58 418 -66 90 -308
5608 -308 -377 -262 -206 -7 -181 -179 -70 -106 200 65 -41 -92 -23 -254 -10 667 -119 -198 190 62 277 -276 58
5631 58 28 -30 -78 -129 245 -48 80 9 27 -393 108 22 83 131 -204 -18 15 61 -36 140 -227 -75 -25 -22 3 78
5657 78 -448 127 -47 -179 -54 81 239 105 -194 -204 -49 138 336 -154 244 -44 -41 -78 149 155 161 90 -166
5680 -166 -292 14 -148 -167 -14 -29 -170 -15 1 321 -2 -369 356 -219 -38 35 -69 -39 -326 -89 -64 226
5702 226 -231 -284 -73 -289 81 -225 -137 -27 -387 -253 -51 -176 33 231 21 -281 -295 -361 -198 -149 43 -357
5724 -357 -273 11 35 -163 -67 90 -165 -498 -351 140 -134 -83 -352 -158 267 -228 -49 92 187 -72 -215 -249
5746 -249 102 -35 99 119 173 -153 -15 14 499 125 -220 126 -101 66 241 174 137 428 -276 92 399 242
5768 242 306 0 -352 -195 -8 118 117 433 -101 -75 407 186 283 163 -32 19 20 101 178 -48 65 -66 -54 68
5792 68 187 232 -80 -122 -128 -145 293 373 81 -184 255 -70 -177 72 -16 98 270 -239 -46 -322 19 64 99
5815 99 193 -175 -35 108 -109 91 -193 -9 -319 -105 -46 -238 -130 -60 -243 -203 -64 82 -314 120 -208 -252
5837 -252 -260 -75 263 109 228 -113 -237 301 -236 -114 -111 18 -174 -359 -517 -47 469 -113 -399 -160 -153 54
5859 54 -245 179 114 -118 -172 -20 144 -168 -9 42 -233 -326 -54 245 546 -240 -255 -15 -60 -114 -18 266 87
5882 87 -193 -284 223 295 22 -59 323 256 -27 286 74 250 -89 -105 -6 202 80 210 -155 -143 155 -290 385
5905 385 118 97 65 -29 -219 312 103 91 206 87 -17 -36 259 230 -188 -187 -28 -223 22 -76 -19 70 228 -314
5929 -314 -97 219 20 90 204 14 131 14 14 122 -199 144 -271 3 -191 -256 -300 -56 -263 79 158 254
5951 254 -22 -142 -257 182 41 -433 9 -54 48 -121 -446 -180 110 -116 170 -96 162 -4 -141 -140 -25
5972 -25 -10 60 -227 -193 -61 -217 -2 21 -1 -206 -145 17 154 -97 -55 51 119 23 69 298 -292 -211 -149 64
5996 64 252 102 -159 -207 224 -108 -17 145 355 53 -218 -216 -18 156 -166 95 68 117 33 2 543 35 190
6019 190 49 79 79 100 111 -132 310 232 143 337 118 -46 -205 151 -121 110 3 412 298 167 -211 436
6041 436 99 62 -107 433 53 100 78 35 44 -252 -52 -171 -230 -141 218 60 382 247 -96 -15 -74 63 146 -62
6065 -62 -305 94 -62 66 334 119 -174 -177 113 203 -96 20 -75 56 -182 -129 99 9 -114 -82 -218 -208 -216 -47
6089 -47 58 -114 -143 -190 -86 -260 -191 77 68 -37 128 -240 -62 281 51 -440 -191 -64 -119 -87 102 137 113
6112 113 -79 131 258 24 235 -241 -3 -66 -22 -179 -45 302 -3 149 -32 169 410 18 208 -261 -185
6133 -185 -153 81 247 89 -8 -108 288 72 -238 55 -71 -217 -212 144 413 170 -72 -26 285 20 -301 -140
6155 -140 60 -200 106 142 115 128 3 206 352 -186 -49 229 147 -57 31 -60 91 -230 -243 151 11 -110
6177 -110 135 3 178 173 324 68 29 -235 -232 192 363 145 38 -377 -303 197 215 -54 -143 -240 -257 -121 64
6200 64 363 183 -173 -293 -160 -52 -130 -109 207 48 -298 -317 81 -11 97 -115 -223 -200 105 -34 198 197 5
6223 5 -217 -150 -306 2 77 -99 144 -129 -143 -90 277 47 -142 -107 -97 330 217 -81 142 94 -206 -198 200 148
6247 148 -252 -342 53 -353 -87 278 -109 322 -62 -146 126 109 -225 15 165 -108 -23 -76 -148 253 271 -5
6269 -5 -257 120 -18 -86 70 200 131 -10 -288 243 -38 -82 367 -267 81 -179 -51 44 222 71 294 25
6291 25 -4 -3 169 313 244 -69 69 189 296 -155 -20 54 202 90 -148 66 209 128 -106 37 160 -53
6313 -53 -107 14 258 -189 -65 -54 236 -80 -62 -5 325 -283 -362 32 -300 -167 -223 -109 59 -122 -226 209
6335 209 -139 -121 -107 -17 250 -428 -229 -26 237 79 29 -4 206 175 4 -297 52 173 -282 -238 48 144 -108
6358 -108 -102 9 38 -156 26 -76 149 -43 78 178 88 85 -243 -155 23 187 -142 -32 -93 -7 303 47 -171
6381 -171 116 15 111 46 -241 405 -12 -91 233 112 -156 191 -188 -96 -41 110 33 20 -24 129 -76 -88 81
6404 81 109 249 91 -31 84 70 -54 -132 72 221 224 111 -33 173 329 -29 -371 135 163 37 173 224 14
6427 14 36 88 -22 259 178 -170 -291 171 -33 88 100 -91 -149 80 141 157 135 -332 141 -214 -45 -105 58
6450 58 79 -143 -99 6 147 307 -94 105 -62 -99 -365 -192 274 -13 -243 12 -47 -53 -87 -18 -2 -109 -127 -311
6474 -311 10 -115 -103 -164 68 -27 -272 -39 170 -217 -166 -49 -109 197 116 -306 62 -231 -167 -280 -36 293
6496 293 192 -194 -114 -63 -127 -239 169 88 -109 -128 247 111 -146 75 -176 148 -226 -243 199 -188 -66 38
6518 38 77 -32 104 -143 240 95 3 -191 -23 292 138 280 -106 11 -345 -23 -37 -111 148 38 95 -39
6540 -39 90 107 -312 190 -128 -80 292 -194 32 18 -150 -60 -53 264 273 272 -133 -12 11 196 133 86 272 13 111
6565 111 22 -177 204 95 119 111 123 -49 169 125 423 -24 12 -118 -6 -176 -15 347 -154 87 -9 229 -133
6588 -133 327 -14 199 43 117 39 73 156 6 20 -330 -109 -151 8 -9 -242 -19 -155 -80 -213 93 121 -10
6611 -10 -294 -115 -83 214 -99 -106 33 -29 -167 -59 -112 -195 -257 25 42 -342 -28 82 -27 -108 8 -383 -127
6634 -127 -61 -173 -11 -4 221 97 -62 383 113 -49 -78 171 117 72 -138 96 184 33 -11 337 191 -98 -14
6657 -14 209 -48 58 43 -90 -98 27 85 -298 -113 17 82 60 65 52 -176 -1 66 -147 26 -39 48 15 9 85 116
6683 116 -60 -95 62 -353 44 23 60 -46 175 62 -57 -107 -86 -128 31 78 475 24 -38 -262 145 -18 56
6706 56 280 -223 72 8 -112 -357 -19 -58 36 -83 -3 -12 -244 38 109 -23 -202 6 -16 27 -70 -273 -283 26
6730 26 -33 31 295 55 -187 31 76 212 -190 -99 259 30 -196 -193 -76 -79 100 -194 -205 -232 -50 -86 -102 -144 -323
6755 -323 62 182 -181 0 -85 -12 59 -157 -84 65 144 211 73 -127 -114 -82 198 120 46 -126 -38 93 441 -35
6779 -35 76 174 -42 114 118 161 202 -38 -152 -115 480 109 133 96 -108 18 -238 27 213 42 -196 -150 180
6802 180 208 -8 9 40 38 36 47 -130 204 130 -301 122 119 -218 -198 379 -20 119 -21 202 236 1 39 -72 -145
6827 -145 238 -199 112 135 280 67 -213 -66 94 -229 59 -110 46 60 -11 -37 316 -293 -166 -447 232
6848 232 97 -113 -47 -82 52 -289 -144 380 61 -5 -96 -123 296 -54 -268 -113 31 -236 56 -194 226 2
6870 2 15 -22 42 33 37 320 -296 174 -55 8 71 40 -133 261 9 253 -237 -316 56 111 27 -33 -76 -158 24 -8
6896 -8 -58 200 -90 -61 45 280 114 -113 39 -257 -245 22 -34 249 37 -218 -327 46 -334 -67 266 77
6918 77 -78 58 99 311 -146 -154 369 -6 79 39 416 211 -16 -133 432 168 236 1 370 231 125 51 -47
6941 -47 -54 179 -36 -190 -204 146 49 185 424 -119 -307 120 198 59 141 -151 87 149 -12 104 230 -79 18
6964 18 -114 154 4 20 -105 232 200 262 54 87 49 -239 28 -160 -327 -63 -79 144 155 137 -287 300 72
6987 72 24 51 35 -46 -361 4 125 130 38 7 23 -62 55 260 -7 25 281 -31 170 37 20 -362 -41 -26 123
7012 123 -131 -165 -61 192 198 -45 89 171 72 33 292 -179 83 15 -105 -11 300 -182 -209 -76 220 44 76
7035 76 53 98 -264 -9 267 225 -19 148 212 343 295 -175 102 -14 57 -224 -75 70 28 -381 -9 260 147
7058 147 -83 -28 13 83 -91 53 64 39 104 120 -39 76 -409 119 298 68 -111 319 77 -154 90 96 -101
7081 -101 84 -29 -138 76 -72 68 136 231 -35 58 335 251 -201 -12 99 -8 -8 -184 -69 -13 69 -134 -32
7104 -32 279 -150 -172 -212 82 -102 -28 -244 148 -152 -12 -42 15 -23 102 -200 -226 -46 -139 125 -142 -187 -396
7127 -396 -8 256 -21 62 -44 306 289 112 99 -115 -40 99 270 247 289 -32 -159 157 131 181 -231 64 11
7150 11 -182 130 176 15 -214 104 -94 -42 287 -15 -46 -161 -205 -123 312 -99 6 164 -5 124 80 149 90
7173 90 -61 167 409 -127 170 222 -46 178 -67 -13 103 173 52 152 -126 -29 -93 -48 34 91 -72 17 198
7196 198 -67 8 -72 217 60 -175 78 91 -85 58 -162 76 121 -93 104 425 120 90 -86 173 -71 118
7218 118 41 20 324 -43 426 173 182 77 -151 -17 -52 -69 -142 -386 -142 -49 56 234 197 49 51 -96 179 150
7242 150 61 211 -90 126 56 68 -331 58 -120 -16 92 -74 -301 -43 223 -2 -164 -133 -99 -48 9 -145
7264 -145 -261 -88 -57 -226 -75 -300 -96 -6 165 -27 139 15 91 178 6 261 -111 -139 -120 -222 57 -310
7286 -310 180 -29 57 -163 -205 -18 -152 -13 54 165 -20 111 -339 -41 -113 -181 35 150 -94 163 -387 243
7308 243 20 286 156 -87 63 124 21 -9 -49 -122 -157 -9 28 -67 27 -294 24 27 133 226 31 17 117 52
7332 52 -53 259 139 56 -69 36 -89 105 144 -216 -125 -7 -363 21 237 35 -96 32 191 -146 -137 -149
7354 -149 184 34 -240 -25 -142 -63 -5 66 7 -261 -357 12 -127 30 -67 123 -290 134 -60 10 115 -206
7376 -206 -94 -432 177 -53 54 -104 -59 71 -20 38 201 422 -243 -202 -136 -139 300 113 321 70 -241 -421
7398 -421 -27 -38 27 31 -123 181 30 -146 -87 30 -209 16 182 -117 -81 -176 -380 107 72 343 -121 -128 88
7421 88 7 -34 -22 -269 212 -39 -296 -122 -256 45 -234 81 -31 -175 -51 87 -165 -169 -5 132 101 121 -230
7444 -230 209 9 -110 74 -55 -357 59 -244 24 124 51 -105 -18 78 -18 -94 326 -24 -162 -88 -32 179
7466 179 11 159 -198 218 41 -45 -314 53 -130 57 -218 75 49 33 -68 7 62 -175 -168 -22 -3 73 -180
7489 -180 105 -247 -335 61 -186 30 -53 -100 187 260 35 -117 40 -229 -73 221 -4 57 -31 -309 201 -4
7511 -4 -13 -279 21 -96 3 -109 -123 136 64 -97 127 134 -1 -54 -117 -64 21 -41 -44 -80 183 23 94 -141 18 65
7537 65 -74 273 -355 -226 2 119 32 51 -15 43 -323 52 114 40 39 -55 -286 -256 -109 24 169 -202 -52 150
7561 150 186 137 86 9 -160 48 142 -2 -11 86 -8 -92 134 58 58 123 220 -23 169 -62 -45 53 145 -183 -181 61 114
7588 114 29 -237 69 -2 -52 110 194 190 18 -43 -43 -120 -55 70 -7 21 229 31 4 -308 50 -140 12 208 -112
7613 -112 -83 -105 -218 266 21 -232 -151 -18 80 -85 -140 -20 132 37 108 -147 -15 85 322 280 272 -60 -84 -76
7637 -76 -162 -10 43 -53 41 -12 -338 -271 94 -229 1 -248 207 352 237 192 1 -129 -124 230 -9 -396 -343 -69
7661 -69 -178 -265 45 18 -103 23 -77 -3 76 66 27 95 152 13 -251 -29 46 -200 -160 -343 -178 -26 239 -293
7685 -293 -58 -139 154 45 158 -12 17 -221 -71 109 -139 -16 -53 252 -72 -201 53 152 -277 70 -214
7706 -214 -126 674 -136 67 264 -19 7 -35 -125 -4 -6 -122 353 11 -81 -68 -50 -218 -18 -179 200 24 299
7729 299 18 162 -105 -100 -45 25 -222 -163 40 -229 246 -105 -40 -178 95 0 -69 -193 -88 99 149 -168 -52
7752 -52 158 48 -163 19 102 59 -128 -1 60 16 183 11 57 41 27 243 149 -223 184 -131 8 96 162 -182
7776 -182 -254 118 133 45 294 92 13 144 105 -189 68 149 108 -56 15 -177 -157 -209 -93 -341 -170 37 228
7799 228 -222 17 168 193 102 19 222 -135 -147 -32 179 -183 -119 175 151 -255 -39 -143 36 32 254 299 288
7822 288 18 -162 352 7 104 10 -111 -16 -96 36 115 27 175 -236 -29 -94 78 181 -166 110 -262 -14
7844 -14 240 116 -104 315 -63 287 266 126 140 68 -27 -164 28 42 -227 -105 -65 229 -143 -81 -102 84 -247
7867 -247 4 -17 -285 -205 131 -114 -104 97 -477 54 -26 114 -11 -265 66 -169 -75 50 -206 -144 -73 -255
7889 -255 -229 27 107 51 89 314 -105 -207 -25 -62 -227 -24 100 123 -50 57 -9 -87 80 -95 204 -99 28
7912 28 171 188 20 8 141 2 -25 -1 22 -100 172 99 75 -49 66 233 -42 57 -187 -10 519 142 -68
7935 -68 96 53 75 -148 110 77 -108 64 68 149 169 -64 -86 107 -87 27 170 122 66 19 -151 -38 -93 197
7959 197 160 -93 -275 -282 1 232 353 -277 -287 -245 -65 288 -168 -98 66 -216 285 -37 115 31 19 -30 138
7982 138 -27 -216 -37 -144 -254 -55 -153 -190 -134 18 40 -171 -53 156 260 3 -194 -293 281 43 91 -146
8004 -146 -393 -230 -304 -31 287 -237 -148 -134 95 -142 84 103 74 -253 -24 -76 48 87 -406 144 -238 -365
8026 -365 -164 -106 -20 267 -137 46 2 141 31 120 198 -124 -34 152 26 219 -56 -243 34 51 218 167 43
8049 43 -79 226 13 29 -100 -48 154 -74 248 -140 78 -119 117 121 142 172 -110 -112 -82 -243 81 -18 -143 18
8073 18 32 171 198 64 -55 -215 -48 16 -438 152 -94 251 28 -210 251 249 -70 264 150 -241 -106 -1
8095 -1 -156 270 140 187 -130 131 213 7 116 7 277 -101 -126 226 -23 -3 204 44 -49 246 -94 -33 45
8118 45 -74 -88 -166 -126 -284 159 307 145 -19 -308 207 157 186 173 -82 93 -76 -19 -172 136 146 359 -124
8141 -124 90 8 32 -87 -260 -111 12 186 -79 -74 79 50 -118 -15 222 -29 -116 126 262 30 -274 17
8163 17 -159 45 340 54 -41 93 52 230 -270 -76 239 -76 -66 -64 -4 -90 157 -121 53 36 67 -12 9 -84
8187 -84 -29 129 6 -87
8191h7
$$ Imaginary data points
##PAGE= N=2
##DATA TABLE= (X++(I..I)), XYDATA
0 0 0 0 0 -8 8 0 8 -16 16 -16 24 -32 40 -40 56 -64 80 -91 111 -128 152 -175 203 -236 271 -307 351 -401 452
29 452 -510 576 -647 723 -807 902 -1005 1115 -1237 1377 -1525 1687 -1867 2068 -2289 2535
45 2535 -2813 3130 -3490 3901 -4382 4953 -5642 6489 -7565 8984 -10946 13845 -18574 27620
59 27620 -51074 234830 448060 -248409 -359414 91211 274674 -111232 -184824 176268 255419
70 255419 -172546 -296494 90010 293629 -23684 -211404 24942 164798 -88724 -198557
80 -198557 89698 260509 -20221 -248978 -50947 180430 44785 -128629 9154 167817
90 167817 -2178 -203121 -48949 209863 129885 -129167 -133251 61677 86900 -39520 -25273
101 -25273 88805 31868 -124137 -84516 92243 95982 -54329 -70628 45039 35096 -84662
112 -84662 -57400 91581 88129 -66797 -99990 20276 59552 -17007 -16458 61142 27470 -87556
124 -87556 -69365 60577 77455 -21450 -36502 31300 5577 -79694 -33135 93855 67665 -83087
136 -83087 -98813 39907 82519 -30063 -77117 18012 62637 -27102 -76680 5096 64707 5948
148 5948 -43701 504 25750 -30727 -43499 40831 72792 -23858 -84795 398 78866 13419
160 13419 -66880 -15385 57871 6261 -68156 -11250 77516 29343 -76942 -55779 47645 52812
172 52812 -26940 -37458 21600 22644 -29457 -21818 33021 28490 -22265 -19408 23634 12246 -29676
185 -29676 -5713 51620 32217 -42192 -46830 22880 47556 711 -22715 8290 18202 -17520
197 -17520 -23106 21444 35798 -9193 -35525 447 29466 5259 -15092 8763 20858 -15197
209 -15197 -32361 12316 45683 7062 -32882 -4765 32068 4433 -31743 -589 43207 14789
221 14789 -37876 -21899 29244 26329 -11747 -12075 8170 -6512 -24287 9045 44542 10121 -44855
234 -44855 -29958 23129 24218 -13339 -11806 19690 10082 -30007 -26670 20195 35640 -601 -28012
247 -28012 -13483 6619 3765 -2455 6591 11914 -4022 -22918 -18829 3782 19109 13626 -4388
260 -4388 -19567 -21174 -7130 13838 21447 3702 -21818 -25896 -4805 13608 10326 107 -772
273 -772 -2767 -15681 -20108 1740 26060 17621 -14708 -27768 -8190 11630 9273 681 1810 -4
287 -4 -15030 -18968 4027 28167 16139 -16466 -26395 -7637 7717 9213 11653 12003 -6890 -29072
301 -29072 -17121 19079 28990 4264 -13055 -6479 -3816 -9346 3562 28199 20777 -16913 -28890
314 -28890 -1409 19875 10418 4209 12626 2296 -25734 -20567 21505 39950 7706 -23795 -14556
327 -14556 4217 2039 2751 21395 21882 -12539 -34968 -8168 28380 25272 -495 -7572 -2161 -8104
341 -8104 -9847 12521 30961 10083 -22277 -19113 7798 14556 4120 6688 12669 -7525 -30828
354 -30828 -9837 32207 31144 -9592 -26196 -5237 5118 -5631 2440 25587 13821 -28237
366 -28237 -34296 7986 31894 8117 -13566 -4727 -38 -14643 -10107 20748 26100 -8823 -30465
379 -30465 -9816 12318 5002 -1624 10082 6920 -22899 -31012 4787 32170 11233 -20254 -16698
392 -16698 -180 -5475 -11130 11234 26261 -2089 -37646 -23877 18709 25591 -3385 -13788 -149
405 -149 -2870 -18999 -6413 25583 22276 -16976 -31086 -4381 13663 2532 15 13462 2635
418 2635 -30045 -26772 17794 34564 646 -23247 -6217 4760 -11809 -9318 25582 29828 -16256
431 -16256 -41376 -4814 31128 14876 -10784 -566 10102 -11671 -23652 8846 38102 13487
443 13487 -25068 -21126 5766 8751 646 12719 20045 -6814 -33009 -11864 27560 25857 -4703
456 -4703 -10845 3166 -2627 -16599 3248 36375 22636 -25747 -33412 7580 29356 6839 -7228
469 -7228 8817 8579 -20919 -22814 18636 38821 4518 -27628 -12936 9308 1743 -3584 16858
482 16858 21091 -13606 -33533 -3729 26981 13993 -8367 -334 7089 -14156 -22756 11021 36832
495 36832 8176 -29692 -20031 10788 9713 -5742 4440 17697 -5873 -33939 -14808 25863
507 25863 25440 -8873 -19531 -3289 -1029 -12971 -1025 24627 16138 -21541 -31061 -565 19436
520 19436 6639 -4187 2340 -1215 -19151 -15139 15398 24849 -3109 -23224 -8812 5370 -3159
533 -3159 -5042 13896 15257 -16632 -33510 -3165 26452 11770 -14903 -9524 5940 -3705 -16421
546 -16421 1482 24181 10326 -19783 -18771 5056 12613 2842 1963 5084 -6205 -16083 -1094
559 -1094 19071 10982 -10051 -9883 4041 1567 -7682 2053 18262 6476 -19400 -16744 10916 20380
573 20380 2437 -8664 -317 4264 -4319 -3761 10514 14817 230 -9925 -3159 6765 5625 3200
587 3200 5420 3728 -5093 -7154 3790 12737 6596 -4932 -6969 367 4741 2621 1275 3562 2951
602 2951 -2943 -5947 1097 9183 5986 -2883 -4079 1278 2241 1325 5148 6500 -3672 -11141 149
617 149 13976 7229 -8817 -7144 5848 2455 -9981 -3674 13865 9431 -14070 -18572 2258 13897
631 13897 3788 -5569 -2528 -2669 -8453 -3828 8678 7725 -4543 -7400 -867 -2917 -8589 2076
645 2076 16419 5939 -20031 -20064 6905 19374 698 -14379 -4713 4532 -5980 -12915 3224
658 3224 17117 3474 -18741 -16974 2422 10104 3605 -250 -1857 -9691 -12846 1923 16591 6938
672 6938 -12143 -11928 2097 2385 -5468 3748 16831 2972 -24612 -19894 13063 24208 2636 -12903
686 -12903 -4796 -447 -8086 -2861 16792 17147 -8311 -20891 -4816 10002 6426 3221 10010 3273
700 3273 -17483 -17494 9391 26070 9560 -11484 -9667 370 707 941 10554 13851 -518 -14386
714 -14386 -9488 5204 11899 9197 4532 -3694 -12210 -8795 8043 18758 9410 -7691 -11291 -1491
728 -1491 4707 3030 4698 10213 4944 -10757 -15515 2119 20512 14209 -6769 -14800 -5134 3849
742 3849 5562 7444 7495 -1174 -12494 -10095 3003 9883 7686 4858 -1424 -13939 -16002 3949 23211
757 23211 12088 -13645 -18183 -686 6440 -1329 900 13002 5085 -18887 -21919 4470 22124
770 22124 8792 -8955 -9426 -5981 -8419 -2101 15053 15390 -8792 -22997 -7644 9507 5455 -1318
784 -1318 4889 3789 -15993 -22202 3601 25826 10308 -16087 -15668 -519 803 -2499 7768 13414
798 13414 -5110 -23120 -9390 14654 13084 -4183 -5184 1915 -5940 -14271 2051 23045 11958
811 11958 -17332 -20856 2192 13875 4300 -1269 3747 -393 -11962 -8260 10469 16175 1673
824 1673 -9359 -5738 -1104 -464 6057 14584 5909 -14377 -16313 5403 18298 6595 -6284 -1049
838 -1049 4366 -5081 -9477 7062 20782 6825 -15405 -13334 5522 12060 4315 1089 2589 -3286
852 -3286 -9414 -758 12542 9831 -2482 -5073 138 -1246 -3618 6115 15182 3304 -14903 -11433
866 -11433 8463 13532 1099 -5459 664 1502 -5908 -4432 8963 12652 -1665 -13064 -6255 5135
880 5135 5847 2025 1853 332 -7881 -9776 2016 12895 6402 -7875 -10077 -2519 1191 -41 4144
895 4144 7914 -1497 -15207 -12174 5595 13029 3157 -5586 -4994 -5670 -8449 -444 13342 9903 -9965
910 -9965 -17778 -3896 7405 2991 -1264 3552 1065 -13192 -14831 5463 18284 4390 -13430
923 -13430 -11067 475 737 -916 5656 8042 -5506 -16235 -5830 10736 9264 -1797 -4493 -1885
937 -1885 -6487 -7160 6497 16509 3116 -15713 -12353 5035 9024 946 503 5554 -2643 -14609
951 -14609 -6320 14181 16472 -1878 -12627 -5435 2823 1810 4115 10051 4918 -10027 -13194 2289
965 2289 13090 8167 -471 -1914 -2932 -6256 -1831 10973 13554 -204 -11117 -5448 4964 5681
979 5681 2962 4968 3924 -6069 -11158 432 14346 10239 -4576 -8594 -308 2880 253 3181
993 3181 9024 3685 -9420 -9726 4020 11876 4921 -3254 -2822 -2267 -4361 586 9448 8078 -4620
1008 -4620 -10912 -3112 4396 4142 2377 3729 -290 -9850 -9035 4714 12908 3720 -8301 -7805 -1156
1023 -1156 522 -35 4446 6415 -2943 -12512 -8084 5592 10505 2175 -5949 -5610 -3680 -3311 896
1038 896 7392 5078 -6002 -11861 -4236 4976 4603 624 -415 -3118 -8918 -6947 5432 11784 1057
1053 1057 -10275 -7230 900 778 -524 5094 6491 -5711 -14804 -4262 11553 9999 -2796 -6986
1067 -6986 -2520 -1631 -3209 3211 10645 4468 -9611 -11333 461 8394 5234 1852 -245 -4892 -8201
1082 -8201 -1520 10397 11253 -1020 -9074 -4609 1421 2175 3856 8515 4577 -8379 -12383 1205
1096 1205 14189 9254 -3345 -4715 -673 -2237 -2955 6542 14013 3599 -11982 -10229 4574 9844
1110 9844 4422 1331 1756 -4103 -9125 -552 13148 10964 -3024 -8437 -2957 793 314 5592 10850
1125 10850 2174 -12856 -11356 5384 12612 4371 -2883 -1560 -2853 -7253 -2536 10635 12158 -2953
1139 -2953 -13712 -6821 4316 5957 2626 2895 290 -8450 -10795 772 11623 7454 -4522 -8327
1153 -8327 -4654 -2825 -207 6637 8101 -2329 -13326 -9317 3884 8010 1877 -1566 -1730 -5687
1167 -5687 -9058 -1617 11016 9057 -5547 -12439 -4648 3077 2302 1368 4333 684 -9884 -11357 1879
1182 1879 11692 5226 -5824 -7016 -3045 -2121 -942 5666 7335 -2687 -11426 -6451 3953 6053
1196 6053 2408 928 -751 -6415 -7681 2817 11463 5442 -7124 -7619 169 3126 -176 2847 7471
1211 7471 1444 -10409 -8566 6061 12636 3281 -5875 -3656 645 -417 -75 6184 7450 -898 -7988
1226 -7988 -3251 4687 5501 2893 2322 -123 -5896 -4622 6098 11572 2232 -7386 -3895 4571 2723
1241 2723 -2178 2521 8651 678 -10263 -5368 9073 9902 -1624 -5870 327 2375 -2341 -33
1255 -33 7451 5222 -6175 -7250 3008 6784 650 -1563 2519 674 -7088 -4272 7534 8881 -3024
1270 -3024 -9096 -1448 3769 25 -1825 3670 3162 -6017 -8287 1359 7962 1871 -5145 -2541 341
1285 341 -3034 -3405 4083 6984 -2161 -10613 -4569 5687 5089 -2039 -3522 -416 -1476 -4980 -1130
1300 -1130 5625 4078 -4428 -7584 -2735 1808 1967 2040 1299 -3146 -7643 -3515 5558 6118 -1816 -5738
1316 -5738 -1107 629 -2363 -1489 5116 5703 -4088 -10364 -2618 7852 6593 -1745 -4452 -2039 -1097
1331 -1097 -1432 1934 5888 2535 -4365 -5348 -1089 2543 2900 3362 2340 -3263 -7076 -1237 8346 8158
1347 8158 -1653 -6215 -1361 2368 598 914 5587 5239 -3586 -8343 -804 8120 6620 -353 -2060
1362 -2060 -1279 -2723 -1788 5511 9018 1515 -6932 -4363 2529 3600 1095 3264 4946 -2130 -8697
1377 -8697 -2556 8517 9094 -758 -5567 -2147 248 -172 2736 7103 2561 -6582 -7169 1562 5650
1392 5650 2022 329 1798 -2182 -8391 -4046 8893 10859 -2364 -11079 -3906 4488 2760 -1068
1406 -1068 2616 3312 -4895 -9563 -1277 8339 6015 -2578 -5314 -4367 -4130 -383 7266 7195 -4348 -11377
1422 -11377 -4463 4656 2910 -1290 996 2377 -5744 -10763 -1227 10313 6784 -5506 -9176 -2493
1436 -2493 1873 1020 1623 2695 -987 -6204 -4902 1615 3942 1968 -585 -2491 -4339 -3735 1348 6162
1452 6162 3100 -4261 -6721 -1490 3418 2774 346 -66 -299 -2405 -2970 1301 5673 3799 -2426 -4527
1468 -4527 -929 2252 2715 2272 1930 -770 -4317 -2993 3609 6254 1666 -2907 -1726 582 -421 114
1484 114 4578 6275 -292 -6224 -3080 4293 5431 1555 525 790 -1587 -2973 1585 6175 3401
1499 3401 -1854 -2275 784 520 -445 3129 6216 548 -7368 -3981 5748 7330 -1177 -4280 524 1891
1515 1891 -2314 -2030 4851 6048 -2548 -7025 -1310 4711 3405 -159 204 -618 -4631 -3209 4598 6997
1531 6997 -379 -6283 -2639 1774 -428 -1250 3932 4786 -4829 -10531 -2088 8162 5008 -3838 -4260
1546 -4260 -492 -1809 -4622 1517 7443 1772 -8266 -6960 1733 3509 -620 -557 1929 -2205 -7912
1561 -7912 -2671 6815 4854 -3980 -5990 -640 739 -1970 416 5194 1433 -7305 -6328 2887 5572
1576 5572 -162 -2828 288 -252 -4685 -2196 5416 5628 -2949 -6796 -1886 3306 1774 -571 1121
1591 1121 1588 -3015 -4901 646 5830 3418 -1970 -3270 -998 -223 557 3759 4414 -495 -4829 -2629
1607 -2629 3025 3995 680 648 1588 -1404 -4312 -823 6139 5980 -1622 -5077 -846 3146 1625 574
1623 574 2395 2479 -2518 -4534 1017 6115 4016 -1048 -2307 -376 -76 447 3210 4405 -202 -4283
1639 -4283 -2519 2240 3268 869 250 804 -1668 -3901 417 5548 3941 -2843 -4951 121 2645
1654 2645 520 -148 2619 976 -4374 -4718 1865 6274 1508 -4322 -3267 -89 -363 -1003 2238 3149
1670 3149 -1870 -6367 -2894 2892 2500 -728 -1327 -905 -3594 -4234 1138 5474 1045 -5966 -4699 1092
1686 1092 1477 -1446 117 2679 -1097 -6638 -3434 4563 5222 -1800 -5231 -1096 589 -1597 -866 3692
1702 3692 2438 -3904 -5887 80 4237 1248 -1756 -512 -433 -2910 -1873 3515 5065 -1352 -5203
1717 -5203 -1750 2393 1705 -191 1936 2301 -3041 -4961 699 6627 3434 -2956 -2839 624 164 -858
1733 -858 2149 4987 708 -5582 -3942 3252 5619 980 -1437 -11 -364 -1975 637 5555 4819 -1528
1749 -1528 -4527 -491 2707 2589 2361 2896 389 -4188 -3200 3735 6700 1711 -2768 -1580 552 -567
1765 -567 97 3946 4873 -1751 -6317 -2324 4573 5024 154 -1267 -881 -2101 -2143 1686 5446 3085 -2700
1782 -2700 -5099 -1374 2018 2649 2755 1432 -2334 -5499 -2977 3573 4929 283 -3658 -2721 -1697 -1743
1798 -1743 772 4607 3020 -4385 -7635 -1894 4555 3758 -538 -1969 -1521 -3401 -3196 1512 5884 2104
1814 2104 -5050 -5907 -1344 2036 1948 1527 798 -2895 -5996 -2950 3897 4689 -248 -3613 -2529 -2266 -1735
1831 -1735 1656 4817 1649 -5470 -6676 -385 4661 2405 -295 -749 -1245 -4133 -2815 3715 6476
1846 6476 888 -5249 -4048 608 1841 1342 2056 1732 -2915 -5535 -718 5118 4071 -677 -2475 -1269
1862 -1269 -1249 -720 3067 5390 1313 -4591 -4075 1772 3760 1659 934 1456 -939 -4184 -984 5750
1878 5750 5812 -946 -4490 -1276 1809 1144 967 3512 2336 -2857 -4670 587 5853 3604 -1151 -1915
1894 -1915 -936 -441 124 3138 3774 -522 -4110 -1790 2000 2660 1058 1306 828 -2746 -4443 518 5835
1911 5835 3071 -3178 -4005 -147 1433 -572 -63 2315 755 -3960 -4085 1256 4178 1626 -2080 -2503
1927 -2503 -1179 -1308 -14 2741 1839 -2350 -4611 -1399 2096 1318 -580 -61 -294 -2918 -3419 690
1943 690 4192 1276 -3628 -3377 -32 1205 -383 424 1428 -1081 -4502 -2774 2831 3659 -852 -3613
1959 -3613 -1210 -316 -1525 -482 3410 2486 -3070 -5386 -405 4283 1708 -1498 -642 84 -1902 -2194
1975 -2194 1982 4406 409 -3585 -1654 1117 988 261 2418 2449 -2783 -5102 559 6123 2989 -2675
1991 -2675 -1984 1619 -145 -2227 908 5827 2324 -4367 -4492 1891 4801 1703 146 399 -650 -2247
2007 -2247 593 4510 3257 -1092 -2385 -18 621 36 2145 4825 1614 -5120 -4146 3024 5982 1714
2023 1714 -2299 -1257 272 -1323 -680 3095 4252 -562 -4739 -2421 2328 3158 1327 282 -849
2038 -849 -2921 -2842 1818 4921 1857 -2696 -3243 -712 450 454 1992 2348 -1456 -5217 -3119 2297 3489
2055 3489 322 -1779 -1905 -1813 -1922 699 3406 1905 -3123 -4116 -1113 1424 1029 100 517 -869 -3495
2072 -3495 -3460 1346 3922 1449 -3296 -3790 -1609 320 1026 1108 315 -1597 -2892 -2473 729 1849 769
2089 769 -1007 -2439 -2107 -1424 1082 3301 1332 -2868 -3945 -423 2664 1420 -613 126 365 -2203
2105 -2203 -3047 1019 5197 2316 -3455 -3794 -75 1968 679 1216 2190 -641 -4070 -1731 3338 3759
2121 3759 358 -876 -135 -1269 -2026 1679 5640 2515 -3570 -4221 1427 3676 1084 261 1968 179
2137 179 -3664 -2170 4134 5368 -484 -3652 -881 1338 165 694 3445 2435 -3154 -4068 1379 4959
2153 4959 2158 -1298 -796 -38 -987 -660 3432 4512 -698 -4424 -1808 2258 2214 650 1076 336 -3596
2170 -3596 -3959 1249 5756 1857 -3247 -3054 -86 519 -556 1621 3451 -567 -5336 -3250 2383 3979
2186 3979 358 -1805 -1748 -1734 -1402 720 2874 1196 -2479 -3385 -872 1010 539 732 787 -1394 -4348
2203 -4348 -2404 2365 3493 -265 -3496 -1706 -265 -301 -328 1334 1907 -1564 -3990 -1869 2338 2451
2219 2451 93 -1808 -1629 -1526 -951 1182 2502 878 -2000 -2839 -1127 1575 1637 1530 195 -1333 -2503
2236 -2503 -1461 2430 3304 811 -2217 -1657 -57 759 1032 2099 2188 -1278 -3291 -938 3207 3409 123
2253 123 -1436 -255 -858 -1097 1226 3992 2618 -2567 -3575 -34 3091 1999 923 1007 -679 -2882
2269 -2882 -1187 3147 4250 599 -2112 -1145 160 69 1537 3557 1998 -2985 -4049 792 4223 2254
2285 2254 -964 -396 74 -1712 -1641 2573 4517 183 -4259 -2520 1786 2313 475 491 633 -1519 -3476
2302 -3476 -169 3719 2626 -1967 -2437 -1020 -50 -545 1475 2771 -336 -4320 -2941 1639 2587 -83
2318 -83 -1249 -234 -864 -2842 -661 2893 2577 -2119 -4160 -780 1096 362 -434 377 260 -2634 -2601
2335 -2601 560 2580 182 -1977 -1716 -608 -429 -241 1190 1457 -1437 -2777 -913 1091 890 -643
2351 -643 -493 95 -1332 -1861 315 2829 1189 -2400 -2328 406 1381 207 -274 860 61 -2075 -1454
2368 -1454 1392 3086 650 -1998 -1268 283 456 707 1471 1078 -966 -2233 -244 2137 1978 147
2384 147 -13 84 -763 -635 1525 3270 1059 -2069 -1723 1082 1696 626 811 1346 330 -1868 -968 2793
2402 2793 3126 -72 -1905 -251 1140 244 274 1813 1434 -1289 -2342 730 2704 1650 -262 -649
2418 -649 -73 -1060 -364 1784 2650 -451 -2764 -963 1548 821 -12 742 781 -1787 -3214 131 3583
2435 3583 1964 -1896 -2575 -48 336 -513 613 1729 22 -3048 -2774 633 2434 590 -994 -1295
2451 -1295 -1091 -1762 -207 2122 1453 -1566 -2931 -948 487 -164 -98 1229 -86 -3010 -2836 1055 3361
2468 3361 406 -2288 -1441 -224 -490 -828 1375 2208 -597 -3408 -2062 1472 2147 148 -745 -594 -1004
2485 -1004 -1876 249 2922 1644 -1448 -2523 -665 812 462 1327 1476 -627 -2608 -1430 1885 2969
2501 2969 414 -1070 -712 -321 -734 50 2649 2456 -1094 -2975 -723 2254 2085 516 275 154 -867
2518 -867 -1278 850 3235 2134 -1191 -1849 235 1391 863 1229 1454 -378 -1893 -871 1929 2584 236
2535 236 -842 -575 -425 -418 817 2724 1590 -1861 -2754 141 2136 724 -160 583 106 -1866 -1624 1681
2553 1681 3595 569 -2312 -1734 401 759 353 973 1092 -985 -2624 -1032 1754 1739 -391 -925 -817
2570 -817 -1342 -945 909 2041 78 -2600 -2343 501 1150 -531 -496 576 -688 -2667 -1861 1724 2638
2587 2638 -669 -3040 -1389 606 22 -277 524 668 -1587 -2405 -417 1650 900 -451 -931 -893 -1227
2604 -1227 -819 1227 2044 -890 -2839 -1485 1258 747 -250 265 848 -917 -2519 -333 2855 1963 -1761
2621 -1761 -2055 -118 823 250 657 1527 473 -2181 -1755 1172 2196 813 -846 -549 -367 -849 499
2638 499 2365 1830 -821 -2131 -470 1415 1197 887 1067 115 -1587 -850 1673 3029 894 -1264 -1054
2655 -1054 625 399 351 1510 1861 -531 -2333 -1201 2164 2915 535 -1101 -258 136 -61 148 1845
2672 1845 1442 -842 -1894 -622 1723 1503 1059 97 -1112 -1736 -860 1848 2044 254 -1850 -1104 -42
2689 -42 111 48 1379 1359 -1116 -3087 -1023 2190 1825 -567 -1799 -396 -588 -629 469 1876 867 -1983
2707 -1983 -2581 -338 952 870 367 -248 -1012 -2578 -1215 1559 1894 -629 -2143 -1417 -84 -220 2
2724 2 1090 841 -1773 -2955 -392 1955 909 -947 -1037 -559 -1454 -905 1168 2546 250 -2766 -1946
2741 -1946 526 1356 229 53 419 -922 -2355 -520 2086 2251 -469 -1998 -920 82 -59 1277
2757 1277 1842 270 -2236 -1670 1325 2065 631 -312 522 -97 -1784 -470 2651 2688 -795 -2663 -562
2774 -562 1714 1475 515 492 698 -784 -1226 436 2158 1408 -663 -496 -205 22 827 1970 1068 -934
2792 -934 -1703 -40 1660 1332 132 197 442 -682 -1063 498 2485 1629 -1250 -1981 -92 996 608
2809 608 -61 249 53 -1208 -927 587 1541 259 -950 -933 -364 277 232 700 381 -847 -1544 -420 568
2828 568 839 -327 -157 -653 -526 -783 124 1138 236 -1846 -1725 -94 518 -39 -275 456 -377 -1812
2846 -1812 -1789 910 1716 -222 -2137 -1181 164 -32 -590 499 947 -766 -2400 -595 1321 1260 -462
2863 -462 -687 -247 -1113 -1116 702 2131 48 -2227 -1430 452 772 -61 487 917 -844 -2434 -636 2839
2881 2839 2421 -817 -2272 132 493 -553 685 2187 832 -1822 -2253 924 2063 1152 -528 -44
2897 -44 -229 -1225 16 2671 2615 -667 -2015 -555 892 752 923 1300 630 -1709 -1655 1447 3430 806
2915 806 -1098 -805 220 107 -14 1895 1920 -390 -2435 -897 1901 1777 323 -90 -42 -835 -850 933
2933 933 2138 845 -1256 -1748 20 112 827 968 922 -786 -1831 -609 1646 1304 76 -797 -610 -498
2951 -498 -277 239 1649 814 -1247 -1913 -1035 1078 1207 62 -552 -995 -1180 -921 397 1457 567 -480
2969 -480 -1990 -1069 356 590 744 114 -880 -1588 -923 361 591 369 -809 -948 -745 -780 -12 1309 582
2988 582 -1227 -2179 -1067 1075 961 -90 -279 -151 -981 -1276 325 1700 872 -1835 -2230 -462 952
3005 952 619 245 849 -531 -1589 -1013 1373 1935 704 -979 -561 -325 -143 899 2351 721 -1537
3022 -1537 -2120 381 1795 627 -29 381 -119 -1461 -854 1778 2830 261 -2157 -634 1002 958 660
3039 660 896 756 -912 -1555 106 2384 1367 -739 -838 -29 -78 174 1822 1955 -94 -2266 -835 1527
3057 1527 1312 -139 57 219 -480 -1190 417 2496 1502 -1194 -1870 -30 696 359 317 612 -203 -1493
3075 -1493 -1190 1029 1770 297 -849 -735 -751 -588 246 1265 580 -1162 -1922 -471 837 485 105 -224
3093 -224 -535 -1621 -1243 858 1566 211 -1356 -1263 -445 213 109 316 568 -778 -2187 -1258 1122 1519
3111 1519 -48 -1179 -1072 -359 -286 175 858 184 -889 -1749 -733 618 622 183 -115 -730 -1372 -313 1216
3130 1216 1511 -38 -980 -986 91 393 369 969 939 -982 -1923 -187 1853 1918 -36 -902 -310 211 -61
3149 -61 462 1809 1140 -879 -1647 69 1531 1267 373 -108 -421 -1022 -16 1461 2100 332 -1145 -429
3167 -429 611 695 735 1172 896 -844 -1538 790 1831 1272 -676 -443 -130 -216 -144 656 1906 157 -1125
3186 -1125 -1231 923 1428 448 -259 38 -411 -1071 -132 1463 1041 -629 -1050 -483 160 -84 629 902 -178
3205 -178 -1517 -1516 876 1292 5 -904 -489 -184 -997 -509 1048 1020 -748 -2216 -605 641 558 -271 -57
3224 -57 13 -598 -1147 -176 983 283 -901 -855 -401 180 -135 695 548 -881 -1538 -701 961 723 -145 -684
3244 -684 -126 -360 -685 -44 1233 319 -1342 -1675 -151 1024 354 -608 280 -203 -925 -741 416 1244
3262 1244 142 -1068 -908 252 321 539 773 391 -942 -1084 4 1250 917 -234 -317 -248 -457 -124
3280 -124 756 1651 430 -1252 -972 896 987 566 186 425 -116 -730 -162 1227 1591 -104 -1054 -560 651
3299 651 663 467 822 666 -579 -789 217 1488 994 -68 -234 109 -153 224 1196 1133 -111 -1218 -549
3318 -549 576 790 457 281 135 -632 -1020 233 1818 892 -905 -1335 -335 508 105 373 812 -121
3336 -121 -1362 -1610 709 1401 764 -593 -781 -672 -408 -179 757 830 -682 -1574 -568 245 259 191 444
3355 444 -150 -1507 -1347 518 1463 392 -1515 -1432 -493 -147 -313 337 655 -262 -1635 -1247 425 1222
3373 1222 346 -668 -851 -560 -784 528 1022 621 -1073 -1208 -501 169 533 502 431 -508 -1671 -898 1097
3392 1097 1316 176 -822 -564 -364 -368 -16 1202 1027 -524 -1424 -134 1070 1267 635 -56 -132 -316 -37
3411 -37 735 1532 921 -770 -877 22 619 603 595 421 -319 -884 -367 1257 1286 413 -494 -379 -201 -43 510
3432 510 1013 904 -624 -1128 -97 1270 1289 1 6 327 -380 -726 68 1358 934 -570 -965 47 652
3451 652 591 101 196 -164 -898 -354 1040 1095 -234 -658 -25 46 -554 91 999 543 -1402 -1336 134 967
3471 967 43 -829 38 66 -1022 -886 732 1038 -387 -1583 -996 362 115 -55 333 328 -687 -1572 -388
3490 -388 1006 493 -833 -824 -281 -650 -901 652 1152 -163 -1716 -841 425 488 -274 -15 100 -796 -1319
3509 -1319 67 1586 788 -1194 -1026 393 245 -290 -306 581 158 -1317 -854 1122 1346 90 -598 -254
3527 -254 -23 -330 161 1025 192 -912 -994 382 1300 523 193 -62 -350 -695 -213 476 1325 75 -701
3546 -701 -580 463 326 183 201 445 -277 -585 -33 882 707 41 -281 -277 81 592 259 387 64 -309 9
3567 9 292 874 507 449 -142 -399 -93 162 680 867 98 -623 -490 326 488 214 50 139 -117 -742 -292
3588 -292 669 1144 189 -1075 -390 527 -79 -108 265 493 -422 -1509 -295 729 796 -140 -390 -360 -774 -695
3608 -695 476 919 -48 -1090 -1088 -64 -16 82 401 247 -796 -1428 -421 1090 855 -621 -1135 -50 -22
3627 -22 -584 275 922 147 -1632 -1151 272 773 190 -648 -48 -520 -756 248 1064 950 -785 -1455 -353
3646 -353 426 221 129 574 250 -1569 -1108 745 1324 115 -814 -283 198 -358 -40 1357 1131 -600 -1046
3665 -1046 -113 948 688 -31 218 220 -179 -664 561 1210 141 -961 -107 -5 343 261 692 623 -211 -796
3685 -796 -49 973 872 134 -285 105 48 -329 210 968 848 -622 -512 284 555 525 272 68 -11 -253
3705 -253 -383 660 801 395 -395 -440 33 164 153 385 -5 -341 -590 -133 313 191 -60 -517 -299 -816
3725 -816 1 123 681 174 -981 -944 -330 384 122 -204 54 -388 -689 -753 298 766 -51 -956 -1169 -213
3745 -213 86 34 -147 318 -911 -1089 -637 645 478 -300 -655 -325 -654 -335 510 779 -48 -1229 -950
3764 -950 184 330 -31 -137 -40 -656 -1103 -213 1050 915 -356 -946 -389 405 157 -95 595 467 -922
3783 -922 -931 23 1083 746 -135 -198 -350 -218 29 816 971 -314 -831 -17 837 461 143 355 195 -401
3803 -401 -915 358 1452 926 -294 -621 258 241 251 747 1253 176 -794 -503 720 1141 402 -55 269
3822 269 -294 -193 183 1054 510 -294 -601 359 273 546 519 566 -86 -1029 -620 506 1100 262 -491 -501 136
3843 136 -142 10 697 596 -48 -1003 -604 612 603 263 -337 -90 -424 -344 275 727 402 -599 -857 -637
3863 -637 85 -40 140 -66 28 -851 -665 320 651 -199 -441 -605 -266 -350 -283 331 126 -506 -1164 -384 546
3884 546 96 -459 -422 -143 -456 -771 105 642 244 -742 -852 86 47 233 -229 51 -250 -621 146 485 453
3905 453 -105 -566 -204 -145 106 209 577 278 -623 -596 377 214 36 -356 -222 153 -310 -241 454 808 200
3926 200 -540 -273 526 692 184 413 349 -51 -500 -53 1129 524 -137 -278 -24 207 179 456 771 -56
3946 -56 -640 -109 541 750 198 -150 278 -132 -364 292 629 976 -292 -469 151 583 292 305 -124 112
3966 112 -422 -390 636 594 169 -595 -522 40 88 36 574 266 -549 -767 -163 280 562 -76 -255 -55 -199
3987 -199 -276 428 594 141 -830 -978 -130 287 204 -11 80 -233 -851 -421 630 579 -212 -949 -889 -365 -231
4008 -231 64 94 -12 -764 -803 -408 368 229 179 -548 -591 -610 -252 490 709 -201 -795 -662 496 380 305 78
4030 78 57 -542 -767 89 820 857 -25 -863 -203 -148 181 338 584 254 -726 -713 303 800 558 42 -146
4051 -146 -415 -423 42 974 1004 -45 -625 -399 478 540 372 275 491 -465 -542 262 1183 1075 -401 -330 53 60
4073 60 359 771 826 216 -756 -350 122 692 473 -93 -147 -472 -552 -149 614 886 100 -761 -539 145 338
4094 338 418 536 281 -646 -617 264 1161 185 -357 -9 -138 -345 -155 491 1060 -277 -1102 -309 495 315
4114 315 -138 -91 -337 -404 -751 -254 718 262 -453 -623 -470 -127 -34 218 551 -521 -822 -315 192 449 -63
4135 -63 -491 -21 -391 -442 -53 468 505 -813 -902 -64 570 177 -132 -244 14 -367 -658 106 726 -55 -351
4156 -351 -312 -181 -76 15 58 -201 -420 -512 213 431 101 -243 -211 -266 141 -451 495 342 133 -583 -464 257
4178 257 303 349 72 94 284 40 -68 392 514 399 -192 -289 261 593 12 165 193 338 -302 25 438 480
4200 480 325 62 21 180 -91 103 682 138 -473 -377 598 662 -34 162 317 364 -461 -343 722 853 -152
4221 -152 -561 -408 437 181 153 381 76 -197 -728 113 511 180 -510 -182 -161 -530 -147 317 522 -233 -967
4242 -967 -453 237 158 -41 59 121 -594 -455 -7 779 360 -525 -681 -223 -60 -97 -94 437 -279 -713 -401 577
4264 577 493 -312 -477 -275 92 17 47 520 187 -872 -1082 -126 240 55 172 146 32 -438 -95 512 428
4285 428 -124 -634 -272 125 -356 -145 310 -181 -311 -489 -212 354 220 -265 -156 -193 253 -58 3 215 166
4306 166 -503 -387 -34 573 259 138 36 -261 -196 -93 641 285 -20 28 -97 219 174 314 412 294 -330
4327 -330 -316 1 542 580 68 -218 73 33 370 182 391 465 -256 -506 234 382 459 280 108 -144 -216 78
4349 78 369 615 58 -246 -181 -7 7 503 336 232 -590 -289 33 624 96 -473 -255 -156 -81 -378 441 670
4371 670 -24 -803 -246 120 280 89 -216 151 -382 -621 -149 662 156 -545 -762 -2 -7 -101 145 309 -450
4392 -450 -726 -296 330 716 -129 -381 -371 -218 -481 -156 441 364 -689 -972 -129 658 152 136 377 -194 -751
4413 -751 107 685 623 121 -477 -244 -56 -275 -117 252 363 -385 -281 118 194 139 -129 128 -6 -14 29 588
4435 588 712 98 -446 -234 -218 557 65 550 -10 -13 -160 -187 543 344 153 -539 -347 0 370 470 221
4456 221 -93 -115 -85 159 233 496 342 275 -165 -93 25 189 386 315 -6 -414 -115 394 264 224 351 -189
4478 -189 -333 -181 520 653 351 -517 -69 -28 139 308 16 364 -314 -474 -146 324 373 119 -107 -214 -220
4499 -220 -57 343 263 2 -660 -117 144 357 190 105 428 -574 -793 -28 436 333 -543 -955 109 -335
4519 -335 -445 200 402 173 -877 -914 -51 -37 -1 27 -67 -199 -302 -416 542 319 -157 -436 -205 55 -154
4540 -154 -217 402 359 -84 -531 105 453 -17 -235 -42 90 24 -74 301 670 -271 -543 -450 329 333 -198 -167 160
4563 160 169 -144 -93 302 168 23 -210 249 -102 283 83 124 232 -578 -87 386 582 -71 -68 206 187 2
4585 2 -360 219 543 -78 -217 -55 488 339 -101 -100 28 -229 -181 -59 509 229 -231 -63 167 296 -61 57
4607 57 328 95 -342 111 145 375 -135 -337 -257 -185 100 -357 221 -8 -286 -212 -53 123 -188 -254 -209 259
4629 259 17 -421 -94 439 -336 -527 -454 27 -133 62 -38 -62 -82 -326 184 463 93 -438 -425 -291 12
4650 12 172 -99 151 -240 -411 -323 42 95 -151 -446 56 -315 -287 -299 237 174 -485 -570 -242 494 141 45 13
4673 13 -325 -493 -138 203 465 224 -503 -362 205 100 413 305 184 -227 -264 85 266 -39 200 106 16
4694 16 -274 -459 121 607 415 -235 -370 236 80 17 151 444 -134 -210 -189 318 929 7 -204 21 55 202
4716 202 328 536 104 -213 -272 248 346 128 206 253 43 -298 -245 446 773 196 -257 -167 456 258 325 168
4738 168 372 -112 -621 -115 403 630 68 -162 -112 301 24 -35 194 -210 -282 -474 -140 232 -14 -87 253
4759 253 -174 -91 -110 360 295 -191 -612 -169 10 24 165 238 410 -299 -540 -367 281 220 160 -11 -384 -442 -209
4782 -209 -259 337 -31 -432 -465 -61 -151 258 -123 121 -314 -488 -103 296 531 -66 -321 -387 -275 98 253
4803 253 376 190 -307 -547 378 462 245 -5 42 -111 -162 -66 53 376 78 -556 -242 250 295 26 262 135
4825 135 -190 149 229 580 246 -442 -177 104 -15 4 100 10 129 -443 -304 275 455 25 -192 395 -220
4846 -220 75 35 430 207 55 -455 297 387 113 -115 101 183 -437 -24 331 870 273 -322 -260 -194 -231 74
4868 74 23 153 -194 -278 -155 232 72 386 122 -243 -269 -368 93 160 359 -249 -291 -147 69 -161 -194 -109 -381
4891 -381 -421 -81 107 209 -31 -269 -322 -407 71 323 -94 4 -322 -276 -215 22 224 -53 -173 -336 -365 -264
4913 -264 83 122 -163 -171 -169 -254 178 -93 181 68 -49 -59 -174 -24 182 -140 -566 -212 -245 -145 -40 193 117
4936 117 -242 -11 -33 148 274 156 -123 179 59 41 63 446 243 -682 226 -86 236 104 0 169 7
4957 7 -267 -139 181 254 -27 -312 434 476 -94 51 472 426 -198 -403 458 264 408 -272 -37 328 151 -22
4979 -22 192 300 369 -450 46 255 292 -137 255 343 86 -130 298 720 270 -374 -13 211 76 49 275 200
5001 200 178 -274 -274 151 -56 -409 -317 49 -230 -258 127 440 -175 -279 -158 -51 91 -239 -39 54 -320 -409
5023 -409 -66 427 326 -151 42 67 -159 29 -6 125 -490 -697 -42 339 246 61 -142 -84 -301 -359 -240 316
5045 316 276 -206 -219 -432 3 210 -219 29 -197 -383 -159 158 52 123 45 -150 -187 -58 -246 -17 490 -139
5067 -139 -266 -379 276 266 12 -74 -396 -300 15 -69 155 211 17 -100 -49 246 131 367 -151 -164 -53 -220
5089 -220 43 252 166 -185 103 109 40 211 423 246 -143 -259 -228 -91 458 148 -170 326 85 -286 -158 214
5111 214 362 -77 -229 -117 190 445 -204 168 147 -226 -302 78 420 473 -231 -196 -212 -211 39 456 275 -213
5133 -213 -341 -72 112 22 -108 -40 -54 -125 -374 35 341 295 -436 -413 -183 76 73 -343 -97 109 -588 -388 333
5156 333 316 0 -358 -262 -130 -243 -189 90 -78 -330 -378 -220 53 -75 20 47 -71 -109 -22 237 339 -307 -422
5179 -422 -21 58 191 -194 37 -27 -475 -464 -440 -41 83 -114 -107 -217 -348 -40 -147 307 98 -319 -237 69
5201 69 81 295 58 137 -118 -68 -208 389 308 137 49 8 307 150 138 353 172 66 -380 -115 242 163 98
5224 98 234 63 288 -173 72 296 282 -26 -322 -9 391 229 58 -162 87 -61 -177 279 283 130 88 91
5246 91 18 331 -2 358 -121 15 -438 -266 289 -51 -255 -226 65 -247 124 132 38 407 -324 -127 258 95
5268 95 -335 -142 126 179 -51 -278 488 130 34 -157 -262 148 -186 282 -69 74 -402 -332 201 99 -157
5289 -157 -74 -365 230 -22 176 505 40 -395 -261 -144 228 47 -492 -179 92 -159 -319 97 158 -61 -385
5310 -385 -117 -172 186 -140 235 171 -216 -177 206 170 -173 -234 37 -328 144 6 37 153 -343 -267 4 49 477
5333 477 201 153 103 230 196 234 297 377 -158 -163 136 42 387 396 128 188 164 -67 35 245 194 -115 -452 -19 69
5358 69 336 344 386 0 -251 23 233 238 -85 2 -108 177 -150 228 326 26 -80 -298 -265 184 272 73 -134
5381 -134 -32 -157 -182 148 393 14 -164 41 108 127 -146 -219 45 -406 -589 -160 47 123 96 -390 -199 -73
5403 -73 -243 -67 428 87 -274 -335 7 -134 -256 346 5 -489 -323 -230 89 124 159 -451 -284 -251 -274 266
5425 266 12 193 -446 -143 -103 203 -28 -71 62 76 -83 -299 -148 259 -43 -367 -195 -113 -135 239 94 16
5447 16 -19 -211 -195 71 362 122 -324 -91 198 -162 297 299 385 -141 -328 -178 -106 149 323 -50 -59 -197 80
5470 80 165 59 -159 -169 -35 242 103 90 255 147 57 -10 385 56 323 183 -142 -38 28 -80 81 254
5492 254 108 135 -23 -2 170 -45 190 -96 -50 -74 51 441 381 7 -55 -66 -69 294 131 112 482 -236 392
5515 392 125 169 64 45 3 -1 197 186 248 226 80 -189 -383 -195 186 137 -371 -56 -102 -311 172 150 99 -128
5539 -128 -249 -173 -193 217 123 17 -309 -404 -240 64 230 61 -362 -168 -240 -14 -189 65 55 -118 -149 -257
5561 -257 187 129 -155 170 32 -27 -96 -103 346 110 36 -443 -138 8 -359 -22 32 -272 -428 -288 188 14
5583 14 39 -237 158 102 17 -210 254 289 -64 19 -197 53 -134 65 62 97 -314 -282 196 314 92 111 -259 -197
5607 -197 -124 -210 306 301 -176 -5 61 268 143 -52 242 264 -69 -220 415 640 164 -461 98 217 258 102
5629 102 -53 425 -195 -289 88 142 251 295 -44 162 -37 -90 -49 44 -85 -75 -277 -229 180 -8 -43 79 -359
5652 -359 31 -20 -126 -5 -233 -99 -335 78 -37 -263 89 -100 99 -98 209 17 222 -107 -135 10 -85
5673 -85 -126 -187 -176 159 -7 -316 -159 518 207 -257 -65 18 -99 49 -199 20 -90 -120 52 -147 295 -60
5695 -60 281 132 -415 -81 227 150 62 -207 -145 17 138 204 109 85 100 -237 18 188 287 -84 -236 185 203
5718 203 72 154 255 26 -49 -209 -123 350 1 59 227 -17 -175 -184 296 299 -73 -83 60 121 448 -113 36
5741 36 322 -119 -118 -29 611 354 -63 159 -48 -166 -80 208 430 167 -293 -119 179 145 173 264 179 -351 -123
5764 -123 113 569 -104 -108 18 110 320 -2 160 186 344 -268 33 191 -90 -160 8 -24 57 -210 -85 195
5786 195 -98 152 -182 -221 -49 -64 108 -25 -227 -187 -56 -124 -19 -23 -111 61 132 -41 -93 266 -201 -218 -329
5809 -329 -250 -41 173 78 42 -69 -114 -250 -290 -73 -32 20 -65 -251 -44 280 45 116 -35 55 -144 287 267 -117
5833 -117 264 93 63 28 -188 21 253 65 -121 -236 1 357 358 214 81 102 -312 65 297 110 18 -101
5855 -101 5 52 96 103 43 153 106 -54 -138 532 190 88 -116 -41 141 286 182 400 -100 9 -59 224 -122
5878 -122 359 -79 -167 -106 -388 338 289 133 -198 -244 268 118 75 2 168 131 -426 -322 252 129 -185 24
5900 24 -41 -113 -105 249 -150 344 -284 -291 6 -268 -78 42 -147 306 -239 -73 -22 -253 -242 -103 -242 -124 96
5923 96 150 15 -65 124 -107 -132 -91 -124 77 -25 -258 56 33 -8 324 224 -78 15 -281 -153 -220 228 -102
5946 -102 -193 -229 -184 -3 48 -70 -55 -148 -47 147 214 -30 215 -503 -85 -40 -324 -208 -222 58 -29 -89 135 -115
5970 -115 208 -33 -93 -229 64 -9 43 182 -2 -318 -16 72 105 -14 265 -19 29 158 137 132 138 332 -320 216
5994 216 308 285 145 -9 -173 68 -60 190 232 188 198 -124 81 234 121 -182 149 -112 -241 -68 119 305
6016 305 -154 -59 -187 30 149 -107 -2 122 93 -307 -125 103 -160 66 -293 25 -64 -184 188 91 54 -245
6038 -245 112 -255 161 -56 -102 -9 -159 -130 -7 179 186 109 -315 -156 8 -67 202 244 -165 -267 -90 -147 -31
6061 -31 108 -242 -144 130 -154 -179 -32 189 -49 -181 -28 -304 24 -385 -171 9 62 -281 124 -96 204
6082 204 -321 -308 152 17 -56 -10 105 -142 -362 -240 -81 168 162 -83 118 6 -309 153 105 242 -6 -374
6104 -374 -83 156 -14 49 163 31 -79 -30 294 134 153 73 -235 436 99 48 58 16 -56 -44 -356 476 67
6127 67 215 265 -168 -136 -96 224 320 304 244 -25 134 281 -153 252 341 240 115 -85 104 266 325 190 46
6150 46 -197 204 123 -22 -95 -167 -89 43 124 -96 121 -72 -93 8 -245 -189 114 92 171 -123 -44 72 106 116
6174 116 102 -296 -244 -120 0 -20 -304 -138 -235 -48 -203 71 223 38 -102 -373 31 17 -103 -37 -360 -14
6196 -14 85 -146 -35 87 -12 -170 -174 156 -134 121 4 114 149 -415 65 66 142 -395 -142 -79 -127 -164 -94 -309
6220 -309 98 -308 -276 -95 229 -15 -50 -56 -23 364 -91 31 99 261 78 -140 54 -81 24 77 74 236 -374
6243 -374 -241 -64 -105 58 74 63 -33 28 327 63 276 -62 44 36 -15 -16 -113 292 304 -277 -52 336 6 38
6267 38 -325 78 274 -44 365 -151 -44 -271 -329 27 109 -41 -38 130 -159 63 147 71 290 182 6 50 -67
6290 -67 -22 303 -99 127 -54 -262 252 1 -23 -269 -160 28 -114 2 -245 104 -348 -170 -262 -169 189 101
6312 101 -315 -344 36 -170 294 81 105 85 -256 20 56 -192 -237 -26 42 -95 -274 -192 11 8 -367 14 70
6335 70 -172 -38 88 -103 -67 -93 -286 -95 184 130 158 -86 -24 -376 77 170 296 -121 -45 106 86 -121 52
6358 52 227 124 -197 173 -7 134 -64 -181 -29 -206 239 -187 -54 148 29 88 78 201 61 81 -181
6379 -181 71 -24 -2 54 -166 -66 115 37 288 191 83 92 49 76 138 482 40 -13 63 10 -243 386 30 -28 190
6404 190 -103 58 -58 -1 96 181 3 -142 167 157 -16 -79 152 -56 -306 -224 7 141 -101 -44 78 -96
6426 -96 -312 113 73 -96 -35 -12 37 -81 -100 -74 -148 -84 -273 -187 411 -270 -170 -135 -246 -279 66 255 -295 21
6450 21 -139 -252 -298 151 -1 91 -105 2 149 -55 21 193 255 234 -22 40 37 -75 -307 481 227 -270 -32
6473 -32 57 185 -262 108 -118 273 -4 -231 257 134 -119 80 -125 99 -121 -62 -203 -53 -33 28 3 244
6495 244 -22 -62 -185 177 223 167 -126 49 31 -166 110 244 106 315 -54 61 -10 274 15 317 285 -278
6517 -278 91 40 239 -5 140 52 117 -81 -60 282 -17 97 -215 80 -134 -25 132 83 -181 -80 -74 216
6539 216 -21 136 -335 59 67 110 190 114 200 52 -290 -179 -94 153 345 -191 -136 -209 71 -69 -58 -110 1 20
6563 20 2 -25 -142 46 46 -174 -57 266 44 162 6 -101 12 -33 226 -187 139 196 0 -339 -229 154
6585 154 162 -61 170 287 279 -102 -41 -163 -181 -225 -114 55 -94 -163 240 108 -342 -267 -286 -190 142 93 -322 -52
6609 -52 -99 -15 56 143 -43 -446 -203 -111 324 -225 -106 95 115 9 12 39 335 91 -161 131 228 -40 -67 247
6633 247 27 27 159 24 55 -66 112 23 175 166 0 43 -214 133 51 117 109 162 -184 312 -58 -247 60 -5
6657 -5 236 422 39 -278 57 259 -6 134 -178 -73 -62 -302 -75 171 5 -96 -38 -36 219 -203 105 -151
6679 -151 -126 -59 90 -36 -63 -343 -62 239 -10 -211 -46 53 -66 -94 18 156 -49 105 225 231 313 -334 -148
6702 -148 27 357 -141 -100 -224 -36 139 -26 -40 -234 61 -326 -20 173 49 -335 162 124 -447 -129 22
6723 22 22 -165 -146 -123 -215 -318 -224 105 36 183 -56 190 -75 -253 21 85 -7 -280 -161 115 -163 120 381
6746 381 -188 221 94 94 23 221 94 -270 -36 110 277 208 -117 -223 96 140 294 233 326 137 -79 -142 252
6769 252 62 165 -13 -86 200 -303 33 171 105 64 118 106 202 -266 153 -10 -116 1 -8 -118 -44 -275 -182
6792 -182 -71 9 -160 -231 82 -14 145 92 -8 -110 -223 -280 -14 51 -57 -12 -123 -44 84 86 53 124 210 -15
6816 -15 241 333 80 -170 -26 146 84 -87 151 49 28 6 -14 250 -70 -32 -100 14 16 -89 -1 0 -128 -359
6840 -359 143 177 -127 -277 -16 -165 -25 -400 -224 97 142 31 146 16 -9 -109 -122 -223 -269 241 141 -162
6862 -162 270 -11 309 -103 -13 83 -29 -17 37 -263 41 94 216 47 67 -3 -205 35 105 214 110 78 -5
6885 -5 -107 -115 151 -139 -180 28 -11 -65 202 366 412 29 -101 261 393 -28 0 42 463 92 -4 628 -14 248
6909 248 -88 29 -48 161 -88 13 -34 -393 -122 -80 378 75 277 -25 5 126 345 -50 -199 61 -317
6930 -317 -88 -30 -15 -162 176 94 -257 -89 102 -315 91 -95 -236 34 -61 -146 53 175 -71 -113 -330 -253
6952 -253 185 139 -60 -208 -175 -131 -89 21 -57 -179 -322 -305 -267 -438 237 10 215 -11 -88 -224 -37 146 61
6975 61 -159 -53 31 -70 11 -13 290 -187 -251 8 -287 -329 333 35 121 58 -2 98 -78 2 -286 189 233 -206
6999 -206 50 14 -55 150 -420 -146 1 -123 -193 -5 -74 110 -113 102 -239 93 64 7 225 112 11 -29
7021 -29 -95 100 90 184 -41 57 173 -256 15 -77 -114 304 262 -251 273 -27 -49 257 -115 -5 -264 -86 -133
7044 -133 -53 45 7 71 1 -129 -4 128 79 -309 314 143 96 24 100 -266 -120 -268 -201 -176 -184 -97 -144 92 -154
7069 -154 -215 16 226 106 -6 -2 293 297 -242 -163 -101 -305 -321 -15 -10 -92 8 -45 -170 -343 -21 313 -101 -5
7093 -5 -444 -82 38 131 -153 -91 -123 -473 -7 -218 -183 367 -244 6 -129 157 -39 -117 48 -208 16 108 -153
7116 -153 46 -158 2 75 -188 104 285 -122 -249 -215 -57 -9 -14 131 -38 2 -43 -264 -19 314 -45 34 282
7139 282 -56 73 91 155 -70 66 -68 -22 -123 -48 95 -186 88 148 175 19 -6 153 -155 45 225 96
7161 96 -103 110 42 42 232 283 26 112 115 -103 56 -58 -277 -224 -34 -130 -305 -2 240 104 353 157 205 -102
7185 -102 101 -18 -105 63 146 216 -235 -156 -26 25 -236 -41 51 -207 74 87 -5 -69 -113 51 -261 31 55 257
7209 257 70 15 -85 -109 116 216 195 -108 -15 79 -11 159 -139 6 197 -104 -120 -69 154 -279 -64 -115 -136
7232 -136 -43 -71 -161 153 120 67 -46 -47 -51 193 119 37 -172 102 17 22 -15 -90 104 -344 -67 140 125 138 23 -128
7258 -128 181 397 46 -160 164 -40 -162 96 -69 19 -26 226 92 196 306 72 140 149 210 188 -121 -179 -268
7281 -268 154 2 -277 16 -212 -207 62 157 9 37 -67 105 -94 -16 -45 189 2 -176 -184 -95 49 -3 -155
7304 -155 -95 150 133 -80 206 234 -201 -43 -99 75 94 -35 -114 58 28 134 -16 -50 -51 27 -36 -102 152 -53
7328 -53 -122 -42 -203 -141 425 -109 -306 139 32 -7 -48 -247 -116 70 -97 -62 10 -158 121 55 130 76 -96 -17
7352 -17 -104 66 -22 -190 -505 155 58 -53 31 -184 -173 -355 -173 198 25 182 -59 460 205 36 242 -107
7374 -107 166 -148 -180 88 347 -236 -158 -9 184 94 -2 153 94 -99 -97 -486 40 257 240 117 -273 -122 69
7397 69 -80 319 55 -135 20 29 45 -336 -170 -60 11 -119 370 101 117 34 104 -1 155 -164 122 74 102
7420 102 -68 -83 -2 97 -92 81 205 -110 -34 -115 -138 209 17 -51 7 -28 107 -52 -37 -21 5 -442 49 148
7444 148 168 -3 75 -227 -109 -72 224 12 44 -131 115 50 -193 -17 133 -195 -101 29 62 240 -3 269
7466 269 -109 -34 92 -222 107 -150 -474 270 201 233 -315 -110 93 199 -37 -167 -55 118 -40 -204 199
7487 199 -212 135 7 -74 9 -102 -241 -328 291 -44 136 -74 -267 -1 21 15 149 -64 -200 -37 45 46 37 -12
7511 -12 -45 -87 -6 136 -168 32 -64 -229 -108 89 95 -138 -73 -35 -159 64 159 -24 80 60 171 59 -33 249
7535 249 90 -71 167 226 119 19 227 41 166 164 -135 74 -122 275 13 210 191 281 305 -155 -27 -5
7557 -5 -7 231 341 -162 -25 164 -251 -186 -241 -71 -42 155 371 18 35 72 -37 83 9 63 24 -326 74 -137
7581 -137 77 43 -3 -21 -272 140 105 92 -105 -74 -175 -190 -295 288 -22 -70 -259 45 30 340 23 75 215
7604 215 19 -91 -46 -47 147 29 -277 -124 -421 -4 128 33 120 16 -336 0 -147 145 -68 -137 24 107
7626 107 -199 141 94 72 148 151 -193 161 -11 113 -89 -252 42 90 -39 -321 -93 40 225 85 -217 -57
7648 -57 83 30 -47 60 -84 137 -133 215 -31 -15 135 94 -86 229 299 63 39 24 -56 -156 148 -258 68
7671 68 176 -9 -2 -225 161 60 100 -48 381 -90 -38 120 -54 -2 166 174 -43 3 33 -431 -305 -342 0 -19
7695 -19 -96 61 -13 6 -75 35 113 124 -120 -55 211 -24 -154 -1 167 -21 -97 280 81 -201 -137 -138 -55 242
7719 242 60 49 70 255 -63 -345 -27 -53 -152 -221 54 113 -173 55 249 247 -143 -63 100 -39 186 222 -10
7742 -10 -69 -182 -158 -97 78 103 63 128 -45 -72 -102 -75 -212 -95 -266 -103 111 160 -29 -94 -129 120 50 36 532
7767 532 -26 154 -90 -29 -48 18 142 42 316 35 56 57 43 177 161 -29 -22 131 180 -259 340 -281 -47 219
7791 219 166 -50 257 -390 -122 301 -30 39 36 29 -230 144 22 110 305 253 46 102 -192 -213 200 -129 -211 -62
7815 -62 -167 -137 229 173 320 86 -52 -392 -222 -264 -301 -70 -148 30 -111 4 63 -40 133 99 -123 116 176
7838 176 -104 -161 -102 -120 153 -20 49 16 -114 -422 215 124 -186 230 9 -129 56 -186 -167 -8 -54 -37 -108
7861 -108 101 -317 -43 171 -168 7 -92 227 -12 -106 -42 -230 219 -3 -181 -13 218 -117 -89 -48 125 -19
7883 -19 113 -23 19 172 -59 -151 -69 104 -274 48 -21 -70 282 361 -48 82 -45 57 -201 -55 -40 22 352
7906 352 108 153 -135 16 78 130 150 -40 118 -45 89 -65 -212 -6 194 -5 -218 184 487 42 93 -186
7928 -186 -133 -10 -170 207 153 88 -32 180 -171 -89 84 -54 -84 -105 179 -141 -237 -62 -310 25 96 82 57
7951 57 -362 -176 116 303 106 -124 -235 -160 94 13 200 101 -85 134 56 44 109 15 -172 -24 85 -202 145
7974 145 63 -143 210 45 -341 -221 -8 -357 18 -56 -175 -202 -27 -25 -114 88 93 -45 43 -319 302 104 -119
7997 -119 -136 -2 365 -182 -210 181 173 152 20 175 186 299 -84 -189 -4 72 3 321 35 77 177 -61 -123
8020 -123 9 -57 97 -48 -123 82 -30 170 73 -76 -12 -227 -1 71 96 -169 5 -4 -259 50 176 169 217 -430
8044 -430 -453 218 -57 -217 46 157 181 58 29 -43 -55 102 190 148 263 103 109 -152 149 -61 132 276 177
8067 177 -60 98 -53 -307 -153 45 -157 -89 56 -12 -172 264 335 -153 85 -241 12 117 -79 290 264
8088 264 319 3 -134 -134 -99 227 257 -157 -10 -40 -321 49 129 -73 -85 -217 -44 86 68 -240 -252 -121 -91 50
8112 50 -307 -27 -106 -69 109 -95 -107 -9 -8 206 -292 76 279 240 -372 105 -2 20 238 -210 362 -85 70
8135 70 27 297 -109 -17 -156 75 57 170 -33 -40 -58 299 -46 41 -91 55 224 42 -80 65 133 57 -365
8158 -365 -119 -66 43 -49 -195 30 -144 -83 -244 2 220 48 121 -129 353 -74 95 24 -28 298 -51 121
8180 121 -156 203 351 -35 58 -181 96 15 5 282 -47
8191d7
##END NTUPLES=NMR FID
##END=
