##TITLE=1H_Lac-DMe-B1-f16
 CDCl3, 8 sc, 
 22.11.2019
##JCAMPDX= 6.0         $$ Bruker NMR JCAMP-DX V2.0
##DATA TYPE= NMR FID
##DATA CLASS= NTUPLES
##ORIGIN= UXNMR, Bruker Analytische Messtechnik GmbH
##OWNER= root
$$ XWIN-NMR		Version 3.5
$$ Fri Nov 22 14:37:12 2019 Russian Standard Time (UT+4h)  she@DPX200
##.OBSERVE FREQUENCY= 200.1315
##.OBSERVE NUCLEUS= ^1H
##.DELAY= (6, 6)
##.ACQUISITION MODE= SIMULTANEOUS
##.ACQUISITION SCHEME= undefined
##.AVERAGES= 8
##.DIGITISER RES= 18
##SPECTROMETER/DATA SYSTEM= spect
##.PULSE SEQUENCE= zg30
##.SOLVENT NAME= CDCl3
##.SHIFT REFERENCE= (INTERNAL, CDCl3, 0, 15.7039)
##AUDIT TRAIL= $$ (NUMBER, WHEN, WHO, WHERE, WHAT)
$$ ##TITLE= Audit trail, XWIN-NMR		Version 3.5
$$ ##JCAMPDX= 5.01
$$ ##ORIGIN= Bruker BioSpin GmbH
$$ ##OWNER= she
$$ F:/spectra/data/she/nmr/H-F/1/audita.txt
$$ ##AUDIT TRAIL=  $$ (NUMBER, WHEN, WHO, WHERE, WHAT)
(   1,<2019-11-22 14:35:36.51 +0400>,<she>,<DPX200>,
      <created by zg, POWCHK disabled, PULCHK disabled
       configuration hash MD5:
       00 E9 B6 7A A2 85 ED C7 34 08 36 98 17 FE 4E 26
       data hash MD5: 16K
       9C E1 F8 83 27 7C 30 21 8C 4D B6 BA 17 1C 7F 4F>)
$$ ##END=
$$ 
$$ hash MD5
$$ 6A 1E 8F 3F 21 38 AF C1 68 21 91 46 FB 7E 37 58
##$RELAX= 
##$RELAX= 
##$RELAX= 
##$RELAX= 
##$RELAX= 
##$RELAX= 
$$ Bruker specific parameters
$$ --------------------------
##$DU= <F:/spectra>
##$EXPNO= 1
##$NAME= <H-F>
##$PROCNO= 1
##$TYPE= <nmr>
##$USER= <she>
##$AMP= (0..31)
100 100 100 100 100 100 100 100 100 100 100 100 100 100 100 100 100 100 
100 100 100 100 100 100 100 100 100 100 100 100 100 100 
##$AQSEQ= 0
##$AQ_mod= 1
##$AUNM= <au_zg>
##$AUTOPOS= <>
##$BF1= 200.13
##$BF2= 200.13
##$BF3= 200.13
##$BF4= 200.13
##$BF5= 200.13
##$BF6= 200.13
##$BF7= 200.13
##$BF8= 200.13
##$BYTORDA= 1
##$CFDGTYP= 0
##$CFRGTYP= 5
##$CHEMSTR= <none>
##$CNST= (0..31)
1 1 145 1 1 1 1 1 1 1 1 1 1 1 1 1 1 1 1 1 1 1 1 1 1 1 1 1 1 1 1 1 
##$CPDPRG= <>
##$CPDPRG1= <>
##$CPDPRG2= <>
##$CPDPRG3= <>
##$CPDPRG4= <mlev>
##$CPDPRG5= <mlev>
##$CPDPRG6= <mlev>
##$CPDPRG7= <mlev>
##$CPDPRG8= <mlev>
##$CPDPRGB= <>
##$CPDPRGT= <>
##$D= (0..31)
0 1.2 0 0 0 0 0 0 0 0.06 0 0.03 0 0 0 0 0.0002 0 0 0 0 0 0 0 0 0 0 0 0 
0 0 0 
##$DATE= 1574418935
##$DBL= (0..7)
120 120 120 120 120 120 120 120 
##$DBP= (0..7)
150 150 150 150 150 150 150 150 
##$DBP07= 0
##$DBPNAM0= <>
##$DBPNAM1= <>
##$DBPNAM2= <>
##$DBPNAM3= <>
##$DBPNAM4= <>
##$DBPNAM5= <>
##$DBPNAM6= <>
##$DBPNAM7= <>
##$DBPOAL= (0..7)
0.5 0.5 0.5 0.5 0.5 0.5 0.5 0.5 
##$DBPOFFS= (0..7)
0 0 0 0 0 0 0 0 
##$DE= 6
##$DECBNUC= <off>
##$DECIM= 24
##$DECNUC= <off>
##$DECSTAT= 4
##$DIGMOD= 1
##$DIGTYP= 9
##$DL= (0..7)
0 120 120 120 120 120 120 120 
##$DP= (0..7)
150 150 150 150 150 150 150 150 
##$DP07= 0
##$DPNAME0= <>
##$DPNAME1= <>
##$DPNAME2= <>
##$DPNAME3= <>
##$DPNAME4= <>
##$DPNAME5= <>
##$DPNAME6= <>
##$DPNAME7= <>
##$DPOAL= (0..7)
0.5 0.5 0.5 0.5 0.5 0.5 0.5 0.5 
##$DPOFFS= (0..7)
0 0 0 0 0 0 0 0 
##$DQDMODE= 0
##$DR= 18
##$DS= 0
##$DSLIST= <SSSSSSSSSSSSSSS>
$$ [...]
##$SUBNAM2= <"">
##$SUBNAM3= <"">
##$SUBNAM4= <"">
##$SUBNAM5= <"">
##$SUBNAM6= <"">
##$SUBNAM7= <"">
##$SUBNAM8= <"">
##$SUBNAM9= <"">
##$SW= 24.9337058887773
##$SWIBOX= (0..15)
0 0 2 0 0 0 0 0 0 0 0 0 0 0 0 0 
##$SW_h= 4990.01996007984
##$TD= 16384
##$TD0= 1
##$TE= 0
##$TE2= 300
##$TE3= 300
##$TEG= 300
##$TL= (0..7)
0 120 120 120 120 120 120 120 
##$TP= (0..7)
150 150 150 150 150 150 150 150 
##$TP07= 0
##$TPNAME0= <>
##$TPNAME1= <>
##$TPNAME2= <>
##$TPNAME3= <>
##$TPNAME4= <>
##$TPNAME5= <>
##$TPNAME6= <>
##$TPNAME7= <>
##$TPOAL= (0..7)
0.5 0.5 0.5 0.5 0.5 0.5 0.5 0.5 
##$TPOFFS= (0..7)
0 0 0 0 0 0 0 0 
##$TUNHIN= 0
##$TUNHOUT= 0
##$TUNXOUT= 0
##$USERA1= <user>
##$USERA2= <user>
##$USERA3= <user>
##$USERA4= <user>
##$USERA5= <user>
##$V9= 5
##$VALIST= <valist>
##$VCLIST= <CCCCCCCCCCCCCCC>
##$VD= 0
##$VDLIST= <DDDDDDDDDDDDDDD>
##$VPLIST= <PPPPPPPPPPPPPPP>
##$VTLIST= <TTTTTTTTTTTTTTT>
##$WBST= 1024
##$WBSW= 4
##$XGAIN= (0..3)
0 0 0 0 
##$XL= 0
##$YL= 0
##$YMAX_a= 345498
##$YMIN_a= -271629
##$ZGOPTNS= <>
##$ZL1= 120
##$ZL2= 120
##$ZL3= 120
##$ZL4= 120
##$ABSF1= 10
##$ABSF2= 0
##$ABSG= 5
##$ABSL= 3
##$ALPHA= 0
##$AQORDER= 0
##$ASSFAC= 0
##$ASSFACI= 0
##$ASSFACX= 0
##$ASSWID= 0
##$AUNMP= <proc_1d>
##$AZFE= 0.1
##$AZFW= 0.1
##$BCFW= 1
##$BC_mod= 2
##$BYTORDP= 1
##$COROFFS= 0
##$CY= 11.3945322036743
##$DATMOD= 1
##$DC= 2
##$DFILT= <>
##$DTYPP= 0
##$F1P= 16.9975609425685
##$F2P= -3.02152046262296
##$FCOR= 0.5
##$FTSIZE= 0
##$FT_mod= 4
##$GAMMA= 1
##$GB= 0.15
##$INTBC= 1
##$INTSCL= 1
##$ISEN= 128
##$LB= 0.24
##$LEV0= 0
##$LPBIN= 0
##$MAXI= 10000
##$MC2= 0
##$MEAN= 0
##$ME_mod= 0
##$MI= 1.114404
##$NCOEF= 0
##$NC_proc= 0
##$NLEV= 6
##$NOISF1= 3.799351
##$NOISF2= 2.8
##$NSP= 1
##$NTH_PI= 0
##$NZP= 0
##$OFFSET= 15.70392
##$PC= 1
##$PHC0= -9789.301
##$PHC1= 17.40086
##$PH_mod= 1
##$PKNL= yes
##$PPARMOD= 0
##$PSCAL= 0
##$PSIGN= 0
##$REVERSE= no
##$SF= 200.130013532006
##$SI= 16384
##$SIGF1= 3
##$SIGF2= 2
##$SINO= 400
##$SIOLD= 16384
##$SREGLST= <1H.CDCl3>
##$SSB= 0
##$STSI= 0
##$STSR= 0
##$SW_p= 3612.71676300578
##$SYMM= 0
##$S_DEV= 0
##$TDeff= 0
##$TDoff= 0
##$TI= <>
##$TILT= no
##$TM1= 0
##$TM2= 0
##$TOPLEV= 0
##$USERP1= <user>
##$USERP2= <user>
##$USERP3= <user>
##$USERP4= <user>
##$USERP5= <user>
##$WDW= 1
##$XDIM= 8192
##$YMAX_p= 0
##$YMIN_p= 0
$$ End of Bruker specific parameters
$$ ---------------------------------
##NTUPLES= NMR FID
##VAR_NAME=  TIME,          FID/REAL,        FID/IMAG
##SYMBOL=    X,             R,               I
##VAR_TYPE=  INDEPENDENT,   DEPENDENT,       DEPENDENT
##VAR_FORM=  AFFN,          ASDF,            ASDF
##VAR_DIM=   8192,          8192,            8192
##UNITS=     SECONDS,       ARBITRARY UNITS, ARBITRARY UNITS
##FACTOR=    0.0002004,     1,               1
##FIRST=     0,             0,               0
##LAST=      1.6414764,     0,               0
##MIN=       0,             -271629,         0
##MAX=       1.6414764,     345498,          0
$$ Real data points
##PAGE= N=1
##DATA TABLE= (X++(R..R)), XYDATA
0@%%%%%QqQj6J6j6K4l2M0m8N6p2Q8j04J24j48J74k02K33k68L08l53M02m58N19
30B75n84O58p42Q34r31J036j156J287j428J584j759J947k152K383k640K925l245
47a708L608m020M492n040N689o470P428q637J0225j2413J5628k0878L1306q5802
61f6592K84697J15607m47966j22038K81649J17814k61390m8085K70516P9735k94491
72i0544j17557K40694J46727j88942j09254J63519P9332j99127r3621K07729J50757
83A89713j68080j68723J01448J38053q4326r8648J06457J11649j19745j49948
93a42150Q9157J74733l1226j50429n058J05034j719p7301K8475Q7747l2036j02446
105e7219R156Q8038l229o4562K4627O7445m5681r8514K9971J16010P871r6091
$$ y = [0, 0, 0, 0, 0, 0, 8, 0, 8, -8, 8, -8, 16, -16, 24, -24, 32, -40, 48, -56, 68, -80, 94, -108, 125, -143, 165, -188, 214, -244, 275, -309, 349, -393, 441, -490, 546, -610, 677, -751, 833, -926, 1021, -1131, 1252, -1388, 1537, -1708, 1900, -2120, 2372, -2668, 3021, -3449, 3979, -4658, 5567, -6846, 8782, -12096, 19210, -66592, 218105, 333712, -114254, -236292, 45357, 163171, -98219, -146304, 124212, 203947, -90544, -208101, 32593, 179320, -9622, -118876, 44643, 123975, -75152, -168773, 38956, 189713, 21633, -147090, -45642, 92411, 8085, -90563, 15894, 127543, 7798, -142150, -52993, 121740, 90514, -59915, -64973, 40061, 38342, -38959, -10484, 77263, 45227, -57219, -48063, 39975, 36746, -27816, -3189, 64256, 18575, -79939, -49968, 66042, 73913, -22178]
117b2178k9664N3513R871l1787L0109N2003m1830q0431K1565P8889p508n9114
129b6562K4371O2538m1580r0308K8093J07695J829r9384k0154P8288J7374p1696
141b9496j3192P8915K1177q2300m2318O3792N0003l8337l4069L1371J2705m7008
153b8757j0623O5371K5578o9186m1465O3754N0869n5406n5307M9957N9989m5586
165I188o7346L5544P3680j8637o9015J417N2111M12l5608R790L2004j9469l9752
178c5681J6833M2730p800l3975P038K2808j8400k4380K9509M0182k3106m9551
190c3793P253M1931J808k9788M796K7610q027l2116L434L1252K634k2557r87J4451
204G901r872j7311J9780L2314j6334m5363p57M2604J3390k9055j1078K2709L496
$$ y = [-22178, -51842, 1671, 11542, -20245, 9864, 61867, 20037, -60394, -38829, 40060, 32552, -26562, -2191, 60347, 18767, -71541, -43448, 64247, 66076, -33308, -53462, 24826, 42200, -29496, -42688, 36227, 57404, -24896, -67214, -3422, 46581, 8244, -25825, 5546, 18251, -28757, -39380, 25991, 51569, -17617, -59082, 4672, 55541, 135, -55172, -5215, 54774, 9188, -58158, -22614, 51066, 32429, -36586, -35169, 16942, 17354, -18254, -8464, 23540, 4071, -35681, -18848, 23882, 16082, -17893, -10855, 11953, -6447, -30827, -1318, 38864, 15758, -33793, -26540, 15391, 17199, -12589, -7793, 19817, 11790, -20326, -16892, 14360, 16994, -5563, -6550, 7901, -1971, -19282, 498, 32812, 16478, -28885, -29642, 12962, 26352, -2703, -13781, 8928, 12424]
217A2424k6612k218L2651R619l0334j6109K2457J2987j5540k273K1802l344l5580
230b0070o294M0959K1765k9617k6243J6155J5062j7380q631K8258J8333l0039
242B258l3488J3374L2979N163j5579o069q61q836p92J8155J3258j0270j4517R0
256e135R31o267O192K2170N909k7466k4132J2695K7133M562j3025o903j173p060
270a1569k536J5199J6507o029j8909q958M009O975Q852R792m311k0958j1090J4507
284h519J8981j743j1366j460N5q927j893J8956J5709j3173k4748k423J5975Q307
298C731k86L057j764j6310j1339J3234K1438J624j4493p736m2k492K227J5500
312F349J0617j3058k0301j469J4357Q142N65K021k775j4480r718J3431K0961J162
$$ y = [12424, -14188, -16406, 16245, 25864, -4470, -20579, 1878, 14865, -675, -2948, 18854, 15510, -20070, -26364, 14595, 36360, 6743, -19500, -3345, 11717, -5663, -14294, 13964, 32297, 2258, -31230, -17856, 15123, 20286, 4707, -1362, -2223, -11059, -11851, 6304, 19562, 9292, -5225, -5135, -4204, -10471, -4279, 17891, 23800, -3666, -27798, -15103, 12030, 16592, 3567, -3336, -4509, -11569, -14105, 1094, 17601, 11572, -7337, -16295, -12286, -5311, 3541, 13333, 9022, -11936, -23026, -8519, 10462, 8719, -2647, -4107, -4052, -12979, -14872, 4084, 19793, 6620, -18128, -20551, -4576, 3731, 3445, 6502, 4738, -11572, -22911, -9677, 11761, 13385, -1108, -8844, -8886, -11378, -9151, 6349, 16966, 3908, -16393, -17862, -3505, 4637, 5202, 7223, 4448, -10032, -19750, -6319, 14642, 15804]
326A5804j5615r023J708K156J872J0652R379r693k0692l238J6204J3125k066o598
340C975l585o308m700Q371J5810K021j4192j0666M058O208K802N302M713q931
354D878j7048m18J9388J2521q804j2324p58J952l400M824J4296K749j8087j4978
368a5209Q362J6272K401n471k045k759q260j760J3413J1900o885j4194l332N638
382a929L392L364O359o45j3822j1089Q385J6521L213r682o550L7k495j584R639
397C114J2439n030j8699q265J1958J2812q06n132j126l843q987J215J6176R649
411A5475j0163j5279k233P122M531N057N640m895j7145p085J5075J5224k480j0230
425a386k027j095p367J814J8573J0786j6355k1300K152J6869N581l797J371K43
$$ y = [15804, 189, -8834, -7126, -4970, -3098, 7554, 16933, 7240, -13452, -16690, -486, 12639, 10573, 3975, 390, -5918, -10618, -2247, 13563, 15584, 1392, -9274, -5216, 992, 3794, 9096, 13809, 4878, -12170, -12588, 6800, 19321, 10517, -1807, -2565, -613, -4013, 811, 15107, 17856, -231, -15209, -6847, 9425, 11826, 6355, 4310, 1551, -6709, -8469, 4944, 16844, 9959, -4235, -7567, -1929, 1463, 4827, 11186, 10541, -3281, -14370, -5985, 10536, 13749, 4067, -2483, -2446, -4941, -6525, 3114, 15553, 10523, -8176, -16441, -4483, 8329, 7523, 2391, 1265, -2578, -11565, -10350, 5826, 15475, 5312, -9967, -12200, -5078, -547, 4510, 10150, 5255, -11890, -18975, -3900, 11324, 8844, -1386, -3413, -4508, -11875, -10061, 8512, 19298, 2943, -18357, -16205, 664, 6245, 2448, 3819, 4062]
439D062j2420j0749J1651K0624J893j6579j0051J793L462M198J0795N771j2396
452B054j8997J067J7046R403m036l189j103j0037q829J1431K2621K744k1872j5127
466a6824P753J1734J443J185N890n108j8063o063J7355J7481l450j3324n740m29
480f160j594O358J5459L337j7074j4663N082J2686L851n15L264m433j5746o386
494a6534J6793J8412l773j6677o581L376J143L049J0963O547j3472j8594P92J6848
508B292J0231l731n810m570p269l603J0824J6094L15j5406j2153K437Q401O481
522D533M367k79r575j1617J091J2947Q697l752o905l844l196k698P385J3736J033
537A1923j5156j3287N507J2922L431l331j725j734o421l463P444J0990O77r314
$$ y = [4062, -8358, -19107, -7456, 13168, 15061, -1518, -11569, -9776, -6314, -2116, 8679, 14450, 2054, -16943, -15876, 1170, 10573, 6537, 3348, 2245, -7792, -16621, -5190, 17431, 20175, -1697, -16824, -9071, 2663, 4106, 5291, 11181, 6073, -11990, -18053, -698, 16783, 13333, 9, -5731, -6160, -7754, -1396, 14063, 17400, 326, -14337, -9255, 3431, 7282, 6767, 10031, 5598, -10148, -16534, 259, 18671, 14898, -1779, -8360, -4984, -3841, -792, 10171, 16718, 3246, -15348, -14556, 2292, 12523, 8792, 2982, -1588, -8857, -12460, -1636, 14458, 14773, -633, -12786, -10349, -1948, 4533, 8900, 8621, -954, -12571, -11480, 1467, 10164, 6412, -493, -4337, -7533, -10231, -2846, 10890, 11923, -3233, -16520, -11013, 1909, 5340, 2009, 284, -1450, -7871, -11334, -3890, 7100, 7777, -1537]
551a537p546m01M432O741N897k662j0759o077N950Q862N25l341L77j246o671l094
567a0550R572J0918l136j3601n585O720P756J152q08j716m375l958L136O709L185
582E419j810l299m103j716K831P476L461n106p309j105M448M164J543p80l211
597I03m538K31M356L758o18j501k266k066j073M044N376O1n923m702K360N332
613C734L599p54m560m614P10N202K923j184k461m10j538k549Q53P315M054n946
629D374r657j128P758O714o75n236m107P9J699J456K095K334L11n035o686q20
645f524Q724R023j713j1525p069M968Q881J960m420k459J035k581m043K247R010
660E514M258p548j0279j475P703P177J117m399o618l551L491O656K718k666l334
$$ y = [-1537, -9083, -9484, -5052, 1689, 7586, 4924, -5835, -11912, -5962, 2900, 3425, 84, 461, -785, -7456, -10550, -978, 9940, 6804, -6797, -12382, -5662, 2094, 3246, 2438, 722, -3653, -7611, -4475, 2234, 5419, 3609, 310, -3793, -5509, -2678, 4798, 8259, 3153, -4156, -5261, -813, 3351, 4894, 4114, 903, -3635, -3404, 952, 4710, 4092, 2591, 325, -1741, -2814, 1230, 6606, 6667, 744, -3958, -1598, 3734, 7333, 6579, 2019, -2595, -1885, 3317, 6240, 5056, 2595, 2185, 647, -1902, -1049, 6266, 10320, 4374, -5283, -6411, 1347, 8061, 7386, 2150, -1957, -1878, -179, 1277, 3372, 5706, 6017, 982, -5704, -6524, 2200, 11223, 9510, -2015, -9084, -4116, 4765, 6725, 2305, -154, 881, -1700, -5743, -3496, 5514, 9772, 2224, -8055, -9530, -1827, 5350, 6467, 2068, -4550, -8101, -4610, 2046, 4764, 2098, -1236]
675a236j553k876j104N882R439o00j2426r414N780J1721L410m308m219k721l273
690g498J90Q058P086k262r097n707J348M676N369N246j637j0333q836M143J1675
705B421O394l712p217m481l39J888N740O812N8p780q828q96P599R520K736n642
721D273j0275m175M955R292M822l426p260l536N32K104M193N686J148p872j0239
736i778L43J1895J0072l857j0687n137K781M850L871K541j029o133m994K1M831
751d10O526L276l013j0355o976N555J3080M270q306q273Q9K539K18L116P076o2
767H350j0441q768M118J0631M648k523n125n594l588L582R689M690n918q180j370
782e799K331J851L387M913r46r565p619M845J0627L704n100n476k091r23J936
$$ y = [-1236, -2789, -5665, -6769, -887, 8552, 7952, -4474, -13888, -8108, 3613, 7023, 2715, -1504, -4225, -7498, -7308, 750, 7836, 5574, -3523, -9230, -7882, -3206, 2163, 7409, 5772, -4561, -13397, -9254, 2421, 8815, 5103, -2114, -6595, -6934, -5046, 694, 7506, 7564, -216, -9044, -9940, -2341, 7179, 9915, 4273, -6002, -10177, -5222, 4070, 8892, 5466, -1794, -5330, -4798, -2694, 1499, 7185, 8333, 461, -9778, -9435, 2460, 12532, 8675, -2012, -7149, -4368, 482, 4353, 6894, 5865, -268, -5262, -5241, -410, 6116, 9392, 6379, -3976, -10952, -5397, 7683, 11953, 3647, -4626, -4537, -1998, -1780, 1336, 8412, 8350, -2091, -10859, -6741, 3890, 8538, 6015, 890, -4704, -8292, -4710, 4979, 9669, 3751, -4429, -5799, -3468, -1617, 1770, 6683, 5737, -3828, -11447, -6602, 4025, 7729, 2629, -2847, -4938, -5861, -3925]
797c925O345M291m674q345j204N272L121K32Q94l68n732n875L959J0650L037p402
813B76p785M6M873L765J757p91l248m360r11L788M668K321j589n558n220L99Q207
830F38O992j776q446n611K476O012L519o34j722j716k919k880L080Q178L759o506
846B444r074l71O872N576l32k240l009k989p98L869N233K40k934l129k309n01
862c452M673O735J87q667o095L789P448J668k736j232j391l430o61N899O434j854
878G315p777m394K492M804K791J608k407n563m556K863Q458L225l983n695k596
893c415L11K286M632M824k709q309m529L884N874L019n62k796n205m092L254Q415
909D882L864n459o966j392K748J692K917L777j639q298m839M471Q358J996l968
$$ y = [-3925, 2420, 6711, 2037, -6308, -7512, -2240, 881, 1113, 2007, 1639, -4093, -9968, -6009, 4641, 7678, 276, -7509, -7463, -2590, 1175, 2932, 2141, -1107, -5467, -6378, -2590, 2078, 4399, 2810, -2748, -7968, -7569, 638, 7630, 5854, -2592, -8203, -5727, 285, 3804, 3170, 1448, -268, -3187, -6067, -2987, 5191, 8950, 2444, -6630, -7001, -129, 5447, 5115, 2875, -134, -3123, -3921, -52, 5181, 5421, 2487, -642, -2951, -3452, 1221, 7956, 8143, -524, -6619, -2830, 4618, 6286, 3550, 2318, 927, -2503, -3164, 2735, 9169, 7315, -462, -4856, -2364, 2440, 5231, 6839, 4432, -1131, -5687, -2824, 5634, 8859, 4876, -819, -3415, -3104, -818, 3814, 8638, 5929, -2380, -6909, -3025, 2849, 5868, 5306, 2510, -2695, -6787, -3533, 4882, 8746, 3287, -3679, -5071, -2323, -631, 2286, 6063, 4424, -3874, -8713, -4242, 4116, 6112, 2144]
924B144m430j955j326K945N787K119m208n737j747L079L741K592P34l389o626
939f277k162N951P300J64n615m455K6J053K395M321J919m102o977j801N326O150
955C216J525l497m361k893J91M594N002J188m403n355j454K908M617L345q44m716
971i37m791K23M637N028L77l375l904j748R31M106L982o0l947n165m10M200N135
988D282L72l562l032r31Q98J906L558J423l248n063j296M487M316M58k570l201
1004a203j358L0L540L625Rl921l258J04J855K692K813m32m922m043J187N464L057
1021E239k018l472j486o80Q41K735L668m03n085m562J513N111L044r56l075k603
1037b189j325J182L916K570j238m344k412M58K586K988J276j797m512k741K662
$$ y = [2144, -2286, -4241, -5567, -2622, 3165, 5284, 1076, -4661, -6408, -3329, 412, 3004, 3738, 349, -6277, -8439, -2488, 4812, 4976, -639, -5094, -5068, -4015, -1620, 2701, 4620, 518, -6459, -8260, -2934, 3216, 4741, 1244, -3117, -6010, -5819, -1225, 3777, 4965, 562, -4793, -6247, -3339, 1278, 4623, 3779, -937, -5728, -5505, -868, 4160, 4537, 1162, -2742, -4490, -3559, 547, 4529, 4469, 522, -4643, -5053, -853, 4282, 4654, 1092, -1940, -2871, -1973, -67, 3491, 4914, 1666, -3397, -4693, -206, 4110, 4568, 1998, -1203, -2561, -2531, 1009, 4634, 4643, 722, -2536, -2432, -577, 2115, 4928, 4496, -426, -4469, -3282, 2182, 5239, 3221, -251, -1737, -2417, -1576, 1159, 4827, 4424, -661, -5223, -3710, 1401, 4445, 3489, 414, -2189, -3514, -2332, 1584, 4154, 2916, -1428, -3840, -3382, -796, 2192, 3468, 1671, -2841, -5582, -2920]
1052b920N023J420k403l112j385k10R58L723K959k001o350k547M126M490J077
1067B848j964k370j786j392K083M365K183k515m643k203J821L506L374j5l786
1082d94m129j036M072M112J204k174l635k016k72L435M410J612l690n872j312
1097e785M284N182O24k211k479k195j439K268N918K358m092n685j346L471L789
1112B662J858J7k952m782r01L832N015N62k803l047k173n9K981N543J094n358
1128A489n474K44M441L335N55l74k729m079j708M667N830P17m943m564m78K480
1144e91L056K581K26l532n080p97M071M855N69k775l415k766J17M193M694J85
1160E591m943m712O40K929K781J317K09l269m769q98N080M819l15m517k909k00
$$ y = [-2920, 2103, 3523, 1120, -1992, -3377, -3587, -2629, 1094, 4053, 2052, -4298, -6845, -2719, 1771, 2848, 884, -1486, -3272, -4664, -2581, 1784, 3967, 1452, -3191, -5394, -3573, -67, 3307, 3292, -494, -4623, -5659, -1587, 2525, 3729, 1555, -2080, -4096, -4368, -933, 3477, 5089, 1399, -4473, -5785, -1501, 3681, 4305, 2094, -385, -2580, -4019, -1751, 4167, 6525, 2433, -3252, -4598, -1127, 2662, 4520, 4537, 1585, -3197, -4098, -266, 4749, 5311, 2508, -539, -2712, -2771, 210, 5753, 6847, 1489, -3985, -3741, 700, 4035, 4590, 4216, 1487, -2592, -4300, 367, 6197, 6914, 1971, -2593, -3071, -591, 2465, 5046, 5272, 1740, -3340, -4137, -66, 4789, 5358, 2583, -832, -3598, -3481, 712, 5406, 5591, 648, -4064, -3424, -495, 2286, 3603, 3812, 543, -4226, -5124, -44, 4775, 4460, -57, -2966, -3166]
1176c166O48K594L325N73m200m675j86M319L361L33k430k976j934N16L487L608
1192C197o03l284l423k31J633L121K434p31m304l357J009M783K808j779k565j567
1208b859l99J44K260L356N99m272m191O68M531L030r08k694k074m55J048K195
1224b1J966rk614k449n30J987L135J892j715l928k292K667L952J216k284j961
1240i88k15L19n49J274L171N13m332l510K017M411J744j869k846k99K5M55K037
1257A358K103j724k748p61J113J328R93J206r35l275j874L038L601L66k839j991
1273a041j75N37J122K004J124k439l264m6K244K062M00r27j624j474r14K068L644
1290C301K09l709k930Q88K458J154P9l57j086k035r65K393K922M49k507k324j121
$$ y = [-3166, -2518, 76, 3401, 3974, -226, -4901, -5087, -768, 2593, 2926, 496, -2480, -4414, -3898, -411, 3197, 2594, -690, -4113, -4344, -2711, 410, 2844, 2113, -2191, -5548, -4539, 244, 3052, 1273, -1292, -2859, -3258, -3114, -854, 2502, 3101, -1171, -5362, -4694, -163, 2867, 1959, -735, -2809, -3264, -2216, -21, 1945, 1936, -678, -3127, -3657, -1670, 1465, 3357, 1642, -2286, -4578, -1911, 2041, 3257, 973, -988, -1203, -884, -1433, -159, 3012, 3525, -807, -4317, -2300, 2111, 3855, 1986, -860, -1159, -1134, -679, 1358, 3461, 1737, -1011, -1772, -659, 669, 1662, 2868, 1933, -1342, -3216, -178, 3423, 3789, 950, -1041, -1216, -679, 443, 2447, 3571, 1132, -2132, -2178, 66, 2128, 2528, 1601, -23, -1497, -2411, -343, 3301, 3510, -199, -3129, -2241, 217, 1371, 1450, 1093, 7, -2028, -2993, -600, 2322, 2771, 264, -2060, -3181]
1307c181J208K482K347r89l644k098J744K823J35k06l63o64k288j214L410L731
1323C233k69m447l102J058L527J718l66j215j856j381N02K608J736J27k172j604
1339a903j587J011L728K476j813m168k483K769L475P36p13j348j369j301M2L482
1355A034K327n85l723k159M37L173K196O38j721l241j094J481L110J460j079j764
1371D90j535p08R89K604K096j130l503j971J478K801K207m54k325k137p30J960
1387A32K357J045j294k332r77Q5J047K077J714r01l770k140K190M102R18k443
1403A810l216O8J286Q43Q02J236j28k946k312P11L013K584n10k783k754k43K753
1420B14K815r9k647j927K88K93O77J182K383j263m144k287K736M191O18k486k564
$$ y = [-3181, -1973, 509, 2856, 1867, -1777, -3875, -2131, 692, 827, 621, 258, -406, -2694, -3908, -498, 3233, 2964, -1483, -4585, -3527, 0, 1718, 1352, 137, -1719, -3100, -2598, 10, 1746, 1873, -299, -1903, -3490, -2479, 1249, 3725, 1912, -2256, -4739, -1970, 1505, 2241, 1528, 180, -1189, -2490, -2448, 1034, 3361, 2776, -947, -3106, -2669, 504, 2700, 3338, 1617, -1624, -2718, -1237, 1873, 3333, 2254, 490, -1045, -1753, -764, 1840, 3936, 2806, -697, -2668, -1190, 1611, 3818, 3364, 1039, -1098, -1828, 132, 2489, 3534, 2240, -92, -1069, -984, 63, 2140, 3854, 2953, -817, -2957, -767, 3335, 4253, 1810, -1406, -1338, -52, 791, 1593, 2829, 2701, -245, -2557, -1846, 1167, 3751, 3241, 458, -2296, -2539, 214, 3029, 2930, 283, -1644, -1356, -1063, -386, 796, 3179, 1916, -2228, -4515, -1779, 2412, 3030, 544, -2020]
1437b020o90J007J539P78K62o31j941j362Q28K071J573j85k201k212p6K599K249
1454A588l36k279j892K70J203J321M99mq58j976j241K142K807N02k063k131j74
1471b622P48J397J878N7k054k624K33K565J774j41j253p42j113q35K029K719M03
1488B419k897k528L21K272J535O85l16k248j765N92K396J708q69r85o05j012m31
1505a728J980L002L2l998k634J981L247L79j305l33n06j456j30K474K196p34k581
1522a14j721L27J601J988J177j527k855j283K010K233P02r97r46j182j128P47
1538i68K663K061j313l439k060J690K661J243m61j192k204j233J150L035J332
1553B965j416k222j475K67J725J635P23q22k975j423J374K534R94o98j483j484
$$ y = [-2020, -2710, -1703, -164, 614, 876, 245, -1696, -3058, -2230, -159, 1414, 1229, -972, -3184, -3260, -661, 1588, 1252, -1027, -2919, -2649, -1446, -125, 374, 370, -488, -2464, -3705, -1563, 1244, 1746, -317, -2448, -2622, -1874, -477, 1401, 1458, -596, -3220, -2987, -422, 1352, 1211, -42, -784, -1897, -2732, -703, 2016, 2419, -478, -3006, -2685, -413, 1122, 1807, 1491, -757, -2522, -1930, 466, 2174, 1305, 320, -285, -1297, -1728, 252, 3254, 3286, -712, -3346, -1365, 1882, 2261, 956, 623, 117, -1339, -1469, 1005, 3201, 2467, -114, -1835, -1508, 93, 2081, 3258, 1731, -1124, -2407, -397, 1836, 2538, 1541, 595, -587, -1715, -968, 1695, 3756, 2443, -996, -3056, -1366, 1295, 2538, 2077, 885, -1319, -2552, -1402, 1633, 2965, 1549, -673, -2148, -1881, -156, 1479, 2202, 1380, -1595, -3018, -1644, 890, 1884, 1186, -297, -1781]
1569a781o59J226K380J181j565k574o70J023J498J364P7j390j993j172J339L100
1585A384R52j660k258q94O04J793J098L14r90k111j005J090K194J669q28k138
1601g86j466P9J357K417N78j504k467l38J182J519O97N89p82k728j315K032L388
1618B452P70k561k160J63O11R50J417P41r92k258r83J581K017P18n68j693j059
1635h54l31J593K152m1j538j651j04J063P82J020K42j417k266P9K066J956k01
1652B550j602j545jL46P45J579M02j655j994p4J640J782k29p55j621l96j2J473
1670F33J332j23j404j828L79R81R81M39m07j661j306O94J967J026m87j611j135
1687a530O7Q82O49J260k18j700j888N56K171J028l93j526p34n01N15J225J085
$$ y = [-1781, -2440, -1214, 1166, 2347, 782, -1792, -2462, -1439, 59, 1423, 1500, 110, -1883, -3055, -1716, 1384, 2336, 676, -1582, -2476, -1872, -79, 1019, 1333, 343, -1768, -2773, -1683, 511, 2180, 1352, -786, -2252, -2173, -816, 1601, 2179, 675, -1792, -2130, -948, 571, 1268, 1857, 1075, -1653, -2968, -936, 2452, 3222, 661, -1499, -1336, -725, 225, 1642, 2383, 1391, -867, -1850, -269, 1748, 2466, 1898, 205, -854, -1185, 408, 2560, 2519, 981, -670, -774, 289, 1071, 2091, 2333, 916, -1350, -1271, 795, 2751, 2550, 948, -597, -598, -252, 493, 2072, 2474, 819, -1175, -1249, 391, 2173, 1944, 1189, -432, -828, -840, 633, 1965, 1842, 438, -1390, -1011, -30, 951, 1390, 983, -678, -1984, -1290, 677, 1703, 1216, -395, -1530, -1463, -581, 68, 1328, 1110, -590, -2478, -1922, 249, 1277, 884, -642, -1376, -1877, -1362, -137, 948]
1704I48l99j926j131P87J311O92K38o92j081j453O82K306J338j635j758j63N42
1721a394L80J018Q66p97k146p26J589J831K97q65r16q20n82O14K487P61j090k774
1739b267j5J344J401M75lj161j229p09J236K115R45j759j457k13MJ155J776P79
1757B417k051k465J5K467J175j63m94p59j166k9J008K363L37k032k144R6J253
1774a72J574N41j84j299j744J00J630J582O6j150j449j174R86J825J461n34j789
1791B70j713L71J736J010Q0o67j097j229k07K039J932l46j972j739K04J394J061
1808A127N46n07j328j444N5J429K060m8j406j586p02R78J585J046o66j610j343
1825a814M55J009J491Q4q05j342j127K09K097J742o46k140j546L85J642J086K85
$$ y = [948, 549, -1377, -2508, -1721, -410, 282, 520, -172, -1253, -2706, -2024, 282, 1620, -15, -1773, -1936, -1394, -1014, 4, 870, 73, -2073, -2799, -1210, 621, 918, 53, -863, -1683, -2265, -1651, 836, 1597, 507, -2267, -2282, -938, 463, 938, 935, -226, -1455, -2164, -928, 1187, 2132, 373, -1084, -1297, -1293, -138, 1638, 2417, 366, -2099, -2084, 383, 1558, 1395, 901, 142, -1024, -1053, -45, 2318, 2655, 623, -1521, -1425, -172, 1402, 1943, 1759, 460, -1284, -1184, 446, 2028, 2094, 944, -505, -1679, -693, 1132, 2593, 2059, 270, -1443, -1072, 664, 1674, 1754, 1087, -10, -1239, -1446, 593, 2525, 2179, 207, -1532, -1328, 66, 1127, 1673, 1166, -162, -1606, -1551, -122, 1938, 1890, 484, -1102, -1804, -826, 759, 1805, 1139, -471, -1814, -1359, -350, 1141, 1225, 420, -922, -2049, -1840, 257, 1999, 1353, -787, -2333, -1948, -306, 780, 1065]
1842A065n01j272j382M8K232J452k23j981j243K14R35J222Q83n62j638j424P18
1859a457J491J050k38o71j069r08O80J696J411j025j391j384J001O87R69P67o43
1876I66j504q60L89K220R65j363j058m20J54N18J196P69k88k146j282J214J629
1893A099Q00n63r02r33l66R18J635M21j231j372k79L94O91J171M78o14j924q66
1911a443J581K062l48r78j189m14L93N54J126M38j189j542j31J047J030N76m95
1928A078j144j331L58J422R58J96j473p78k93M42P56P04O35j589j441m07J813
1945i4J331m3j389j006l55O10R56R91J01j497j729O9J576Q33J85o96r39m91r9
1964a686J427J242mj694j302L06P02J364L67m04j333j142N03J249R63r3r17j031
$$ y = [1065, 564, -708, -2090, -2042, 190, 1642, 1419, -562, -1805, -1591, -656, 566, 1449, 887, -751, -2175, -1457, 34, 1084, 846, 175, -894, -1802, -1122, 574, 1985, 960, -431, -1815, -814, -127, 842, 1609, 966, -538, -1398, -1009, 1211, 2176, 813, -245, -665, -511, 7, 1203, 1972, 1684, -462, -1744, -530, 1099, 1899, 1336, 434, -499, -865, 53, 1688, 2109, 878, -494, -773, -379, 312, 1483, 1961, 1347, -577, -1443, 138, 2200, 1852, 874, -315, -729, -336, 218, 1344, 1782, 593, -949, -1080, -33, 997, 1573, 1078, -66, -1397, -1039, 383, 1341, 1537, 64, -714, -1007, -565, 191, 895, 1530, -59, -1500, -1907, -94, 1237, 1194, -195, -1201, -1556, -946, 10, 1001, 1102, -395, -2124, -2055, -479, 354, 539, -157, -1096, -1587, -1686, -259, 983, 979, -715, -2017, -1711, -1009, 355, 722, 318, -1015, -2157, -1654, -405, 558, 465, -452, -1483]
1982a483n05L33J847J211o52k146q87O08K177K83l50n92n39r04k4J383K098l41
2000A517j889j726O63J579P49K99p72j017q76P77J069O74m0m69j062p43N32J770
2018A035J093r58k034r35J260J682M1K53j051o36l94qJ769J165q24j510o92J02
2036f42J121J097J77p80j331o25O84J624M70o44p05r06m00P53J346R23q54j778
2054d70r22R10J007J014j61r76r99o24J014J642j2n63j091o20M29P37O85L86p82
2073F04j408q15J088J421M84o09j300m42j46R67Q96L89j040p57m67K26J280L42
2091G13J21q62j438j25J201J428j7j276q12r4N00L28P94k3j28j642m94J320J722
2110A216L4j486q20q0K23Q12R37K30j564p92K08P99P27K03J49j033j112L83J185
$$ y = [-1483, -1988, -1655, 192, 1403, 751, -1395, -2282, -1674, 503, 786, 436, -156, -695, -1599, -1623, -240, 1858, 1517, -372, -2098, -1435, 144, 893, 1192, 420, -597, -1473, -696, 373, 1047, 1007, 538, -524, -1267, -735, 1035, 2128, 1170, -864, -1799, -539, 1143, 1184, 1437, 386, -250, -644, -652, 1117, 2282, 1458, -52, -744, -642, 479, 1576, 1753, 973, -358, -983, -299, 1325, 1795, 1151, 446, -460, -860, -107, 1239, 2162, 1308, -470, -1392, -482, 525, 1539, 1378, 402, -597, -1221, -207, 1435, 1423, 860, -231, -851, -422, 315, 1000, 1386, 604, -804, -1619, -531, 890, 1374, 765, -535, -977, -1123, -156, 740, 1129, 89, -668, -1135, -909, 371, 713, 834, -28, -1466, -1591, -390, 1038, 1021, -255, -1067, -1161, -661, -333, 461, 438, 310, -1332, -1826, -506, 1216, 1250, -236, -1056, -1136, -913, -101, 836, 1066, -498, -1290, -1082, -283, 444, 647, 796, -237, -1349, -966, 219]
2129B19R27J21j388m03m08P10K96P85J24j084j035K42J127J204k67q80p48m4o3
2148e65J148J029P4j794p37K54J292N36K41r68o02q06N51J380Q52q23j110m03
2166d51j93O06J313P83j052j279j215J182J106P55m59r63m58m89O05P84J093n28
2184A140j460r02N86J178R08n66o79j235J80M73R28L39k77r93o08k52Q47J171
2202G78M81r17j590l54J049J340l13l47p41m75l89M77J333P99j176j102p25Q73
2220i99R85O44r8r80q00n08J023J285r0m48j042m97j51J033J063L15q40j533n6
2239a694Q82J101K06n20m87o77k92P59J538J46j199p46n44J107M98N71R6j149
2257d04j91n43P99J156O15j228o91n79L79P87P62K22p07j287L7N91J123L57n18
$$ y = [219, 1146, 1267, -121, -524, -932, -222, 74, 859, 983, -101, -1136, -894, 233, 1437, 1170, 290, -458, -502, -565, 583, 1612, 1686, -108, -845, -591, 701, 1237, 1478, 510, -92, -898, -347, 1033, 1885, 1062, -48, -451, -644, -38, 1275, 2058, 1006, -273, -1488, -306, 800, 1555, 1096, 133, -325, -814, -209, 575, 1668, 1140, -320, -1222, -636, 542, 1450, 884, 205, -1030, -850, -377, 551, 890, 613, -380, -988, -1240, -393, 778, 1259, 342, -1248, -1602, -553, 787, 474, 127, -614, -1089, -1478, -1001, 332, 1131, -45, -1147, -1872, -999, -14, 630, 532, -448, -1248, -1756, -733, 552, 462, 14, -1028, -1525, -1676, -643, 420, 735, -105, -1638, -1694, -812, 289, 495, -25, -512, -1189, -1481, -722, 816, 962, -237, -983, -1527, -420, 78, 649, 745, -404, -595, -1138, -339, 817, 1432, 204, -487, -1066, -687, 100, 862, 1084, 377, -910, -873, -282, 841, 1198, 680]
2276F80r99j96J68N22J117j20j079r38N85O59N64M99p10m57o41j89Q10J389k89
2295A375j047o73j31N26Q69L70q0q90r69J90P05J048j55l97q26n35M15R77N78
2314A350r9j152o99K40P21J14M23j87j053o04K9J193J071m21r82n54j11K21N72
2333G2Q90m61p66n11q8P45P63m42k52l95m06M70Q87M01o34q92p6k05Q90L14J53
2354D57j61j139p13P32J435l4n26p29l09J90J63R20O17n94j139l57O26Q90M71
2373H00n42m05r52J8P60P89J94o12p22j51J77N88Q74k22o55r09k6J066Q31M87
2393A388j087m12p00L74M79P54L46p65j015m73R33J142J10l73o79m95J18N41O94
2412H80K58n71q80m79P01P27L43K1j113n65J15Q37P23J45j089k73l41Q8O22Q10
$$ y = [680, -319, -515, -347, 175, 1292, 1172, 93, -845, -260, 399, 963, 1462, 752, 295, -346, -535, 275, 1664, 1375, 328, -345, -476, 50, 919, 1289, 1209, 319, -650, -460, 245, 1293, 1138, 741, -85, -620, -205, 772, 1350, 1251, 99, -600, -360, 361, 475, 898, 711, -342, -946, -917, 276, 1347, 926, -56, -610, -721, -500, 72, 962, 501, -265, -776, -864, -119, 644, 202, -50, -445, -851, -381, 506, 907, 273, -619, -695, -900, -10, 304, 457, 296, -843, -1556, -824, 611, 577, 51, -678, -987, -797, -634, 286, 903, 309, -830, -1187, -561, 329, 800, 258, -147, -1099, -1081, -321, 468, 662, 50, -672, -823, -646, -58, 816, 594, -61, -970, -996, 70, 901, 1388, 301, -111, -811, -437, 42, 796, 1142, 377, -638, -1111, -178, 964, 1074, 701, 22, -473, -355, 186, 880, 1138, 567, -313, -792, -91, 636, 979, 1000, -113, -678, -563, 274, 997, 1142, 53, -220, -561, -473, 149, 959]
2432I59J05j023r54J25J160P44j23p38n47k30j46N74J018k0q02p51q2L83Q16J15
2452E83j43q56o72M54M50Q73m28k75p21l78K66R45O72k03j074p69K10O18O18J74
2472C44n83l83m92J11O66Q82m04r81k35n0P01J58Q48n05q16k70j28J016M53j89
2492A43o55n79J21J55J002M66n88j082m26P80M63N59k29k11o35l99J41R78J022
2511A026o38q71l71K68M77O51K83m66r06l78N24R27M64m17n31m21k10R94K94K80
2531I79l80q69j75M54O78N66n42mq88j82N35P44N03p15o08m45P14K9N23J70l65
2552G22p37o33O23P60N51l94q97m15J03O95N98o1l31r78l7K56Q44N96m81q37o73
2573g26o4Q64Q98nm23q96j0L43L99O40j83p19p37m80J066O99K15j005m53j01J02
$$ y = [959, 1064, 41, -913, -788, 372, 1116, 993, 255, -292, -522, -668, -94, 924, 904, 102, -649, -731, -348, 468, 583, 440, -416, -1088, -634, -184, 689, 261, -14, -735, -1113, -847, 98, 770, 567, -507, -1276, -1066, -448, 170, 344, -239, -622, -1114, -1003, -337, 545, 141, -840, -1075, -1125, -424, -266, 582, 77, -739, -1009, -1137, -121, 332, 143, -512, -1091, -970, -815, 187, 653, 65, -1017, -1443, -663, -200, 359, 130, -81, -716, -1115, -974, 4, 1026, 388, -483, -854, -586, -109, 542, 825, 359, -547, -925, -401, 526, 990, 573, 42, -379, -589, 405, 699, 979, 599, -270, -445, 9, 687, 1253, 711, 707, -181, -363, 172, 916, 1419, 704, 96, -349, 365, 394, 917, 1087, 722, -15, -648, -25, 735, 1286, 892, -5, -420, -317, 378, 976, 915, 584, -394, -431, -175, 669, 1265, 784, -53, -726, -790, 74, 972, 967, 544, -352, -362, -19, 380, 1020, 837, 118, -619, -1099, -33, 666, 881, -124, -577, -678, -576]
2594e76O29M71m5n31m90o06Q55N75L96m76o03q70J61J136L79m7o75p45K62R1O52
2615e7M40J74q15p33J28P03Q51l12q37k62k90K23Q07N06j65o44l50k73Q20N01
2635D15M3n06m52n11M61O12L72J38o27l90l3R0O93P67n01q52p84L41J022M67l50
2656D15j88l13o96K81J115M56l82p96o82M30O53N97j62o16n33K25j07O81N39k83
2676F34k95q14k34Q28P20o1J94j226m08M34Q22R4N1m56m75j43l2R05N97n95r46
2697d06q8J71N80M58k55l55k85m26J89P92Q2j90p54r1o8M35O66J5l47n96o96L10
2719h59R60K50j49n84k29l35N65P09K42p13n99l89P18K32K26K81m30m43n25N82
2739d90O06L86p77o97n8K35N17O78J64p11n31j76N50L34O1k36k04k45O5M54O52
$$ y = [-576, 53, 524, 479, -52, -542, -1148, -293, 282, 678, 202, -401, -1271, -1110, 26, 405, 358, -317, -1062, -800, -709, -57, 383, 557, -258, -991, -863, -160, 691, 379, -458, -720, -1010, -787, 20, 526, 361, -283, -633, -906, -86, 415, 458, -48, -500, -1011, -550, 62, 434, 572, -55, -445, -478, -388, 305, 1072, 571, -281, -1065, -724, 298, 765, 415, 227, -86, -782, -501, 614, 1070, 688, -108, -790, -360, 293, 890, 728, 112, -421, -196, -303, 378, 917, 634, 339, -475, -709, 119, 839, 778, 972, -254, -662, -228, 594, 688, 739, 283, -192, -335, -367, 538, 1135, 540, -406, -494, -323, 257, 715, 460, 105, -180, -606, -417, 375, 457, 267, -487, -578, -646, -211, 455, 470, 123, -473, -1169, -859, 101, 351, 202, -382, -611, -946, -381, 328, 570, -143, -742, -1131, -413, -181, 45, 326, -104, -547, -1072, -490, 116, 502, -275, -972, -1030, -795, -278, 400, 564, -147, -678, -854, -304, 30, 91, -145, -349, -594, -529, -75, 577]
2760E77k52p55l05K75O7M04L22P1l35n19l66R13M71L89j084m61L19J25K58O27
2780G41l42l66l80r0M14M22L89n49k99l01K41M81N85l28n28oj00J53J88M37j95
2801E67o03k35N0J181p1j41o38k40P7L30K63N09n63m63m65L21O74L75M9k94n60
2822A23k03R5M82M88o10j75n35M31O5N91k21j84n23l97P44L92J24O9j026r0P2
2843b88K01P61n7j01j076j49L35N98L34k00n52k20l63O21N92K22o06p77J81q8
2863f32L97O28O2n07p92J80L43N25L99q70m17k65K68L61O02K19n70p22l22O87
2883d26M88Q2j94l90n13K94M90M55M25q29n07m76Q13M76K78r9q87k45k1N16P16
2904D46p1j44n69l17L81K07L81K38m75j064L04M53Q00R0m86k69k98L6L08L88J52
$$ y = [577, 325, -430, -735, -460, -393, 11, 333, 404, 69, -450, -816, 97, 568, 957, -127, -588, -269, -144, 114, 741, 399, 33, -347, -437, -23, 399, 788, 239, -60, -361, -120, 361, 946, 618, 90, 84, -16, 137, 325, 762, 567, -36, -271, -221, 960, 889, 748, 110, -130, -53, 277, 540, 1049, 486, 23, -442, -121, 553, 928, 977, 683, 123, -80, 15, 497, 985, 375, 200, -335, 96, 161, 752, 531, 347, -176, -573, 171, 563, 687, 756, -270, -360, -288, -87, 674, 617, 516, -560, -709, -374, 224, 558, 358, -194, -414, -777, -156, 436, 658, 52, -725, -544, -632, -235, 393, 455, -52, -844, -664, -321, 204, 603, -267, -684, -949, -681, -320, 282, 501, -69, -791, -1113, -426, 62, 144, -50, -440, -953, -659, -169, 286, 711, -118, -625, -1101, -288, 188, 466, 367, -520, -765, -786, -270, 446, 375, 231, -338, -655, -274, -67, 314, 552, 77, -987, -683, -230, 570, 660, 174, -95, -393, -357, -49, 339, 491]
2925D91o03j86k02Q2J083M7j64m01m24j22O28O05j6p53k59l48M20M20O05l03q01
2946b01j42J10N35L27j58j27n86j44J45K71N79L6r62j22J19M05K35K20j93n77
2966b30n05M9R50K44r6m42n99J52N2N81M46j75q13j80K30Q7L41L82j83j007K05
2987e11J33M73L76k73p19j63L55J34N0L66k41l15m37J45P57J27Kp04l17L10K15
3008b37K05K85k27m79k41K95K72L72k36L21o31l24L50N54j25j59j84L2j23J68
3028a12O63k48p0o07j78L16N58K60m07l36l30K54L00K04L84m30o85J65M33L17
3048D51J70l10K16n82k51L89O12M5l21k73k74K10L05L59j41m8o89j45O07L17K33
3069H80l09k10m54O3K61K68j0m06j60l55Q67J99P2L1n18j52k61M98M10p1l11n60
$$ y = [491, -112, -298, -500, -418, 665, 712, 548, 147, -277, -399, 229, 834, 818, 65, -194, -542, -122, 298, 903, 600, -201, -343, -233, 302, 629, 471, 344, -242, -386, -241, 30, 609, 645, -317, -439, -320, 85, 320, 540, 347, -230, -735, -686, 264, 508, 412, -30, -629, -477, -425, 156, 602, 427, -386, -566, -336, -249, 92, 474, 291, -716, -511, -378, 95, 471, 198, -521, -684, -329, -195, -145, 221, -20, -335, -772, -627, 130, 257, 259, -445, -762, -452, -237, -32, 253, 26, -453, -694, -399, -127, 245, 9, 330, -301, -625, -275, 279, 154, -5, -189, -157, -280, -112, 551, 303, 233, -374, -552, -236, 322, 582, 175, -161, -491, -237, 63, 267, 651, 221, -464, -299, 134, 451, 621, 311, 527, -55, -306, 83, 695, 740, 419, 146, -128, 82, 387, 746, 605, 557, -132, -277, 330, 647, 880, 571, 361, -93, -30, 231, 499, 489, 83, -77, -432, 435, 634, 706, 737, 219, 67, -194, 304, 714, 643, 332, -228]
3091b28q8P2L33P24l81m34l44j10K64N21j4k87l44j33J89J67L97J35p98j85m2
3112e86K47L68LJ24l53k91N5J81O21n9p36m8J37q0M41J59J19p30k70L10R4M71
3134A77k88j28P1l81j55O44J96j26j79p20L14L98L4K45k00j59j51P3K42M01l61
3155e3j43n17J38N31P1o3j20O6m98L78P8K85Qk89k61K03J01L55o0l17k69r3N18
3178D9N1L98p7j82m8p19L38N76K53k61k04l04R6N51l59L2J2p08M23j5L16L4j83
3201F9K68l05l37K20Q53j91m06l72J96R7m5M41p6l18l8l23L81L12M7j82n80O2
3223b27J97M69N0l44k40l22J56K39J79J69o1n93j6P7J65M70k36M1p47k9N09j04
3245a98L22k43n0l90J82R4M70m8l36m11N36j61M48N0j28l28j83l40M49L16J62
$$ y = [-228, -316, -244, 89, 813, 432, -2, -346, -456, -192, 329, 315, 28, -316, -449, -260, -93, 304, 439, -359, -544, -586, -339, 29, 32, 156, -197, -488, -433, -252, 369, 310, -426, -474, -337, -417, 24, 183, 302, -428, -698, -388, -294, 177, -111, -239, -168, -549, -704, -60, 136, 10, -169, -889, -575, -177, -143, 102, -98, -257, -408, -335, -93, 308, -53, -196, -713, -575, -44, 27, -36, -156, -90, -588, -210, -132, 153, 161, -128, -389, -186, -85, 270, 210, -107, -376, -469, 49, 100, 498, 421, 239, 191, -528, -190, 386, 639, 378, 174, -130, -34, 517, 158, 190, 202, -506, -83, -98, 218, 252, 69, 337, 32, -305, -85, 768, 577, 171, -201, -5, 92, 47, 488, 412, 94, 56, -267, 114, 426, 473, 291, -289, -227, -30, 439, 489, 145, -95, -417, -261, -22, 157, 326, 265, -328, -344, -267, -102, 368, 132, 173, -574, -603, -94, -198, 124, -119, -169, -559, -377, -283, 187, 139, -197, -608, -72, -233, 215, 265, 137, -191, -374, -714, -265, 51, 213]
3266B13k75m66m7K88L17J25K65n16m39K22K62K91K56j42o24l16k23R90J9N3n12
3287b59J47m40R48r0K97j13n75l85K76M29K66q0j05m44j38L18R4L83m73J33l89
3308b00K41K21N34p8l17m79k49K59O38K33l27k65k91j49N88OM68m66k65k34L69
3329B37J46J29O9m34k20qk1N48K00j80q18j51N06J6N45o8n47JN9J71j06L16ol55
3353B9l53O7L15L58J04n26l31r3M47R8k11MQ3k42l77M17N87p3J10r96J45J0L32
3376i6J87k24l48K37q0L8K29L26m33j13k91k80M66L85n4m94k2J2M99K13j08j53
3398a04K35p29j05M84M48L3k18o40k2L85J41L52j83k9n39N0L01K37j05o8j72Q
3420b40l98N65L85J37m15k82r5J93L36J05k19q3r0J05J55J3L63m74k33N8k4K11
$$ y = [213, -62, -528, -575, -287, 30, 155, 420, -96, -535, -313, -51, 240, 496, 354, -270, -586, -809, 181, 200, 253, -259, -112, -552, 396, 306, 603, 490, -85, -470, -194, 235, 501, 421, 316, -128, -266, 52, 146, 529, 56, 189, -200, 41, 262, 796, 718, 401, -78, -327, -68, 570, 803, 476, 211, -80, -229, 359, 365, 833, 367, 102, -132, 237, 383, 512, 581, 147, -73, -81, -102, 446, 646, 466, -352, -503, 3, 19, 564, 496, -51, -50, 9, 180, 74, 390, 384, 29, -324, -257, 58, 416, 520, -6, -337, -430, 17, 115, -96, -92, -9, -251, -628, -211, 376, 303, 413, -583, -438, -428, -96, 91, -133, -481, -244, -324, -286, -57, 269, -164, -277, -568, -848, -382, 3, -51, -545, -567, -555, -56, 157, 49, -104, 131, -598, -703, -219, 229, 262, 44, -596, -618, -233, -92, 260, 77, 48, -491, -441, -140, 97, -8, -76, -248, -240, -638, -73, 312, 449, 34, -248, -343, -150, 186, 291, 72, -11, -101, 4, 159, 172, 535, 61, -172, -114, -138, 73]
3442G3l1M97n39j85J34K81J22k63L79m22q7o3J32L18l9k12j20k48L39L18j72j41
3464G1%k32N0P3N07k5m46k79q0N28k14K91J7j38p39M30L51J46j13j84k10J11k14
3487b99M66OK0k00l99P2K78j98N19n78K98k4k57M11Q7j14j03k04J68m7L07k65
3509e6k88j47lN11J35k48R0o4l05K83j52N27j10J2o74L72n3P6J82n3o19L09N8
3532b17J14O27l11j70k18N0rN11l01K69k97k40m5L16J67M2k39k78L21j88J10N04
3554E18j2n18k00J17N59k03J25J6l72j69Q3J76M16k87J7m25L86k23K76j26J51
3575C05p2k09L33m42N66j46j87J3j23K00R5R2P1j73l34k89P90m50K62k8p7j64
3597C3L28kj04M9k73n1j97K85j59N01l03l88R8Q5L84R1k46J12k67j46R4K88l3
$$ y = [73, 42, 539, 0, -185, -51, 230, 352, 89, 468, 46, -41, -104, 28, 346, 307, 95, -25, -273, 66, 384, 212, 71, 71, -161, -111, -38, 469, 444, -2, -281, -361, 167, -47, 244, 261, 123, -616, -186, 165, 311, 198, 14, -196, -85, -299, 167, 173, 193, -7, -406, -334, -56, -254, 265, -313, -15, -39, -296, 115, 202, 88, -15, -219, -51, -98, 209, -56, -344, -491, -494, 17, 152, -96, -6, -70, -375, -92, -244, 283, 173, 185, -489, -117, -170, -94, 88, 35, -584, -275, -217, -103, 524, 213, 43, -175, -125, -134, 377, 76, 345, 48, -192, -237, 79, 246, 288, 49, -229, 92, -96, 14, 518, 506, -12, -212, -95, 464, 261, 386, 402, 30, -139, -56, 120, 536, 249, 266, -159, 227, 4, 280, 154, 305, 233, 24, 357, -85, 481, 335, 148, 161, 38, 238, 333, 425, 496, 323, -11, -300, 490, 40, 302, 274, 197, 33, 361, 359, 255, 304, 31, -20, -217, 68, -91, 410, 107, -281, -183, -98, 286, 377, 131, 243, -24, -170, -76, 212, 179]
3620A79k23l20j22M16Q3j19J48k33j32k27N25Q4K8j07k87k35J74J82J16j20M5
3641a45j64k5R4K18k54L28k54l8k59K06M16k02j87k82J33q4M40K55k64L15l24
3662g7k64J75K12M06k52q12M56p5L9J85P5J00m10l98O85N3L05k73k24k66L17J73
3684A30J93j7k73j88k16L61L05l5m5l9k68O4K04P4l23K93j37k01K58O9J64J77
3706E50n52Lk91O58m3p9n1mj44J2J22L79k92m6k88j04J38K81j36N9k4k68N7j98
3730b61M61K65m22r4J64l59L50L3j53rm4q4J15nK00j18J21m75K59J13J83j59j97
3753a16j53l33K09L78L83k92k93l55J46N26l1r7J3j48m73L70L13J23Km99q5Q1
3775c31M61M2k59n2L77m12J57K12m4j25k6m17qM54M7j24J88k60k64J15M08L79
$$ y = [179, -44, -364, -486, -70, 13, -106, 42, -191, -323, -550, -25, 59, 87, -20, -307, -542, -368, -186, -70, -190, -145, -309, -334, -240, -22, -276, 52, -202, -240, -499, -293, 123, -79, -266, -548, -415, -499, -59, 196, -68, 247, -77, -341, -166, 46, 452, 200, -612, -156, -231, -192, -7, 68, 168, -242, -640, 45, 98, 403, 130, -94, -360, -43, 130, 323, 306, 33, -155, -371, -10, 295, 260, 215, 176, -92, -28, 176, 250, -73, 220, 83, -118, 140, 209, 373, 550, -2, 1, -290, 368, 325, 246, 195, 191, 47, 59, 181, 560, 268, 222, -66, -170, -32, 249, 113, 172, 148, -120, -63, -261, 200, 465, 43, -51, 113, -246, 104, 137, -16, -25, -69, -153, -38, -43, 157, 39, 160, -315, -56, 57, 240, 81, -116, -269, -602, -393, -15, 368, 76, -217, -572, -426, 100, 69, -28, -15, -163, -636, -266, 47, 170, 172, -327, -412, -331, 130, 172, -87, -139, 238, -174, -17, 195, 151, 26, 0, -417, -425, 29, 76, -48, 140, -120, -384, -269, 139, 518]
3797E18m75PL4n2k00M73l89J63L1j58k9L46j74N19n37n45O10N9J50j89J62l26
3819bl56L11L23m22K69M05o40p8L65J9O6r4j08j16j10J13M35j94L18k84m43N92
3841C69k97R7K66m29QR4OL63l92p5m0K16j01kO04l37j36l62J53K83k37m3l10J65
3865a37K22k53m6M30j56l29J10j87L90j41j78M64l33k3k19M16r9PN2l93R5lK57
3888e4J16o7k74J62l79L50J35J39j56k65j40L31J95l41L32k99Qj40K88j3j37J83
3910b6L0l11p1Q6J81L70o83O8Q9k4L09k91J87l20K36N2R3Q0j94p3P1K22j72k44
3934c35J79J47J02k34oK91k12K65k1k44p5L85J1l31K01k03O6n1m0L92o8Q0n58
3957b59L9L32J80J3j96j25r9L6K28K25j52k4l11J08P9L62l5k07K3l67k2R1M86
$$ y = [518, 43, 50, 84, 32, -168, 305, -84, 79, 110, -48, -77, 269, 95, 614, 77, -468, 142, 201, 351, 162, 324, -2, -358, -47, 276, -146, 123, 528, -112, -190, 175, 194, 260, 166, 58, -58, -168, -55, 380, 186, 504, 220, -223, 369, 72, 169, 435, 6, 14, 108, 114, 477, 85, 10, -30, 186, 85, 83, 687, 350, 214, -148, 5, 288, 51, 8, -302, -137, 85, -168, -214, 216, 60, -269, -159, -346, 44, -97, -275, 189, -144, -167, -386, 30, -69, -62, -10, -403, -308, -311, -54, 62, -5, -279, -117, -496, -146, -11, 128, -28, -293, -433, -102, 93, -248, 84, -215, -207, -347, -59, -72, -209, -26, 4, -307, -378, -292, -111, 259, -424, -356, -267, -291, 18, -273, -86, -406, -170, -118, -25, 55, -139, -212, -141, 81, -91, -335, -156, -9, 93, -141, -147, 144, -68, 197, 176, -68, -143, 242, 253, -78, 123, -80, -14, -65, -105, 287, 219, 299, -259, -220, 112, 292, 305, 109, -16, -115, -79, 149, 374, 222, 198, -113, -5, 74, 436, 401, 194, 217, -150, -172, -81, 405]
3980D05o4l08j2M0j90K69R9j86J45k30j10K25L29k2l03l74M02j5K30j93L1k40
4002g2J91l76K41K15l94M62m32l5J96J06R8k71r0n0o8n4L66J7o3m53L42rJ89K42
4026B98j66k22J07k84P0Q2K02J10k70j86l0J44K65K98o20J83j83r4N91m03K34
4047A26j14j71j43L37oJ58pl33j6q3K56J2O3j06J39l06J03L05K27m29k4J45p3
4070F0n7J03l0K61k22r6q7N1K17K23l62l07P8J6J57J40L36l08n56K58L87J81m90
4093d7O35o52r5J01M15r6l5j24r2j75M32M4Pk37o2L0k24O65k92j25r4j14N9L0
4117d6J04J54J58m99j98K67J7j95J62n3j13K24J43k01J82m5J5j67M8K47j14R8
4139A88m72L0j1j90O61M4k30j80j19k55L20k2j0J25l15K04JJ25j49K22k63OL6
$$ y = [405, 341, 33, 21, 61, -129, 140, 239, 53, 198, -32, -142, 83, 412, 390, 87, -287, 115, 100, 330, 137, 168, -72, 119, -257, -16, 199, -195, 267, -165, -200, -4, 102, 200, -71, -161, -211, -279, -333, 33, 50, -13, -466, -124, -133, 56, 298, 132, -90, 17, -267, -197, -115, 87, 197, -73, -259, -289, -145, 120, 418, -202, -19, -202, -296, 295, -108, 126, 12, -159, -302, 35, 29, 187, 180, -153, -169, -252, 4, 16, 79, -27, 112, -194, -91, 214, 441, 12, -12, 133, 60, 3, 106, 76, 337, 115, 19, -68, -17, 200, 423, 61, -246, -168, -152, 5, 145, 481, 173, -383, -125, 262, 443, -47, 588, -64, -159, -58, 357, 261, 226, 102, 10, -165, 267, 311, 318, 81, 19, 49, -175, 490, 198, 73, -21, -135, -76, -46, 58, 212, 370, -129, -327, -60, -43, -238, -76, -129, -242, -18, 125, -76, 106, 61, 76, -91, -43, 204, 90, 188, -284, -254, -265, -455, 206, 250, 20, -160, -279, -534, -214, -236, -246, -121, -436, -232, -231, -106, -255, -33, -296, -290, -254]
4162b54m6J46K11m5q3m21K60l0R7J26n3J41j87O4j3L58Jn36L88j7J11n12M40j5
4186A31k77L00k46J43R7k4n07L94o2q0L79j94J74l48L92l49M0%K49k20L2q7L39
4209B76q3k7N6j00%K48O5k90J57k93o7K5L72r4kl74K80o3k19J14K69k66K06k66
4233g6K60l19k2L30r6j66P2R5J81J43l76J52j5R5r5m82N55l23L5j48J50J01L19
4256C70l48N3k56J1L01l79L48j64K89J10j33n8l79L3O6J29N5k97L61k81O4k76
4278c81K8J52R3q9K38r6N8Q1k53J74Q5O3m72O4J01K79k58L37l41lk21K82j3l3
4302a25L08j34l15Q7K19p6N2j34J02k40Q0J50J68j73M47k66K0j00J27j94L09m37
4324a25k08J57K82k49N45l13j97J73j24M05k02j8j60J77m4K3J01R9k9m17J82J03
$$ y = [-254, -300, -154, 57, 12, -71, -492, -232, -262, -165, -39, -92, 49, -138, -74, -87, 271, 272, -264, 124, 107, 218, -294, 146, 131, -146, 154, -92, 51, 148, 124, -383, 11, -51, -131, 248, 54, 228, -120, 272, -77, -37, -37, 212, -8, 24, -63, 276, 193, 166, 222, 122, 122, 370, 435, 145, 302, 9, -58, -33, 339, 245, 243, -131, 149, 86, -133, -19, 250, -16, 190, -76, 184, -135, -157, 173, 77, -89, -17, 78, 259, 402, 26, 178, 163, 258, 163, -319, 236, -87, -52, -200, -50, 51, 370, 22, 75, -181, -170, 131, -248, 100, -64, 225, 335, 202, 144, -235, -202, -136, -7, 48, -249, 112, -169, -105, -381, -353, -201, -108, -197, 41, -55, 3, 84, -169, 5, 90, 153, -319, -255, -154, 125, -133, 204, -137, -140, -361, -79, -92, -125, 183, 49, -266, -179, 40, -36, 16, -118, -16, -256, -176, -26, 142, -31, 416, 150, 170, 70, 197, 3, 312, -125, -333, -176, 106, -143, 402, 89, -108, 65, -59, 346, 144, 126, -34, 143, 99, 122, 223, 322, 293, -124, 58, 161]
4346A61j19J17%m34J42L96k46KK51l7k90K42k63K87j19r9k68K22j40N32m61J99
4368G5J16m91N28k42K94k01p2j75J36n0L2j37L38k69k50J28J50j83K43L3j89N7
4390a29j69P4J58O9mj61o2J85j6j5K52l12k96K54K91l81J03K12l01J62k47K67
4412f6K61k70J41k22M6K46L0q2k86J16k22K2L02j72m6O9j99L39J6j19J66l83L50
4435C7j06q9K80J0j9k38nk58K22M72k11q1q9p5o4J92J45M11m70MJ56j27k20J21
4459bJ74o7p5n4n3J61J09K09o14J66J83J17oP4j59j04n8O7J3J74Q6l88J91J21
4483B65k56J54R3o9l1l22M45j63L85m15J3J14l31M6J66L29k50K9k21j11L25k58
4505f3L48L6k42o4J12J43k78J73o4M0j90J20l00L22J11L0l94mJ21P8J15m49L63
$$ y = [161, 42, 159, 159, -275, -133, 263, 17, 19, 270, 233, -57, 185, -78, 209, 90, -9, -277, -55, -195, 337, -124, 75, 191, -300, 228, -14, 280, 79, 7, -168, -32, -82, -50, -187, 151, -118, -368, -240, -90, -273, -30, 3, -186, -129, -298, -224, -66, 3, -1, -162, -224, -39, -55, -70, 182, -130, -426, -172, 119, -262, -159, 53, -248, -86, -333, -66, 195, -75, 66, -156, -110, 136, 166, 84, -202, -86, -308, -286, 16, -156, -202, -133, -332, 7, 23, -96, 70, -313, 37, -69, -158, 122, 132, 113, -125, -130, -388, -166, 306, 95, 14, -75, -150, -214, -22, 123, 534, 64, 68, 224, 97, -123, -2, 172, 105, 30, -24, -77, 84, 193, 402, -212, -46, 137, 254, 248, 322, 163, 59, 1, 68, 81, 255, 341, -47, 144, 265, 9, 163, 256, 187, 156, -166, 279, 116, 501, 86, 99, 213, -118, -72, 94, 423, 173, 202, -19, -130, 195, -63, 285, 321, 79, 15, 127, 270, -8, 165, 101, 141, -49, 71, -229, 93, 204, 234, -160, -164, -43, 35, 150, -299, 64]
4528F4j87K7J2O7K03k44j62P6P8L0j66J77J52l05j4K15M25j44k00Lk88K36qp1
4552b4p0L9k12O4J09L21j08j15l27nM62O6m24L08j68J17J9M6qj75O7O7r3p7O8
4577e3j13L97l86J48k1J14j32J48j41J33J68m33RM63k22N4k47J00M6J72M0l67
4599a23K37k9j11k59L66Q5k18K64n1k82J61m7K9P6J8m8J27k33J90N3j52l64J71
4622a40J73k7L2J12k65m2M28k50O0l46K78J19j36J02J33r9j78k00J50J76J56k53
4644a7k95N3N9K87r2m1pK80m46K78k35l49Q20m51J46J60j57J75M4l22L9k12N3
4667b30J56q5N7j83K17k72k16M63P6k66K00j86L89J40n26J77J01J19q8J09l69
4688b17J76L75n24K29k16J3mK93j04o4J17k14L59p2J32n78R3L83j10j04nL38k50
$$ y = [64, -123, -96, -84, -17, 186, -58, -220, -144, -66, -36, -202, -25, 127, -178, -192, 23, 448, 304, 104, 107, -181, 55, 47, -24, -94, -55, -267, -203, -94, 227, 119, 4, -323, -328, 134, 200, -224, 84, -84, 33, 52, 98, 90, -85, -18, 49, -44, -121, -53, -166, 231, -155, -7, -28, 86, -46, 102, -39, 94, 262, -171, -162, 301, 79, 133, -114, -14, 32, 204, 244, -123, 114, 85, -26, -285, 81, 166, -52, 212, 161, -121, 40, -7, 22, 98, 116, 68, 195, -38, 152, 205, 53, -311, -140, 33, 6, 38, 150, -115, -157, 271, 21, 81, -265, 13, 132, -4, 98, 231, 132, -46, -246, -96, 80, 236, -17, -312, -259, -200, 87, -5, -46, -53, 227, -219, 59, -176, -525, 295, -156, -10, 150, -7, 168, 212, -110, -71, -283, -230, -74, -159, -102, -285, -68, -340, -556, -93, -17, -283, -83, -269, 120, 260, -266, -89, 12, 131, 43, 152, -217, -41, 334, -190, 39, -177, -164, -168, 125, 21, -43, 74, -140, 219, 147, 279, -299, -206, 177, 67, -37, -42, 296, 46]
4711D6l69L65L5K64m15K67k9o4k60L89j57K78j46m7k09L11M9j15j93p3M7j27L41
4734A88n8r5q1o0K59p5k4J3j21J90j29K0O0L39m10j3N6Q8j94M10m95L44k13k02
4758b03J41N9J37OJ18k91J91j88Q4l30M27l75O4N8j4l3M10l81N8j05K57k36J02
4781d4J08j06l07j4J25L36R0k64q9J21J34p3K61k62r8l71K85P4K85j47J72l34
4803a18k09K80L06k58k7j5j10n8L86l79J98l54K29J13q9L3J17K5OJ20j44k23N66
4826C95k95j28J27j9Q5j12j99K27J75m03L07K15l16K91k28l22J93J31j24R7J67
4847B64l94j69J33K90j89k06J53J81R1Q8j58K4jkj96J34q1K55lo0q8Q6j71J59
4871A40m6k01M1Q3l7RN0K9j68N6j53j9kN25k73l48J67p7J89o4J54n6J85j05r0
$$ y = [46, -323, 42, 77, 341, -74, 193, 164, 100, -160, 229, 72, 350, 204, 157, -52, 259, 308, 193, 0, -73, -26, -153, 188, 130, 35, -46, -106, 153, 78, 54, 67, -54, 136, 7, 27, 87, 426, 16, 3, 59, 147, -47, 363, -132, 212, -1, -203, -62, -3, 134, 140, 258, -33, 158, -30, 54, -276, 151, -224, -160, -102, -116, -149, 261, -120, -62, -167, 90, -146, -44, 64, -42, -349, -363, -238, 98, 188, -76, -165, -44, 90, 17, 278, 16, -82, -453, -168, -94, 191, 44, 216, -118, -327, -47, 259, 1, -26, -41, -151, -209, 177, -202, -4, -358, -129, -16, -105, -72, 45, 70, 76, 196, 52, -171, 395, 100, -28, 99, 80, 165, 53, -146, 81, 256, -147, 160, 375, 59, 350, 122, -200, -7, 124, 0, 97, 264, -130, -299, -166, 124, -65, -271, -118, 63, 154, 242, 84, 108, 107, 105, -91, 43, -38, 217, 214, 154, 66, 152, -19, 140, 94, -107, -66, 17, -20, -11, 39, 68, -100, -44, -197, -216, -218, 307, 34, -314, -147, -224, -35, -99, 55, -1, 184, 79, -11]
4896a1Q8j15M3N4P3l36K73j55o6K02j1n6m0K2J32m05K96K23n22M21l67L50j20
4919b7j12K54J22l10k18M02k8O6n05K53L2k7L07n13J58j17K13K16r8k22L32m66
4941b88K29L08k58J09k79J37k2K79k91M2Oj33M8J22J86j77J35L36n29q7Q7j55
4963a95M46j25J1p4p7J62j02R4P0j24o8J70K1j8m0j65j5L02k87J99k39L59Q9m44
4987e0J84j95J45K58k71J82q51M33L8M04k24K23l95K48r5MJ83m1j06j27N2J11
5009A10j80J22j6m2j95J99J12k30J84q9J15j63P9J4J4J28j12j44n3L14j4J38l09
5032a8oP5J9n4k6n4J5j17K27Nn24M49M0M6j43K6J61k7J24m69L21O5k73K51j73
5057f0J49k14R0l43L02j39J76J82n16l8jO70q8J8m92K59j55j47P59m57P3K5j13
$$ y = [-11, 77, -38, 5, 59, 132, -204, 69, -86, -152, 50, 39, -17, -57, -35, 97, -308, -12, 211, -311, 110, -257, 93, -27, -139, 115, 237, -73, -291, 111, 83, 149, -356, -103, -71, -98, 209, -304, -146, -263, -50, 166, 68, -154, 178, -288, -59, 249, -9, 100, -179, -42, -64, 215, -76, -34, -28, -161, -113, 9, 195, 18, 153, 489, -40, -127, -40, -195, 251, 126, 137, 63, -14, 148, 46, 140, 210, 86, 18, 188, 209, 191, 151, -14, -29, 273, -14, 185, -54, 305, 394, -50, 134, -61, 84, 342, 71, 253, -598, -165, -127, 277, 53, 276, -119, 129, 34, 38, 221, 180, 74, -53, -1, 110, -70, 52, 36, -6, -201, -2, 110, -120, 64, -25, 90, -73, 6, 20, 34, 162, 50, -94, -147, 167, 153, 291, -18, -24, 51, 70, 16, -10, -64, -49, -166, 61, 66, -458, -9, 31, 77, -66, -40, 121, 94, 218, -251, 70, 135, -138, 113, -60, 89, -125, -35, -378, -76, -215, -39, 143, -373, -411, -412, 258, 170, 188, -304, -45, -200, -347, 412, -45, 28, 53, -60]
5080f0J43j73M36j76k23J4J53r4lK67l45J17l52L48J1j56L82k98J50m62N32K8
5102B39j62j67k08L86j69J15L3K57l42m8N6j75L70j67O2j87J62k04O19k72m8p8
5124G2j09K9K23J06l22J01j11j02Q8K06k3p4j79r6L4J77qO5R8N5l43R8L81l16
5148E0K60m19RL74m22K06P4%J16q36M08k25M24j26K1M1j14L5k42M12K6j50J19
5171D1nq3m7NJ73l06N2P1J85k2L0k97k3R5P7j98J9J25L6q8J34O6j42R7P6j85j51
5198b65K84j72M46j30m8k45j70Q3M73o9j55j64o6K24q1R6K36l80K15p7j02J67
5220A00j61m0K26K2j67K37k58J78r1kj03J36J70k84j67QQ3J14J9R1r0K27l16K23
5244A55k88M85Ml30J98ql26N7K14l60M8J10rL1K42l57K43j15m4J73k68M11k34
$$ y = [-60, 83, -90, 346, 170, -53, -39, 114, 20, 17, 284, -61, 56, -296, 52, 63, -93, 289, -9, 141, -321, 211, 239, 77, -90, -298, 88, -81, 34, 67, 324, -18, -66, -10, -185, 185, 18, 80, -107, 55, -149, 470, 198, 150, 72, -37, -8, 215, 321, -1, 100, -11, -113, -25, 181, 158, 84, -95, -191, -157, 20, 12, 77, 175, 230, -113, -15, 366, 50, 310, -109, -100, 274, -148, 58, 132, 132, 248, -588, -180, -405, 19, -107, -86, -45, -159, -124, -366, 46, 72, -78, 41, 36, -47, -94, -89, 84, -222, -170, -99, 86, 64, 94, -203, -226, -131, -54, -252, -233, -108, -72, -160, -26, 40, -102, -5, 71, -114, -265, 19, -153, 293, 163, 115, -130, -300, -217, 256, 187, 32, -132, -198, 26, -55, 41, 277, -103, 112, 35, -67, 100, -61, -101, 125, 147, -20, 217, -41, 137, 46, 44, -59, 77, 247, -37, -204, -196, -113, 1, 20, 111, 21, 248, -68, 155, -133, 352, 356, 26, 224, 216, -110, -53, 161, -199, -151, -41, -50, -19, 223, -134, 109, -6, -50, 123, -145, 266, 32]
5267C2Mk76J94K21k65J40n6j08j0J52r6L7J28k89Q0J86m6K40m07K4R0J33j06R8
5291A00J4j98K46j65n5j37L24L5k41m8L04k50N8J96k63J29j76K44l70L1J00P7
5313d5l9R1p3J74q5J3o4K4j4j79M90n22K58p2M8j03j21Q8J22L4j75K3N3M59k37
5338A48m24L88l12L32r4P6l6K41n04L10j08m0l7m0L43l19L6N2K23j13p9K2j13
5361d8j93J93L25jn66j5J55O5J89L2n0J9q2j4p5K05k56M64m94j51L35J26m3J80
5385C00k81p4o2n8J79Q5J4r6k5L2k12L46j46m6J41o7k92N57k43k41J29q5M3J47
5409D5K01k50j14P6P2o0J18k50K58J39n7m67L43k68J56j22k60K35J7J87L07m18
5431a12K19l79L16j61K25P1o7n3K5l36n3K60J22k75J05K85j84p9L17l84L90m41
$$ y = [32, 36, -240, -46, 175, -90, 50, -6, -114, -124, 28, -68, -31, 97, -192, -112, 74, 28, 268, -139, -115, -25, 108, 2, 100, 114, -84, 162, -3, -58, -195, 129, 164, -77, -125, 179, -71, -13, 183, -80, 49, -127, 117, -253, -222, -122, -45, -84, 7, -66, 108, 23, 36, -28, -4, -18, -197, 293, -229, 29, -43, 5, -98, -219, -131, -9, 25, -150, -127, -74, 385, 148, -276, 112, -200, 132, 38, 114, 78, 319, -185, 125, 17, -23, -60, -100, 243, -76, -40, 12, 235, 122, 43, 65, -48, -241, -48, 277, 276, -290, -305, -150, -85, 104, 136, 86, 105, 23, 9, -66, 139, -117, 347, -147, -298, 37, 163, 120, 300, 19, -55, -117, -175, 4, 89, 103, 7, -18, 14, -198, 148, 2, -44, 97, 30, -262, 295, 52, -189, -60, -145, -102, 45, 246, -4, -118, -42, 30, -30, 88, -162, 96, 235, 178, -289, 54, -214, -58, -180, -440, -205, -188, -1, 306, -112, 107, -272, 44, -117, 108, 179, 112, 59, 84, -252, -305, -45, 77, -198, -93, 192, 8, -71, 246, -138, 252, -189]
5453a89JoKL3rL46Rm44L66q5O0j43J64j04l69K86J93j11Q0j05J80N2k07L08l44
5478c6K23p3M5j45K5J89k17O6lJ95m23M0L0Q8L2J3J34k6M6K3k37J10J00j5m10
5503b26L47O1L1k11M3N0j52L9N6L6l1j18L62j92j6J90k25o2m6J96j92j5j63L72
5527A34k53K42j62K2j83J44n7j7J18K4Q7p8K32l66p4o3J50L57m53J94R2Pk87J54
5551c6l7k14L35K7J39k20o2K15j18k21K16J9p3K5l82L02k34K97j31j18J2L89l08
5574a78P5K44m79L22R6j54J29K83k28k02q2R9J82j71K39j08j77O9r3J80O4l08
5596a98J12K37l65j85M84n6j4k47J51qO7J24l06M53j29l39K23P3o0P3q4J6k6o6
5620g0K80q7J16r2J7p5j34j32K35J26k73N3j39M52j32k77K60k68K03J67N8m30
$$ y = [-189, -188, -194, -192, -159, -168, 178, 187, -257, 109, 24, 84, -59, 105, 1, -368, -82, 111, 0, 80, -25, 155, 207, 0, 308, -36, 187, 114, 159, 14, 39, 228, 11, 77, 74, 269, -154, -114, -84, 4, 36, 49, 183, 157, 203, 226, -11, 99, 199, 184, -226, 121, 182, 213, 2, 45, 95, -57, -18, 38, 74, 43, -75, 287, 95, 79, 269, 44, -18, -64, 132, -60, -75, -238, 134, -119, 123, -39, -17, -200, -56, -113, -130, -12, 12, 99, 21, 253, -113, -187, -250, -100, 257, -196, -2, 90, 97, -190, -36, -73, -287, 48, 75, 214, -6, -68, 147, 29, -192, 24, 43, -30, -5, -387, -85, -319, -22, -153, -271, -259, 130, -178, -103, 141, -338, -16, 80, -74, 55, 338, 110, -92, -174, -75, 107, -64, 175, 67, -110, -41, -134, 46, 110, -198, -86, 151, -214, -399, 85, 29, 15, -232, -81, -89, -22, 102, -204, 249, 120, -219, 4, 77, 17, 90, 6, 22, -4, -70, 210, 123, 239, 147, 164, 89, -45, -177, 58, 184, -89, -36, -175, 277, 145, -132, 128, -140, 63, 230, 288, -142]
5642a42K74j21j48L74k33r8R2k18L18j54J83J60l15o6J02P4k3j09O7M31o12M9
5664a15K20l86M12j90j1J63m27M07M7j68L14l95m6J50J07j15m5J8r9o3K39k65
5686b48L99K0p3m64L78J16k66J00K7j00P0K16n10N15l06N6K16k47J76Ql51J55
5708a13P5j54L14k39L8J71j16L4k75L59J84q4k95qK29J49l49r5r4L72l30J27R7
5731cJ57J30k83l75M04mJ14j20M3L7j79J98k72K19l3R4k27L61n14O82o40K54J44
5754A87J25m41L36l07K56r9j45p3K97j06Rn5J7K15l68K21k14L05k47k0L9K16k01
5777e3k0m8J56m5j55K61j84l1j6K36k2m1j4k1R7k91L83l08K7p9K65J67l35l3L77
5802B73j50k2K60n06o1P5N2q1K54o3j28K50Q3m86K49k60K14j17J75n4j49K73k20
$$ y = [-142, 132, 11, -137, 237, 4, -94, -2, -220, 98, -56, 127, 287, -28, -94, 8, 82, 59, -50, 17, 448, -164, -115, 105, -281, 131, -59, -70, 93, -334, 73, 120, -48, 266, -129, -175, -25, 82, -33, -78, -60, -159, -222, 17, -248, 151, 171, 98, -366, 12, 128, -138, -38, -11, -111, -41, 175, -335, 180, -126, -70, 146, -101, 75, 83, -268, -113, -38, -192, 122, -117, -79, 92, -24, 10, -265, 94, 278, 194, -101, -109, 120, 269, -80, -175, -269, 103, -227, -100, -3, 154, 284, 1, -374, 30, 26, 140, 20, 63, 100, -79, 119, -153, 66, 33, 127, -100, 261, -253, 429, -211, 43, 187, 312, -129, 207, -100, 156, 57, -88, -161, 136, 30, 39, -16, 1, 216, -152, 69, -145, 160, -87, -107, -68, 148, -53, -73, -121, 35, -10, -165, 96, -88, -119, -135, 101, 79, 38, 24, 3, 100, -191, 192, -116, -89, -168, 97, 264, -71, -104, 273, 123, 101, 361, -145, -206, -131, -79, -160, 94, 31, -97, 153, 236, -250, -1, -261, -47, -164, 11, -43, -192, 81, -139]
5825a39J8ok9r5L00j73L33k84l59M14m00M51J62n08L56J0O1k69J33L54m35K66
5847A61l20J60jj67L24J03j10k23J20j5R7k44K60K82m32M7j50N0J38Qm5k00J68
5870A1j75J51J48Pj43J04Q8r8o6m1K6l1j87J35K74n6j93J31J06P3k85N2J75l01
5894i5K3K94j84K09k79j42L09p6k96K96m8J40j57mj33J30J55l88K71O3j80k83
5916c75M35j38K20k40j96K04J12j38K15j56K93p36K75L28k54J88n3j00M2J4PJ6
5938c7J7K08l34K55K06l43O3j50M1j3J46j58l53J99K90P2j19l4j94qL06j49J69
5961H0n6j99L78l80K00o4J80j5k46J61k39K96J56m29o9M48k08J19k10K60j49K71
5983B85k67O4O9J97k60j41J23q7R2j57K05j93M1J90j66J99rj7n0n5J38p3j73J81
$$ y = [-139, -121, -127, -156, -251, 49, -124, 209, -75, -434, -20, -420, 31, 193, -315, 41, 51, 112, -157, -24, 330, -105, 161, -159, 1, 0, -167, 157, 260, 150, -73, 47, 32, 129, -115, 145, 427, -5, 42, -108, -58, 80, 88, 43, -157, 11, -164, -13, 135, 142, -1, 103, 191, 93, 27, -14, 12, -19, -206, -71, 203, 147, -46, 85, 191, 264, -21, 31, 206, -95, -72, 222, 38, 247, -32, -174, 135, 59, -237, 59, 11, 151, -6, -10, -143, -13, 142, -246, 25, 88, -92, -375, 60, -78, 142, -98, -294, -90, 22, -116, 99, -57, 236, -500, -225, 103, -151, 37, -16, -116, -74, -60, -53, -37, -20, 188, -146, 109, 315, -28, 35, -115, -74, -87, 59, -99, -452, -253, 37, 109, -10, -44, -238, -246, 60, -89, 80, 24, -175, 203, -177, 23, -41, 139, 124, -122, 39, -200, 96, 252, -177, -246, 202, -6, 113, -97, 163, 14, 285, 18, 82, 151, 348, 88, -53, 70, -17, 75, -82, 123, -70, -29, 161, -5, 194, 185, 168, 118, 63, 201, 128, -45, 136]
6007A36l77K14R6l13J38j09L11M5q8m2j18K0QL81k99m1PJ87l83K67j04m9L77j83
6031H1N8j98K11j33k0N9q0J17k98J2J76j7k32J88J07j22K01Jj16j47M1K91l66
6054a86K57j13oJ89q6J3lo5k52J49l59L42K3j34L00k84k51M34j14K35l29l6O3
6077b13L37k75j35J85O7j46J51J38j82K98l31k10K59J21Q7o0k19O3K47k22l6M1
6099c5j68lJ29K18o3k14L69l69Q0k40k3K28n6J20j46J37k0J95m4n7K05k46j00
6122a03K03j92L2L34r6p5k17J3J74j6o3J03n5j41l41M24j64M30l89K72l31j93
6144c91P23j60k01N6r0k1RK95j68j49L26l07K28J15j8j13o6n6K9J8o1R2j78m4
6168a32K36o8qJ44k08L61p8k30j96J75k00K32K1j17L2J58j99q0O0j33K64Qp2j36
$$ y = [136, -241, -27, 69, -244, -106, -215, 96, 141, 53, 11, -107, -87, -79, 302, 3, -38, -31, 156, -227, 40, -64, -113, 264, 81, 139, -59, 152, 19, -1, 58, -22, 95, -203, -191, -15, -32, -264, -76, 31, -91, 110, 111, -5, -152, -111, 180, -186, 71, -42, -48, 141, 55, 68, 65, 0, -252, -103, -462, -120, -97, -231, 69, -215, -466, -32, -146, 89, -240, -276, -213, 124, -151, -286, -101, -34, -180, -29, 109, -73, 225, -106, -316, -57, 64, 151, 91, -128, -65, 182, -40, -76, -35, -203, -206, -77, 141, 78, -136, 233, -136, -56, -296, -319, -91, -147, -27, -173, -36, -56, 139, 95, 38, 243, -3, -103, 100, -92, -60, 274, 178, 103, -114, -101, 73, 57, -6, 97, 42, -99, -440, -16, -180, 250, -139, 133, -198, -391, 332, 172, -29, 27, -63, -84, -75, 220, 52, -97, 229, -78, 150, 265, 247, 134, 68, 12, 41, 59, -2, 90, -88, -132, 104, 36, 28, 172, -36, 325, 247, 17, -179, -4, -204, 28, 49, -68, -36, 122, -77, -157, -97, -230, 34, 42, -30, -166]
6192a66O2j71n0L66j76J16q7j90L71m83M26O8j4K55n30mJ69J79k63J67j1k80L68
6215A22j56J84j57o4K63o3K1Pk27M1J43k18N1O3j48p2L63r8M0j85K9P1O3l28L20
6240F5R8l08L25p9R0q8n4n8n4n4L33k0j51j86N8k40K64l7o0J27M33n9k77L3k45
6265a44L23lk59N5J24J18r1j25J88m8m06L54j04K35j90k8Q7K68m90j47M19q8r5
6288d7J58O1m83J64j6Q9mJ47l5o8J05k07K54j49J19k70J19J59k70RK57j13j12
6311a33p6J57j15K67j12m0j98K09K74l52O4R8K70l09J42k60lK83j39l64M33J57
6333B53n64K71K71n18L93j63Q4j67j06J57J63j30J57k81M5K13j37L40n62J77O3
6354d1k3P3Mj88K03j49P5J16q3q4J10J87K2m01J16J3K20j59j64P2L9K8P2M9K07
$$ y = [-166, -104, -275, -325, 41, -135, -19, -106, -296, 75, -408, 18, 86, 72, 327, -203, -207, -38, 141, -122, 45, 34, -246, 122, -34, 150, -7, -71, 192, 129, 150, 157, -70, -29, 114, -104, -53, 10, -138, -210, 153, 55, 95, -90, -61, 10, 73, -255, 65, 163, -145, 180, 101, 191, 103, 49, -9, -63, -117, 216, 196, 45, -141, -83, -323, -59, -96, -156, -29, 404, 345, 68, 101, -144, 179, 176, -83, -28, 96, 214, 123, -2, 186, 138, -268, 86, -18, 217, 27, -1, 86, 354, -136, -283, 136, 48, -47, 111, 172, -311, -147, -163, -74, -78, 69, 34, -34, 71, -136, 118, -31, 88, -182, -63, 96, -174, -165, 92, -21, -133, -209, -52, -167, 100, -12, -52, -250, -41, 233, -119, -55, 43, 313, 4, 146, -114, -117, 166, 27, -337, 96, 253, -311, -40, 231, -287, 106, -57, 27, -140, -246, -89, 74, -56, 101, -180, -135, 78, -59, 281, -281, -104, -41, -64, 9, 13, -175, 28, -121, -46, 70, -13, -97, 13, 200, 222, -179, -63, -50, 170, 11, -153, -81, -42, -14, 58, 107, 314]
6379C14n42K53j05m6j58L88j17M10l40P7l05K4M1l8K36P9j40J47o6n9jj58K73
6402A67q7j05K56l71L30mj4j97J5Lj5p3J10J63J38k47j85J99k28J36M7j2K76n08
6426b06L20l29J32K92k34l13Q8N87k95m07K14l2L02L3P0k96J5P1l7q7J41p6K28
6449A81j62o9j19K86j91j94M03l4m68K21K45k5l9J4j5k79N8M09ml66J41J87l1
6472A49l72L68j59J76k43O5n1J34M9J5j09R4l90M54k88k05N52n61M10o9k59R1
6494a49L60Nj17R1J22j02j80k27J03j1L45k03o4K20n47L04K68k11J17Rk51J76
6516E8k18J50r8MJ11k85L43nR4o7j67M0j99J2L73N2k50k57M19p5p0J17j92K15
6540A05k1J1j28J2k82K83M1j53M7j7oK77j3n7j01k15J8J32O7q3J99k51J08L0j53
$$ y = [314, -228, 25, -80, -126, -284, 104, -13, 397, 57, 134, -171, -147, -106, -144, 92, 171, 31, 178, 112, 53, 52, -106, 167, 80, -25, 231, -140, 190, 186, 172, -25, -10, -7, -22, -95, 15, 178, 316, 69, -116, 83, -145, -9, 38, 26, 302, -206, 114, -215, -83, 209, -25, -338, -250, 337, 42, -365, -151, -183, 119, 152, 222, -74, -59, 12, -25, -112, 29, -47, 181, 19, -50, -169, 117, -74, -268, 135, 101, -367, -146, 99, 74, 35, 49, 34, -245, -187, 222, 218, -148, -7, 180, 149, -223, 145, -14, 162, -81, -16, -67, 67, 116, 131, 22, 116, -274, 180, -108, -313, 239, -322, 88, 19, -240, -149, 211, 216, 99, 190, 312, 210, 30, -197, -94, -105, 240, 37, -27, 193, -354, -50, 218, 7, 124, 133, -118, 58, -160, -10, -108, -104, 7, -278, 65, 60, 154, 87, -80, -40, -239, -227, 146, 198, -52, -309, 110, 35, -35, 82, -110, 105, 84, 95, -33, -21, -303, -20, 21, -132, -85, -102, -108, 169, 156, 99, -2, -217, -199, -67, 0, -83, 116, -135, -27, 3, -150]
6565a50J33j52J23r7J64J21j69k09R3J75j2j15J19j5r1J93R7k77pJ87l36N2J23
6588e0J9K2k26J30J84j93j54M53n8j8k67J81j27j5j06R5j73j0J84K67Ol04k53
6611d13M13O3J46J8k83J7K95n08P9k6L3j21M97qj94J4k73O9J40K65l2k77J09k80
6635b57J55kK67J2j56J14j23O1j49k2K24j71J46J44l10J99J28k86K12l8lj4R1
6658B22k65J04r5J60J19K6m32J13J63j00k2K2K08j20J38l40K28J65k56j24K10
6679A24k0k91N15r8n46K02m3K87p3n1l3P8j5n8L80l07J5k69L81pk21k51L74j25
6703e2q5j25J02K24Q1J64l90j82K39K07n63M52p7l0J53l19Q6j21K79k08J89J11
6725A35j54k6r2N1l9L41j40K3n5KQ5k32j10J21L70l85J44o6L9k99L53J06m6j0
$$ y = [-150, -17, -169, -46, -143, 21, 142, -27, -236, -143, 32, 20, -95, 24, 9, -82, 111, 208, -69, -76, 111, -225, -173, -50, -31, -9, -235, -105, 79, -114, -268, 185, 127, 109, -158, 23, -104, -119, -225, -130, -303, -313, -129, 138, 144, -160, -413, 0, 63, 209, 227, -56, -39, 256, -252, -173, -199, -166, -287, 210, 202, 8, 22, -251, -182, -42, 223, 191, -86, 23, -257, -102, -104, 163, 175, 19, 133, 10, 71, -78, -100, 124, -47, 99, 243, -67, 132, 260, -26, 186, 148, 145, 131, 222, -43, 61, -34, 126, 245, 271, -161, -48, 115, 15, -7, 15, 223, 103, 241, -99, 129, 294, 38, -86, 124, 104, -187, 328, 230, -316, -114, -157, 130, 57, 6, -27, 51, 36, -22, 358, 51, 66, -203, 178, 171, -50, -301, 73, -52, -137, -262, -160, 64, 145, 309, -81, -263, -24, 183, -380, 72, -5, -35, 118, -201, -115, -236, 43, -165, 24, 135, -19, -45, -137, -86, -125, 216, 76, 99, 44, 46, 131, -101, -211, -90, 280, -105, 39, -27, 12, -287, 66, 172, 126, 116]
6749A16m3O8j6r3k58Q3J46K32q5k96Q4q2K11J2m3J34k76J16l1j19P5J24K22l53
6773g2K87p9k47J40Q3n7j08l2K01r2m8l8J72j49r9M48k75n2j1K19j15j25%K37
6797A88O4j71J34q9j47j96J49k54L72N9Mm5l08K12J7p7J29k40M42j47l56L33K1
6820I4j60j44J47m4j96M66J38m97n9P2L64j43M4m25K00rP2l0j7l22O30o8n9J65
6844B19n12L07L48k35l79K27k4M0J08o9R0p7m6J59k60N2O1m60K78J86Q8MJ14l21
6868a02L5L08k03M7m8j21J23k06J17K64n94L66L68m01j34K04K5R1j80l89L37J49
6890E6m0q9J71J72K%n4j46l9L3J68r3m2j02K77m03K18j75K61k09J85l22K06r6
6914f1N4KJ70P2o1r8R4Ml66K67l2j96J09j86M67j1l25R9l7m3K98n78L86r9O5j88
$$ y = [116, 73, 141, 125, 32, -226, -143, 3, 235, 150, -146, -62, -144, 67, 79, 36, 170, -106, 10, -21, -140, -65, 59, 281, -72, 215, 136, -111, 29, 112, 55, -53, -85, 116, 24, -24, -62, 110, -39, -138, 310, 35, -17, -28, 191, 76, -49, -49, 188, 252, 81, 215, 126, -21, -217, -68, -322, 50, 109, 113, 68, -240, -28, -11, -88, 41, -199, 243, 96, -260, 73, 94, -66, -210, -63, -107, -303, 163, 301, -196, -255, -183, 181, 38, 82, -343, -143, -152, -80, -110, -127, -449, 181, 113, 54, 219, -293, 14, 362, 127, -252, -25, -49, -9, 99, 30, 120, 43, -3, 156, -104, -52, 9, -451, -173, 13, 101, 105, 219, -102, -67, 241, 38, 85, 37, -84, 39, -167, -50, 214, -380, -14, 354, -47, -181, 23, 48, 139, -41, -430, -93, 56, 16, -73, 98, 270, 272, 272, 218, 72, 33, 66, 234, 141, 99, -3, 274, -129, 89, -86, 175, -34, 151, -171, 35, -61, -7, -5, 165, 237, 176, 78, 172, 176, -190, 77, 45, -151, -42, -228, 239, 228, -97, 2, -35, -78, 220, -358, 28, -71, -6, -194]
6940a94L8n1Q2J59m9K08l44j53k6J16K30j2K67j22L4l13P6J49k53o8LK06K9R8
6964A10l3m83L93J8j31K12l76L83q3p2k35M10j8k21J26o5Q6k2j84K56K48l10j31
6987a22J0J60k1j9n8J31q2L24k11k26j11L23j51j2j29M33l45j45P9J51j52J36
7009c7K40l07lL95j52j89MoK6N8K8m4k03Nm5K90K24k60N1j93Q5J2q4n5K83j38
7035a5rj78L74k78L20l76R5J78o7J41l49J00L46k98N5k20M1j59N70m48L00k44
7057a21K14j82m1j01J5L23k22N0J78nM6q7l8K08k36o2j11J86p6M0J05p3O9j68
7081h9k37J37O5J20K74m75Q0O3J7K12k14J79l31J24m7K75j70k54K67k20K19J17
7103A12j66O7j46j09K25K9n7J95J0k83LnK54Ok20O3Pp5J49K47m95Q00p00O9J25
$$ y = [-194, -156, -207, -125, 34, -15, 193, -151, -304, -330, -214, 16, 4, 271, 149, 183, -130, -54, 95, -158, -226, -223, -17, 12, 110, 77, -406, -13, 5, -126, 86, -290, 93, 10, -62, -297, 113, 95, -126, 0, -65, 21, -1, -185, 71, 319, 9, -122, -112, 48, 27, 8, -50, 81, -1, 323, 112, -114, -225, 98, -53, -65, -194, 239, -106, -251, -172, -21, -173, -37, 203, -104, -107, 288, 136, -53, -49, -55, -29, 29, 57, 13, -190, -185, -230, 60, 284, 24, 75, -118, -33, -21, -105, -160, 123, -15, -24, -202, 172, -106, 214, -162, -67, 111, 44, 185, -164, -64, 282, -16, 39, -181, -140, -299, 271, -177, 123, -121, 93, -89, -130, -231, -216, 107, -115, -65, 113, 108, 154, 67, 29, 237, 1, -61, -172, 14, -62, -22, 83, 10, 79, -89, -326, -189, -124, -4, 270, -205, -125, -62, -45, 167, -47, 132, -199, -75, -122, 153, -17, -271, -4, -224, -5, 112, -54, 13, -133, -242, -17, 12, -45, 150, 160, -123, -120, -125, 129, 135, -85, -22, -15, -90, 59, 306, -189, 611, -89, -20, 105]
7128A05j48n9J07j29K16l79N36n29J01l5M19K9l24nK96j53k29K63J09j05R2k16
7150c8m5L9K66j77o6J14j38j52M24j84j18P2LK39l14J75J13l33J97k23J53l8J49
7173A18k33P3M64l54M3k69J0M5K06j00j7L67j05kq4j33K4j33L38m20r6M36n4P1
7197A95l13j9J67j5J8k01K38j48M71m16k15M07k14K6L1Mp8J40l11O4J14R5Qj41
7221i3J59j50j09R0J34j81K80k70K01n2J08J05k86O8R2l01L86m1o9k15k54O69
7243B71l13j47L03j70ok78N66K5r2k31q0J5K33O1j68n0k22K86K16l57O8n5J72
7266D7M8K39q3m2o0l20L00N0j10K01m64K71K29n70j7L12r3R1J81j80P0J49k17
7289C2J00k3m7J56j98r1J18K88m28J1Q2J19j06j29P0K18l08Q2J07k54N43l02j23
$$ y = [105, -43, -102, 5, -124, 92, -287, 249, -280, -179, -214, 205, 234, -90, -95, 201, 48, -181, 82, 191, 86, 178, -38, -83, -44, 222, 45, -21, 93, -45, -197, 227, 43, -75, -3, 0, 239, -75, 100, 213, -120, 77, -146, 7, -31, 118, -115, -42, 422, 68, 111, -158, -148, -103, 103, 3, -14, 353, 248, 246, 162, 29, 53, -80, 258, -162, -258, 178, 124, 195, -118, -137, 30, 15, 33, -168, 70, -78, 393, -23, -238, 169, -45, -19, 12, 16, -62, 78, -233, -169, -55, 40, 48, -93, 66, -84, -193, -103, 31, -150, 130, -140, 61, 9, 117, 222, -64, 4, 96, -205, 181, 140, 71, -144, -398, 271, -42, -189, 114, -56, -62, -340, 226, 251, 159, -72, -152, -137, 96, 157, -11, -61, -283, 3, 219, -138, -70, -125, 47, 95, 334, 251, 209, 149, -171, 129, 179, 69, 270, -194, 77, 306, -264, -281, 31, -62, 29, 210, 30, 100, 249, 32, 132, 109, 62, 218, 20, -71, 47, 335, -93, -82, 0, 119, 13, -116, -46, 172, -136, -54, 53, -201, 342, 40, -83]
7312h3L01r8p6k04R3N9J62k66j27K53m7K83j83k98K27P6K9j8K49j94j14J9j83
7335a40K28o9j89l7K69j37N7J98Nk76J55O9k54J14R5n6Jo3j99L6J61J15m5j06
7359f8J61M7n76L93j34J48P1l4j86J67k8j32k02N60j38k1Q0k13P8J45J70m11k2
7382a45J3K14l44L82m01M54j76j3l0J57k98J43J64j81J29j44K13l26M12o91L94
7403g4l8J62p5J12j60j32K48R8k5r8k8L37j19K6m05M69l39J38J06m09J32O3L5
7426B4M7J94k25j18jL2NJ29J8Qm8O2l56m8J22K79n4p7o1k6j22J13K2M1Q1J07j25
7453B3J61k31o6J05L9k15O2j93M72l57J7K05J3k46J53R4j68R1k05L35k16K14M
7476I1l18J29j96L90j97j2PJ3k19K14Lj7q4L32l36M8L56j87jj96J15l29O29j45
$$ y = [-83, 218, 120, 44, -160, -67, -8, 154, -112, -239, 14, -33, 250, 67, -231, -4, 72, 101, 83, 332, 138, 24, 43, -140, 88, 19, -170, -207, 62, -75, -18, 180, 185, -91, 64, 133, -121, -7, 88, 32, 33, -30, -229, -193, -32, 83, 38, -68, 93, 140, -436, -43, -177, -29, 42, 8, -178, -11, -39, -171, -373, 187, 49, 28, 108, -105, -27, 118, 288, -123, -145, -132, 82, -262, 120, -281, 173, -3, -16, -46, 111, -187, -44, 120, -61, 68, -76, 137, -189, 223, -468, -74, -112, 50, -25, 87, -73, -205, 43, 141, 116, 18, -10, 327, 208, 234, -171, 298, -41, 97, 203, -206, -74, -11, 24, 71, 265, 40, -78, -79, -47, -42, 87, 105, 113, 65, 127, -229, -277, -155, 124, 70, -7, -68, -94, -216, -103, -81, -40, 41, 148, 23, 184, -47, -113, -8, 31, -184, -122, -315, 157, -200, -183, 22, 35, -211, -58, 36, -132, -41, -246, 89, -127, 87, 91, -227, -98, -294, 96, -101, -113, -106, -93, -312, -98, -95, -112, -196, 136, -200, -152, 204, 17, 16, -180, -65, -394, 235, 90]
7500I0l01K64N4j52k75K49N1O9o9l65M18r1m3J04m7j54O0j81L88jJ5J57n23J92
7524i1n7R5j20P4J88O1j5p7j21K61l85J50l70L76m4J26J36k43j8K1J92Q5k65k53
7548b94R9j3J44J1J8K9J48j65J57k96J39J65k01L30k77K49l03r0P4k04L9J86n6
7571a11K9J3k25N07m94K31M16N2k18K73l25j72P7o0m9J24r4Oo8K53j40r3M9j36
7595a55J35k09K67P8k12n4J34J19l31q1J19J06J78k10K45k35O6o8j36K78q7K2
7617c1m1j96K27J26kJ04k28m0M2K0o9J53J1j65j25K75K06k54j67P0P9q8R7m4q4
7642a24QRL19l7M4J3k44j48J71L00k08p1j75jK18n0q5K17j53n1K86N1m75L97Q1
7667B92k62J36l00K01K8j95N6k2Q2k89K13J81J35j22l16K67j79Q1K22l93Q8L07
$$ y = [90, -211, 53, 107, -45, -320, -71, -20, 49, -20, -385, 33, -58, -101, 3, -44, -198, -138, -319, 69, 68, 83, 240, -283, -91, -148, -53, -173, -99, 89, 150, 135, 58, -63, 198, -187, -37, -407, -31, -75, 51, 187, -56, -74, -53, 139, 224, -41, -294, -195, -208, -64, -53, -35, -6, 142, -23, 134, -162, -23, 142, -59, 271, -6, 243, -60, -150, -76, -280, -241, -55, -111, -82, -69, -294, 213, -281, -50, 366, 418, 200, 473, 148, -24, 53, -7, -56, 68, -26, -20, -88, 165, 25, -68, -19, -155, -20, -229, 38, 116, -96, -150, -16, 103, -228, -309, -190, -84, 94, -116, 129, -106, -40, -108, -244, 34, -53, -31, -72, -268, -41, 85, 83, 187, -41, -81, -39, -19, -88, 65, 76, -89, -214, 61, 267, 13, -154, -84, -5, -93, 4, -40, -124, -116, -107, 212, 175, 219, 232, -12, -160, 11, 311, 103, 32, -143, -144, 74, 24, -61, 156, 3, -48, 238, 289, -186, 211, 292, 30, 166, -134, 67, 95, -100, -44, -66, 16, -273, -60, 121, 256, 134, -182, 85, -94, -13, 209, -184, -96, 211]
7689B11k05J61k82P4J76l56M00j81k0K3j18J01J88k03J43k10j5r0L01J72j44k68
7711a42O3M6o4J74l03J59k86K69O5ok33K21j41J94J56o16M55J66m87M37r6j77
7733a46%j61L26L6j39k57K49j41K1k7J99Q5j76j7j19N42%k67Q5k62J30nJ9q1K38
7758A32M26o27r0K41J92j91l55L53L5k64q9K61J49j49O1R0m24K84l8m4O7k61L19
7781G8Oj41L0L2K24j94M1r0l8J00n8J94k20p6P7K83l57J93J48J6j74K22l3q0m
7806A79Mk19L6jK32k80K70j21Rj15J18k95k2K45j92J47K12m09M05l39J17J93j41
7829C3m7j72K75j67J1J52j82PL08k89L32l94P0J75j55q3k39M10j57p2qJ60N4k73
7853b51L5O3L05l04J82K1J55r6k75L01l65K39Lj80Q7J71j05J3k24J19L71n49K59
$$ y = [211, 6, 167, -115, -41, 135, -221, 179, -2, -22, 1, -117, -16, 172, -31, 112, -98, -113, -203, 98, 270, 126, -142, -79, -33, -97, 77, -226, -67, -353, -84, -19, -25, -258, -37, -178, 16, 172, -444, 11, 177, -310, 127, 31, -146, -146, -307, 19, 55, -84, -341, -92, -233, -212, -239, -40, 45, -131, -148, -267, 275, 275, 8, 93, -169, -39, -44, -25, -106, 132, 558, -69, -159, 82, 274, 83, -272, 81, 116, -148, -237, 24, 173, 24, 85, 175, -249, 35, -3, -47, 20, -241, 78, 84, -57, -27, 5, 229, 35, 76, -14, -52, 48, -10, 184, -36, -112, -35, 248, -109, 84, 232, 248, 74, 296, 263, 183, 179, 183, -36, 0, -1, 231, -49, 221, 100, 109, -6, 112, -183, -205, 40, -152, -5, 207, -202, 203, -136, -19, 174, 33, -14, -186, 89, -78, -67, 85, -97, -90, 218, -71, 261, -133, -63, 112, -43, -126, -365, 45, -112, -184, -192, -32, 22, -251, -216, -153, 152, -152, 30, 51, 206, 110, -165, 136, -229, 10, 13, -167, -80, 91, -14, -1, -225, -106, 265, -284, -25]
7876b5Q0K03k04r6qK7J02j65J1p7J13J69j97J15m11M57j58R5J89J6k60n2p5L07
7900A56l06r4M53m89L13j40K60k04r5K75m1k4j37N13l45r5j86P9l4M2j06K54N2
7923A01m13J86Q1J36J2K25k93Nk50K06j36L03k83K29j38l6J01j39Q7K61j21M1
7945A65m4j6lk15k0Q5M78l10l61P8K34k23K5j04L35k53L30r7l2l7K57l71J63j0
7969E4n41L87K36j63K6J24r1L6r4K89n53L92k88K3L99k29j65L04k37K0J58j53
7991f6j17J04l1L3O1MJ4J00j7l38K85r4L41o54M49j46P6l00M57k28k3k82L00k29
8015c01K43P8k4j01P8k7l6k8p1M0L18N4j38J09j42k21L24o43O30j24j34NJ04J90
8039A83j25j67K56k15o6j3L5L33k56n18O62k77K86j86K50j63k29L51j01J88j65
$$ y = [-25, 55, 258, 54, -42, -50, -23, 79, -86, -75, -152, -39, 130, -67, 48, -363, 94, -64, 31, 220, 236, -24, -76, -151, 156, -150, -244, 209, -280, 33, -107, 153, -51, -146, 129, 88, 64, -73, 440, 95, 0, -186, -107, -141, -99, -205, 49, 101, -312, -126, -45, 91, 103, 328, 35, 40, -210, -4, -140, 163, -120, 109, -29, -65, 36, -103, -16, 245, 124, 165, 121, 105, 102, -113, -133, -48, 430, 120, -241, -163, 71, -152, -127, -231, 104, -149, 181, 84, 52, 15, 272, -99, 64, 54, -487, -100, 136, -27, -1, 123, 32, 68, -26, 263, -290, 102, -186, -163, 236, 7, -158, 146, -91, -71, 87, -66, -183, -79, -110, -77, -16, -12, 2, 102, 85, -253, 32, -62, 279, -375, 74, -72, 4, -296, 161, -67, -90, -372, -72, -301, -58, 20, -4, -105, -27, -54, -90, -118, -189, -149, 169, 223, 85, 194, 52, -169, 155, -488, 142, 18, -116, -111, -7, 183, 58, -109, 147, -68, -134, -147, -112, 221, -35, -553, 109, -168, 118, -68, 182, 19, -210, 141, 40, 228, 63]
8060F3k32L0K56m5j40L00J7j87k91N3K03J6k84L33j74q4M78l23J63q7j14r6M03
8083B58l18N5m7R4R1l11M57l24K25k84J46k85qN29m51L48j46m9L45n60K37q1J01
8106B2n7p1P4j26k4J27R7o8p6K61j14J88j51j86N67n40Rq4P9K68k08J11j21k26
8130b49j2m0M59J0k58P8j32j38K78K09k88j64K82j06K16K8M0l4j51k79J32N0J96
8153A27j46M5l4k16K13O4J00j93J5P0j6mJ71M2nr3O7j87O9P2R7l26L91l34m9k48
8179c08N10N3j26j03NN8J23j38K8q2j82M7
$$ y = [63, -169, -139, 117, 72, -68, 232, 249, 62, -229, -176, 27, 43, -241, 92, -82, -166, 312, -11, 152, 65, -49, -145, 258, -60, -5, -52, 42, 133, -178, 279, -45, 180, -104, 42, -243, -251, 278, -173, 175, 29, -20, 325, -235, 2, -79, 22, -35, -106, -32, -158, -182, -55, 42, -26, -102, 159, 45, 233, 82, -104, 463, -77, -68, -152, -73, 195, -13, 98, -23, -249, -261, -301, 158, 168, -90, -12, -144, -282, -4, 205, -83, -247, 35, -71, 145, 173, 213, 179, 28, -251, -119, -69, 127, -19, 26, -8, -224, -11, 53, 153, -40, -25, 45, 29, 25, 196, 238, 233, 140, 207, 20, 89, 161, 258, -68, 323, -11, -60, -308, 202, 255, 129, 26, 31, 89, 212, 74, 102, 20, -162, -115]
8191a15
$$ Imaginary data points
##PAGE= N=2
##DATA TABLE= (X++(I..I)), XYDATA
0@%%%%QqQj6J6k4L2m0N6o4P2r0J14j36J58j88K21k55K93l41L94m47N11n83O58
29C49p45Q42r49J062j184J325j480J647j827K026k248K489k756L051l378L744
45A968m152M612n133N730o424P240q215R405j0893J2822j5439J9197k5090L5725
59B1353o0800K20674J64271n26358r0769L30776J49634k75859o4146K50576O4709
70A84061k97492r1766K65910J44464k18708j28254J63887R3569j81960p5150K06556
81F5117J25256j96395j65162J30837J60293q6300j12666R1969J00280j18784j28609
92a34164J09240J67604o0830j68414P537J27890N721q6272J4834P8310l5441r8285
104g2270K1035R8948k952p4923J1236O0937l8035q1936M2897J11191j1049j10873
$$ y = [0, 0, 0, 0, 0, 8, 0, 8, -8, 8, -16, 16, -24, 32, -32, 40, -50, 64, -72, 86, -102, 119, -136, 157, -184, 210, -237, 274, -309, 349, -396, 446, -503, 559, -625, 700, -780, 867, -960, 1066, -1182, 1307, -1449, 1602, -1776, 1968, -2184, 2428, -2705, 3025, -3399, 3841, -4374, 5031, -5862, 6960, -8479, 10718, -14372, 21353, -39447, 181227, 345498, -180860, -271629, 59147, 208781, -67078, -131224, 119352, 184061, -113431, -205197, 60713, 205177, -13531, -141785, 22102, 115671, -66289, -141439, 65117, 190373, -6022, -171184, -40347, 119946, 33646, -79020, 12949, 113229, -5555, -134164, -24924, 142680, 81850, -86564, -79027, 48863, 54584, -31688, -16854, 61456, 26015, -72270, -51235, 47713, 44761, -30162, -18926, 42011, 3976, -77960, -35063, 76128, 65079, -45794]
116d5794k3509P5878K4700l7770J0959L8008m0906o8849L4056Q4079j1515o8529
128b9192J2751N6094l6430p4825L8267J01550j3279j06593j4167Q8124K1067p3286
140b9919j3905P4446J4829q2217l2041P6002N0065n0537m4451L2008K2639l7739
152b0820q359N7745J6802o8631l4229O7085M7299n9511n3692N2358N7458m8356
164E149o2945M1524P1256k8001p3102R293O1418J342m2556L921L2271j5631l5250
177c1311J9761M2595j1688l9157N889K7970j1703k1320K5839L1479k8618m6587
189c6851J5321M7566n83l5212Q49K6897p841k9942O503L2752m20k7300k991J7887
203F635l849j4436J5639K4237k0386m0366Q599M6307Q874l5948j3746K4197P117
$$ y = [-45794, -69303, 6575, 31275, -6495, 4464, 42472, 1566, -67283, -33227, 50852, 39337, -29192, -16441, 39653, 3223, -71602, -33335, 68215, 54936, -51657, -65824, 22300, 43367, -29919, -43824, 30622, 45451, -36766, -68807, 7195, 57260, 6723, -37728, -5720, 16919, -20820, -29179, 28566, 45368, -23263, -57492, 9593, 56892, -2619, -56311, -3953, 53505, 5149, -57796, -16272, 54984, 26983, -46119, -36826, 24592, 25934, -16622, -12701, 19570, 3939, -31311, -11550, 31045, 19357, -19800, -13911, 14059, 2356, -18964, 6875, 38354, 9736, -36851, -21530, 26036, 25453, -9759, -8910, 17987, 10146, -19796, -13293, 19459, 19039, -8261, -11252, 6635, 2786, -11650, 3989, 28226, 7840, -32526, -23927, 22380, 31254, -4694, -18440, 5757, 12874]
216A2874k3508k078L0235N508l2836j3369K6687J5761j8047q661J6570j815k8661
229b1340q6M0029J4445l7108k6650K2024K1145j4427j0375K3431J1160l1634k6605
242c5991K3175L6420l100k5761q276N575r26K701J5722O867j6093j6335M186Q199
256c637j021M766J4177k025k7578j5263K1228K8331k694k1917q107M286R40J665
270f849J3137R865j2253k0309k552J3116J0399M525M94q332j7444l176J9706J7495
284A7822p988j6588j685N089k229Q46J5617P986j8392k1709N948K1946P833p243
298G253m301l311j0466m153J7354J8615o141j9968o414O789M177L670J0157L288
312A6549j6485j6784O492J9584O331o184m852l678r197k348J6004J7046o722k0166
$$ y = [12874, -10634, -12712, 17523, 23031, -9805, -23174, 3513, 19274, 1227, -7434, 9136, 7321, -21340, -21426, 18603, 33048, -4060, -30710, -8686, 12459, -1968, -12343, 11088, 22248, -9386, -35991, -12816, 23604, 20504, -5257, -13533, -7958, -8884, -6183, 9539, 16406, 313, -16022, -11836, -3637, -4658, 108, 14285, 12260, -15318, -30581, -9353, 18978, 16284, -5633, -13740, -9454, -8514, -6849, 6288, 16153, 3900, -16409, -18961, -5845, 4554, 9079, 9573, 1241, -16203, -19379, 327, 17822, 9834, -6754, -8439, -3350, -5579, -4733, 10884, 18870, 478, -21231, -15283, 6663, 14496, 7253, 2952, -359, -10825, -14978, 2376, 20991, 14850, -5118, -11532, -4743, -566, 3104, 13261, 16549, 64, -16720, -10228, 9356, 15687, 9503, 4651, 973, -8224, -10572, 5432, 22478, 15756, -4410]
326d410p031Q602O986K184N443K223j2612j5929L578K0417R803q956j1572k888
340d162l38P33R164J1275m058j6748q053R557J0217J037q53p60q714j1502N787
355g418J9586P102j4977j4743K888P179N68K620Q570k335j8233r326J4382J7033
369A2896j933j2189m016L55k781J964J2213O871j1482j4658N31J1308N161m63
383C777L89l442j1183n202J2549J5206k268j4354o861M183K664J135P264O549
397A0406r038j7468j620J7541J1575n746j0262j767o8k906M024J3793L948j4419
411b007j4301L720J3112N100q8m58o822j2984N2J8351J2795q981j4942o13L751
426d315j373L814J3722L603j9447j7498R755K1515L121j0232l266L7p551m389
$$ y = [-4410, -11441, -2839, 4147, 6331, 11774, 13997, 1385, -14544, -10966, 9451, 19254, 10298, -1274, -4162, -4500, -3767, 5397, 16672, 12614, -4134, -12187, -2630, 7587, 8624, 7771, 7011, -1703, -13205, -7418, 12168, 19270, 4293, -10450, -7562, -383, 185, 2805, 11375, 9040, -9193, -18519, -4137, 12896, 10963, -1226, -5242, -4887, -7668, -5704, 6509, 13380, 1898, -12760, -12229, -921, 4240, 3777, 4166, 724, -10459, -15661, -3112, 12094, 9826, -4528, -11389, -7206, -4542, -3407, 3857, 10406, 1368, -16100, -17720, -179, 11396, 5650, -4612, -6379, -6447, -9353, -5329, 8464, 12412, -2007, -16308, -12588, 524, 5624, 5536, 5078, -1744, -14728, -14676, 3675, 16470, 7489, -7453, -8066, -4315, -5688, -1874, 11848, 15451, -3996, -21494, -11739, 9776, 12897, 2665, -601, -564, -8115, -12504]
440a2504J4440J7146n603k0717p886R370R326L286M299q22j4066j2962P760J9878
454A0945O021j0890q239m98l905k571J3048J6953n839k4628j0194J5303J5759
467A1265j412n625L07n138j2428Q80J9683J2930j1004j7647k698O459L559O209
481E340Q747l611j8044j0011J1554J6163N27p110j767m255j0293P04J8001J3615
495A9560j1208j9836k937J0014N373J774N405R2j4185j3363P845J9857O049j0775
509C665j0079k159p44K314J0997J0259o000j7767p955R561J2586L341j734n568
523G17q939n962O652J4363M249r263r347j085J745K029P614Q037m237j6154p679
538a7260J1515J4439N25q376m121K1k493o8Q701P884m235j1371m740M746P696
$$ y = [-12504, 1936, 19082, 13479, -7238, -15124, -5754, 3572, 6858, 11157, 10335, -3731, -16693, -8933, 10945, 16966, 6076, -2163, -2661, -6566, -9137, 3911, 20864, 15025, -9603, -19797, -4494, 11265, 9853, 4228, 4535, -603, -13031, -12151, 7532, 20462, 9458, -8189, -10887, -4428, -869, 5340, 14087, 10476, -7568, -17579, -6025, 10138, 10665, 3555, 1788, -2467, -12760, -12056, 5945, 19560, 8352, -11484, -14421, -4407, 966, 2740, 8145, 8237, -5948, -19311, -11466, 8391, 14440, 3665, -6414, -8573, -9317, -7003, 3994, 14253, 8253, -9514, -17469, -7908, 4678, 8019, 6285, 717, -8222, -14184, -7532, 6831, 11080, 1817, -7530, -8615, -6870, -4841, 2773, 10810, 6573, -9581, -17260, -5745, 8694, 9219, 843, -3278, -3257, -5750, -5818, 2883, 10767, 6532, -4839, -9579, -4833, 2863]
553B863M670L57n918r249j800R118Q889k156o332j903N68k830l67R423P548p548
569E333j3164j151J0751P811k188m534l021j914o82M443O356P52n524m391j093
584b216R24M229N360L10p505o037J975O589L169j072l049l843j558J816N106K119
600F317k864l118j132l55R96L722L259k318o405k883M479N488J040l241n281k062
616d358K724N428J759l732l906p3N11j139K341N248J126p674p785K559R639M715
632G383m261p671j761K549L185J719P50k7k088m551l095K721Q686M891n874j1407
648h851l341Q813R213r80p354k854J732k98j089K949O878L29r619p327L258J0144
664A603N338l307o942m671L49O194N829K9n277l827P3O01J529N166N370m445j2292
$$ y = [2863, 7533, 7890, 1972, -7277, -9077, 41, 8930, 6774, 442, -1461, -893, -3723, -4090, 5333, 12881, 5333, -7831, -8982, 1769, 9580, 7392, 2858, -163, -2077, -2759, 1684, 8040, 8792, 3268, -1123, -2216, -1292, 2937, 8297, 8607, 1102, -4935, -2960, 3629, 6798, 5726, 2677, -1166, -2724, -908, 4198, 6317, 3453, 335, -797, -1152, -156, 3566, 6825, 4507, -1898, -4781, -302, 5186, 6226, 2985, -2296, -4358, -1634, 3794, 5553, 1821, -2085, -2158, -1647, -2786, -445, 4803, 5929, -1745, -9530, -6971, 2668, 7383, 3122, -4549, -6310, -3761, -576, 1143, 1893, 1866, -222, -4773, -7868, -5147, 3539, 8430, 2556, -8851, -12192, -3379, 5834, 4854, -2500, -5354, -3622, -3920, -5009, -2060, 4818, 5147, -4472, -11799, -8541, 1603, 6941, 3634, -3308, -7979, -7630, -1436, 4393, 4422, -855, -4682, -4609, -4008, -2479, 2687, 8057, 3612, -8680]
681h680m381J0446J1796o31q917n185p2J254K925O511L582n859r422k390O148
696b875O624L172j41n050q895l493Q440J2067K078r053q115j609M134M645M646
711F575J843m047q106n094M056R590O417k850r127q222J268Q979Q017L83p856
726A826o910q39L963M522L106J548l192p785n852N064J2366N387r034j1590j391
741h811P252O141J628j506l868n244k541L817O744L098j063o332p718k177R741
756h39J1387j099j2078p115L757O027J211J073L126k642j0014m520Q281J0907
770G462P18p242o602k250J423N528P825M20q675p934J704O699K911R36J389l624
786F88q195l222Q191J0310nq755n925J142L214L159M057P28o304p037J825P657
$$ y = [-8680, -13061, -2615, 9181, 8550, -367, -5552, -5624, -4370, -1445, 5066, 8648, 2789, -6633, -9023, -2875, 3749, 6921, 6780, 1730, -7165, -10658, -2218, 9849, 11927, 2874, -5241, -6850, -2716, 1929, 6575, 8418, 4371, -3735, -8829, -4773, 4817, 11234, 8384, -743, -8965, -7697, 1282, 9299, 9682, 1826, -5084, -5923, -1960, 2562, 5668, 7216, 4024, -3761, -9613, -4549, 7817, 13204, 4170, -7420, -8811, -1559, 4582, 6210, 4704, 836, -4408, -6949, -3132, 3612, 6710, 5647, -685, -8403, -10580, -839, 10548, 9449, -2629, -9744, -5987, 40, 1251, 2324, 5450, 2808, -7206, -11726, -3445, 7462, 8180, 938, -5664, -7914, -6491, -963, 6862, 7282, -1393, -9327, -7623, -924, 1987, 2923, 4312, 688, -7507, -10729, -2538, 7772, 7767, -988, -6913, -5771, -2557, 602, 4659, 5387, -917, -7954, -6129, 1528]
802A528L062k097j738j429l572j935N754Q777o18r488o407L399P681K613j139
817D391k798l635j778J740M865L056n09m096m654j737L761P972L345n321r221
832d619k385O049O977J216l382l444j212r31j68M035O115k95q116p327L175R190
848D878L489l216m749k324m38J407M050L173j741m725k838M65K331M373L426l064
864D497q462l242O362P955o96n921k529K46p76Q40N253L783m647p913k037N657
880a630N724P67k282l619m543r26N276O951K59o987m991L42L023L256L021Q01
896D442m924p059j152O449P018j4m201m220k648o72N230P078L13p533o558J904
912f547N094K460R41O18l326o493k024P817P338j004p120m001N31K586L247L762
$$ y = [1528, 4590, 2493, 755, -674, -4246, -6181, -427, 8350, 7732, -1756, -8163, -4764, 2917, 5530, 4391, 1593, -2042, -3820, -2080, 2785, 5841, 5332, 1236, -3418, -5155, -1394, 6578, 9923, 4602, -4619, -7004, -955, 6022, 7238, 3856, 412, -800, -1731, -1899, 2136, 8251, 7956, -160, -7487, -4312, 4878, 8367, 5151, 402, -1922, -2360, -953, 3097, 6270, 4529, -196, -3034, -2569, -238, 4135, 7561, 4497, -3965, -7207, -845, 7110, 6414, 493, -2036, -1790, -2566, -1726, 3527, 7310, 2663, -5250, -7287, -1630, 4094, 4861, 2579, -1040, -5583, -6509, -1233, 5718, 5977, -1010, -6001, -5659, -2636, 620, 3641, 4442, -482, -7541, -8693, -2244, 4774, 4760, 559, -3661, -6309, -6981, -1751, 5327, 5640, -1893, -8451, -6547, -1453, 1007, 1948, 2566, -760, -7253, -9277, -1460, 5878, 4874, -2246, -6247, -5716, -3130, 117, 3879]
928C879j89n908m940J714N321L459p9j898l924m465J520P693N104l460p053k832
944f058K498L693K152J609m83m824n086J398O791N398k144n648l828L02L281M251
960C302K955k295n469l782J987M583M101J25l290m914k204K980N735K861k143
975D532n365k792O97L334L624J432k352m554l369K061N766L450k233n155k287
990c211J212K261K523J217o15m111l857J477N199L396j759m697k379N62K397L348
1006B963J326j940m557j981K025L190J782N47k155m562j785K962N951J076m332
1021E10l897n09J718K010K142J284k289m645k495L796N445J239l581l398j746
1036d416J431K422K769J123l379m013p98K867L436J429j021k699l673l19M352
$$ y = [3879, 3690, -2218, -7158, -5444, -123, 3336, 3257, 1359, -2565, -7030, -5510, 2183, 7287, 3827, -3226, -6058, -3560, 133, 2285, 3894, 3411, -1413, -6499, -5101, 1690, 7088, 4944, -704, -4532, -4230, -949, 3302, 6257, 3962, -1507, -5289, -3302, 1281, 5382, 5507, 2217, -2697, -4901, -1921, 3814, 6675, 4532, -833, -3625, -2928, 406, 4030, 5462, 3110, -1444, -4813, -2752, 3014, 6464, 4231, -924, -3211, -1999, 262, 2785, 4002, 3387, -724, -4581, -3104, 2095, 5491, 3732, -965, -3344, -2782, -385, 2963, 4289, 2349, -2208, -4189, -2164, 1026, 2808, 3355, 1200, -3362, -5147, -2185, 3766, 4842, 510, -3387, -3896, -2178, -168, 1974, 3258, 969, -3676, -6171, -2375, 3070, 4309, 728, -2670, -4416, -2985, -563, 2206, 3329, -50, -4063, -4861, -1994, 1442, 2871, 1850, -849, -4522, -4841, -489]
1051d89M562n36m252k803O09J601J504K659P09l724m957L7N793M079j509l495
1067b12k569j28J216K781L011J66m311l604j40L782L899J211k616m275k441K132
1083b098M566K945j095m103k635k09K350L137K446o79m977m693J643O184L865
1098F647k037m313k122jR59K679M236j49n282n265J225N324L328n35k641k917
1114h64k988J183N330L880k132m851k729K78K143L290L398k015n830m240K883
1129c264O071K296k085k879k357j941P93M776M370k032o376l455K457M107K465
1144B946nj956m037k788K002N166L450k276m446k761j65K445M309K249k790n727
1160d384k280K966M230K066p28k135l216k332J704N582L054k966n692j126K021
$$ y = [-489, 4073, 3537, -715, -3518, -2909, -1308, 196, 2855, 3564, -160, -5117, -5080, 713, 4792, 3283, -212, -2781, -2909, -1693, 1088, 4099, 4265, -46, -3650, -3790, -8, 3891, 5102, 2486, -1789, -4230, -2098, 2468, 5413, 4318, 215, -2420, -2629, -279, 2858, 5304, 4625, -352, -5045, -3402, 2782, 6647, 4610, 297, -1825, -1826, -867, 1812, 6048, 5899, 617, -4648, -3423, 1901, 5229, 4694, 2053, -864, -3852, -2669, 2661, 6541, 4409, -442, -3171, -2893, -750, 2540, 5938, 3923, -1907, -6147, -3264, 2807, 5103, 3018, 139, -2218, -4159, -3366, 1410, 5780, 3748, -2628, -6083, -3626, 481, 2946, 2941, 985, -3052, -5840, -3838, 1328, 4778, 2502, -1944, -4705, -4870, -2425, 1884, 4133, 1343, -4384, -6664, -3698, 532, 2598, 1870, -265, -3481, -5813, -4109, 1473, 4527, 1561, -4131, -5257, -3236]
1175c236K193K272Q75r06m702k827K709N166J924k187l521k089K15J909L919J726
1191C440k352m131j534J333L753K078L65k401m248j381L469N064P05l735k927
1206b502k44J642J005J732J961j357m518k422K586N363J639k708l607q26P23K051
1222E18K186M38j329k816j346J137K787K253o5k875l353k98L622L649m59l621
1238D28k196J107J213K51J062J449r40l794j855L178M303K9l440k276j6J456J129
1255A088J248L76k234k568L35K077J861l30l81j583k343j99L410L104j445l825
1271a409j363J701J103R00J051l22k408k721J061L429J545j470j848q77n02j15
1287b245K612K647j259l760j973K085L264N99j695r44j235n55K75K524K421j381
$$ y = [-3236, -1043, 1229, 2104, 1198, -3504, -6331, -3622, 1544, 3468, 1281, -2240, -4329, -4114, -2205, 1714, 3440, 1088, -3043, -4577, -3244, 509, 2587, 2952, 551, -3697, -5078, -1609, 3455, 4160, 425, -2502, -2746, -1104, -99, 1633, 3594, 2237, -2281, -4703, -2117, 3246, 4885, 2177, -1430, -2256, -1533, 518, 2704, 3142, 1813, -1003, -2349, -1212, 1575, 3828, 3763, 888, -2465, -2763, 859, 4508, 4049, 428, -1768, -661, 552, 803, 1865, 3314, 2374, -1420, -3275, -97, 4206, 4235, 795, -1481, -1497, -41, 1088, 2336, 2712, 478, -2090, -1755, 322, 2183, 1853, 1472, -111, -2454, -2653, 757, 3861, 2416, -1409, -2772, -1071, 32, 932, 1983, 1661, -747, -3468, -2407, 1022, 2567, 1097, -751, -1628, -2130, -2245, 367, 3014, 1755, -2005, -3978, -1893, 1371, 1970, 275, -669, -1904, -2459, -2184, 340, 2761, 1380]
1303A380k890j770O90K382K014N18j857l478p22L207K688j54k050p16m03p45M8
1320a858L194K595j595n265j207K976L924O16k265j751j211M7J594K446N99j154
1336A685k656j039O1K632L102N31l463l743j87L907L311o07k561j488o65n6J653
1353D17K255J686k422l697j309K740L147R51j039k849k465M64K910K667K30k691
1369I95k427k28P06J902K160L79k281l426q63K991L404K31k325k476j134P94K411
1386H13K085o92k437j623m90J563J532J361l41j938l092n23L625L578o83m195
1402a457k188J130K308R01L1j08q56k467j151K339L008Q73k127k809j721J639
1418b655L550J574j622l279j196J526J430M73O57N52j539l410l60L471L806j240
$$ y = [1380, -1510, -3280, -2590, -208, 1806, 2324, 467, -3011, -3733, -526, 2162, 2008, -42, -758, -1161, -1906, -1858, 1336, 3931, 2336, -2929, -4136, -1160, 2764, 3380, 1115, -636, -1847, -1800, -206, 2240, 2839, 1685, -971, -2010, -1949, 683, 3785, 4316, 853, -2890, -3077, 830, 4141, 3534, 973, -515, -1180, -1236, 417, 2672, 4358, 1936, -1761, -3070, -330, 2817, 3768, 2729, -120, -2585, -2121, 789, 3456, 3686, 995, -1432, -1660, -954, 948, 3108, 3487, 1206, -2220, -3083, -92, 3312, 3543, 1218, -1258, -2392, -1598, 813, 2898, 2206, -231, -1854, -2344, -781, 751, 2112, 1771, -167, -3259, -3782, -157, 3421, 2738, -1457, -3645, -2515, -207, 694, 725, 617, -239, -2706, -3857, -1518, 1490, 2363, 236, -2573, -4294, -2655, 895, 2469, 847, -2432, -3628, -2102, -672, -199, 458, 1010, -529, -3939, -4299, -828, 2978, 1738]
1434A738l596k187J240K193J394l29l90q04j808J40J696J908M14j334k549r18
1450c192J342K740J481j378k534j318J435J864O20l30k98j216j139L87K441K136
1466C041q48l017j616J143J865J368P93j377k409j353J590L064Q52j667j754j54
1482d79k90L32J752J780m52l381j809J856K642R88r04j224j818l79J329K723O34
1499C300k013j845O6P9M28J599J915j546l456j280K980L078o75k489j004K50n9
1516f72L89K230R83j729k550q41J435K009J319q44k205k133K81K731K232q66j959
1533a90j315j95J09J529J705J023k610l262r7K705L063o43j741j613q42J33J546
1550f95K631M32k393k648j18J795J890J027q03j880j959R5K297K243m5k004j778
$$ y = [1738, -1858, -4045, -2805, -612, 782, 453, 63, -741, -2549, -2409, -713, 1195, 1609, 275, -2274, -3192, -1850, 890, 2371, 993, -1541, -2859, -1424, 440, 1060, 730, 432, -784, -1923, -1536, 905, 3041, 2193, -824, -2440, -1297, 568, 1936, 2729, 1352, -1057, -2410, -820, 2244, 3096, 1429, -325, -479, -769, -437, 1315, 3095, 2643, -738, -2547, -691, 1951, 2939, 2035, 811, -1007, -1386, -57, 2666, 3300, 1287, -558, -492, -413, 15, 1614, 3529, 1983, -1473, -2753, 227, 3305, 2630, 141, -863, -613, -672, -283, 1947, 2930, 1201, -1349, -2190, -755, 1254, 2573, 1729, -476, -2609, -2328, 403, 2635, 1769, -190, -1505, -1700, -1591, -62, 1643, 2666, 56, -3206, -3303, -598, 2465, 1822, 81, -1532, -2374, -2241, -695, 1936, 2368, -25, -2673, -2791, -996, 894, 1921, 1118, -762, -2721, -2626, -329, 1914, 1869, -135, -1913]
1567a913l89M41K068J622M7k345k207K31K101J880o6n08j641j468l6K520K248
1584B585J12k746k232M36K120J553L38q66j420j659j95K185K475p2j899k047m41
1601a773J304K162J053m97k507k084J350K282L12P48q31j093j877k32K635K518
1617C470p92k940j323Q81J498Q28L13k35j519j662L55K074J442k56j736j349n30
1634a481J007J838J148q32k239j141O56J504Q99p1p12j578r77R52J874J293j000
1651A140k316q70J110R91M02P07p53j427j420O40K189R71p04j951p00K02R32J386
1669E29M08p23k203l08N72J531O83j51r86j530p00J740J824M34j495j819p9Q14
1687a459R79N72O11r16j706j082J620K088N99j627j641n6J046L88J165J85p79
$$ y = [-1913, -2302, -1861, 207, 1829, 1876, -469, -2676, -2445, -344, 1536, 1470, 962, -679, -2147, -2183, 337, 2585, 2697, -49, -2281, -1845, 275, 1828, 2166, 1300, -120, -1779, -1974, 211, 2686, 2614, 715, -1332, -1773, -469, 1693, 2746, 2249, -258, -2342, -992, 1290, 1602, 2350, 1519, 426, -1451, -1683, 952, 3470, 2678, -262, -1585, -704, 794, 1622, 1935, 1700, 181, -1481, -1126, 948, 2390, 2134, 398, -951, -1481, -474, 1364, 2512, 1680, -559, -1700, -1044, 460, 1359, 1288, 576, -1002, -1979, -1027, 847, 2140, 1140, -1176, -2046, -936, 55, 457, 1164, 411, -1016, -2436, -1796, 393, 1364, 660, -1291, -1991, -1789, -857, 529, 937, 214, -1989, -2297, -1725, -194, 489, 338, -648, -2178, -2878, -1138, 686, 1120, -375, -2194, -2273, -1459, -480, 92, 703, -213, -1919, -3001, -1381, 707, 1306, -321, -1962, -2018, -972, -584, 581, 766, -13]
1704a3j894j73J146K078j5j092p45j171K16J444J653J79j812j921M89J580O44
1721E93O89L8j104j916M6K134J981o57j789p85k8M95J037J672p5k146j954N62
1739a207K463R68m38j224n97o17L08J897J339p14k304j008N01R96J246R84q39
1756A754k053j721J196K295J126j160j199o27j91l05K132J421p36k634j358J253
1772h07J977J005n31j100j056j057R76K052P38p13j971j089M16J437J195M13j224
1789F61k189o73J266J665R72q47j359q06q68J182J855J123j178k273j046J162
1805a353J708J283o13j249j421j91R44J543R21q75k110q18O87J022J860K42j622
1822d2j550p64J278J860O55r50r36j459p9J180K012O48j467j949n53J172K077
$$ y = [-13, -1907, -2080, -934, 1144, 1129, 37, -708, -1879, -1663, -219, 1434, 1613, -199, -2120, -1631, -51, 593, 1282, 1320, 216, -1700, -1654, 480, 2461, 1804, 15, -770, -798, -303, 734, 2406, 2331, 185, -1769, -1207, 1256, 2224, 1786, 562, -35, -652, -344, 1553, 2892, 2178, -126, -1134, -633, 363, 1609, 2593, 1754, -299, -2020, -824, 1471, 2597, 1437, 238, -389, -580, -885, 1247, 2668, 1932, -702, -2060, -807, 1170, 2175, 1644, 544, -512, -1569, -593, 1459, 2197, 1484, -487, -1576, -1160, 277, 1472, 1885, 661, -1528, -2201, -935, 730, 1702, 855, -504, -1310, -2178, -996, 859, 1982, 804, -1469, -2515, -1353, 355, 1638, 1025, -224, -1645, -1836, -892, 651, 1572, 697, -1413, -2231, -1544, -522, 1338, 1580, -42, -1592, -2356, -1078, 782, 1437, 487, -449, -1908, -1987, -807, 1205, 1853, 386, -1563, -2116, -944, 1133]
1839A133J53m34r07r73o03O18K333P54j167j891m86Q53J291P71j59p54j708o49
1857a825J537J902K44j291r22p27J78J293J140L72j165j992J29J310J249K40o22
1874A050m14j435m24J524J897j28j753j095k19J129P53O72q7j145j453n9J209
1891B2J632J39j510r86k64L14J327J191n67j683j076M25J027N58O21m14j383j212
1909a839n4K147J326q00j609o33Q24J01N04O04l5j155j387K97J723J120n86j030
1927d82j026m38Q61J283Q31p95j401r84N72J149P46K42n64j425q85P14J930O77
1945A005q64j228r43P84Q05P10M19p35j339n09P48J539P85r95j231J67l97N39
1963g40J087J065q16k136n09J021J987K09l01q98j195o9P75J535M67o65j190m48
$$ y = [1133, 1286, 852, -55, -1028, -1631, -1013, 1320, 2074, 907, -984, -1470, -617, 674, 1445, 1286, 532, -1176, -1825, -288, 1614, 1858, 567, -355, -1082, -904, 389, 1529, 1901, 736, -1256, -1127, 183, 1432, 1672, 1050, 636, -799, -1223, 301, 2198, 2070, 317, -778, -997, 132, 885, 1557, 1470, 325, -1128, -1187, 22, 1654, 1793, 283, -703, -967, -653, 674, 1865, 1298, -385, -1461, -1036, -9, 549, 1170, 756, -627, -1839, -1893, 254, 1580, 780, -829, -1462, -638, -537, -33, 571, 536, -619, -2006, -1709, 14, 1134, 548, -482, -1508, -1946, -1085, 198, 1029, 234, -1167, -2151, -1579, -430, 316, 558, -6, -1431, -2316, -1602, 328, 1005, 141, -1087, -2030, -1246, -441, 269, 688, -47, -1386, -1895, -1147, 392, 1177, 182, -1049, -882, -1279, -740, 347, 1412, 596, -1540, -2049, -1028, 959, 1168, 867, -31, -1226, -1295, -520, 1015, 1482, 817, -373, -821]
1981h21P6R47J421L74j514j695k41J741J472j1j051o70k77k86K57J941P95j082
1999A376k046k35P36J470R75r16j018j089K29J042P95N17q26p90n57k72J462Q11
2017A664L91j395j899jK035J062j56r22q77m27j10Q33J495K18j568j204m09J168
2035a02J355J24l60j354j156K86J336J304l41j033r27k29L61J104P84j46j375
2052c69j281N4J354J480j37r19j102m16L87M50J497k3j508j127J80Q21O30N07
2070D78r9o53j665j3J956J216j96j438j110J75R88N17N63n57p02n63Q2R17R50
2089H46j4p53j157l99N62J596O06m56j736m67N74J071L66n5m04p46o34K76J171
2108B47J527r26j532m21M06R89N32M08l01j231q84J029R69M42m43j65j184n48
$$ y = [-821, -745, 202, 1623, 1997, 483, -1212, -1453, 288, 1760, 1749, 698, 28, -249, -535, -278, 1663, 2458, 1376, -670, -905, -169, 1301, 2276, 1360, 342, -747, -518, 524, 1319, 1836, 1010, 220, -337, -609, 853, 1664, 2055, 660, -1239, -1240, 795, 1857, 1701, 779, -98, -525, -635, 198, 1693, 1911, 343, -861, -1270, -102, 1253, 1377, 1017, -337, -1493, -1207, 129, 1433, 1092, 59, -868, -1097, -736, 368, 1152, 1006, -369, -1650, -1596, -242, 1238, 1101, 182, -920, -1336, -949, -499, 998, 975, -533, -1660, -1480, -659, -29, 478, 379, -274, -1939, -1952, 4, 1220, 1024, -414, -1524, -1349, -361, 156, 719, 162, -540, -1103, -1021, -104, 846, 832, 79, -1078, -1477, -915, 681, 1287, 831, -905, -1372, -798, 273, 639, 584, 180, -566, -1200, -924, 247, 1774, 848, -684, -1105, -699, 290, 822, 1230, 929, -302, -1186, -157, 812, 1254, 811, 646, -538, -1086]
2126a086Q23J434Q33j249j381k71P79Q52L40l30k08j081n57J007J388K74r86j268
2144f87mK54N05R18J53q93j102l68J082J036J95l50r43o07O4Q59J073l5j271r34
2164a055J6M62Q44L92L33r36j783K49J235J445l98j093n06j96J67O08Q93K84j293
2183c32j036l13J113Q49M47p75r50m32qJ145N06J37q30j083nO68Q56Q83n41j064
2203g65j353K55J718J179l22j222q00K47R6N68J252J90j245j386J97J128J317
2220A054l83n83q47l92K60J475O02m86r39n83j70Q34Q65L42j22j238j020R38Q09
2239D16O70p4r11o64L20j90J416J021m70j653n53M84Q65P70J2q71n01n56o2J182
2259F51J135m83j082p85K84J004P26j2o66q17n84O20J035M87j22q95r47J24L74
$$ y = [-1086, -263, 1171, 2004, 755, -626, -897, -118, 734, 1074, 744, 536, -545, -1102, -95, 1293, 1567, 581, -687, -691, -437, 68, 986, 1139, 246, -856, -1224, -142, 894, 1089, 739, -204, -811, -747, 112, 1185, 1150, -121, -1055, -1039, -577, 267, 659, 992, 56, -1727, -1478, -243, 1202, 804, -289, -795, -991, -824, -216, 677, 961, -332, -1368, -1681, -568, 281, 728, -47, -997, -1429, -1437, -292, 214, 351, -479, -1562, -1567, -899, -43, 840, 299, -765, -2118, -1863, -145, 1034, 712, -510, -1310, -1063, -967, -399, 853, 1043, -202, -1588, -1391, -263, 1054, 671, 88, -759, -1151, -891, 584, 1186, 700, -239, -822, -992, -158, 707, 1049, 927, -311, -1331, -393, 416, 1086, 1012, 101, -563, -243, -433, 983, 2004, 1534, -119, -672, -188, 677, 1447, 1459, 588, 87, -469, -531, 651, 1786, 1303, 221, -564, -280, 724, 1450, 1438, 772, -45, -629, -9, 1026, 1513, 1391, 496, -451, -327, 47]
2278D7R11Q44p36j236n01O94M90P52m12o66l79j34P1Q75O98p12j144n01O81O07
2298B49N72Q4p69o23m97K21J334M88o52q85l22j10M22J071M38r15j166k23N41
2317g42J314k30N0l29j124j30O62J334k55o18r53n6M67M34O67k75m82p51n45J080
2337d82J019r8o55n51k60L98N09N03L38j040p73J01R16L63K63j50p10o91j69J128
2357d1N84L26j160n02L34J5N64N49j93n06r96K85J120O29L3q26o38j16J82R19
2377E62P55n25o51o44J35L63P74L12n03p45l74p5J045J025m93j193j6k76P67J61
2397D04M89jj048q49N42Q35Q13j86o89o24j70N33K74N20j83p50p43L47O14O44
2417G72J40q29o11m22N70P40N99l71j145m80M61K02R27L14n31q41j249Q95J163
$$ y = [47, 958, 1802, 1066, -170, -671, 23, 513, 1265, 853, 187, -192, -326, -255, 620, 1318, 606, -538, -1039, -358, 249, 821, 905, 136, -487, -984, -763, 571, 1059, 407, -478, -800, -910, -488, 583, 1021, 106, -1060, -1283, -742, 572, 342, 392, 63, -1061, -1191, -529, 805, 550, -68, -1021, -1077, -610, -176, 491, 216, -266, -1017, -1562, -482, 537, 439, -216, -767, -1027, -629, -120, 383, 721, -319, -1092, -991, -75, 288, 551, 401, -309, -1000, -1169, -41, 543, 869, -291, -793, -459, -444, 120, 669, 476, -30, -1026, -741, 379, 1008, 1041, 215, -423, -539, -357, 562, 1317, 792, 141, -503, -368, -5, 769, 1081, 578, -167, -541, -616, 429, 1454, 961, -232, -248, -524, 243, 404, 893, 892, -156, -1005, -463, 372, 1185, 999, 310, -314, -484, 49, 323, 843, 660, -90, -833, -486, 128, 772, 912, 83, -528, -950, -380, 360, 959, 588, -557, -1037, -576, -374, 553, 867, 336, -505, -1754, -859, 304]
2436C04N16p35m11m85J29K88M71N25k40j126n28O14P57N36r5r19m95m50M75J146
2456B77K97o18q91N2J9N21N67L89l09j129m94R61J054j44n38k89k50k28O26Q20
2476F93K64j021o41m82N98J004M62k64n13q84P3O34O25K65o89m49jK74K81P46
2496I75Mp31o15j98R90M16K35o86k79l21k14R96N07N4k91r32n11O38Q42N41k77
2517A143j049k34j11Q46O82J09p28q94l9L61P29K41J3o45q92K97M94P41J2q53
2537B23l66k21PJ016N06j91q95q49L85M31P22k77o3o14m80L4R37P88k85j145k82
2558f19J13O91rM40n02l16p24L82O50M35q2m94n37o09L84R45N57m23j110k29L25
2579g32O96P8j18K76p58o86L12J138L69n84r31m09L23O91L78J86l95l22r20N19
$$ y = [304, 820, 85, -326, -811, -682, -394, 77, 602, 362, -764, -1292, -678, 79, 615, 520, -399, -894, -1344, -869, 277, 574, -44, -935, -883, -864, -343, 224, 613, 304, -825, -1319, -358, 696, 552, 14, -275, -525, -753, -127, 693, 957, -64, -705, -1187, -589, 415, 877, 613, 100, -784, -711, -77, 548, 813, 124, -325, -326, -52, 229, 975, 979, 248, -367, -565, 425, 841, 1076, 390, 111, -210, -424, 572, 1079, 1133, 842, -90, -601, 37, 879, 1420, 1143, 94, -140, -251, 595, 1277, 1386, 658, -236, -275, 86, 815, 1056, 1069, 424, -468, -171, 323, 1064, 1076, 223, -143, -364, -357, 659, 1165, 974, 79, -770, -385, 46, 768, 491, 428, -186, -666, -632, 305, 1093, 808, -337, -619, -506, 185, 176, 616, 114, -202, -926, -544, 106, 541, 459, -35, -572, -1181, -797, 148, 705, 282, -828, -1057, -732, -36, 42, -76, 200, -558, -1244, -932, 206, 575, -9, -940, -1349, -1026, -335, 43, 229, -166, -488, -1408, -889]
$$ [...]
8191b03
##END NTUPLES=NMR FID
##END=
