##TITLE=1H_Lac-DMe-A3-21
 CDCl3, 8 sc, 
 18.10.2019
##JCAMPDX= 6.0         $$ Bruker NMR JCAMP-DX V2.0
##DATA TYPE= NMR FID
##DATA CLASS= NTUPLES
##ORIGIN= UXNMR, Bruker Analytische Messtechnik GmbH
##OWNER= root
$$ XWIN-NMR		Version 3.5
$$ Fri Oct 18 15:50:32 2019 Russian Standard Time (UT+4h)  she@DPX200
##.OBSERVE FREQUENCY= 200.1315
##.OBSERVE NUCLEUS= ^1H
##.DELAY= (6, 6)
##.ACQUISITION MODE= SIMULTANEOUS
##.ACQUISITION SCHEME= undefined
##.AVERAGES= 8
##.DIGITISER RES= 18
##SPECTROMETER/DATA SYSTEM= spect
##.PULSE SEQUENCE= zg30
##.SOLVENT NAME= CDCl3
##.SHIFT REFERENCE= (INTERNAL, CDCl3, 0, 15.7039)
##AUDIT TRAIL= $$ (NUMBER, WHEN, WHO, WHERE, WHAT)
$$ ##TITLE= Audit trail, XWIN-NMR		Version 3.5
$$ ##JCAMPDX= 5.01
$$ ##ORIGIN= Bruker BioSpin GmbH
$$ ##OWNER= she
$$ F:/spectra/data/she/nmr/H-F/1/audita.txt
$$ ##AUDIT TRAIL=  $$ (NUMBER, WHEN, WHO, WHERE, WHAT)
(   1,<2019-10-18 15:49:30.59 +0400>,<she>,<DPX200>,
      <created by zg, POWCHK disabled, PULCHK disabled
       configuration hash MD5:
       00 E9 B6 7A A2 85 ED C7 34 08 36 98 17 FE 4E 26
       data hash MD5: 16K
       E8 E8 EF A2 65 5B 1E C1 32 A1 02 74 B5 D7 DB D5>)
$$ ##END=
$$ 
$$ hash MD5
$$ 75 96 11 68 DD B8 65 A8 A5 0E 11 48 52 2A D3 30
##$RELAX= 
##$RELAX= 
##$RELAX= 
##$RELAX= 
##$RELAX= 
##$RELAX= 
$$ Bruker specific parameters
$$ --------------------------
##$DU= <F:/spectra>
##$EXPNO= 1
##$NAME= <H-F>
##$PROCNO= 1
##$TYPE= <nmr>
##$USER= <she>
##$AMP= (0..31)
100 100 100 100 100 100 100 100 100 100 100 100 100 100 100 100 100 100 
100 100 100 100 100 100 100 100 100 100 100 100 100 100 
##$AQSEQ= 0
##$AQ_mod= 1
##$AUNM= <au_zg>
##$AUTOPOS= <>
##$BF1= 200.13
##$BF2= 200.13
##$BF3= 200.13
##$BF4= 200.13
##$BF5= 200.13
##$BF6= 200.13
##$BF7= 200.13
##$BF8= 200.13
##$BYTORDA= 1
##$CFDGTYP= 0
##$CFRGTYP= 5
##$CHEMSTR= <none>
##$CNST= (0..31)
1 1 145 1 1 1 1 1 1 1 1 1 1 1 1 1 1 1 1 1 1 1 1 1 1 1 1 1 1 1 1 1 
##$CPDPRG= <>
##$CPDPRG1= <>
##$CPDPRG2= <>
##$CPDPRG3= <>
##$CPDPRG4= <mlev>
##$CPDPRG5= <mlev>
##$CPDPRG6= <mlev>
##$CPDPRG7= <mlev>
##$CPDPRG8= <mlev>
##$CPDPRGB= <>
##$CPDPRGT= <>
##$D= (0..31)
0 1.2 0 0 0 0 0 0 0 0.06 0 0.03 0 0 0 0 0.0002 0 0 0 0 0 0 0 0 0 0 0 0 
0 0 0 
##$DATE= 1571399370
##$DBL= (0..7)
120 120 120 120 120 120 120 120 
##$DBP= (0..7)
150 150 150 150 150 150 150 150 
##$DBP07= 0
##$DBPNAM0= <>
##$DBPNAM1= <>
##$DBPNAM2= <>
##$DBPNAM3= <>
##$DBPNAM4= <>
##$DBPNAM5= <>
##$DBPNAM6= <>
##$DBPNAM7= <>
##$DBPOAL= (0..7)
0.5 0.5 0.5 0.5 0.5 0.5 0.5 0.5 
##$DBPOFFS= (0..7)
0 0 0 0 0 0 0 0 
##$DE= 6
##$DECBNUC= <off>
##$DECIM= 24
##$DECNUC= <off>
##$DECSTAT= 4
##$DIGMOD= 1
##$DIGTYP= 9
##$DL= (0..7)
0 120 120 120 120 120 120 120 
##$DP= (0..7)
150 150 150 150 150 150 150 150 
##$DP07= 0
##$DPNAME0= <>
##$DPNAME1= <>
##$DPNAME2= <>
##$DPNAME3= <>
##$DPNAME4= <>
##$DPNAME5= <>
##$DPNAME6= <>
##$DPNAME7= <>
##$DPOAL= (0..7)
0.5 0.5 0.5 0.5 0.5 0.5 0.5 0.5 
##$DPOFFS= (0..7)
0 0 0 0 0 0 0 0 
##$DQDMODE= 0
##$DR= 18
##$DS= 0
##$DSLIST= <SSSSSSSSSSSSSSS>
$$ [...]
##$SUBNAM2= <"">
##$SUBNAM3= <"">
##$SUBNAM4= <"">
##$SUBNAM5= <"">
##$SUBNAM6= <"">
##$SUBNAM7= <"">
##$SUBNAM8= <"">
##$SUBNAM9= <"">
##$SW= 24.0689530833862
##$SWIBOX= (0..15)
0 0 2 0 0 0 0 0 0 0 0 0 0 0 0 0 
##$SW_h= 4816.95568400771
##$TD= 16384
##$TD0= 1
##$TE= 0
##$TE2= 300
##$TE3= 300
##$TEG= 300
##$TL= (0..7)
0 120 120 120 120 120 120 120 
##$TP= (0..7)
150 150 150 150 150 150 150 150 
##$TP07= 0
##$TPNAME0= <>
##$TPNAME1= <>
##$TPNAME2= <>
##$TPNAME3= <>
##$TPNAME4= <>
##$TPNAME5= <>
##$TPNAME6= <>
##$TPNAME7= <>
##$TPOAL= (0..7)
0.5 0.5 0.5 0.5 0.5 0.5 0.5 0.5 
##$TPOFFS= (0..7)
0 0 0 0 0 0 0 0 
##$TUNHIN= 0
##$TUNHOUT= 0
##$TUNXOUT= 0
##$USERA1= <user>
##$USERA2= <user>
##$USERA3= <user>
##$USERA4= <user>
##$USERA5= <user>
##$V9= 5
##$VALIST= <valist>
##$VCLIST= <CCCCCCCCCCCCCCC>
##$VD= 0
##$VDLIST= <DDDDDDDDDDDDDDD>
##$VPLIST= <PPPPPPPPPPPPPPP>
##$VTLIST= <TTTTTTTTTTTTTTT>
##$WBST= 1024
##$WBSW= 4
##$XGAIN= (0..3)
0 0 0 0 
##$XL= 0
##$YL= 0
##$YMAX_a= 188161
##$YMIN_a= -293803
##$ZGOPTNS= <>
##$ZL1= 120
##$ZL2= 120
##$ZL3= 120
##$ZL4= 120
##$ABSF1= 10
##$ABSF2= 0
##$ABSG= 5
##$ABSL= 3
##$ALPHA= 0
##$AQORDER= 0
##$ASSFAC= 0
##$ASSFACI= 0
##$ASSFACX= 0
##$ASSWID= 0
##$AUNMP= <proc_1d>
##$AZFE= 0.1
##$AZFW= 0.1
##$BCFW= 1
##$BC_mod= 2
##$BYTORDP= 1
##$COROFFS= 0
##$CY= 11.3945322036743
##$DATMOD= 1
##$DC= 2
##$DFILT= <>
##$DTYPP= 0
##$F1P= 20.1720416913024
##$F2P= 0.152960286110954
##$FCOR= 0.5
##$FTSIZE= 0
##$FT_mod= 4
##$GAMMA= 1
##$GB= 0.15
##$INTBC= 1
##$INTSCL= 1
##$ISEN= 128
##$LB= 0.24
##$LEV0= 0
##$LPBIN= 0
##$MAXI= 10000
##$MC2= 0
##$MEAN= 0
##$ME_mod= 0
##$MI= 1.114404
##$NCOEF= 0
##$NC_proc= 0
##$NLEV= 6
##$NOISF1= 3.799351
##$NOISF2= 2.8
##$NSP= 1
##$NTH_PI= 0
##$NZP= 0
##$OFFSET= 15.70392
##$PC= 1
##$PHC0= -9573.112
##$PHC1= 18.60089
##$PH_mod= 1
##$PKNL= yes
##$PPARMOD= 0
##$PSCAL= 0
##$PSIGN= 0
##$REVERSE= no
##$SF= 200.130013532006
##$SI= 16384
##$SIGF1= 3
##$SIGF2= 2
##$SINO= 400
##$SIOLD= 16384
##$SREGLST= <1H.CDCl3>
##$SSB= 0
##$STSI= 0
##$STSR= 0
##$SW_p= 3612.71676300578
##$SYMM= 0
##$S_DEV= 0
##$TDeff= 0
##$TDoff= 0
##$TI= <>
##$TILT= no
##$TM1= 0
##$TM2= 0
##$TOPLEV= 0
##$USERP1= <user>
##$USERP2= <user>
##$USERP3= <user>
##$USERP4= <user>
##$USERP5= <user>
##$WDW= 1
##$XDIM= 8192
##$YMAX_p= 0
##$YMIN_p= 0
$$ End of Bruker specific parameters
$$ ---------------------------------
##NTUPLES= NMR FID
##VAR_NAME=  TIME,          FID/REAL,        FID/IMAG
##SYMBOL=    X,             R,               I
##VAR_TYPE=  INDEPENDENT,   DEPENDENT,       DEPENDENT
##VAR_FORM=  AFFN,          ASDF,            ASDF
##VAR_DIM=   8192,          8192,            8192
##UNITS=     SECONDS,       ARBITRARY UNITS, ARBITRARY UNITS
##FACTOR=    0.0002076,     1,               1
##FIRST=     0,             0,               0
##LAST=      1.7004516,     0,               0
##MIN=       0,             -293803,         0
##MAX=       1.7004516,     188161,          0
$$ Real data points
##PAGE= N=1
##DATA TABLE= (X++(R..R)), XYDATA
$$ [...]
2103I09J118j580j322R7O91J79n2R81n24k258m58J331J894j74j336j025n84L83
$$ 909 2027 447 -875 -778 -87 92 40 1021 497 -1761 -2219 -888 1006 832 -504 -1529 -2113 -1730
2121a730J337J448o84j362r34L29Q1J485R14p05k197j85J297N65R9m5Q6j511j073
$$ -1730 -393 1055 371 -991 -1925 -1596 -1515 -30 884 179 -2018 -2203 -906 -341 -242 -287 -201 -1712 -2785
2140b785J454J639J45j332j150k25R97J038N09r49q23k29M20P69N09M63j46j775
$$ -2785 -1331 308 453 -879 -2029 -2254 -1257 -219 290 -659 -1482 -1711 -1291 -522 -13 450 304 -1471
2158a471o27J371J451M31r24j193j81K39J280N66j66j089r10L96J079J261J0j219
$$ -1471 -2098 -727 724 1155 231 -962 -1143 -904 376 942 776 -313 -1223 -827 252 1513 1523 304
2176C04j448M82O54Q14P48m59m51j160l02J345J372L18j106j522j86J345J103
$$ 304 -1144 -662 -8 806 1554 1095 644 -516 -818 527 1899 2217 1111 -411 -597 748 1851
2193A851N20j113p63j20K1O83L03Q57q92j370l04J235N97J56l82r79m52J9J043
$$ 1851 2371 1258 495 375 396 1079 1382 2239 1347 -23 -327 908 1505 1661 1279 300 -152 -133 910
2212I10P38R2j054j029J14Q07R12j55j253k00k3L68L79N25l31l62q56k95N75J432
$$ 910 1648 1740 686 -343 -229 578 1490 1335 82 -118 -141 227 606 1131 800 438 -418 -713 -138 1294
2232A294j93j210j456J08J212R28m42q66o10n8K92M44P43k09r18n26J49O00M06
$$ 1294 1101 -109 -1565 -1457 -245 683 241 -625 -1235 -1293 -1001 -557 186 -23 -941 -1467 -1318 -718 -312
2251c12K42k95p63k16J05O65P79M0j085j066M92P83K97k65l51k95n5p5M59M69
$$ -312 -70 -365 -1128 -1344 -1239 -574 205 245 -840 -1906 -1414 -631 -334 -599 -950 -1245 -1300 -1375 -916 -447
2271d47Q8l40o04j84N77M86L32p04k02J26M96K11k55J66K2l43j50M11N01m6l62
$$ -447 -359 -699 -1303 -1487 -910 -424 -92 -796 -998 -872 -376 -165 -420 -254 -232 -575 -725 -314 187 141 -221
2292b21K09J76m33O8O48L7k82n71N56n8O28j67Q2j140M16N01N29p70R6N96k52
$$ -221 -12 164 -269 -201 447 484 202 -369 187 129 757 590 672 -468 -52 449 978 208 304 900 648
2313F48l57K6O43M84l66j44k66k82N55M86j57m28l25L95n0J94j55j54L43n34q7
$$ 648 291 317 960 1444 1078 934 668 386 941 1427 1270 842 517 912 862 1056 901 747 1090 556 469
2334D69L11l8J5N32q33k90l91O67N91l42J9n52j59K01O48k84L9n3n36p4n71R52
$$ 469 780 742 757 1289 456 166 -225 442 1033 691 710 158 -1 200 848 564 603 550 14 -60 -631 321
2356C21P33p93m61m08M08J94N6N37p06r46Q3R21J06m79k59J03n14j85Q11K76k72
$$ 321 1054 261 -200 -608 -200 -6 50 587 -119 -1065 -982 -61 45 -434 -693 -590 -1104 -1289 -478 -202 -474
2377d74l83j32k40j59R89Q26p61j356N0J024M06P8m54n36k90L23K83N54k66l70
$$ -474 -857 -989 -1229 -1388 -399 427 -334 -1690 -1640 -616 -210 -132 -586 -1122 -1412 -1089 -806 -252 -518 -888
2397h88q9o28N07Q21L86m81o63l69K50P99N76K98j121j122M17J354L15m7n93m61
$$ -888 -977 -1605 -1098 -277 109 -372 -1035 -1404 -1154 -355 221 519 -602 -1724 -1307 47 362 315 -278 -739
2417g39L78l37Q72M34j38l81l01n42O30J176L18j057q39p5P58Q95k3J3r94l04
$$ -739 -361 -698 174 608 470 89 -212 -754 -124 1052 1370 313 -526 -601 157 1052 1029 1042 48 -256
2437b56J09J201M32l85l20n88k57P47M81N20j65j000p40N7R58J033N9j249j182
$$ -256 -147 1054 1486 1101 781 193 -64 683 1164 1684 1519 519 -221 -164 794 1827 1886 637 -545
2456e45L78J284N68j27j175l82j58J60N72R72j9j154o23l03J113N71N31r83j029
$$ -545 -167 1117 1685 1558 383 1 -157 3 575 1547 1528 374 -249 -552 561 1132 1663 680 -349
2475c49n05P66J088J80p33p08p13M41P66M74j91n37j146L18P42OO49l81r83n99
$$ -349 -854 -88 1000 1180 447 -261 -974 -533 233 707 516 -21 -1167 -849 -107 -101 548 167 -816 -1415
2495a415K49J046J185o60j312q56Q5J247O15l83p36l16JJ97M97O83l34o95r64
$$ -1415 -1166 -120 1065 405 -907 -1763 -1678 -431 184 -199 -935 -1251 -1250 -1053 -556 127 -207 -902 -1866
2514a866JJ216Q95j84p37q69j34Q21P65j12l69n19n70L41R56O21j18j147m18Q09
$$ -1866 -1865 -649 246 62 -675 -1544 -1678 -857 -92 -204 -573 -1092 -1662 -1321 -365 256 138 -1009 -1427 -618
2534f18K02L15O32m66p30n87J66J375O68j56j297m96O07O76J023p49q15l28M75
$$ -618 -416 -101 531 65 -665 -1252 -1086 289 957 801 -496 -992 -385 291 1314 565 -250 -578 -103
2553a03J32N54M88J4r05q41L74R98M76j79m92l02j77L50O36L64n94o81j11L70
$$ -103 29 583 1071 1085 180 -661 -287 711 1187 1008 516 214 37 387 1023 1387 793 112 1 371
2573C71R84J77q33k57j50M1N04J72K50j2p79o11r3J301N36n26j264j72O95N62
$$ 371 1355 1532 699 442 292 333 837 1009 1259 1247 468 -143 -236 1065 1601 1075 -189 -361 334 896
2593H96K59m89j99l48J56m77N70L71L3p88n10O55L10j89R3J17l19o89j11Q57K15
$$ 896 1155 666 467 119 275 -202 368 739 772 -16 -526 129 439 250 343 460 141 -548 -659 198 413
2614D13k17p69k36K95N83M9m00l92N3R9L7l09N02K71m48r70L24Q95Nn03m0j52
$$ 413 196 -573 -809 -514 69 118 -282 -674 -621 -522 -485 -794 -292 -21 -469 -1439 -1115 -220 -215 -718 -758 -910
2636i10j78L57K77J68n91K46k76M1j0N23J56p03J34j37L54j22j6O27m58l96J64
$$ -910 -1088 -731 -454 -286 -877 -631 -907 -866 -876 -353 -197 -900 -766 -903 -549 -671 -687 -60 -518 -914 -750
2657g50K76N34m86Oj07l26O42j17J13j46L37j12k36j39O76N15n06j037P33J41
$$ -750 -474 60 -426 -420 -527 -853 -211 -328 -215 -361 -24 -136 -372 -511 165 680 174 -863 -130 11
2677A1K0K02K25n1r4k84J80L19J58k3q4l72J39J80J60mM9k26q8k43O24M94p7r66
$$ 11 31 233 458 407 313 29 209 528 686 663 579 207 346 526 686 682 731 505 417 174 798 1292 1215 249
2701B49J02K10N05k31k03L6r8k8r7M53M0K30l00q02lO87M23j89p17J64o6k11J70
$$ 249 351 561 1066 835 632 668 570 542 445 898 938 1168 868 66 63 750 1173 984 267 431 365 154 324
2724C24P64l72o09k52kM60R5L08p75m22l2M16J62M43j02k74n29n39R88M57l05
$$ 324 1088 716 107 -145 -147 313 408 716 -59 -481 -513 -97 65 508 406 132 -397 -936 52 509 204
2745B04q38l21M83K43l6J99j17k96j99k35L42N59j15k94o33l38O36R19j25p12
$$ 204 -634 -955 -472 -229 -265 -66 -183 -479 -678 -913 -571 -12 -127 -421 -1054 -1392 -756 163 38 -674
2765f74m61K1K48N57L5K77r89l03J68K83J031l75j88l93j96k29R71K68K51q73
$$ -674 -1135 -1114 -866 -309 -274 3 -986 -1289 -1121 -838 193 -182 -370 -763 -959 -1188 -217 51 302 -571
2785e71n33L81M61O25k58o02k53j52R68J50Q5j06m96k60J46N17P53l44k39o07
$$ -571 -1104 -723 -262 363 105 -497 -750 -902 66 216 301 195 -301 -561 -415 102 855 511 272 -335
2805c35KM85L99M16k24q81n45N65J033M55o69l01p14L34N42M07J24k72q36j02
$$ -335 -333 152 551 967 743 -138 -683 -118 915 1370 701 400 -314 20 562 969 1093 821 -15 -117
2825a17J46R36L62kr94o78K58J060K32j9n75o39k57P74M73j64L24q34j67O5M36
$$ -117 29 965 1327 1325 331 -347 -89 971 1203 1184 609 -30 -287 487 960 796 1120 286 119 184 620
2846F20M38O3p26o11J4L50P78j31n65p09j26N16O20L08n43o41l77L05L76J10K76
$$ 620 1058 1121 395 -216 -202 148 926 795 230 -479 -605 -89 531 839 296 -345 -722 -417 -41 69 345
2867C45m7r32k50L99M61N75o34n34n26K18N37R01m30p95m86K76O55K41jn64j28
$$ 345 298 -634 -884 -485 -24 551 -83 -617 -1143 -925 -388 513 83 -712 -1198 -922 -267 -26 -27 -591 -719
2888g19k35q6Q34q8m1k26k49o19M51R97L60p09r71J82O29M61J04n17M2l95m3O49
$$ -719 -954 -1040 -206 -294 -335 -561 -810 -1429 -978 19 379 -330 -1301 -1119 -490 -29 75 -442 -400 -795 -838 -189
2910a89R9P0l00R9n20n2P14K78l94j47n17N99l4Q11j39m35n03L9P18N95l15m56
$$ -189 -90 -20 -320 -221 -741 -793 -79 199 -195 -342 -859 -260 -294 517 378 -57 -560 -521 197 792 477 21
2932B1J91l46R3K87K85J47k25m42j62J75P98L32n07m53l22P96J42l2J5j19j85
$$ 21 212 -134 -41 246 531 678 453 11 -151 24 822 1154 647 194 -128 668 810 778 793 674 489
2953D89j70K58L17J22j16n60k66P2P19k82J1J12k87n12N04M95q4k57m43J18K03
$$ 489 319 577 894 1016 900 340 74 146 865 583 594 706 419 -93 411 906 822 565 122 240 443
2974D43k6J59q9k45J83k07k27L71K18j78o77L40o4M16l21m2k98l2M24l85M4q2
$$ 443 417 576 487 242 425 218 -9 362 580 402 -275 65 1 417 96 54 -244 -276 148 -237 -193 -275
2996b75K47k61k7J31nr5l2jk0j56LJ12K23k20k27qJ2J31L50l90k67P7J55j6J35
$$ -275 -28 -289 -316 -185 -190 -285 -317 -318 -338 -494 -491 -379 -156 -376 -603 -611 -599 -468 -118 -508 -775 -698 -543 -559 -424
3021d24k25K83J41o36j03J91L91P6r7k36J72p9L88k11k04K27j49m00O36j94jJ11
$$ -424 -649 -366 -225 -861 -964 -773 -382 -306 -403 -639 -467 -546 -158 -369 -573 -346 -495 -895 -259 -453 -454 -343
3043c43jK96j79L12r7N0J42m05j25L16L40K38o97k79M14J05L54k42J2o3N5R5j07
$$ -343 -344 -48 -227 85 -12 38 180 -225 -350 -34 306 544 -153 -432 -18 87 441 199 211 148 203 298 191
3066A91K04L80Q2o92j87J64N96M24o85r7j13K00Q1K80j85l36j19M9J46K73M19
$$ 191 395 775 857 165 -22 142 738 1162 477 380 267 467 548 828 643 307 188 237 383 656 1075
3087A075m63j68j01l84M98J75L49j00p73m14Q19M84n4n12q30L32L86O9m9j92K57
$$ 1075 612 444 343 -41 457 632 981 881 108 -306 513 997 943 431 -399 -67 319 388 339 147 404
3108D04l73l14L59K46O2o0n68k35L18L67L96m96l77k41J08L5O67j00l98l44j46
$$ 404 31 -283 76 322 384 324 -244 -479 -161 206 602 106 -271 -512 -404 -369 298 198 -200 -544 -690
3129f90p6N25N98l65l78l75J33K8J29P62l20r83k02M36J001j33q70M9k14j91K79
$$ -690 -766 -241 357 -8 -386 -761 -628 -600 -471 291 -29 -1012 -1214 -778 223 90 -780 -731 -945 -1136 -857
3150h57O17N9k44j96k42L2L80R02k99j002j23L20O40l36K38m51q1j64M91K40m8
$$ -857 -240 -181 -425 -621 -863 -831 -451 451 152 -850 -973 -653 -13 -349 -111 -562 -643 -807 -316 -76 -124
3171a24Om61J64J10L41l5K50m92o1j60N09N16K06p19m26k99P24O54k09k76k08
$$ -124 -118 -579 -415 -305 36 1 251 -241 -302 -462 47 563 769 50 -376 -675 49 703 494 218 10
3192A0l4L74q5O63l31k80q0r0J74M90L18n42p04j0N05K99L72n00q7o47J64O93
$$ 10 -24 350 265 928 597 317 237 147 321 811 1129 587 -117 -127 378 677 1049 549 462 -185 -21 672
3214F72L29l75j10m72P9J41J05L70Q2m62k54l57M64N66J96n69m46n22O92N19r2
$$ 672 1001 626 516 44 123 264 369 739 821 359 105 -252 212 778 974 405 -41 -563 129 648 556
3235E56j82p57L49j46K40L30l47Ml15j95N52J11Mr6m54o6l83N44O62j63n67j91
$$ 556 374 -383 -34 -180 60 390 43 47 -268 -463 89 200 204 108 -346 -412 -795 -251 411 248 -319 -510
3257e10k24N80L85m71K2j32k24m7R7O68m3k05n83k14M56K34N11m38r74K34L76
$$ -510 -734 -154 231 -240 -218 -350 -574 -621 -524 144 101 -104 -687 -901 -445 -211 300 -138 -1112 -878 -502
3278e02K07L29m92k27M39k15j54M20J99l69J28j18k44N39L28l45p4l14m14N15
$$ -502 -295 34 -458 -685 -246 -461 -615 -195 4 -365 -237 -355 -599 -60 268 -77 -151 -465 -879 -364
3298c64N27m6j89k44j01L72K68J7m26J31L1J94q1K4M17l23k18m93P07M62J1m76
$$ -364 163 117 -72 -316 -417 -45 223 240 -186 -55 -24 170 89 113 530 207 -11 -504 203 665 676 200
3320B00p7JL2M47k83O0N3k13R3KR6L46m48P5J27k90J27J32J54k5m20R2M2K51R3
$$ 200 123 124 156 603 320 380 433 220 313 315 411 757 309 384 511 221 348 480 634 609 189 281 323 574 667
3345F67J18o02n6L95J89o6m32L83m21r8N1K28p2k08J37m5j05JN55P2p25l05l9
$$ 667 785 183 127 522 711 645 213 596 175 77 128 356 284 76 213 168 63 64 619 691 -34 -339 -378
3368c78M74L7k22O1k23K5l5o3L12Q8k13L33p51j03K24O68o54K2l08J48K10J8m1
$$ -378 96 133 -89 -28 -251 -226 -261 -324 -12 76 -137 196 -555 -658 -434 234 -420 -398 -706 -558 -348 -330 -371
3391c71k55j92K84J46k24L35j16k9J33m15J81K88j73J10j68l02K36K86k2J11l89
$$ -371 -626 -818 -534 -388 -612 -277 -393 -422 -289 -704 -523 -235 -408 -298 -466 -768 -532 -246 -268 -157 -546
3412e46j43m7O96kO9l63q5J07k04K18R9L13l50m13K2O08L40M3o17j78M81k73P02
$$ -546 -689 -736 -40 -42 27 -336 -421 -314 -518 -300 -201 112 -238 -651 -629 -21 319 362 -255 -433 48 -225 477
3435D77o46J32L29n21l7M41L14l06J09j22k31J59M01N1K66m22l80K55J73K31k35
$$ 477 -169 -37 292 -229 -266 175 489 183 292 170 -61 98 499 550 816 394 14 269 442 673 438
3456D38j59k68J73L04k30L64q0k44j07m39P15J53J87m21m78L25J53M55j70l18
$$ 438 279 11 184 488 258 622 542 298 191 -248 467 620 807 386 -92 233 386 841 671 353
3476C53J48o60L66J32M07l18l86o3k7J48L13j08K86n76k74j15P46o6K73n88k00
$$ 353 501 -159 207 339 746 428 42 -21 -48 100 413 305 591 15 -259 -374 372 306 579 -9 -209
3497b09j03K01N70j57n31k96J05L11K14l60L12J35n68l73K11N44L52o42m51M4
$$ -209 -312 -111 459 302 -229 -525 -420 -109 105 -255 57 192 -376 -749 -538 6 358 -284 -735 -691
3517f91J39M26J51l88j89j42K71J19K67j53m62k5j26M14K97l11K85j65m53m4K47
$$ -691 -552 -126 25 -363 -552 -694 -423 -304 -37 -190 -652 -677 -803 -389 -92 -403 -118 -283 -736 -780 -533
3538e33O35M8o11j72Q9M80J62j38j07m36J80JK22N9l0J14l48k36M37K64J94k95
$$ -533 102 150 -461 -633 -544 -64 98 -40 -147 -583 -403 -402 -180 -121 -151 -37 -385 -621 -184 80 274 -21
3560b1o0m76N44L78P4k2o00r7J81L82K07K17m14k05K53oq1K45N0l63k72J22L69
$$ -21 -81 -557 -13 365 439 417 -183 -280 -99 283 490 707 293 88 341 335 254 499 549 186 -86 36 405
3583D05L27N9n95j72K94K08J67q7j31k77J88j5MN2M80r77P8j28M98K17k33p7k75
$$ 405 732 791 196 24 318 526 693 606 475 198 386 371 375 427 907 -70 8 -120 378 595 362 285 10
3606A0j5R2K16L07j83l68q6M6J39J86K57n90l46K25L19k67J67O6R2o99l85R00
$$ 10 -5 87 303 610 427 59 -27 19 158 344 601 11 -335 -110 209 -58 109 175 267 -432 -817 83
3628H3K3k84r8j24m6J82K03M4k38j63K91l69K74Q6M2j00k22m21N49J47M8j27k68
$$ 83 106 -178 -276 -400 -446 -264 -61 -17 -255 -418 -127 -496 -222 -136 -94 -194 -416 -837 -288 -141 -93 -220 -488
3651d88j20m88P51J51N3j79k60Q3M47j05j56L16m57K06r8N3p0K33Rk55PL76p9
$$ -488 -608 -1096 -345 -194 -141 -320 -580 -497 -50 -155 -311 5 -452 -246 -344 -291 -361 -128 -119 -374 -367 9 -70
3674g0l52M97o75L13L03k18OJ28j71J19j85L38K33J23k65K5l22K54J23O9j63n4
$$ -70 -422 75 -600 -287 16 -202 -196 -68 -239 -120 -305 33 266 389 124 149 -173 81 204 273 110 56
3696E6l5j61K60J75K52n40L9n0L83k6j95O66l89j74j45K2K39r8J71j88p6N0L67
$$ 56 21 -140 120 295 547 7 46 -4 379 353 158 824 435 261 116 138 377 279 450 262 186 236 603
3719F03m1j59k27J1J60k5J71j95K19N1m72L91m28M83m99L07o5l15m1L59K61k79
$$ 603 562 403 176 187 347 322 493 298 517 568 96 487 59 542 43 350 285 -30 -71 288 549 270
3741B70k24n52P24j25L91l38l43J47J12j48n11O82k05m8k26J1O5L55K37m16k43
$$ 270 46 -506 218 93 484 146 -197 -50 62 -86 -597 85 -120 -168 -394 -383 -318 37 274 -142 -385
3762c85r7N80p8m8m21L36l15o9K96O3l8o49L56J88j16K57KJ45k78j92r5QK02J86
$$ -385 -482 98 20 -28 -449 -113 -428 -497 -201 -138 -176 -825 -469 -281 -397 -140 -138 7 -271 -463 -558 -550 -348 -162
3786a62k08l62L96PJ83J38l74J17j3q4K13j7J53m03J58k34P1L11R6j3m8r0L80
$$ -162 -370 -732 -336 -329 -146 -8 -382 -265 -278 -362 -149 -166 -13 -416 -258 -492 -421 -110 -14 -27 -75 -165 215
3809B15k33j97l7Rm4K16p3M36L3n52J65j05p3j95O99p7l0j78L05k64N44J61m21
$$ 215 -18 -215 -252 -243 -287 -71 -144 292 325 -227 -62 -167 -240 -435 264 187 157 -21 284 20 564 725 304
3832C04l61J47K70pJ37j74Q5k28k41M73L46l57q0j48j12N8M85m9j56k94L7N7K71
$$ 304 -57 90 360 353 490 316 401 173 -68 405 751 394 314 166 54 112 597 548 392 98 135 192 463
3855D63j51J20l71J2l5J29L57Ol74o4p3j34L13J25K82p05J33l82M89l2J80l75
$$ 463 312 432 61 73 38 167 524 530 156 92 19 -115 198 323 605 -100 33 -349 140 108 288 -87
3877h7k44P4N43j80j21k44J54J15o69N31r9L14K2m65K7J70M0J75j3l44j77J8M13
$$ -87 -331 -257 286 106 -15 -259 -105 10 -659 -128 -227 87 109 -356 -329 -159 -119 56 43 -301 -478 -460 -47
3900d7M0l87J81pk45K16k26K16MJ13m91j97L99P1J45k48j88PL84L14k78K36m81
$$ -47 -7 -394 -213 -220 -465 -249 -475 -259 -255 -142 -633 -830 -431 -360 -215 -463 -651 -644 -260 54 -224 12 -469
3923d69K49J02K07k03RK11k26r7j4L89k93J94l46J87O1nN45n51k09k88M59L41
$$ -469 -220 -118 89 -114 -105 106 -120 -217 -231 158 -135 59 -287 -100 -39 -44 501 -50 -259 -547 -88 253
3945B53K9j44%l05J43K23k46L71J40l8l62p4M50Q0p4j68p7PJ2J03R5k57p4N6R
$$ 253 282 138 138 -167 -24 199 -47 324 464 426 64 -10 440 520 446 278 201 208 220 323 418 161 87 143 152
3970A52K18K4o6J13j17k70R4J97M4M36q10J91j61n8Q42o16m4k8N8m8K14j59p5
$$ 152 370 394 328 441 324 54 148 345 389 825 15 206 45 -13 829 213 169 141 199 151 365 206 131
3993A31k23L59j12j22M10po00J47j64K93j18L90j42m63o0j4O80m40K4j04j11K6
$$ 131 -92 267 155 33 443 436 -164 -17 -181 112 -6 384 242 -221 -281 -295 385 -55 -31 -135 -246 -220
4015b20L6K99l86P9o0pjk09N15k68o7l6k08J81N05l00k50J05K0K90k90k2J06l10
$$ -220 -184 115 -271 -192 -252 -259 -260 -469 46 -222 -289 -325 -533 -352 153 -147 -397 -292 -272 18 -272 -294 -188 -498
4039d98j74J98K24O7m7j24Q2K54j28Q2r7J67j65j51p3O27k78J51o1m14K35J01
$$ -498 -672 -474 -250 -183 -230 -354 -272 -18 -146 -64 -161 6 -159 -310 -383 244 -34 117 56 -358 -123 -22
4061b2O8O9J2k70j61L09l70L56L65m07k05j05O86l58K73N1l44J07L07k0k68M59
$$ -22 46 115 127 -143 -304 5 -365 -9 356 -51 -256 -361 325 -33 240 291 -53 54 361 341 73 532
4083E32j71K05m56K36l55R1M94m56M8K24j5P6o9j96l67L01M08q0k00q6K3J32J31
$$ 532 361 566 110 346 -9 82 576 120 168 392 377 453 384 188 -179 122 530 450 250 164 187 319 450
4106D50l02L23o8j85J61r0l21K12N2j01L2J43Jr9j2j93J27J55m1N6qo2p6l63j00
$$ 450 148 471 403 218 379 289 -32 180 232 131 163 306 307 208 196 3 130 285 244 300 292 230 154 -209 -309
4131c09jJ65J6j79J73l78N20k48K71J34j41k15K01j51K83n25L37k86R9k56J58
$$ -309 -310 -145 -129 -308 -135 -513 7 -241 30 164 23 -192 9 -142 141 -384 -47 -333 -234 -490 -332
4152c32N3M22j82n1n29L65O2r5J5J98m44j3O07m78J08L7P0l91J06K23M7K99m71
$$ -332 -279 143 -39 -90 -619 -254 -192 -287 -272 -74 -518 -531 76 -402 -294 -257 -187 -578 -472 -249 -202 97 -374
4175c74p0m5L88k49L88J04p04j82L28N49R5l2m48l9J74R9k0P6j53j30R1J4J01
$$ -374 -444 -489 -101 -350 38 142 -562 -744 -416 133 228 196 -252 -291 -117 -18 -38 38 -115 -245 -154 -140 -39
4198c9M12j74k11k82L92m2K64k12n4n5j61J31J81K99k4l84j30M13J48m48M35Q8
$$ -39 373 199 -12 -294 98 56 320 108 54 -1 -162 -31 150 449 425 41 -89 324 472 24 459 547
4220E47j16k91K09J21mJ19j53n54N50j76J95m2l20j02M04r9k27P0K00j73n5j26
$$ 547 431 140 349 470 466 585 432 -122 428 252 447 405 85 -17 387 288 61 131 331 158 103 -23
4242b3K7M44j24j25j98R5q3L62k43k8J34n93L00J73O1j51j60kk20K50K05j03j4
$$ -23 4 448 324 199 1 96 13 375 132 104 238 -355 -55 118 179 28 -132 -134 -354 -104 101 -2 -16
4265a6j45P5l28N25k33Q3l54l26M12J74j56r5j22K99k46J41J29l8J11k05j64Q0
$$ -16 -161 -86 -414 111 -122 -39 -393 -719 -307 -133 -289 -384 -506 -207 -453 -312 -183 -221 -110 -315 -479 -399
4287c99L79K06j09l15k14p1J01N96l13j81r9O8K54K18nm19J05j37K50K38p6k57
$$ -399 -20 186 77 -238 -452 -523 -422 174 -139 -320 -419 -351 -97 121 116 -303 -198 -335 -85 153 77 -180
4309a80m3K62q7l33L57j7j4j63kN41j72L36j73m81q6m7M08j82j7K13N8j49J1M3
$$ -180 -223 39 -48 -381 -24 -41 -55 -218 -220 321 149 485 312 -169 -255 -302 106 -76 -93 120 178 29 40 83
4333H3K34l01O1j24K1O6M37k76P8q9l84m0J64L80l72N9Q7l3J17j40J41K28j92
$$ 83 317 16 77 -47 -26 40 477 201 279 190 -194 -234 -70 310 -62 -3 84 51 168 28 169 397 205
4356B05j50O9JK66j39j01J72j71j72J98J01k22r5K28L05j88L3k76J34Nm56P2L23
$$ 205 55 124 125 391 252 151 323 152 -20 178 279 57 -38 190 495 307 340 64 198 203 -253 -181 142
4379A42j54P2m6j13L28k1j60j3k80j16J54J92J05k26Q6j12l4l13L60J13j99J35
$$ 142 -12 60 14 -99 229 208 48 35 -245 -361 -207 -15 90 -136 -50 -162 -196 -509 -149 -36 -235 -100
4401a00K58n13K13J32R1l33p8J64q3m7L38k03n8J27k89J32l5R2l5O6k17o4L41
$$ -100 158 -355 -142 -10 81 -252 -330 -166 -249 -296 42 -161 -219 -92 -381 -249 -284 -192 -227 -161 -378 -442 -101
4424a01q4rr8k1q5K26K01r8Q6l04J24k6K14k64J89K20l44J48j33K08M3k38nM3
$$ -101 -185 -194 -292 -313 -398 -172 29 -69 17 -287 -163 -189 25 -239 -50 170 -174 -26 -159 49 92 -146 -151 -108
4448a08J72p6J08n1m1J05j45K7K1L10l8j95m88M97Lk35L49J69j96k24L04O0K64
$$ -108 64 -12 96 45 4 109 -36 -9 12 322 284 89 -399 98 101 -134 215 384 188 -36 268 328 592
4471E92l52o2j33l8J91R5q1l59L98k08N06k67j79n9J23j12J77J40j23K51n29L80
$$ 592 240 178 45 7 198 293 212 -147 251 43 549 282 103 44 167 55 232 372 249 500 -29 351
4493C51n64K54J66J36k27j06L81n68O21o2l85k57K00K45l41M92j26l46K7j00J30
$$ 351 -213 41 207 343 116 10 391 -177 444 382 -3 -260 -60 185 -156 336 210 -136 -109 -209 -79
4514g9j7L77k51k10l9K6J72n7J25q0m10K99k55M49M3k5l91J00K1l7R2Lj94m5l11
$$ -79 -96 281 30 -180 -219 -193 -21 -78 47 -33 -443 -144 -399 50 93 68 -323 -223 -202 -239 -147 -144 -338 -383 -694
4539f94M26L92j13l62L25l25L8Q4J89p7n3j52p2R6M01j11j69M5l55J52LM75k25
$$ -694 -268 124 11 -351 -26 -351 -313 -229 -40 -117 -170 -322 -394 -298 103 -8 -177 -132 -487 -335 -332 143 -82
4562h2J21j05j52L80n1m0oj99j86K69K01j84J97k10l6n2O5L13M1k07m7p0L4M42
$$ -82 39 -66 -218 162 111 71 65 -134 -320 -51 150 -34 163 -47 -83 -135 -70 243 284 77 30 -40 -6 436
4586D36m1k76k60J77n1K37L2J52L7n53p4K35K54r1k30k25L27q0L36m5L6j74l94
$$ 436 395 119 -141 36 -15 222 254 406 443 -110 -184 51 305 214 -16 -241 86 6 342 297 333 159 -235
4609b35M86j52N22j84l82J85j18n1J39J1o2N0k4k34l1L90m09J23P0k52N20j81
$$ -235 251 99 621 437 55 240 122 71 210 221 159 209 185 -49 -80 310 -99 24 94 -158 362 181
4631A81l3k20K78j06l17K68j42j11J18j15P8k5l0k58L47N9Kk50M9K37n2r5j48
$$ 181 148 -72 206 100 -217 51 -91 -202 -84 -199 -121 -146 -176 -434 -87 -28 -26 -276 -227 10 -42 -137 -285
4654b85J52M8J3K08n29J69k5M5K01k90K33q4m1l61N0M34J92K4l52r1L2K09j53
$$ -285 -133 -85 -72 136 -393 -224 -249 -204 -3 -293 -60 -144 -185 -546 -496 -62 130 154 -198 -289 -257 -48 -201
4677b01J78q2J29l44M09l24M28k84j46J68J8R7l82L30m36K23j79K33N36n38L93
$$ -201 -23 -105 24 -320 89 -235 193 -91 -237 -69 -51 46 -336 -6 -442 -219 -398 -165 371 -167 226
4698B26o66O7M01L1Lp7J6J31N8l54J54J45K85k66N5k70N07l16k20L52o7j96L04
$$ 226 -440 -373 28 59 62 -15 1 132 190 -164 -10 135 420 154 209 -61 446 130 -90 262 195 -1 303
4721C03j99j45J84p0K05k25K38%k18L99l03m06N0N67o8l37K54k18P3Q4J61ql34
$$ 303 104 -41 143 73 278 53 291 291 73 472 169 -237 -187 380 312 -25 229 11 84 168 329 321 -13
4744a3j82M56k3k68J07M7o5q6l0K31LL66m90j01J16j6J30Qk50l62K82M35k70p1
$$ -13 -195 261 238 -30 77 124 59 -27 -57 174 177 543 53 -48 68 52 182 190 -60 -422 -140 295 25 -46
4768d6R1r2j84L3P9M83m02qN0j2k40K22j47K10l97K68j00p1N2Q5j02j43J96k0
$$ -46 45 -47 -231 -198 -119 364 -38 -46 4 -8 -248 -26 -173 37 -360 -92 -192 -263 -211 -126 -228 -371 -175 -195
4792a95l0j20L84m40J52M0K90L0k19K06k06J5J09Qk92J64n9o8L0kM5l3j36L95
$$ -195 -225 -345 39 -401 -249 -209 81 111 -108 98 -108 -93 16 24 -268 -104 -163 -231 -201 -203 -158 -191 -327 68
4816F8n7n3L09l42N5r4K2J08Pk17L27q1j26k19K06J80j16m9M7N5K37k31J67M5
$$ 68 11 -42 267 -75 -20 -114 -92 16 23 -194 133 52 -74 -293 -87 93 -23 -72 -25 30 267 36 203 248
4840B48k49n7K11r7j97N08l25K52k3j82j6J03M3k71L79k66J53N4j46r7J47j6j04
$$ 248 -1 -58 153 56 -141 367 42 294 271 89 73 176 219 -52 327 61 214 268 122 25 172 156 52
4863E2p8J49J34J54n79M1M00o0j74K42j65k01K12J7J25m07L04p9m43M23R9k78
$$ 52 -26 123 257 411 -168 -127 273 213 39 281 116 -85 127 144 269 -138 166 87 -356 67 166 -112
4885a12J31j39k04L85J15J09k46j4j20pj3L24l29Q8r1J66l03QJ69k02j96L81r8
$$ -112 19 -120 -324 61 176 285 39 25 -95 -102 -115 209 -120 -32 -123 43 -260 -252 -83 -285 -481 -100 -198
4908a98K47k32r2M58l78j37K91k92M57n45K82j9K29p1j11J5k40N9R1j35K53J25
$$ -198 49 -183 -275 183 -195 -332 -41 -333 124 -421 -139 -158 71 0 -111 -96 -336 -277 -186 -321 -68 57
4930E7J36j61j21J14r0J13m7l77K02J33j38K47k33j29j10N45j53K07k01n0j41
$$ 57 193 32 -89 25 -65 48 1 -376 -174 -41 -179 68 -165 -294 -404 141 -12 195 -6 -56 -197
4951a97N5R4K24l21K82j02k15J8P5Q5O8M5m50K35L20R1J41k54j36k14Q3L27j24
$$ -197 -142 -48 176 -145 137 35 -180 -162 -87 -2 66 111 -339 -104 216 307 448 194 58 -156 -73 254 130
4974A30K16o9k13l63J74L44J41j32j37l85k5N08J99j08K11k28k22M9J87J21l88
$$ 130 346 277 64 -299 -125 219 360 228 91 -294 -319 189 388 280 491 263 41 90 277 398 10
4995A0J07k19L39j62K83k2n6r1k79R8J80J97q8j58j56N7Q5j00M7m7K74m03J0J14
$$ 10 117 -102 237 75 358 336 280 189 -90 8 188 385 297 139 -17 40 125 25 72 25 299 -104 -94 20
5019B0M5l00K09Q6m83J55J54n2pj01J98j26L06j47j94n5j14Q2L32j42J9j4j25
$$ 20 65 -235 -26 60 -423 -268 -114 -166 -173 -274 -76 -202 104 -43 -237 -292 -406 -324 8 -134 -115 -129 -254
5042b54J15P9j41J11j16P3l05J39J40J00m12L50j50J09lJ49L6n6Mj1J90m16J1
$$ -254 -139 -60 -201 -90 -206 -133 -438 -299 -159 -59 -471 -121 -271 -162 -165 -16 20 -36 -32 -43 147 -269 -258
5065b58N5J95j79q1K51k5N3r6O7k19M0N15m45K40j26K35m89L4L53N4R7k01J11
$$ -258 -203 -8 -187 -268 -17 -42 11 -85 -18 -237 -197 318 -127 113 -13 222 -267 -233 120 174 271 70 181
5088A81l7p7J21l8k22J91k77k50M50L00k45m44L61p0M2J15k16J97J69k51M15r4
$$ 181 144 67 188 150 -72 119 -158 -408 42 342 97 -347 14 -56 -14 101 -115 82 251 0 415 321
5110C21k20K2j18P8K58k16q5J87k41J66J16j82K35l91K79j30p6O8j84J25P7k48
$$ 321 101 123 5 83 341 125 40 227 -14 152 268 86 321 -70 209 79 3 71 -113 12 89 -159
5132a59J43j07J37J09o5K50l94K41q2j23p5J02Q3L7k10l12O17j76K36m78J36j13
$$ -159 -16 -123 14 123 58 308 -86 155 73 -50 -125 -23 60 97 -113 -425 192 16 252 -226 -90 -203
5154b03J99J56k20O8j42k2K3L20j74j4n7J14m00J88J11q5O7k32K96p3l7q9O5k36
$$ -203 -4 152 -68 0 -142 -164 -141 179 5 -9 -66 48 -352 -164 -53 -138 -71 -303 -7 -80 -117 -206 -141 -377
5178c77O4K32J91Q6k49N1l09L40j02k04L39r8j04J0j92%K57L1q1j73J06P3nP5
$$ -377 -313 -81 110 196 -53 -2 -311 29 -73 -277 62 -36 -140 -130 -322 -322 -65 -34 -115 -288 -182 -109 -114 -39
5202c9k06L12j81k97O92l28J09j10R6j81K09j05J42J62k31p7L1K0K88l93K23j15
$$ -39 -245 67 -114 -411 281 -47 62 -48 48 -133 76 -29 113 275 44 -33 -2 18 306 -87 136 21
5224B1M4K06j1j29j80L91m3m51M28K3j58M8k19M15j87K63j96K6k23M03n17K48
$$ 21 65 271 260 131 -49 342 299 -152 276 299 141 189 -30 385 198 461 265 291 68 471 -46 202
5246B02J05k09j84J75j19r2Q8K24J10m57J04J65j6r5J50j19k5N2p8K76k42J67
$$ 202 307 98 -86 89 -30 -122 -34 190 300 -157 -53 112 96 1 151 32 7 59 -19 257 15 182
5268A82j81k21K68J72r7J4K7j96M02k36l06K93n0k26k53P0J81J85j56r0j79K89
$$ 182 1 -220 48 220 123 137 164 -32 370 134 -172 121 71 -155 -408 -338 -157 28 -128 -218 -397 -108
5290a08M75m56k89K88l97Q9O84k49k76M23m24J26J09L7j28l30J70m4J86M6j3J78
$$ -108 367 -89 -378 -90 -487 -398 286 37 -239 184 -240 -114 -5 32 -96 -426 -256 -300 -114 -68 -81 97
5312I7k92r1k68K85J93j81J3j22K56R0kk07L68k66K19k90o6K61L63l11j66N7j54
$$ 97 -195 -286 -554 -269 -76 -257 -244 -366 -110 -20 -22 -229 139 -127 92 -198 -264 -3 360 49 -117 -60 -214
5335b14J88j24K35j22j44L99o8l99L01P7j37m4kJ96j6j00Rj8J29j77K45n5j28
$$ -214 -26 -150 85 -37 -181 218 150 -249 52 129 -8 -52 -54 142 126 26 35 17 146 -31 214 159 31
5358C1J60l35R4J40R4j02J40p5j58m1J38O4j72M37m87J80l1l8K16j94k53L47k63
$$ 31 191 -144 -50 90 184 82 222 147 -11 -52 86 150 -22 415 -72 108 77 39 255 61 -192 155 -108
5381a08Q6J25M01l96l43N84j06j21j94J89l40J58o8K94J08m86L05n76M65L6j3
$$ -108 -22 103 504 108 -235 349 243 122 -72 117 -223 -65 -133 161 269 -217 88 -488 -23 13 0
5402@k08O4K02m29L25O4l44J67j16R1J81Q2j35K1m43K33J54l60J49L23q7k51L0
$$ 0 -208 -144 58 -371 -46 18 -326 -159 -275 -184 -3 79 -56 -35 -478 -245 -91 -451 -302 21 -66 -317 -287
5425b87K93n5j45J33k80M17r4J91m55J11P7K15j99k13J59J20k94R3K4K44R7j69
$$ -287 6 -49 -194 -61 -341 76 -18 173 -282 -171 -94 121 -78 -291 -132 -12 -306 -213 -189 55 152 -17
5447a7j56L9j14K42k36L13n3j62m7J87J18p8j21K70l05k8j13M11o7k76J35J8p7
$$ -17 -173 -134 -248 -6 -242 71 18 -144 -191 -4 114 36 -85 185 -120 -148 -261 150 83 -193 -58 -40 -117
5470a17J82J30k36P0M2rK24j05j05k36L89L0l95K01J60j94L48m66k13L10M5J36
$$ -117 65 195 -41 29 71 62 286 181 76 -160 229 259 -136 65 225 31 379 -87 -300 10 55 191
5492A91J35j15j6j18o6l99M43j12qJ67K64j72k96K49r6j38R6J06K89k61l36L23
$$ 191 326 211 195 77 11 -388 55 -57 -65 102 366 194 -102 147 51 -87 9 115 404 143 -193 130
5514A30J00m3k5l7J7L1n20L98j04Q9q6K92L9k49k27K93K1r7m32K94J61J25j02
$$ 130 230 187 162 125 142 173 -347 51 -53 36 -50 242 281 32 -195 98 119 22 -410 -116 45 170 68
5537F8k42J13n6k25J53L02p3j07%m03O38l63K96l37ML70l84M1k8O1L63l33J83
$$ 68 -174 -61 -117 -342 -189 113 40 -67 -67 -470 168 -195 101 -236 -232 138 -246 -205 -233 -172 191 -142 41
5560D1j53L17m76j2N9L2p3j0J48K69M5l28J17l98K92L36J7k42L1j48L02j46k07
$$ 41 -112 205 -271 -283 -224 -192 -265 -275 -127 142 187 -141 -24 -422 -130 206 223 -19 12 -136 166 20 -187
5583a87J03j64j59N03k99L45j96L22j56k46K5K4L24j72j88r2L07k52K83J46j78
$$ -187 -84 -248 -407 96 -203 142 -54 268 112 -134 -109 -85 239 67 -121 -213 94 -158 125 271 93
5604I3l00K05J70j36j09P7M39k62m50M59l56M45j61q2j4K1j06M26m23J50J01k16
$$ 93 -207 -2 168 32 -77 0 439 177 -273 186 -170 275 114 32 18 39 -67 359 -64 86 187 -29
5626b9L21j18l54M7JL96k88J89J5k41M9L88l65J51j20m5j37j04L69k30L34Kk00
$$ -29 292 174 -180 -133 -132 264 -24 165 180 -61 -12 376 11 162 42 -3 -140 -244 125 -105 229 231 31
5649C1N2k8J94k33k95L21j79j40R4L8K32J78j49l00k17N35k99j27J86k36K82J20
$$ 31 83 55 249 16 -279 42 -137 -277 -183 -145 87 265 116 -184 -401 134 -165 -292 -106 -342 -60 60
5671F0l03J93lP0O3p5q7k64K17L07j02l09k5l6N5K95j02r7k87P4K95M2q3P5j62
$$ 60 -243 -50 -53 17 80 5 -82 -346 -129 178 76 -233 -258 -294 -239 56 -46 -143 -430 -356 -61 -19 -102 -27 -189
5696a89L43j48r6j03K76O6k37l13L17j9J28K5j91n6J13P4j72K55k26N5n5P2J55
$$ -189 154 6 -90 -193 83 149 -88 -401 -84 -103 25 50 -141 -197 -84 -10 -182 73 -153 -98 -153 -81 74
5719G4l2o3K62r8k21L97j83j50p2O0j17R0K69k19Q9k77L46J12J74l28k10j54K76
$$ 74 42 -21 241 143 -78 319 136 -14 -86 -26 -143 -53 216 -3 86 -191 155 267 441 113 -97 -251 25
5742B5K2J69M3J48m62L68k32J98N8j51j7l21K39j48P6N9N8l5L58m68J18m8J86
$$ 25 47 216 259 407 -55 313 81 279 337 186 169 -152 87 -61 15 74 132 97 455 -13 105 57 243
5765B43k03Q1j12J0O4o5R2j96p5K89M2j04Q7n5k00L16k15m3j0K20m6j13l3J33
$$ 243 40 121 9 19 83 18 110 -86 -161 128 170 66 153 98 -102 214 -1 -44 -54 166 120 7 -26 107
5789A07r4J8l3K0Q7l25j8M79k66j70J06L38l53J99l48L4J27p4M4K41k92L49m50
$$ 107 13 31 -2 18 105 -220 -238 241 -25 -195 -89 249 -104 95 -253 -219 -92 -166 -122 119 -173 176 -274
5812b74J02j45K36j9L11k54p5J6j31N9Q5n5J59N4j54L21m57K77p9j35K38r0J03
$$ -274 -172 -317 -81 -100 211 -43 -118 -102 -233 -174 -89 -144 15 69 -85 236 -221 56 -23 -158 80 -10 93
5835I3k54K46k3q2l32K99J53q2J48k28j64M26l96L70j69K6r2m6K13k7Qj42K39
$$ 93 -161 85 62 -20 -352 -53 100 18 166 -62 -226 200 -196 174 5 31 -61 -107 106 79 87 -55 184
5858A84p9np7J2o7J91M7k30N9P9j54k4j9K3K33r3k3J98j80j37N30k80k01M38l90
$$ 184 105 100 23 35 -32 159 206 -24 35 114 -40 -64 -83 -60 173 80 57 255 75 -62 468 188 -13 425 35
5883C5R9K9J11J32m65J28k19J48K97k91J74j66j45J20o1L25k93K17j31m9R1J9
$$ 35 134 163 274 406 -59 69 -150 -2 295 4 178 12 -133 -13 -74 251 -42 175 44 -5 86 105
5905A05K00k62P8k08J99L3L5O2n9j99k53K06K23j68J07N7j12l23L97k02N7oj2
$$ 105 305 43 121 -87 112 145 180 242 183 -16 -269 -63 160 -8 99 156 44 -279 118 -84 -27 -33 -45
5928d5Ok81L98R2Mk81j72K77J32m37K63j2j71j62K78j23L02l07K3K04O1j93N9
$$ -45 -39 -320 78 170 174 -107 -279 -2 130 -307 -44 -56 -227 -389 -111 -234 68 -239 -216 -12 49 -144 -85
5951h5J76j14nj7K42m27K22J52m7j15lo5K31j45J9m6jJ69k09j73M96o80N16O2
$$ -85 91 -23 -28 -45 197 -230 -8 144 97 -18 -21 -86 145 0 19 -27 -28 141 -68 -241 255 -425 91 153
5975A53m9k96L59k43K54l16J08K71k42K9K6ORj97L64k20j95L36j33J29j17J3J7
$$ 153 104 -192 167 -76 178 -138 -30 241 -1 28 54 60 69 -128 236 16 -179 157 24 153 36 49 66
5998F6m9K14k92M17j28k57K48m74L96n3J78L07n59J19j71J33k30ML14J01j69l87
$$ 66 17 231 -61 356 228 -29 219 -255 141 88 266 573 14 133 -38 95 -135 -131 183 284 115 -272
6020b72K22K50Q8j52j42k6k15N57k79k66L01q6J8J26K6j76P2j61q9N1K5j37N36
$$ -272 -50 200 288 136 -6 -32 -247 310 31 -235 66 -20 -2 124 150 -26 46 -115 -204 -153 -128 -265 271
6043B71n0J0k07lK2k0k46J76K18j24j47K22jk76J63J54P3q0j59p4n3Lo8K23j40
$$ 271 221 231 24 21 43 23 -223 -47 171 47 -100 122 121 -155 8 162 235 155 -4 -78 -131 -128 -196 27 -113
6068a13n1Q0J4q8J2J22k9K63l73j67J98k31L19j84K09k17j33L78J70j98kj95l6
$$ -113 -164 -84 -70 -158 -146 -24 -53 210 -163 -330 -132 -363 -44 -228 -19 -236 -369 9 179 -19 -21 -216 -252
6091b52L61j04K01m98L1J59J12K23k51M8r6o4N85n34rl5J21K26l98M38j59k5j83
$$ -252 109 5 206 -292 -261 -102 10 233 -18 30 -66 -130 455 -79 -88 -123 -2 224 -174 264 105 80 -103
6114a03L37q9L8l17J00O1J30j63L7L77l67j09R9L1J36j04Q0K13k34J57k69L7J6
$$ -103 234 145 183 -134 -34 27 157 -6 31 408 41 -68 31 62 198 94 174 387 153 310 41 78 94
6137I4Op3K56k40J47k37M68m96J02j29r6M64n91K59N4j8Po4j79L18r2L0j22K65
$$ 94 100 27 283 43 190 -47 421 -75 27 -102 -198 266 -325 -66 -12 -30 -23 -87 -266 52 -40 -10 -132 133
6161A33k77j4J89j12j13L26p8J33m5kj18j47K6K61N7l64K23l12R8J47j54L03j94
$$ 133 -144 -158 31 -81 -194 132 54 187 142 140 22 -125 -99 162 219 -145 78 -234 -136 11 -143 160 -34
6184c4J08N3j72O9j62j00KN03k69n1q9P4J80j47O1l22L84l80M30j17j59r3L50
$$ -34 74 127 -45 24 -138 -238 -236 267 -2 -53 -142 -68 112 -35 26 -296 88 -292 138 21 -138 -231 119
6207A19m7k60J37j7M8k19N0J34j96J91K31k86J79j09J95j00j10M6J19k48K73o3
$$ 119 72 -188 -51 -68 -20 -239 -189 -55 -251 -60 171 -115 64 -45 150 50 -60 -14 105 -143 130 67
6229F7R5M2j67j58K82j43J23j60R8R1l17L63o0P6j39J03r4k31J64L08j94k48J02
$$ 67 162 204 37 -121 161 18 141 -19 79 170 -147 216 156 232 93 196 102 -129 35 343 149 -99 3
6252Ck28N47m33J78n0J39j17J00k12K63j21Mj15l3j3q8M31j93l09N00q3m5P6k41
$$ 3 -225 322 -111 67 17 156 39 139 -73 190 69 73 -42 -75 -88 -176 255 62 -247 253 170 125 201 -40
6276d0n5L93p2j12R8l13P9J56o3j68M54l65j2J6J8j37Q9N4K8p9R6j29K16j97L5
$$ -40 -95 298 226 114 212 -101 -22 134 71 -97 357 -8 -20 -4 14 -123 -34 20 48 -31 65 -64 152 -45 -10
6301a0L46m17k2J07M0l6J08k9k47kK79k47K70j79n1j19M33j39r4j20J34J5P7k21
$$ -10 336 -81 -103 4 44 8 116 87 -160 -162 117 -130 140 -39 -90 -209 224 85 -9 -129 5 20 97 -124
6325a24Q8n4k03J62k66M97j60j79L01M2k49m4J08o6J99J02l53J10l6j56M8J62
$$ -124 -36 -90 -293 -131 -397 100 -60 -239 62 104 -145 -189 -81 -147 52 154 -199 -89 -125 -281 -233 -71
6347g1k27Q07n70J16j3n3K06O5N0l69lm4j00L07M9l60L35l14J91Ol1K19m83J62
$$ -71 -298 509 -61 55 42 -11 195 260 310 -59 -62 -106 -206 101 150 -210 125 -189 2 8 -23 196 -287 -125
6371a25P8J10J44k61o7K05M4J33j23j42j2p5K17j01J43K6lj21K0M0m9j7R7k86
$$ -125 -47 63 207 -54 -121 84 128 261 138 -4 -16 -91 126 25 168 194 191 70 90 130 81 64 161 -125
6395a25J19O8L02k82q1K30k32J12J30k13j20J30n0K01j83r6J68J60j3m53K35K04
$$ -125 -6 62 364 82 1 231 -1 111 241 28 -92 38 -12 189 6 -90 78 238 225 -228 7 211
6417B11k09K11k92K55l02r4J72L47k45j76j85L28j48p1L86n53J87J28j7l44N78
$$ 211 2 213 -79 176 -126 -220 -48 299 54 -122 -307 21 -127 -198 188 -365 -178 -50 -67 -411 167
6438A67n37P9j56R5M18l09L39j40q8M40j52o6R8o2j59p6j63M3M94l43O3Q0j66
$$ 167 -370 -291 -447 -352 66 -243 96 -44 -132 308 156 90 188 126 -33 -109 -272 -229 265 -78 -15 65 -101
6461a01O5Q7j19K9j70K37k46M04l64J50k1k13O3L54j66k83J49J57k45J67J25K2
$$ -101 -36 51 -68 -39 -209 28 -218 186 -178 -28 -49 -262 -199 155 -11 -294 -145 12 -233 -66 59 81
6483H1J31k56J73j82j39J51k62J66oJ95J24j39l5K87L3k86k8LJ67N3l16N5J06
$$ 81 212 -44 129 -53 -192 -41 -303 -137 -143 52 176 37 2 289 322 36 8 11 178 231 -85 -30 76
6506G6k08K02R2k75K5L93l06L06k32O2J09m05N65l86j32J24J1K32j48N9lJ69l15
$$ 76 -132 70 162 -113 -88 305 -1 305 73 135 244 -161 404 18 -114 10 21 253 105 164 161 330 15
6529A5K6R4k3k23K35j83J40N9k92K34k03K7L75j72j25j27j8J3K43ko5M24l32j90
$$ 15 41 135 112 -111 124 -59 81 140 -152 82 -121 -94 281 109 -16 -143 -161 -148 95 93 28 452 120 -70
6553g0K51m61J79LL27k29k19J19K16j72q1P3K43nJ49m89J20R1k09L62k2l35K45
$$ -70 181 -280 -101 -98 229 0 -219 -100 116 -56 -137 -64 179 174 323 -166 -46 45 -164 198 176 -159 86
6576H6o8l04K20L58k27j77j91J41K77l31P8j65K03J69j47k12J75K79l04J01N7
$$ 86 18 -286 -66 292 65 -112 -303 -162 115 -216 -138 -303 -100 69 -78 -290 -115 164 -140 -39 18
6597A8l06J77K2K49m72L20q4N0j17N0J54P1j18j96J05J40j00J68k86M84m25q4
$$ 18 -288 -111 -89 160 -312 8 -76 -26 -143 -93 61 132 14 -182 -77 63 -37 131 -155 329 -96 -180
6619a80J38P9n0k04O32k67K73n56J50J66j66o6L19l81n7L73l26M3K80r5j79M4
$$ -180 -42 37 -13 -217 415 148 421 -135 15 181 15 -51 268 -113 -170 203 -123 -80 200 105 -74 -30
6641c0N7J61J81k44J01k24o0K14j39R2J79l16Q5p4L62k36j19j16J67l9l0k9j18
$$ -30 27 188 369 125 226 2 -58 156 17 109 288 -28 57 -17 345 109 -10 -126 41 2 -28 -57 -175
6664a75l1J47J42p2K13Q3m06j16M29q5j55n3k8R5j00K24k30%J84ML0l36o3L47
$$ -175 -206 -59 83 11 224 307 -99 -215 214 129 -26 -79 -107 -12 -112 112 -118 -118 66 70 100 -236 -299 48
6688D8o3J2j33J59J7j69J23j75L13l00J79Kj96J43j83J56R3k18k24K98J47jj50
$$ 48 -15 -3 -136 23 40 -129 -6 -181 132 -168 11 13 -183 -40 -223 -67 26 -192 -416 -118 29 28 -122
6711a22J5o2k18K29J76J18k05J27j22o4R6J65l37Q0Qp7K07o7r6K19l26L0J59k9
$$ -122 -107 -169 -387 -158 18 136 -69 58 -64 -128 -32 133 -204 -124 -116 -193 14 -53 -149 70 -256 -226 -67 -96
6735i6K08k58k2L5QM17k71J90j63j52k8P6J16j98M16k02k13N2J04K00j41k4RJ0
$$ -96 112 -146 -168 -133 -125 292 21 211 48 -104 -132 -56 60 -138 278 76 -137 -85 19 219 78 54 63 73
6759G3j71K21Q3L59k11k48j16J5L9P7J49j41o4Q7K2n1J15l41Q1P9j26J79j74J81
$$ 73 -98 123 206 565 354 106 -10 5 44 121 270 129 65 152 174 123 238 -103 -22 57 -69 110 -64 117
6783A17m8K66k99k13N13m35J69K16k86p2J86j60J38k12J20J27J58q1k25l0jJ43
$$ 117 69 335 36 -177 336 -99 70 286 0 -72 114 -46 92 -120 0 127 285 204 -21 -51 -52 91
6805I1K19m97L29j00j61L62k46M13l23j01K8J4o1J81l92Q2k26M95l84r1J2J02
$$ 91 310 -187 142 42 -119 243 -3 410 87 -14 14 28 -33 148 -244 -162 -388 107 -277 -368 -356 -254
6827b54N6o7M06l08K60j98K01p9K39l68j1P8J13k82K74n7L9l44J12L2K35j90J17
$$ -254 -198 -265 141 -167 93 -105 96 17 256 -112 -123 -45 68 -214 60 3 42 -302 -190 -158 77 -113 4
6850DN6O0m13J53O0j06K78o11M29k3q5K5M6K90j9k7qj6j8mk29K54j76J55J11l
$$ 4 60 120 -293 -140 -80 -186 92 -519 -90 -113 -198 -173 -127 163 144 117 109 93 75 71 -158 96 -80 75 186 183
6876A83q5j58J25j72N0P6n5LN9o1q1K02o1lk12J60J45L1j15J28Lr4m5j14K76J2
$$ 183 98 -60 65 -107 -57 19 -36 -33 26 -35 -116 86 25 22 -190 -30 115 146 31 159 162 68 23 -91 185 197
6902A97J21Jl96L28m19kJ3J30o6J55J37j86J25M0k77K89r9j08j00J86P6k29K22
$$ 197 318 319 -77 251 -168 -170 -157 -27 -93 62 199 13 138 178 -99 190 91 -17 -117 69 145 -84 138
6925A38k36J61J8j87K16r3k53K98J4l2j17Q2l04L75O8m6k13P0J3J15l63J60J47
$$ 138 -98 63 81 -106 110 17 -236 62 76 44 -73 9 -295 80 148 102 -111 -41 -28 87 -276 -116 31
6948C1j76k74K80j07L0J12j50K07l7j83J49R8J70l15K41O2m12J51J67j01q4R0
$$ 31 -145 -419 -139 -246 -216 -104 -254 -47 -84 -267 -118 -20 150 -165 76 138 -274 -123 44 -57 -141 -51
6970e1L66l24O6m1K6j87J91j44J22K21k63K64m39o2j6L10j51J88o4n9K21j26j45
$$ -51 315 -9 57 16 42 -145 46 -98 24 245 -18 246 -193 -255 -271 39 -112 76 12 -47 174 48 -97
6993i7K32k60O9K54l63O6L42n12L29k59Q8J49j6M5l97K22M25k60j4k67K05J54
$$ -97 135 -125 -56 198 -165 -99 243 -269 60 -199 -111 38 22 67 -330 -108 317 57 43 -224 -19 135
7015A35M4j55O3K78k80o2j29K48k50J43l2J37k87L28j2l41K26j80R0J74j13M4
$$ 135 179 24 87 365 85 23 -106 142 -108 35 3 140 -147 181 169 -172 54 -126 -36 138 25 69
7037F9K19m32lJ15j88N09J76l44J01j92J28n55L76K09k37J30l38M23Oj44j42n0
$$ 69 288 -144 -147 -32 -220 289 465 121 222 30 158 -397 -21 188 -49 81 -257 166 172 28 -114 -164
7059a64K9J02j88J92L70n13K38n07K97Q1rm0j08J97j11QR3J48j39L76k34j7l23
$$ -164 -135 -33 -221 -29 341 -172 66 -441 -144 -63 -72 -112 -220 -23 -134 -126 -33 115 -24 352 118 101 -222
7082b22J95R3l04pL03J4r0q4K46k26M1j17K38j28K72l28o1K02n12P05j32j56N3
$$ -222 -27 66 -238 -245 58 72 -18 -102 144 -82 -41 -158 80 -48 224 -104 -165 37 -475 230 98 -58 -5
7105eo3K1j65K37j71K69k19l2O3J73l98L41jj64K12O6m48L40j90K2J63l85J98
$$ -5 -68 -47 -212 25 -146 123 -96 -128 -65 108 -290 51 50 -114 98 164 -284 56 -134 -112 51 -334 -136
7128a36J05n7N7l7J41m4K61l35J15k27K57r6m2j04J11L32j24k37j2L39K7k62L82
$$ -136 -31 -88 -31 -68 73 29 290 -45 70 -157 100 4 -38 -142 -31 301 177 -60 -72 267 294 32 414
7151D14o90K35J85q5p9J66N3p3p4j64K75j47K93k29P0K81n13K37k81R6Q8m72L69
$$ 414 -276 -41 144 59 -20 146 199 126 52 -112 163 16 309 80 150 431 -82 155 -126 -30 58 -414 -45
7174d5m9pK4J54p8r7M2j73J49j7J54m57K83O5J44j70L2L0K1jk75L25p5j9k6K65
$$ -45 -94 -101 -77 77 -1 -98 -56 -229 -80 -97 57 -400 -117 -52 92 -78 -46 -16 5 4 -271 54 -21 -40 -66 199
7200A99j74L6j2l4k06L06j53QJ14k58J42k07J06L4p6J65L14m20O4k53L71k46R5
$$ 199 25 61 49 15 -191 115 -38 -30 84 -174 -32 -239 -133 -99 -175 -10 304 -116 -52 -305 66 -180 -85
7223h5J64K7k91M6K75m44N08k20M7k2j15J90o4j03R9J13k78J96M3J18j41k84K08
$$ -85 79 106 -185 -139 136 -308 200 -20 27 5 -110 80 16 -87 12 125 -153 43 86 204 63 -221 -13
7246a3j13m7K50nj00K0o4j71K5M4O6Q5M4k3Q1m8J04O4j92M4L3O6j24MK8j13K55
$$ -13 -126 -173 77 72 -28 -8 -72 -243 -218 -174 -108 -23 21 -2 79 31 135 199 7 51 84 150 26 30 58 -55 200
7273B00j85K53j66r7j62L05L2%j35j5j03o5J27R7k00J53L19l14k87J41N0l94K91
$$ 200 15 268 102 5 -157 148 180 180 45 30 -73 -138 -11 86 -114 39 358 44 -243 -102 -52 -446 -155
7296a55K3L67k75j14M29n65K88l04M28Rj04k17j35O15j78k75K89K64n62J96k70
$$ -155 -132 235 -40 -154 275 -290 -2 -306 122 131 27 -190 -325 290 112 -163 126 390 -172 24 -246
7317b46J31J30n4r1J90L3Rj75P2r4N5j33L30l21J72N4j31Mp0M24k50p7K6p2J99
$$ -246 -115 15 -39 -130 60 93 102 -73 -1 -95 -40 -173 157 -164 8 62 -69 -65 -135 289 39 -38 -12 -84 115
7342A15kl3k22kN9j1m4J07j9q9J20l10M16j70l3k19N72l01k22M51j0j81J13J5
$$ 115 113 80 -142 -144 -85 -96 -140 -33 -52 -141 -21 -331 85 -85 -118 -337 235 -66 -288 163 153 -28 85 100
7366A00k33N3J47m06K01L43Jk12J0J06j86J30j24J08k33O5j27L44p8l07K43M9
$$ 100 -133 -80 67 -339 -138 205 206 -6 4 110 -76 54 -70 38 -195 -130 -257 87 9 -298 -55 -6
7388fp6j3K17k06K87m50L63J00k44J56Q2j61L8l0J04j76PkK09l02K03m0L7k01
$$ -6 -82 -95 122 -84 203 -247 116 216 -28 128 210 49 87 57 161 -15 -8 -10 199 -103 100 60 97 -104
7412a04J2J13J23j11M5r1P3Q5k37J60M0j02M7j61K85O1k19j48J4K1o8J17K41k27
$$ -104 -92 21 144 33 78 -13 60 145 -92 68 108 6 53 -108 177 238 19 -129 -115 -94 -162 -45 196 -31
7436c1qK4PK13p3k68J61k98K62R4J8j38L28k69j26o9J39J03o2N9Q3J88l12k10
$$ -31 -39 -15 -8 205 132 -136 25 -273 -11 83 101 -37 291 22 -104 -173 -34 69 7 66 149 337 25 -185
7460a85J95l8K6k74K19K06j96j62J55n9K02k16K74l3Nk52P3j6L5k04K85k25P2
$$ -185 10 -28 -2 -276 -57 149 -47 -209 -54 -113 89 -127 147 114 119 -133 -60 -76 -41 -245 40 -185 -113
7483a13o4J67j12L07o04N02j55K01r3m6L20k39J24m84J33J34J74Km22K71k77J94
$$ -113 -177 -10 -122 185 -419 83 -72 129 36 -10 310 71 195 -289 -156 -22 152 154 -268 3 -274 -80
7505h0K53j29J42k13mK33n6K70l10Q2j53k55M64k15k15R5Q3N9j65Q8J15K5q0N1
$$ -80 173 44 186 -27 -31 202 146 416 106 188 35 -220 244 29 -186 -91 -8 51 -114 -26 89 114 34 85
7529H5l31K55J4n2K45k6l41M63j76qj23L40l42L59j94j26M8l14j80Q18n5l81O7
$$ 85 -246 9 23 -29 216 190 -151 312 136 128 5 345 3 362 168 42 90 -224 -404 414 359 -22 45
7552D5K80m07K05L9m26J55J43k2j28Q1k4J31k0J29k84K93J83l94n2L42k66Nj01
$$ 45 325 -82 123 162 -264 -109 34 12 -116 -35 -59 72 52 181 -103 190 373 -21 -73 269 3 8 -93
7575i3K50k22K0J79j10j30k67M84K7m3l7j58J91k22PN4r3L9r5K26l02L85k73K3
$$ -93 157 -65 -45 134 24 -106 -373 111 138 95 58 -100 91 -131 -124 -70 -163 -124 -219 7 -295 90 -183 -160
7599a60K9N2j20K07j48N3J00r5j70Q4J32l52O33k2n6r3p4J09j95j02K40K56r2
$$ -160 -131 -79 -199 8 -140 -87 13 -82 -252 -168 -36 -388 245 223 167 74 0 109 -86 -188 52 308 216
7622B16k05j4K61n04K40k6k6j99L79k8j36J66j38M82n93K21l57M94j40j38l6N6
$$ 216 11 -3 258 -246 -6 -32 -58 -257 122 94 -42 124 -14 468 -125 96 -261 233 93 -45 -81 -25
7644b5pQ4j52L53k55M08m03J23j32p2N0J0k10o3J85K39K14n98L82l56O25k37k76
$$ -25 -32 52 -100 253 -2 406 3 126 -6 -78 -28 -18 -228 -291 -106 133 347 -251 131 -225 400 163 -113
7667a13K35k51J32J03k33N05l00L6k51J60p1J18j92R4K26j66l7k24P8j5L96q8
$$ -113 122 -129 3 106 -127 378 78 114 -137 23 -48 70 -122 -28 198 32 -5 -229 -151 -166 230 142
7689A42j41j0R3K08k39k17n1K20L70m46j77P6J41O3j14J74l14L80o05L35J44j76
$$ 142 1 -9 84 292 53 -164 -215 5 375 -71 -248 -172 -31 32 -82 92 -222 158 -447 -112 32 -144
7711a44o7L34j21m06N42k45q4J56N0r3j52N4P0L28m41J75r7J47n4k20K69R8k14
$$ -144 -211 123 2 -404 138 -107 -191 -35 15 -78 -230 -176 -106 222 -219 -44 -141 6 -48 -268 1 99 -115
7734a15K3J55k03J26L1j90J96O5R4n1k1j11n7k8K75j12k38M04j81K24k80m0K16
$$ -115 -92 63 -140 -14 17 -173 23 88 182 131 110 -1 -58 -86 189 77 -161 243 62 286 6 -34 182
7757A82j86J3N4k83J66Q0P7j79J11Mk14J93M78m26j11j06J02J74j87qN06j97k35
$$ 182 -4 9 63 -220 -54 26 103 -76 35 39 -175 18 496 70 -41 -147 -45 129 -58 -66 440 243 8
7780HO9L46l73q1k5K03J83nm7j9k36Q6r7K21q6n3pJ34n5j2l6k64n5K70l14L8O02
$$ 8 77 423 50 -31 -56 147 330 325 278 259 23 109 12 233 147 94 87 221 166 154 118 -146 -201 69 -245 -207 395
7807C95n46K16L9nrPP8l60J2q5L47r7M7O9J8j62K23n1J70k52KJ1Qk1k2o4J85k98
$$ 395 -151 65 104 99 90 97 175 -185 -173 -258 89 -8 39 108 126 -36 187 136 306 54 56 67 75 54 32 -32 153 -145
7835a45J98J1o5O7j19J96N1l15j04M29l59p9J51J0J19j90K10P9l37q3K11k19j08
$$ -145 53 64 -1 66 -53 143 194 -121 -225 204 -155 -234 -83 -73 46 -144 66 145 -192 -275 -64 -283 -391
7858c91M89j40n9J52l27J58K0m9L31l5P0k75N6k21K04ok09r0J76L58j75KJ65k41
$$ -391 98 -42 -101 51 -276 -118 -98 -147 184 149 219 -56 0 -221 -17 -23 -232 -322 -146 212 37 39 204 -37
7882c7q3R2k59K95J78k62K58m00K89Q7j25p3R0K57l89L41k51J88j50q0L2J40J09
$$ -37 -120 -28 -287 8 186 -76 182 -218 71 158 33 -40 50 307 -82 259 8 196 46 -34 -2 138 247
7905B47j90p1J84l36J52J73l11K70l3m6J04J76l86J3P4k27K94l84M90l15R0K02
$$ 247 57 -14 170 -166 -14 159 -152 118 85 39 143 319 -67 -54 20 -207 87 -297 193 -122 -32 170
7927A70j07P8l43J18J3J20k10L18j88J33J84l08O8J87Pl89j24K32J50l57J97Q2
$$ 170 63 141 -202 -84 -71 49 -161 157 -31 102 286 -22 46 233 240 -149 -273 -41 109 -248 -51 31
7949C1J00l1j52n1R3k4K01j53j72M3R5N9j76K22Q6j34l0j02j16L34O2j98K54j47
$$ 31 131 100 -52 -103 -10 -34 167 14 -158 -115 -20 39 -137 85 171 37 7 -95 -211 123 185 -13 241 94
7973I4kj11P3K2k35M99k53L0k26K00J41r8k15P8K7QJ19j57j46J33Jk35J68k8O
$$ 94 92 -19 54 76 -159 340 87 117 -109 91 232 134 -81 -3 24 32 151 -6 -152 -19 -18 -253 -85 -113 -107
7998a07K89j51j59J01k4k59L10l05L59R3l10K62k15K42J1m18N06q1k93P2N6l3
$$ -107 182 31 -128 -27 -51 -310 0 -305 54 147 -163 99 -116 126 137 -281 225 144 -149 -77 -21 -54
8020e4L22k31J7q3P8K90l39q3K0K66j20j60n7j09K89J67m38K43P8J30L18o88J98
$$ -54 268 37 54 -29 49 339 0 -83 -63 203 83 -77 -134 -243 46 213 -225 18 96 226 544 -144 54
8043E4N6K9Nj48J1N7j53P5j30L10j28j4J94l76K8P6J24J12j47j89L89j94p4K9
$$ 54 110 139 144 -4 7 64 -89 -14 -144 166 38 24 218 -158 -130 -54 70 182 35 -154 235 41 -33 -4
8067dJ33j62M4K52m96L08q2k8j88K45J94l76K28L6j10o2N0r5K21j44q8R7j99J13
$$ -4 129 -33 11 263 -233 75 -7 -35 -223 22 216 -160 68 104 -6 -68 -18 -113 108 -36 -124 -27 -226 -113
8091a13K25j01j94J60J04k89L45L1M8j77q4k2K70l39J33k30K60l4j21J22j09K45
$$ -113 112 11 -183 -23 81 -208 137 168 216 39 -45 -67 203 -136 -3 -233 27 -7 -128 -6 -115 130
8113A30j17j1k3j27J13L73l81k2oO0K2J14j71j64J20n6K54Ll11K63PJ12K9j94
$$ 130 13 2 -21 -148 -35 338 -43 -65 -71 -11 11 125 -46 -210 -90 -146 108 111 -200 63 70 182 211 17
8137A7J79J21l76p3j86L16J96j34J91k90K15r2k99P9q1M02r4L2k48L38j38N8j47
$$ 17 196 317 -59 -132 -318 -2 194 60 251 -39 176 84 -215 -136 -217 185 91 123 -125 213 75 133 -14
8160a4j8K65n1Jk56P3j13J27k39L94j49K66l34J64k92L30k36J32L3j34J30P0m74
$$ -14 -32 233 182 183 -73 0 -113 14 -225 169 20 286 -48 116 -176 154 -82 50 83 -51 79 149 -325
8183c25L88Nl01L09L2k76K3K28
$$ -325 63 68 -233 76 108 -168 -145 83
8191H3
$$ Imaginary data points
##PAGE= N=2
##DATA TABLE= (X++(I..I)), XYDATA
0@%%%%%%%%%%qJ6j6J6k3L1l2M0m8N6o4P2q7J01j16J32j48J66j88K11k37K68l00
$$ 0 0 0 0 0 0 0 0 0 0 0 -8 8 -8 8 -15 16 -16 24 -24 32 -32 40 -47 54 -62 70 -78 88 -100 111 -126 142 -158
33a58L34l72M14m60N10n64O24o92P67q48R39j041J155j285J433j604J803k042
$$ -158 176 -196 218 -242 268 -296 328 -364 403 -445 494 -547 608 -677 756 -848 955 -1087
51a087K333k691L148l755M602n866P944j1934K2182r0247k18432K72228K09736
$$ -1087 1246 -1445 1703 -2052 2550 -3316 4628 -7306 14876 -75371 -293803 -21575 188161
64A88161j82554j50005J77246Q8456j91816q1374J93355P8608j57641o3848J23590
$$ 188161 5607 -144398 32848 121304 -70512 -151886 41469 120077 -37564 -101412 22178
75B2178K5176j00127J8896J13245l6945j30453J6265J24419J0040q6827j0418
$$ 22178 47354 -52773 -33877 79368 42423 -88030 -71765 52654 62694 -24133 -34551
86c4551N3836j2907n2080K2993O5129j2129p2927j0535O0736K1682m4697j6438
$$ -34551 19285 6378 -45702 -22709 42420 30291 -42636 -53171 7565 29247 -15450 -31888
98c1888L9712L741n1565l731O7080K0500n8349k6266L9305J1705k6477J7598L7058
$$ -31888 7824 11565 -40000 -43731 23349 43849 -14500 -40766 -1461 10244 -16233 1365 38423
111C8423l5647n3351L8421O3249k8410n1462K8265L0582m7219k5422O3458L4081
$$ 38423 2776 -50575 -12154 51095 22685 -28777 -512 30070 -17149 -42571 20887 54968
123E4968n7416k9388M3197J286n1663K1067P6587j9038q8470N642Q0941Q38o5081
$$ 54968 -2448 -31836 11361 12647 -39016 -17949 58638 39600 -48870 -43228 37713 38551 -26530
136b6530O381N4680j3702m8016J9561M5535j7151l4954J6590J7057k7827n926
$$ -26530 -20149 34531 20829 -27187 -7626 37909 20758 -14196 2394 19451 -8376 -14302
148a4302M9565J3990n9371l0186M9049L2664l8918k5994L6979K0529l9937k3968
$$ -14302 35263 49253 -10118 -40304 8745 41409 2491 -23503 13476 34005 -5932 -29900
160b9900L7230K6540k9997k5297K0594J6721j5018n988J7058j122k2618K499K4052
$$ -29900 7330 33870 3873 -21424 -830 15891 873 -5115 11943 10821 -11797 -9298 14754
173A4754k91j9590K970J2487j2422j3229K0954K1239k1309k8408J1517K3031p695
$$ 14754 14463 -5127 -2157 10330 -2092 -15321 5633 26872 5563 -22845 -11328 11703 4008
186D008j3945J1253J0263j8355j5320J4165J6171p485q925N357J555j0644J916
$$ 4008 -9937 1316 11579 -6776 -22096 -7931 8240 755 -8170 -2813 -1258 -11902 -9986
199i986J5764n04j9055l924J9250P549j3743n445J1569L93j6935j586K0185O785
$$ -9986 5778 5274 -13781 -17705 1545 9094 -4649 -10094 1475 1868 -15067 -16653 3532 10317
213A0317j6077p510J2611Q42j5005O85J9301N87j9805m80J9886j025k2562N24
$$ 10317 -5760 -13270 -659 183 -14822 -14137 5164 5751 -14054 -14534 5352 4327 -18235 -17711
227a7711K5653L338k1587l664J8948J339j7714J157J8990R07j6489j134J2147
$$ -17711 7942 11280 -10307 -13971 4977 6316 -11398 -10241 8749 9656 -6833 -7967 4180
240D180R94q252L387N578p951n564J0590P621j0998q311R351O455r035k645J2319
$$ 4180 5174 -3078 309 5887 -2064 -7628 2962 10583 -415 -8726 625 7080 -1955 -4600 7719
255G719K778j5360o662J3402R279o054k795N027l243q899N398J2230k457r939
$$ 7719 10497 -4863 -11525 1877 11156 5102 2307 7334 4091 -4808 590 12820 10363 424
269D24K538P612m497n428Q223L668j2636p354J3465J0743r090q630L366l01p616
$$ 424 2962 10574 6077 649 8872 12540 -96 -7450 6015 16758 7668 -962 2404 2103 -5513
284e513L742J4797P98j4138o336N080K943N87N643K190r148p222N300P447R92
$$ -5513 -1771 13026 13824 -314 -6650 -1570 1373 1960 7603 9793 645 -6577 -1277 6170 7162
299G162r05k141n910l646P559P450l016o108k080k434j244N913P715l290j0994
$$ 7162 6257 4116 -1794 -5440 2119 9569 6553 445 -1635 -4069 -5313 600 8315 5025 -5969
314e969n120K375M778O841L975p955j2178L39R081K366p22M769n01j3294m789
$$ -5969 -11089 -8714 -3936 2905 6880 -1075 -13253 -12914 -3833 -1467 -2189 2580 2079 -11215 -16004
329a6004J5061J0159r364q546M744J272n025N455J2055o700j7311n58J2892M108
$$ -16004 -943 9216 -148 -8694 -3950 -2678 -7703 -2248 9807 3107 -14204 -14762 -1870 2238
343B238j567L042m348j6155k442J8062R887j0134o193M646m379q118J0449J6857
$$ 2238 671 3713 -635 -16790 -19232 -1170 8717 -1417 -7610 -2964 -7343 -15461 -5012 11845
357A1845n783j8156r26J1436L378J39M924k206j3772k685J4442R431n029n478
$$ 11845 6062 -12094 -13020 -1584 1794 1933 6857 4651 -9121 -11806 2636 12067 7038 1560
371A560k397n558j459J2838J1053p972j3274k068M380J888N241P536l263j3435
$$ 1560 -837 -6395 -7854 4984 16037 8065 -5209 -7277 -2897 -1009 4232 11768 8505 -4930
385d930o738P622J1608M790m425r930n252O656R054J364l439j059m017o322M498
$$ -4930 -11668 -4046 7562 12352 7927 -2003 -7255 -599 8455 9819 6380 5321 1304 -5018 -520
400e20J5723L833j3823j1528K696O018K720N861L391r828j3174O89J1243O084
$$ -520 15203 19036 5213 -6315 -3619 2399 5119 10980 14371 4543 -8631 -7942 3301 9385
414I385l85l141q333p994O812J4282P89j1832m177M285j489j271J0575P392j2131
$$ 9385 9000 5859 -2474 -10468 -3656 10626 11415 -417 -4594 -309 -1798 -3069 7506 14898 2767
429B767j5872M482J4234L031l796m19m493j0804N50J5187P833r356r830q48Q98
$$ 2767 -13105 -8623 5611 8642 4846 4427 -66 -10870 -10320 4867 12700 3344 -6486 -7334 -6436
444f436L44P527P667p560j4468l46J1395M970l943q67m2n378m898P297J1907J36
$$ -6436 -6092 1435 9102 1542 -12926 -13272 -1877 3093 -850 -1717 -1759 -7137 -12035 -4738 7169 7305
460G305j2072q325L129Q236N684R06m451q142m001M784P034K742j640k904n097
$$ 7305 -4767 -13092 -9963 -1727 3957 4863 412 -7730 -11731 -6947 87 2829 1189 -1715 -6812
475f812m077L230R759L755p694p732K104M894J637K004L151n287j0018J549J3696
$$ -6812 -10889 -7659 2100 5855 -1839 -9571 -7467 -2573 -936 1068 4219 -1068 -11086 -9537 4159
490D159O675p707p905N44K707m12L303O558j371q326m317K666M387M635K361m751
$$ 4159 10834 3127 -4778 -4234 -1527 -1939 1364 7922 6551 -1775 -6092 -3426 961 5596 7957 3206
506C206q673j660Q847O758l024n302r53N54P8L056M075k73n034l483J686N302
$$ 3206 -5467 -7127 1720 8478 5454 152 -801 -247 -169 2887 6962 6689 1655 -1828 -142 5160
522E160L221j251l908j484k00j159K145O867K021q736q564L800Q936P56m753k716
$$ 5160 8381 7130 3222 1738 1538 379 2524 9391 11412 2676 -5888 -2088 6848 7604 2851 135
538A35O98N95J297j54l232N64N631j154q499N1J2806K680j4464o360J1377P758
$$ 135 833 1428 2725 2571 -661 -97 5534 4380 -4119 -4068 8738 11418 -3046 -9406 1971 9729
554I729p585m043O029r37p898K100P528k259o368L434L539o836m026Q052L376
$$ 9729 2144 -1899 4130 3193 -4705 -2605 4923 2664 -3704 -270 3269 -3567 -7593 459 3835
569C835p891j974N971q69o829M018P999o549p717O613P837p069o269P689M576
$$ 3835 -4056 -6030 -59 -928 -7757 -3739 4260 -2289 -10006 -3393 4444 -2625 -8894 -1205 3371
584C371p188k799O932M16n737K674N593o257p145O808P641o234n004N833R00q562
$$ 3371 -3817 -6616 316 732 -5005 -2331 3262 -2995 -10140 -3332 4309 -1925 -6929 -1096 -196 -8758
600h758N27R838J00p721K038M857n630n465Q260Q247n543p072K493K999o38L625
$$ -8758 -8231 1607 1707 -6014 -3976 881 -4749 -10214 -1954 6293 750 -6322 -3829 -830 -1468 2157
616B157K366p193l644Q444N275r073l260R852K278j2025l540J2434O284p852n823
$$ 2157 4523 -2670 -6314 2130 7405 -1668 -4928 4924 7202 -4823 -8363 4071 10355 2503 -3320
631c320J219K40J990N822o6q584p32P516n70o617M577Q538o129j1447N751J1691
$$ -3320 -2101 -1861 129 5951 5885 -2699 -3431 4085 3515 -3102 1475 10013 3884 -7563 -1812 9879
647I879j841p405K113J466n970J373J0742K21j0290j884N081k303j594R228M102
$$ 9879 8038 633 2746 4212 -1758 -385 10357 10578 288 -1596 3485 1182 -412 8816 12918
662A2918j3338r410R578Q708m849k724N335l150j0174J662J2322J608p800j036
$$ 12918 -420 -9830 -252 8456 3607 883 6218 3068 -7106 -5444 6878 8486 686 -350
676c50J268n224K84J1294L814j1988p870P007N404j772Q41K135n699p362M298
$$ -350 918 -4306 -4022 7272 11086 -902 -8772 -1765 3639 1867 2708 4843 -856 -8218 -3920
691c920P353q40k365J999m244q263K218J2807L150j0092o821K310L470K272K991
$$ -3920 3433 2593 228 2227 -2017 -10280 -8062 4745 7895 -2197 -9018 -6708 -3238 -966 2025
706B025j211n955k168L984J673n07L796J479q299p561O965J1426L99q715m311
$$ 2025 814 -5141 -7309 -3325 -1652 -2159 1637 3116 -5183 -12744 -5779 5647 6046 -2669 -6980
721f980O85O98L310N083P2n521l789l52J475N232O004l110j0949l069Q896O834
$$ -6980 -6295 -5597 -2287 2796 2868 -2653 -6442 -6794 -5319 -87 5917 2807 -8142 -11211 -2315 4519
737D519k450k809M81k810m281L639R054J688o303o074o36L318N852N010k775r106
$$ 4519 2069 -740 -259 -3069 -7350 -3711 5343 7031 728 -5346 -5982 -2664 3188 8198 5423 -3683
753c683l124M837N567J053q30j107l510l872K113O815L903k776o381l543J991
$$ -3683 -6807 -1970 3597 4650 3820 2713 -797 -4669 -2556 4259 8162 5386 -995 -4538 -2547
768b547N701N112j044o003m647J634N432L105p82k988k430j910J252L945L353
$$ -2547 3154 8266 7222 1219 -3428 -1794 3638 6743 5961 2973 543 -1367 -115 3830 7183
783G183o95m619m126j71M062N268Q52n513n799J253N179K033o98j209j788l785
$$ 7183 6488 1869 -2257 -2428 1634 6902 7754 2241 -3558 -2305 2874 4907 4209 3000 1212 -2573
799b573j53N430M750k662o135k604J946K886L168J177l479m665r59J952K012L373
$$ -2573 -2726 2704 7454 4792 -1343 -3947 -2001 885 4053 5230 1751 -2914 -3873 -1921 91 3464
815C464J819n025q302O68Q708L974m268m005k93j017k47M084L531k872m386j37
$$ 3464 5283 258 -8044 -7376 1332 5306 1038 -2967 -3260 -4277 -4524 -440 3091 219 -4167 -4304
831d304Q23l51L134M320k866p958r83O673L713k546k172n66j574k25M083K350
$$ -4304 -3481 -3832 -698 3622 756 -7202 -8185 -1512 2201 -345 -2517 -3083 -4657 -4882 -799 1551
847A551l093k681O21M19m67K228K845j923m713N31K910J520q33J080j479l582
$$ 1551 -1542 -4223 -3602 -3183 -3650 -1422 1423 -500 -5213 -4682 -1772 -252 -1085 -5 -1484 -5066
863e066O74N902K165m152l382J207J852J42J779J804j647l604n38K188K063Q72
$$ -5066 -4392 1510 3675 -477 -3859 -2652 -800 -658 1121 2925 1278 -2326 -2864 -676 1387 2259
879B259K99k110k527N92K497J139L13j99j410k676J440M708O41m200j496K520
$$ 2259 2558 448 -2079 -1487 1010 2149 2462 2263 853 -1823 -383 4325 4966 766 -730 1790
895A790J155j863K12K867l86k521l27J069J21N73J474j203l432J326L865l22m076
$$ 1790 2945 1082 1294 4161 3775 1254 927 1996 2117 2690 4164 2961 -471 855 4720 4398 322
912C22J32L145n98k348J140J938k117k062K927J680l451j521K829Q78k545m12
$$ 322 454 3599 3001 653 1793 3731 1614 -448 2479 4159 708 -813 2016 2894 349 -63
928f3K332j48l070J159K061k275j008K739O54m019j606M664J601m516j416K948
$$ -63 2269 2121 -949 210 2271 -4 -1012 1727 2381 -1638 -3244 1420 3021 -1495 -2911 37
944C7J517k839n27J587j096j471J339J897k132p04K046j015k422J605L006j994
$$ 37 1554 -1285 -1812 -225 -1321 -2792 -1453 444 -1688 -2392 -346 -1361 -3783 -2178 828 -1166
960a166k808J280J736j878m44L653L50n222j796M955K833k896j978J026j61j338
$$ -1166 -3974 -2694 -958 -2836 -3280 373 723 -4499 -6295 -1340 1493 -1403 -3381 -2355 -2516 -3854
976c854J857K480j300j835J66o0r81J968L266j272m856n3L244J308K07M29q46
$$ -3854 -1997 483 -817 -2652 -2486 -2546 -3527 -1559 1707 435 -4421 -4474 -1230 78 285 714 -132
993a32l418m37L800K694j467j474p18r81M80K703K206j652k388n49M25J034K648
$$ -132 -3550 -3987 -187 2507 1040 -434 -1152 -2133 -1653 1050 3256 1604 -784 -1333 -908 126 2774
1010B774J753k765m154M10L758K197j69j397k447j331J942L133R21j432j576j242
$$ 2774 4527 1762 -2392 -1982 1776 3973 3804 2407 -40 -1371 571 3704 4625 3193 1617 375
1026C75j518J158M852J892m271m249N27L762J267M85l19k132l689M21M045L176
$$ 375 -1143 15 4867 6759 2488 -1761 -1234 2528 3795 4280 3961 1829 -1860 -1439 2606 5782
1042E782j093l294k745m53L342L201K11k565l119r83J55K949L162O78m509m609
$$ 5782 4689 1395 -1350 -1803 1539 4740 4951 2386 -733 -1716 -1561 1388 4550 5228 719 -3890
1058c890O12M209L665q08m026k700J63J628J666J748N24l364m293M3N060L495
$$ -3890 -3278 931 4596 3788 -238 -2938 -2775 -1147 519 2267 2791 -573 -4866 -4823 237 3732
1074C732j117m298k532l7J999L264K029k668m406j170J557K838K861K43m392m567
$$ 3732 2615 -1683 -4215 -4252 -2253 1011 3040 372 -4034 -5204 -3647 -809 2052 2295 -2097 -6664
1090f664J137M842K378j313j887j172k498k99M414M558k073n720k254K247L913
$$ -6664 -5527 -685 1693 380 -1507 -2679 -5177 -5476 -1062 3496 1423 -4297 -6551 -4304 -391
1105c91K617p99l572k919O38L293J763J031R5k790m869P71N829L605k166m024
$$ -391 2226 1427 -2145 -5064 -4426 -1133 630 1661 1756 -1034 -5903 -5132 697 4302 2136 -1888
1121a888j842J04J992L560K239l359l537m53J719K591K970k16m552l481K639M150
$$ -1888 -3730 -3626 -1634 1926 4165 806 -2731 -3184 -1465 1126 4096 3880 -672 -4153 -1514 2636
1137B636N56q52J08j418m066P09O091L702m056m796j10J557K128K824K6m115l302
$$ 2636 3192 2340 2448 1030 -3036 -2327 3764 7466 3410 -1386 -1496 61 2189 5013 5039 924 -2378
1154b378K454K570j48N66J093k592m636J374O143J521l372k556j09m26R65L628
$$ -2378 76 2646 2498 3064 4157 1565 -3071 -1697 4446 5967 2595 39 -70 -496 469 4097
1170D097J905l888m074J163J822J373J687l15m119k783K690L593j191j476J419
$$ 4097 6002 2114 -1960 -797 1025 2398 4085 3770 -349 -3132 -442 3151 1960 484 1903
1185A903l04m640p11N757K925m237l933J90K143J918J023j274l341r9K377P1j401
$$ 1903 1599 -3041 -3752 2005 4930 693 -3240 -3050 -907 1011 2034 760 -2581 -2680 -303 -232 -1633
1202a633K222K125l925m547K969N163j054l820Q47Q44k342p07L797J929l586k630
$$ -1633 589 2714 -1211 -5758 -2789 2374 1320 -2500 -1653 -809 -3151 -3858 -61 1868 -1718 -4348
1218d348J751J410j169J708n0k845j028L229J249k540J0K667n05m064Q87M338
$$ -4348 -2597 -1187 -2356 -648 -698 -3543 -4571 -1342 -93 -2633 -2623 44 -461 -4525 -3638 700
1234G00O86k971r30J195k11k24K274O33l309o73K905O18k202n0K348n12j809P01
$$ 700 1386 -1585 -2515 -1320 -1531 -1755 519 1152 -2157 -2830 75 693 -1509 -1559 789 277 -1532 -831
1252h31J242m63m83J424m83j971J065K929o26k756O3K148O46j449R02L25r59M43
$$ -831 411 -52 -535 889 406 -1565 -500 2429 1803 -953 -890 1258 1904 455 1357 1682 723 1166
1270A166J079o51j965J629K421j207k826O87K543r06j537J108J788j654j743J104
$$ 1166 2245 1594 -371 1258 3679 2472 -354 333 2876 1970 433 1541 3329 1675 -68 1036
1286A036O84k97K27M76k94j338M24J094j53J7p3m69j191M86K459L37k483j593
$$ 1036 1720 1423 1650 2126 1832 494 918 2012 1859 1876 1803 1334 143 629 3088 3425 942 -651
1304f51Q50J412k46p2P39j103j655m29O79R45J096r9j527k326J47K952J575j971
$$ -651 199 1611 1365 1293 2032 929 -726 -1155 -476 469 1565 1466 -61 -2387 -2240 712 2287 316
1322C16k360K6J317Q08m37j87j21l10j072M18J086J072l64k175j502R89J771J408
$$ 316 -2044 -2018 -701 107 -330 -517 -638 -948 -2020 -1602 -516 556 192 -1983 -3485 -2496 -725 683
1340F83l34k339j346n1J300J754R68k034j751o75J433J653N88k89j393j617M04
$$ 683 349 -1990 -3336 -3387 -2087 -333 635 -1399 -3150 -3825 -2392 -739 -151 -440 -1833 -3450 -3046
1357c046K254K205r42j937j018m32R98K001J632n84k948k017P44K747K620j10
$$ -3046 -792 1413 471 -1466 -2484 -2916 -1918 83 1715 1131 -1817 -3834 -3090 -343 2277 2167
1373B167l074k784J288K690O80n38j38J13j502j711K384L477Q1l112k563J324
$$ 2167 -907 -3691 -2403 287 967 429 291 404 -1098 -2809 -425 3052 3133 21 -2542 -1218
1389a218K474J979j90k106j788M4K180J328J02j94j721j841K58K964K101j271
$$ -1218 1256 3235 3045 939 -849 -805 1375 2703 2805 2611 890 -951 -693 2271 4372 3101
1405C101k171j001n97J069K305J938k176l576n99K520J907R11o00k072k188J99
$$ 3101 930 -71 -668 401 2706 4644 2468 -1108 -1707 813 2720 3631 3031 959 -1229 -1030
1421a030L347J827j134j712j255p48NL159K781k141l897j245J610J307J020J448
$$ -1030 2317 4144 3010 1298 43 -705 -700 2459 5240 3099 -798 -2043 -433 874 1894 3342
1437C342j362m762q74L373K860q68j894j035j000M68J828J850j507j817q54M41
$$ 3342 1980 -2782 -3656 -283 2577 1709 -185 -1220 -2220 -1752 76 1926 419 -1398 -2252 -1811
1453a811q9K294K560j921m619j197L906K983j071j679j485o89P3J520J953m71
$$ -1811 -1900 394 2954 1033 -3586 -4783 -877 2106 1035 -644 -2129 -2818 -2745 -1225 728 257
1469B57k062j147o07P31K551J700j954l250n55K292J360P54J85j687k500j18L343
$$ 257 -1805 -2952 -3559 -2828 -277 1423 -531 -3781 -4336 -2044 -684 70 255 -1432 -3932 -4050 -707
1486g07K303o71j725j736l70Q49L006J223k089j462m33l81P14K852J643k721l317
$$ -707 1596 925 -800 -2536 -2906 -2057 949 2172 83 -1379 -1812 -2193 -1479 1373 3016 295 -3022
1503c022K31K736J456n21k02j348j110M84L073P66j563j361m4m55Q18K653J583
$$ -3022 -2791 -55 1401 880 678 -670 -1780 -1296 1777 2543 980 -381 -425 -880 -62 2591 4174
1520D174k695k439N66J613N90P69J114j422l007n04L598J609j801j744l0L74k15
$$ 4174 1479 -960 -394 1219 1809 2578 3692 2270 -737 -1241 2357 3966 2165 421 391 765 550
1537E50J452L07o25j309o2q5P89J653P17k556k225P74K877J058j689n08j60q24
$$ 550 2002 2309 1684 375 313 228 1017 2670 3387 831 -1394 -620 2257 3315 1626 1118 958 134
1555A34m70J724J299r87j228p28n1Q42Q12L1j582p88Q20j01k32P94M00j507j886
$$ 134 -336 1388 2687 1700 472 -256 -307 535 1347 1378 -204 -992 -172 -273 -505 289 689 -818 -2704
1574b704J097K093P91j731r97K34j46K67O67J29m8k35m28p66K4J396P31j745j204
$$ -2704 -1607 486 1277 -454 -1451 -1217 -1363 -1096 -429 -300 -348 -583 -1011 -1777 -1753 -357 374 -1371 -2575
1593b575J131Q59n53p61M76M99o39m12M74O66o50k18m1M66K04O1p2m66N56J54
$$ -2575 -1444 -585 -1138 -1899 -1423 -924 -1563 -1975 -1501 -835 -1485 -1703 -1744 -1278 -1074 -1013 -1085 -1551 -995 -841
1613h41n13l97J181P38q51q07N85O97R3o11l12J024L75n96q15k62J272O46k93
$$ -841 -1354 -1751 -570 168 -683 -1490 -905 -208 -115 -726 -1038 -14 361 -235 -1050 -1312 -40 606 313
1632C13j133N87O23O5p58k41J022J02n02J17R05L23k58n09m0J1J065K70nk80r74
$$ 313 -820 -233 390 455 -303 -544 478 580 78 195 1100 1423 1165 656 616 627 1692 1962 1957 1677 703
1653G03l93K44J248J087o31j787o69J323L51P3k07j73k74n7m24K59J103N72j236
$$ 703 310 554 1802 2889 2258 471 -198 1125 1476 1549 1342 1169 895 838 414 673 1776 2348 1112
1672A112j788R87J589J121j291j489L92Q1oQ36O28p43j460m51N07J094K14K77
$$ 1112 -676 311 1900 3021 1730 241 633 714 708 1544 2172 1429 -31 -482 25 1119 1333 1610
1690A610j417j246k25J088O82Q5r3j162j363J09K504J106j717k136M44J317K99
$$ 1610 193 -1053 -1278 -190 492 577 484 -678 -2041 -1932 572 1678 -39 -2175 -1731 -414 -115
1707a15J44O91p64j352o24R68R90Q50j4k183k049Q10K524J053j319j371l40o22
$$ -115 29 720 -44 -1396 -2020 -1052 -62 788 774 -1409 -3458 -2648 -124 929 -390 -1761 -2101 -2723
1725b723M65J792J043j257k490K09J365N20Q75K04j173j679M45J754J189J65n67
$$ -2723 -2258 -466 577 -680 -3170 -2961 -1596 -1076 -201 3 -1170 -2849 -2404 -650 539 704 137
1742A37k029j347J257L404J284k304k290N6R36K57J183J328j624k079j90J299
$$ 137 -1892 -3239 -1982 1422 2706 402 -1888 -1832 -896 -639 544 1872 248 -1831 -2021 -722
1758g22J203R91j18k060j853J135K938Q31j161j328l90m56J173K611Q11k226k462
$$ -722 481 1472 1354 -706 -2559 -1424 1514 2345 1184 -144 -534 -990 183 2794 3605 1379 -1083
1775a083O66J727M11O72M47j309k304j67K241J450J26r43j902j297J093K848P36
$$ -1083 -417 1310 1721 2393 2840 1531 -773 -940 1301 2751 2877 1934 32 -1265 -172 2676 3412
1792C412k246j794L18N88R46J176k7j382j846L68J358J206M64n20k050j571J456
$$ 3412 1166 -628 -310 278 1224 2400 2373 991 -855 -487 871 2077 2541 2021 -29 -1600 -144
1809a44K094R06r27j520j239o59J792K052j63k340j564O52P57K94O30L08j592
$$ -144 1950 2856 1929 409 -830 -1489 303 2355 2192 -148 -1712 -1060 -303 -9 621 929 -663
1826f63j473O36J580Q35k08j382j074j161J834K430M5j910j235j22J19J135J345
$$ -663 -2136 -1500 80 915 707 -675 -1749 -2910 -1076 1354 1399 -511 -1746 -1868 -1749 -614 731
1843G31J0k001j230Q52O75O18j05j08r60j119L92J405R70p86j294p82K04J781
$$ 731 741 -1260 -2490 -1638 -963 -345 -450 -558 -1518 -2637 -2245 -840 130 -656 -1950 -2732 -2528 -747
1861g47J696q30j895r84Q87J017N87M56J32j251r39R7J519Q77K2o09j529l73Q95
$$ -747 949 119 -1776 -2760 -1873 -856 -269 187 319 -932 -1871 -1774 -255 622 644 35 -1494 -1867 -972
1880i72K058m15q15p53o4N74P55O67m16j375n77J505K30L93K57kn87r33L00J549
$$ -972 1086 671 -144 -897 -961 -387 368 1035 619 -756 -1333 172 402 795 1052 1050 463 -470 -170 1379
1900A379Q55q44p47q36Q31P55M75k87o12o47K29Q50kj04j33l37q45N90O40N99
$$ 1379 2234 1390 643 -193 638 1393 1868 1581 969 322 551 1401 1399 1295 1162 825 -20 570 1210 1809
1920A809q27m29M32m87K74P20O21m32j501n99J148J138j29o31o10O6J26n6k47
$$ 1809 982 553 985 498 772 1492 2113 1681 180 -419 729 1867 1738 1107 497 563 689 633 386
1939C86J64m0K20o32r04P62Q67m33j353j3O95N77m20n96L90l66K16O1l56J58M95
$$ 386 550 510 730 98 -806 -44 823 390 -963 -976 -281 296 -124 -720 -330 -696 -480 -419 -775 -617 -122
1960a22J31m37m14J71J99k84M26J99p21m90M22J22M1n13J39L79j70q82O2N89K28
$$ -122 9 -428 -842 -671 -472 -756 -330 -131 -852 -1342 -920 -798 -757 -1270 -1131 -752 -922 -1804 -1742 -1153 -925
1981i25k74j07l01j30Q94N79r34o72O66J002m23j34K78p3l73O6M63N78k92J03
$$ -925 -1199 -1306 -1607 -1737 -843 -264 -1198 -1870 -1204 -202 -625 -759 -481 -554 -927 -861 -398 180 -112 -9
2001ik89m12m73O88J190k26r16k33o0J44O32O97o90r20M87J303k7j146N99O76
$$ -9 -298 -710 -1183 -495 695 469 -447 -680 -740 -596 36 733 43 -877 -390 913 886 -260 339 1015
2021A015p52o25O21J330M39q62j010m14O83J431N40j033j323L88O13k49K89P88
$$ 1015 263 -362 259 1589 2028 1166 156 -258 425 1856 2396 1363 40 428 1041 792 1081 1869
2039A869l75j284m66J165R73n33p47J96l82l50P83J345m62j332l83K4Q01R43L17
$$ 1869 1494 210 -256 909 1882 1349 602 798 416 66 849 2194 1732 400 17 41 842 1785 2102
2058B102j126j600K0J883N56r29M3R0j265q46R66J502M96j578r71l32P19N42O32
$$ 2102 976 -624 -604 1279 1835 906 949 1039 -226 -1072 -106 1396 1892 314 -657 -989 -270 272 904
2077I04o16j561m66J013Q96j8L70r69j262j23J751N79n9r92k64p17l25J295J452
$$ 904 288 -1273 -1739 -726 170 152 522 -447 -1709 -1832 -81 498 439 -553 -817 -1534 -1859 -564 888
2096H88l83j461j519K94J312J228k92j543r36O19J181L2l29L35n39j375m8J879
$$ 888 505 -956 -2475 -2181 -869 359 67 -1476 -2412 -1793 -612 -580 -909 -574 -1113 -2488 -2536 -657
2114f57J573p37j253j146M06M32J776R09j536j327p6P47R81O94L14j479j408L65
$$ -657 916 179 -1074 -2220 -1814 -1382 394 1303 -233 -1560 -1636 -889 92 786 1100 -379 -1787 -1422
2132a422J797R65r70n24J2o19l30J313J563m62k076m79P16J021J246k07j165j451
$$ -1422 375 1340 370 -154 -142 -761 -1091 222 1785 1323 -753 -1232 -516 505 1751 1544 379 -1072
2150a072P91J120N20J94l62l15j300j23J729J229k63j446o28l27J265N05O61j018
$$ -1072 -281 839 1359 1553 1191 876 -424 -547 1182 2411 2148 702 74 -253 1012 1517 2178 1160
2168A160j291l72R81J183P95p89j837n89J072J079N94k15q33o62p17K53J492J096
$$ 1160 -131 -503 478 1661 2456 1667 -170 -759 313 1392 1986 1771 938 276 -441 -188 1304 2400
2186B400o45j734r99L99J931M54l92j225j065L86P66L59K26J20j234j003N08Q20
$$ 2400 1755 21 -978 -579 1352 1806 1414 189 -876 -490 276 635 861 981 -253 -1256 -748 72
2204G2J020q40p32o36k62Q19P94J57p00j163J71J53J304N52q85j099m96O91N29
$$ 72 1092 252 -480 -1116 -1378 -559 235 392 -308 -1471 -1300 -1147 157 709 -176 -1275 -1771 -1080 -551
2223e51J35K60o92k4q32J1J251N35n91q92p48N71J039L46k78j119j72pP67R82
$$ -551 -416 -156 -848 -872 -1704 -1693 -442 93 -498 -1390 -2138 -1567 -528 -182 -460 -1579 -1751 -1758 -991 -9
2243iJ71m68r09j56L80M37O79N2l42p42j82L74J092M09m14j293l71O41J328n9
$$ -9 162 -306 -1215 -1371 -991 -554 125 177 -165 -907 -1089 -715 377 786 372 -921 -1292 -651 677 618
2263F18o25o43O8O01Kl3L57M26q56k12L01N28N37O4p11m59L48R62j31jn21K54
$$ 618 -7 -650 -582 19 21 -12 345 771 -85 -297 4 532 1069 1133 422 -37 311 1273 1142 1141 620 874
2285H74l17O5N35j5k43O8J72k30j18J44K72O1q56l32P94k02N59j87j83m55J18
$$ 874 557 622 1157 1142 899 967 1139 909 791 935 1207 1268 412 80 874 672 1231 1044 861 406 524
2306E24O47l8q06J70M44p0k65l28N88J02n06q8m55J59R8K47J04p70j23M74K03
$$ 524 1171 1133 327 497 941 871 606 278 866 968 462 374 -81 78 176 423 527 -243 -366 108 311
2327C11m85L0J16l10n02M32O13o59q4L38l06q77L84Q42M14l38n36l97K31L18L85
$$ 311 -174 -144 -28 -338 -840 -408 205 -454 -538 -200 -506 -1383 -999 -157 257 -81 -617 -1014 -783 -465 -80
2348h0l65l18m57M60q0m74P15M83p36m24N6K26N65j04m8n44n92N43J035L4n59
$$ -80 -445 -763 -1220 -760 -840 -1314 -599 -116 -852 -1276 -1220 -994 -429 -533 -581 -1125 -1717 -1174 -139 -105 -664
2369f64o16k3M06M13L55J6n75j82P5L7M13R83m7p05j105L20J101M62q10j61k00
$$ -664 -1280 -1303 -897 -484 -129 -113 -688 -870 -795 -758 -345 638 591 -114 -1219 -899 202 664 -146 -307 -507
2390e07j83N18P42L82q35m64o6O9M52R04r7l50n71k82Q24O79L94n84n67p14N61
$$ -507 -690 -172 570 952 117 -347 -413 -344 108 1012 915 565 -6 -288 536 1215 1609 1025 458 -256 305
2411C05J109N64r34n41k47J50N71M29jk76l34r19N05N23P58k7j271p13J05J344
$$ 305 1414 1978 1044 503 256 406 977 1406 1405 1129 795 -124 381 904 1662 1635 364 -349 -244 1100
2431A100O59n08p46n26j79K11R97O23p78p27n11M57M87M36J07m61r40m74N55R33
$$ 1100 1759 1251 505 -21 -200 11 1008 1631 853 126 -385 72 559 995 1102 641 -299 -773 -218 715
2451G15N50j011r80p13Q73R43M42q08r18m73O93J74M18J3j24r21l96P44P55M63
$$ 715 1265 254 -726 -1439 -566 377 819 11 -907 -1380 -687 -513 -95 -82 -206 -1127 -1523 -779 -24 439
2471D39l90j008q81O19R55L53k58r02q48L5J002O41M98j182n95j64O54O92J76
$$ 439 49 -959 -1840 -1221 -266 87 -171 -1073 -1921 -1886 -884 -243 255 -927 -1522 -1686 -1032 -340 -164
2490a64k37o76k68k84P86R51Q21j036j340k85Q97J322J1n94q29MM23L80L38K11
$$ -164 -401 -1077 -1345 -1629 -843 108 929 -107 -1447 -1732 -835 487 498 -96 -925 -921 -498 -118 220 431
2510D31l12r49l9N65Q82K28l74r44m17M74Q87O04m4r78n13%J127J69L94n81j076
$$ 431 119 -830 -869 -304 578 806 432 -512 -929 -455 432 1036 992 14 -499 -499 628 797 1191 610 -466
2531d66K38J048K55J59k85k96m65l6O92R62J89j031j096R1Q88O36k5o57r79K90
$$ -466 -228 820 1075 1234 949 653 188 152 844 1806 1995 964 -132 -41 847 1483 1458 801 -178 112
2551A12N40K12J53J03J4j259j34M99P45N23j038n19j02O5P71L88l59m71n45k20
$$ 112 652 864 1017 1120 1134 -125 -259 240 985 1508 470 -49 -151 -86 685 1073 714 243 -302 -522
2571e22J349J14J7r25o58L87J08K60m3K95m99j27q82M78J002K53r14o37k97O02
$$ -522 827 941 958 33 -625 -238 -130 130 87 382 -117 -244 -1126 -648 354 607 -307 -944 -1241 -639
2591f39R17j63o21l56q8K84J29J89M45m36r77J31N96O41m43n21L22j66m14M64
$$ -639 278 115 -506 -862 -950 -666 -537 -348 97 -339 -1316 -1185 -589 52 -391 -912 -590 -756 -1170 -706
2611g06M85R0r71P7j26N47L44k16l18m39N49K92J31o87O83j2o23k07N90P43j80
$$ -706 -221 -131 -1102 -1025 -1151 -604 -260 -476 -794 -1233 -684 -392 -261 -948 -265 -277 -900 -1107 -517 226 46
2632D6p36oJ57K47L16J37J16p04L73J4l58O22J26J24o10k36O09J16j27J98K5M8
$$ 46 -690 -696 -539 -292 24 161 277 -427 -54 -40 -398 224 350 474 -136 -372 237 353 226 424 449 497
2654D97q08P82L36Q8m58j42KJ21K43J00K08m60M25J97q01K2M84M23n75n24K56
$$ 497 -311 471 807 895 437 295 297 418 661 761 969 509 934 1131 330 352 836 1259 684 160 416
2675D16N31q1l10J45K42k36j83R2K72J5jm30j55J3K36m8J22m63J68j49o3N44R9
$$ 416 947 866 556 701 943 707 524 616 888 903 902 472 317 330 566 518 640 177 345 196 133 677 776
2698G76m08n91j57P05K66k26j71n75K94m5j33J83J6L53o54m84K55O21J48l75q24
$$ 776 368 -223 -380 325 591 365 194 -381 -87 -132 -265 -82 -66 287 -367 -851 -596 25 173 -202 -1026
2719a026K89K32K62L12j10m00m00k07O07J4K46j69k04m53N8M66J63r0l8k23n19
$$ -1026 -737 -505 -243 69 -41 -441 -841 -1048 -441 -427 -181 -350 -554 -1007 -949 -483 -320 -410 -448 -671 -1190
2740a190N08K28M50o83l64qN38l8p7P15n29l14K5J31N09L02k97m03k81r7Q39O82
$$ -1190 -682 -454 -4 -687 -1051 -1059 -521 -559 -636 79 -450 -764 -739 -608 -99 203 -94 -497 -778 -875 -36 646
2762F46l39o86k27K53N03M10K56o62n44j03O82L48o7P2m26k35L3M57N37L42n00
$$ 646 307 -379 -606 -353 150 560 816 154 -390 -493 189 537 470 542 116 -119 -86 371 908 1250 750
2783G50p38m40P23O35M13p48o30k46O60M79N13o59j52j55n88N51O91N0j50p85
$$ 750 12 -428 295 930 1343 595 -35 -281 379 858 1371 712 560 405 -183 368 1059 1109 959 174
2803A74l57N37M02P88l55p78q86O59L27P24k49m10p13J70K02M50j63l4p08J00
$$ 174 -183 354 756 1544 1189 411 -475 184 511 1235 986 576 -137 33 235 685 522 488 -220 -120
2823a20J29j54J075J44n87r14k26M27R00j01n96m76k09K61K55P54l42n94l45l1
$$ -120 9 -145 930 1074 487 -427 -653 -226 674 573 -23 -499 -708 -447 -192 562 220 -374 -719 -750
2843g50K19Q46k88r9q37m26L47R09O5k36m18m44N0O75L43lr27l74K45K71O31p1
$$ -750 -531 315 27 -72 -909 -1335 -988 -79 -14 -250 -668 -1112 -1062 -387 -44 -47 -974 -1348 -1103 -832 -201 -272
2865b72l03M15q52l39O98P90K96r47l93k57N54Q31p0j55p55k22O20N2L88j58l72
$$ -272 -575 -160 -1012 -1351 -653 137 433 -514 -907 -1164 -610 221 151 -4 -759 -981 -361 -309 79 -79 -451
2886d51k89k7M22M89K27l38k88m26N08K69M71Q8p72n69K39J027L39l27l32k56
$$ -451 -740 -767 -345 144 371 33 -255 -681 -173 96 567 655 -117 -686 -447 580 919 592 260 4
2906Dj15J49K45M71K46n73l47m5O69K59K20m55o80k1K99N29J71l93m86J09K37
$$ 4 -111 38 283 754 1000 427 80 35 704 963 1183 728 48 27 326 855 1026 633 147 256 493
2927D93L65M44l85j008K62J25M93k42K38Pl60m46N09J03M01k9r12k06J99L99N48
$$ 493 858 1302 917 -91 171 296 789 547 785 792 432 -14 495 598 999 970 58 -148 51 450 998
2948I98m65k48k63q1J22K34j25M74q26p3J48p3K47J30j64l04Rk52M12M59m84m98
$$ 998 533 285 22 -59 63 297 172 646 -180 -253 -105 -178 69 199 35 -269 -260 -512 -100 359 -125 -623
2970f23Q1J64K43j78J4k22j27K69k05l8L95L4k39k81J52j90N94j00n63l7K32K94
$$ -623 -542 -378 -135 -313 -299 -521 -648 -379 -584 -622 -227 -193 -432 -713 -561 -751 -157 -257 -820 -857 -625 -331
2992c31j07l04J92k06K19m18L77O3j09M06j81Q6j12J8J56J0k00j5r6N20lK80m98
$$ -331 -438 -742 -550 -756 -537 -955 -578 -515 -624 -218 -399 -313 -425 -407 -251 -241 -441 -456 -552 -32 -35 245 -253
3015b53j08n3N99l80j27L13K52l71l0l23P58L28k58k77n33N19L76K35o9m83J94
$$ -253 -361 -414 185 -195 -322 -9 243 -128 -158 -481 277 605 347 70 -463 56 432 667 598 115 309
3036C09j7K10j57L42K5j67k35R5o6K95K21m64J49l97K37K69o6K39m77p3N0O45
$$ 309 292 502 345 687 712 545 310 405 339 634 855 391 540 143 380 649 583 822 345 272 322 967
3058I67l43K45l53M8l6j75J96J24k8j86k74N1K71L28j95n24j62J04K18m2j01J76
$$ 967 624 869 516 564 528 353 549 673 645 459 185 236 507 835 640 116 -46 58 276 234 133 309
3080C09k38k43M14j26M3N8k95k8l68J67O11j2m20k76l42k50R60J96L7p70n17M30
$$ 309 71 -172 242 116 159 217 -78 -106 -474 -307 304 292 -128 -404 -746 -996 -36 160 197 -573 -1090 -660
3102f60K86L19l66J1k06Jj46K11K81k9n4q60L00K59P03l48k80m1j24L4L21mK18
$$ -660 -374 -55 -421 -410 -616 -615 -761 -550 -269 -298 -352 -1212 -912 -653 50 -298 -578 -619 -743 -709 -388 -392 -174
3125a74k20l64L0O13lq1O8n10p8M93K35k6n4j38n43M82L39N67k37q36k8K73L06
$$ -174 -394 -758 -728 -115 -118 -199 -131 -641 -719 -226 9 -17 -71 -209 -752 -270 69 636 399 -437 -465 -192 114
3148A14j3M09l39m06O9j3J62M12K91p36k01j00N11Q42m76j13m78K87Q0L91K20
$$ 114 101 510 171 -235 -166 -179 -17 395 686 -50 -251 -351 160 1002 526 413 -65 222 302 693 913
3169I13L7o15j98K96J4M20n4k51l76q6k4M28O20j83k27q11j61Q52N44m81m41l58
$$ 913 950 335 137 433 447 867 813 562 186 100 76 504 1124 941 714 -97 -258 594 1138 657 216 -142
3191a42J69N16j20L58m28k65k40J61M17L84m52k55m87o7L82J004n26l79k25k54
$$ -142 27 543 423 781 353 88 -152 9 426 810 358 103 -384 -451 -69 935 409 30 -195 -449
3211d49l6N83L24P8o70m44M70k25K26J13m59j42Nl7K06K98q1n55q9j45P92N88
$$ -449 -485 98 422 500 -170 -614 -144 -369 -143 -30 -489 -631 -626 -663 -457 -159 -240 -795 -884 -1029 -237 351
3233C51q86l14M4K12oK19J76j89l84J8N1J22M65n9k08l11J36J24Q2M64j68o33
$$ 351 -535 -849 -805 -593 -599 -380 -204 -393 -777 -759 -708 -586 -121 -180 -388 -699 -563 -439 -357 107 -61 -694
3255f94j86J16P28K74j25o98j3L45K90m8j79J23j33j34n8N19Q5Mk66k05o0L19
$$ -694 -880 -764 -36 238 113 -585 -598 -253 37 -11 -190 -67 -200 -334 -392 127 212 216 -50 -255 -315 4
3277DM79R2n90j96N26k49J64L73J37o73K04J57q3J87j10k93K14j31l6O67j85k3
$$ 4 483 575 -15 -211 315 66 230 603 740 67 271 428 345 532 422 129 343 212 176 843 658 635
3299F35l07j62K58QM54j71l40l41N00j5k07L88L6m03q3k15M71n0J12j13n30K68
$$ 635 328 166 424 432 886 715 375 34 534 519 312 700 736 333 250 35 506 456 568 455 -75 193
3321A93J34K73k88r7k49J62M5l2j22K78k09l05L55m3M5K12L8l80n79L84K55K03
$$ 193 327 600 312 215 -34 128 173 141 19 297 88 -217 138 95 140 352 390 10 -569 -185 70 273
3343B73l59Nn60Q2M35L61m63j23J04q9o8P3J1K1q7J26l44J89O7L29J66p66j44
$$ 273 -86 -81 -641 -559 -124 237 -226 -349 -245 -334 -402 -329 -318 -297 -384 -258 -602 -413 -346 -17 149 -617 -761
3366g61K32M2J03j0N0m3j86J34J63O6r2l54L76k66O3K26J47Q4o35K0K31M76k15
$$ -761 -529 -487 -384 -394 -344 -387 -573 -439 -276 -210 -302 -656 -280 -546 -483 -257 -110 -26 -661 -641 -410 66 -149
3389a49M9l25K96o8K25Jkk95K3J10r7L92N13l71p54K39L11J29K53L3j1n80nQ5
$$ -149 -100 -425 -129 -197 28 29 27 -268 -245 -135 -232 160 673 302 -452 -213 98 227 480 513 502 -78 -83 2
3413BM93K48m24Oj02L6k94L63O34n62k54j27K96j28O23k12k65j72j33L17L87l98
$$ 2 495 743 319 325 223 259 -35 328 962 400 146 19 315 187 810 598 333 161 28 345 732 334
3435C34J41L86o71j21L58J21k0j73n1j28k8L00J79l07j20j50R9O40j09k02m77
$$ 334 475 861 190 69 427 548 528 355 304 176 148 448 627 320 200 50 149 789 680 478 1
3456Ak21L59L3l2j2nj16K1n9J38K69l26l02j12O2L71J32k16m46ro4J05L45J10
$$ 1 -220 139 172 140 128 123 7 28 -31 107 376 50 -252 -364 -302 69 201 -15 -461 -470 -534 -429 -84 26
3480B6j58n77L34J54qL13l65l09k33J79%N23K76k04k32q36M98L88J89q0n08q3
$$ 26 -132 -709 -375 -221 -229 84 -281 -590 -823 -644 -644 -121 155 -49 -281 -1117 -619 -231 -42 -122 -630 -713
3502g13J11N57k79J6N19m92n44K41J86N41m2l93k68K72M2N05l38k89j0k4L43J15
$$ -713 -602 -45 -324 -308 211 -281 -825 -584 -398 143 101 -292 -560 -288 -246 259 -79 -368 -378 -402 -59 56
3524E6J49Q6n98L8J59K93J32P2n08K91k12J75J30L33n0o17l6M44K16J63o0q29
$$ 56 205 291 -307 -269 -110 183 315 387 -121 170 -42 133 263 596 546 -71 -107 337 553 716 656 -173
3546a73j13J62N92p7J79k55j28k73J03M74M76k32n08ok2K06L00j02j26m48r0L92
$$ -173 -286 -124 468 391 570 315 187 -86 17 491 967 735 227 221 199 405 705 603 477 29 -61 331
3568C31L60m9m4j83k35PJ99K0k1k68P5m49N33J06M06l76m74l19J97M13K58p66
$$ 331 691 642 598 415 180 187 386 406 385 117 192 -257 276 382 788 412 -62 -381 -184 229 487 -279
3590b79K15J30n05N68j49R5k56o1k24J45L02K69m30j46q5J34J42L13l83l7q3l26
$$ -279 -64 66 -439 129 -20 75 -181 -242 -466 -321 -19 250 -180 -326 -411 -277 -135 178 -205 -242 -325 -651
3612f51J18M42J90j88n68M4M12j38l3L59j41l62k41L30K14N39m15m95j26J88M92
$$ -651 -533 -91 99 -89 -657 -613 -201 -339 -372 -13 -154 -516 -757 -427 -213 326 -89 -584 -710 -522 -30
3633c0k85J83n7r4j58K98jK36k66j64j10K29P2L90j35k44l33K5L51K50O6J9m44
$$ -30 -315 -132 -189 -283 -441 -143 -144 92 -174 -338 -448 -219 -147 243 108 -136 -469 -444 -93 157 223 242 -202
3656b02K55m7J77O2l40O3K49j41K23Q4j78l5J49j39j92K93L03n6q07K43K88L29
$$ -202 53 6 183 245 -95 -32 217 76 299 383 205 170 319 180 -12 281 584 528 -279 -36 252 581
3678E81J08l2m69R2L3j12L08Q4K1j13n02K77j5K49m5J7r7l51K79K40m16J78q5
$$ 581 689 657 188 280 313 201 509 593 614 501 -1 276 261 510 465 482 385 34 313 553 137 315 230
3701B30l94K66K87j62J29l10J54r7k37K76J34J47p8n96J10K58K7l08R3j53rK52
$$ 230 -164 102 389 227 356 46 200 103 -134 142 276 423 345 -251 -141 117 144 -164 -71 -224 -233 19
3723A9r7M5M55l93m42K14j67K73j6R5l20n0j57J54J90L7k06k47L28J42P6K0k93
$$ 19 -78 -33 422 29 -413 -199 -366 -93 -109 -14 -334 -384 -541 -387 -197 -160 -366 -613 -285 -143 -67 -47 -340
3746c40k62K16p6K14J37j20J46l44m5J91l2K10q2m29M04m53N21Qk12j12J98P9
$$ -340 -602 -386 -462 -248 -111 -231 -85 -429 -474 -283 -315 -105 -187 -616 -212 -665 -144 -136 -348 -460 -262 -183
3768a83J6J03J8%p5k1j14L25j27Q8Q1r1m26M14q0L36k67k17R3O2L54R5l0k28q9
$$ -183 -167 -64 -46 -46 -121 -142 -256 69 -58 30 111 20 -406 8 -72 264 -3 -220 -127 -65 289 384 354 126 37
3793C7K22j35L17j70K4r2j37J07J94R4M9k88n28N97K03j10J02r8j64k28J31K95
$$ 37 259 124 441 271 295 203 66 173 367 461 510 222 -306 291 494 384 486 388 224 -4 127 422
3815D22J74m20k37N04k34p6M22L00m62l84K0J54L50J05j96l40j7K1N37l91l5k89
$$ 422 596 176 -61 443 209 133 555 855 393 9 29 183 533 638 442 102 85 106 643 252 217 -72
3837g2L19k12K09j32J06j64j00l10K11K93j7k39O8k09%k7M20J32k02l94p1J74
$$ -72 247 35 244 112 218 54 -46 -356 -145 148 131 -108 -40 -249 -249 -276 144 276 74 -320 -391 -217
3859b17Q4M3m35L15q2l91K78J2K31J21m36j27K83jK62l03k98q5K19L23K03j96
$$ -217 -133 -90 -525 -210 -292 -683 -405 -393 -162 -41 -477 -604 -321 -322 -60 -363 -661 -746 -527 -204 -1 -197
3881a97L2j03j8j51J33J78R7m87j96L04J54M68m16L03n87J03q5O31l8l51l45K61
$$ -197 -165 -268 -286 -437 -304 -126 -29 -516 -712 -408 -254 214 -202 101 -486 -383 -468 163 125 -226 -571 -310
3903c10L49j07J42J64j08n54K63K78l3j87J81k41K01j68P25r7J19m73k12K07K02
$$ -310 39 -68 74 238 130 -424 -161 117 84 -103 78 -163 38 -130 595 498 617 144 -68 139 341
3924C41K08k23j58m9J8K11j46lQ0J02n11J90L59L4J79k69k86K5R2O4J12J3k57
$$ 341 549 326 168 119 137 348 202 199 279 381 -130 60 419 453 632 363 77 102 194 258 370 383 126
3947A26n9L42mJ32k89j08Q9j06MK53K42k44o54M96j16r8O0K44m18P2j31M21p1
$$ 126 67 409 405 537 248 140 229 123 127 380 622 378 -276 220 104 6 66 310 -108 -36 -167 254 183
3970A83J83m56PQ1j8j66K00M92n92j25l7O8J76o2k02J12l01M70o8P9Kn18%J31
$$ 183 366 -90 -83 -2 -20 -186 14 506 -86 -211 -248 -180 -4 -66 -268 -156 -457 13 -55 24 26 -492 -492 -361
3994c61N8K19j90K24l71j66K85J77j91J06j10l22J74K31J81J8k55k23m2L48R4
$$ -361 -303 -84 -274 -50 -421 -587 -302 -125 -316 -210 -320 -642 -468 -237 -56 -38 -293 -516 -558 -210 -116
4015a16J00l19Q7M2j24K4J39J13l29J71j13j7N19j45j01j53K62K1J44k01k24J15
$$ -116 -16 -335 -248 -206 -330 -306 -167 -54 -383 -212 -325 -342 177 32 -69 -222 40 61 205 4 -220 -105
4037a05K04J56k55K69Qk54N8p7N8M2J82L27n02j4J2L30j43J24k45j81K65J18n64
$$ -105 99 255 0 269 277 23 81 4 62 104 286 613 111 97 109 439 296 420 175 -6 259 377 -187
4060a87L83l9k47N78m14P1K35K99k15o46M04j29L31J22k24j55k57Q8K61j01kj15
$$ -187 196 157 -90 488 74 145 380 679 464 -182 222 93 424 546 322 167 -90 -2 259 158 156 41
4082D1p7J11j25p2M79l35L0K20l12J52k04L13k67q0J82r5L43P5j59l25j53K95
$$ 41 -36 75 -50 -122 357 22 52 272 -40 112 -92 221 -46 -126 56 -39 304 379 220 -105 -258 37
4104C7J46l00M4n9J12N5pm20K63j71K32k70j52M42q4j44J78m1l20M06Ml0q8m5
$$ 37 183 -117 -73 -132 -20 35 28 -392 -129 -300 -68 -338 -490 -48 -132 -276 -98 -139 -459 -53 -49 -79 -167 -212
4128b12j33J07k9J00P9j22l00r3O3M66o1LN0l88O2J97P7r4j89K53P1k95J92M4
$$ -212 -345 -238 -267 -167 -88 -210 -510 -603 -540 -74 -135 -132 -82 -470 -408 -211 -134 -228 -417 -164 -93 -388 -196 -152
4152a52L13m13J22k34J37K93J66k99R7l71J48J06L36j59k71M00k80J56J33r2Q7
$$ -152 161 -252 -130 -364 -227 66 232 -67 30 -341 -193 -87 249 90 -181 219 -61 95 228 136 223
4173B23k75K02lJ06J05J17j66k99Q9J91R5J75l98k18O2M5K42q9K35j98J71k53
$$ 223 -52 150 147 253 358 475 309 10 99 290 385 560 162 -56 6 51 293 204 439 241 412 159
4195A59j37M44m6k13p6k10N13j8K47l62l19J99K13j22K0L2k67O4NL2j94L04j84
$$ 159 22 466 420 207 131 -79 434 416 663 301 -18 181 394 272 292 324 57 121 126 158 -36 268 84
4218H4m0P6j79K75Q4j12j70j93j82K98M41k28j62l28L80l44J73J97o6l90L47l43
$$ 84 44 120 -59 216 300 188 18 -175 -357 -59 382 154 -8 -336 44 -300 -127 70 4 -386 -39 -382
4240c82K62Q0j88J20l58J25K21mj12j74K69j06j5J82k13J39K52l88k14K38j06
$$ -382 -120 -40 -228 -108 -466 -341 -120 -124 -236 -410 -141 -247 -262 -80 -293 -154 98 -290 -504 -266 -372
4261c72P5M6R5O0k3r7j04J39K22n12j23L47J21K65j83l66j25N72L6k89J70k05
$$ -372 -297 -251 -156 -96 -119 -216 -320 -181 41 -471 -594 -247 -126 139 -44 -410 -535 37 73 -216 -46 -251
4283b51LL4J51J11K87n43J91kJ5J09ko9ro0q0J62M9K57j26l50J52K46K8j14j34
$$ -251 -248 -214 -63 48 335 -208 -17 -19 -4 105 103 34 25 -35 -115 47 96 353 227 -123 29 275 303 189 55
4308E5j66j0J42J95L5M03k04j96k92j6L85j27K02l25K40kk76O3J47k4r8l33M24
$$ 55 -111 -121 21 216 251 654 450 254 -38 -54 331 204 406 81 321 319 43 106 253 229 131 -202 222
4331B22PK14k16o2m4j63J87kQ2P7m23J65K69p1j15Rj00j52L56L3N1k58J18k86
$$ 222 229 443 227 165 121 -42 145 143 225 302 -121 44 313 242 127 136 36 -116 240 273 324 66 184 -102
4355a02p9lL03k15L11j54m17R7K83K12j55m48K39l50J24N7J46k21K58j06l35L65
$$ -102 -181 -184 119 -96 215 61 -356 -259 24 236 81 -367 -128 -478 -354 -297 -151 -372 -114 -220 -555 -190
4377a90N4Q0j41qk30J57J1M49k31n07j34O27j02k2R9k53J09L4j29K38k71J13q2
$$ -190 -136 -56 -197 -205 -435 -278 -267 182 -49 -556 -690 -63 -165 -187 -88 -341 -232 -198 -327 -89 -360 -247 -329
4400c29l9J01K85j03M1K3l66j39R12k97ll47J47J01Mn5J70j35J67j33M6p5J19
$$ -329 -368 -267 18 -85 -44 -21 -387 -526 386 89 86 -261 -114 -13 -9 -64 106 -29 138 5 51 -24 95
4423I5j26J5j80P6L66k29L46l21J59m58M45k38M54l7k07r8L02k21l5K89p2k60
$$ 95 -31 -16 -196 -120 246 17 363 42 201 -257 188 -50 404 367 160 62 364 143 108 397 325 65
4445F5K03k59L65J20J39o63J69q0L83k96k16N99k47o3Q9k56K07M4j85R1j32J44
$$ 65 268 9 374 494 633 -30 139 59 442 146 -70 529 282 219 308 52 259 303 118 209 77 221
4467B21J25r2J11j60L1J45q5j55j0j59j38L35q0m2k53J29LK67k61j15M14j30j77
$$ 221 346 254 365 205 236 381 296 141 131 -28 -166 169 89 47 -206 -77 -74 193 -68 -183 231 101 -76
4490g6j02o5J78j16K99p0j71j21M5j15M41j26k70MJ13j82K4M61m18K69m19q8M19
$$ -76 -178 -243 -65 -181 118 48 -123 -244 -199 -314 127 1 -269 -265 -152 -334 -310 151 -267 2 -417 -505 -86
4513h6k9j61p8q9N5M6L59j67Rj74K72j03p0K26p3K9k01r5J35L86j18p7k9l43J16
$$ -86 -115 -276 -354 -443 -388 -342 17 -150 -141 -315 -43 -146 -216 10 -63 -34 -235 -330 -195 191 73 -4 -33 -376 -260
4538b60j1N30J22l89n00L07M02m9l05J06J27j19r3K65M0M3l41j20K26O0k0M10
$$ -260 -271 259 381 -8 -508 -201 201 152 -153 -47 80 -39 -132 133 173 216 -125 -245 -19 41 21 431
4560D31k49l37K90n3J41M17n98Pp3j28L82N6j48j07J37m7j78k3L22K55n90J52
$$ 431 182 -155 135 82 223 640 42 49 -24 -152 230 286 138 31 168 121 -57 -80 242 497 -93 59
4582E9M2O3J75k30K89m91M1K99K97m69L8j04k33K18j16m2O48m00jk25N25k24j28
$$ 59 101 164 339 109 398 -93 -52 247 544 75 113 9 -224 -6 -122 -164 484 84 83 -142 383 159 31
4605C1J31m16N4J18K11m9k56Q2l7j59J78J12P1j85%J02k60L54J24j10l10lpJ28
$$ 31 162 -254 -200 -82 129 80 -176 -94 -131 -290 -112 0 71 -114 -114 -12 -272 82 206 96 -214 -217 -224 -96
4629i6K74k10k51L6K8p6P2j6L05k48k54K22K6K21k18r1M3j0j67M37p2m1p3P7o9
$$ -96 178 -32 -283 -247 -219 -295 -223 -239 66 -182 -436 -214 -188 33 -185 -276 -233 -243 -410 27 -45 -86 -159 -82 -151
4654a51K61J23k00j87o2Q3J19j69K36j03j91k76L4M14L6Q3n9j64N01l88L07l26
$$ -151 110 233 33 -154 -216 -133 -14 -183 53 -50 -241 -517 -483 -69 -33 50 -9 -173 328 -60 247 -79
4676g9m3J08R0J89l75J82R5J49l39k9q5J78j39N30l74j70M63k61L66l12O8j24
$$ -79 -122 -14 76 265 -110 72 167 316 -23 -52 -137 41 -98 432 58 -112 351 90 456 144 212 88
4698H8K33J21j05j82n9J36k78L30q5M2k5j76J03j98K46J82j05l47k43K58N7R8
$$ 88 321 442 337 155 96 232 -46 284 199 241 216 40 143 -55 191 373 268 -79 -322 -64 -7 91
4720I1J16J82k54P5k20k15K71K1n0O2j34J2K53k44k0j85L24J77j97J35k00j39
$$ 91 207 389 135 210 -10 -225 46 67 17 79 -55 -43 210 -34 -54 -239 85 262 65 200 0 -139
4742a39j30M09l35K25j44k90K58M8J3K8j82J86L9k75j0q9M37Kj56n11M9K90K97
$$ -139 -269 140 -195 30 -114 -404 -146 -98 -85 -57 -239 -53 -14 -289 -299 -388 49 51 -105 -616 -567 -277 20
4765B0j88j5m2J70j60j76K73N9J08j79k36m0R7n5K73j89R4j20N16k94K39l06k8
$$ 20 -168 -183 -225 -55 -215 -391 -118 -59 49 -130 -366 -406 -309 -364 -91 -280 -186 -306 210 -84 155 -151 -179
4788a79L43l88M18j06o5j11o1K56j23K11n6J00k20QL9J07K5j13Kk90K96j08J67
$$ -179 164 -224 194 88 23 -88 -149 107 -16 195 139 239 19 27 66 173 198 85 87 -203 93 -15 152
4811A52r7L79k46K21m61M0O5K63k93J97K0l3K3K30m20j36K07j90M12P6j06k70
$$ 152 55 434 188 409 -52 -12 53 316 23 220 240 207 230 460 40 -96 111 -79 333 409 303 33
4833C3J36J4J3k61K90l16k27L97k07J27J51j79M2j70J40J12L00k67l32j42M06
$$ 33 169 183 196 -65 225 -91 -318 79 -128 -1 150 -29 13 -157 -17 95 395 128 -204 -346 60
4854F0k2L07l84R8R1k34N6Q4J16k80p9J92J03m78L00R0P4m52j51M21L78n54J41
$$ 60 38 345 -39 59 150 -84 -28 56 172 -108 -187 5 108 -370 -70 20 94 -358 -509 -88 290 -264 -123
4877a23Q6L7j71J08m63M18j00J87m9j52M79l14k48J03k46L51j02j22L11K24m49
$$ -123 -37 0 -171 -63 -526 -108 -208 -21 -70 -222 257 -57 -305 -202 -448 -97 -199 -321 -10 214 -235
4898b35J97k0O1r0n2J47l85Q4KM2P9r9L60n16K68J54R5k4k50O0j49O21k42M8l29
$$ -235 -38 -58 3 -87 -139 8 -377 -293 -291 -249 -170 -269 91 -425 -157 -3 92 68 -182 -122 -271 350 108 156 -173
4923a73J01J36k7K95n2j99m9j77J65K14N0P1j92l98K75J75j60J49j70L2pJ99K1
$$ -173 -72 64 37 332 280 81 32 -145 20 234 284 355 163 -235 40 215 55 204 34 66 59 258 279
4946B79M2k73%J18j77K07l6r3L2K91j98M7l5J26J08k52j32M2K58m62K81K12l71
$$ 279 321 48 48 166 -11 196 160 67 99 390 192 239 204 330 438 186 54 96 354 -108 173 385 14
4969A4k5L68k89p9J58J20k06L6j5M83l12o1l20K64K16k48J00l7j69J36j77J3K02
$$ 14 -11 357 68 -11 147 267 61 97 82 565 253 192 -128 136 352 104 204 167 -2 134 -43 -30 172
4992A72J2k52k91J08K20K16o7j58k5l17ML72Q3k37m9j02K44J39l20M7k3j4L1M5
$$ 172 184 -68 -359 -251 -31 185 118 -40 -65 -382 -378 -6 77 -160 -209 -311 -67 72 -248 -201 -224 -238 -207 -162
5016a62K32n27M10j73j43N0J53r8K84j45l34L04j07M6K77j93J51j92J74j21j8
$$ -162 70 -457 -47 -220 -363 -313 -160 -258 26 -119 -453 -149 -256 -210 67 -126 25 -167 7 -114 -132
5037a32K54l95J36p1j38M86j32p8K41m65K68j77K61j18J49n06M18J36j4J00r4
$$ -132 122 -273 -137 -208 -346 140 8 -70 171 -294 -26 -203 58 -60 89 -417 1 137 123 223 129
5058A29M0j22M0rP0J15L4l29O9P5k5L21J14m95j29K11N3J30r5m9q1l77J55M21
$$ 129 169 47 87 78 148 263 297 -32 37 112 87 408 522 27 -102 109 162 292 197 148 67 -310 -155 266
5082B66n6N8q4l61N1K24J44k52P0Q1j84L48r2M5k39o6K62j23N2J70k82o5K34m40
$$ 266 210 268 184 -177 -126 98 242 -10 60 141 -43 305 213 258 19 -47 215 92 144 314 32 -33 201 -239
5106b39L15j35L14q6J55m07L1l5K33m2k25Mj75N45l18j72J2K5Q1j14rJ47Q6o0
$$ -239 76 -59 255 169 324 -83 -52 -87 146 104 -121 -117 -292 253 -65 -237 -225 -200 -119 -233 -242 -95 -9 -69
5130f9P9j06j48J69nj29j86K58k15N01m49O4p5J08J77p6l28l1M18r4L7J43k23
$$ -69 10 -96 -244 -75 -80 -209 -395 -137 -352 149 -300 -236 -311 -203 -26 -102 -430 -461 -43 -137 -100 43 -180
5153a80m2j23R8J08j13J46J26n7j34K62k11j1J31K4k76K90k10J08j00J03K28l79
$$ -180 -222 -345 -247 -139 -252 -106 20 -37 -171 91 -120 -131 0 24 -252 38 -172 -64 -164 -61 167 -212
5175b12K17L6k10J40K03p6J04M6j38j21J74l31N31j25n3J17l08j13K48j72J82
$$ -212 5 41 -169 -29 174 98 202 248 110 -11 163 -168 363 238 185 302 -6 -119 129 -43 139
5196A39k66J49R7Q0j6j80J1l08K09P1j00nK65j33K4L65l2m7k54k6R0j41J2R4L9
$$ 139 -127 22 119 199 183 3 14 -294 -85 -14 -114 -119 146 13 37 402 370 323 69 43 133 -8 4 98 137
5221A37j27q1R5J00Q9k07q5P0J28Mn2K9O9m6j83R5j51L71m5k16k09J90L3R7m6
$$ 137 10 -71 24 124 213 6 -79 -9 119 123 71 100 169 123 -60 35 -116 255 210 -6 -215 -25 8 105 59
5246E9k65j51m2M31k32M11j71J32m10J72L97l20m2l21K20r1J41k65J44n8l6m5
$$ 59 -206 -357 -399 32 -200 211 40 172 -238 -66 331 11 -31 -352 -132 -223 -82 -347 -203 -261 -297 -342
5268c42J58m8J65K06k76N9j37q7K74J21j74j58J46j94MK5J90m7L7J94LP2m93K25
$$ -342 -184 -232 -67 139 -137 -78 -215 -302 -28 93 -81 -239 -93 -287 -283 -258 -68 -115 -78 116 119 191 -302 -77
5292g7kO1n0Q2j12L79l66M7j57kM9k07K58J26P6j43J13r8o1J96k14j54N39k15
$$ -77 -79 -18 -68 14 -98 281 -85 -38 -195 -197 -148 -355 -97 29 105 -38 75 -23 -84 112 -102 -256 283 68
5316F8J14q3k4J04N0l12L2M69l63j7j55K65K45L69n75k56L40k32J96M1n4k70L49
$$ 68 182 99 75 179 229 -83 -51 418 55 38 -117 148 393 762 187 -69 271 39 235 276 222 -48 301
5339C01j41j28J40Qq7k97L72o8o4P7n5K22K5l37J69j6P4j66p7R4K43p5k21J9o9
$$ 301 160 32 172 180 93 -204 168 100 36 113 58 280 305 -32 137 121 195 29 -48 46 289 214 -7 12 -57
5364e7q9J40k48K2J02J25o6p6j67J83K02l24j42M75m15L13J70k42j37J31l9O4
$$ -57 -146 -6 -254 -232 -130 -5 -71 -147 -314 -131 71 -253 -395 80 -335 -22 148 -94 -231 -100 -139 -75
5386g5j2p2q2o9K66L0k11K89l6m42o6K51J50j79L02k46k15L86r1J42j92K13j41
$$ -75 -87 -159 -241 -310 -44 -14 -225 64 28 -414 -480 -229 -79 -258 44 -202 -417 -31 -122 20 -172 41 -100
5409a00k04L78r9r4J36j52mN5J17l12L46J43k85J00k79L47J29j85N0k86R9J72
$$ -100 -304 74 -25 -119 17 -135 -139 -84 33 -279 67 210 -75 25 -254 93 222 37 87 -199 -100 72
5431G2M7p8k53M15r2Q9j58K05l3j9l21NJ04N7L3P4K7j64N35j40j95l5J55l05j96
$$ 72 119 41 -212 203 111 200 42 247 214 195 -126 -121 -17 40 73 147 174 10 545 405 210 175 330 25 -171
5456a71N93m06l5J20J65l22K62k57M81m58J23j95J66K85k69M1k8K7kM1j4J29j15
$$ -171 422 16 -19 101 266 -56 206 -51 430 -28 95 -100 66 351 82 123 95 122 120 161 147 276 161
5479A61k58p2M9K6K52Pk71K7k87N40m7j36n4L2j03o7O2L23j85k90M02j93j74K51
$$ 161 -97 -169 -120 -94 158 165 -106 -79 -366 174 127 -9 -63 -31 -134 -201 -139 184 -1 -291 111 -82 -256 -5
$$ [...]
8191A19
##END NTUPLES=NMR FID
##END=
