##TITLE=1H_Lac-DMe-A3-19
 CDCl3, 8 sc, 
 18.10.2019
##JCAMPDX= 6.0         $$ Bruker NMR JCAMP-DX V2.0
##DATA TYPE= NMR FID
##DATA CLASS= NTUPLES
##ORIGIN= UXNMR, Bruker Analytische Messtechnik GmbH
##OWNER= root
$$ XWIN-NMR		Version 3.5
$$ Fri Oct 18 15:42:51 2019 Russian Standard Time (UT+4h)  she@DPX200
##.OBSERVE FREQUENCY= 200.1315
##.OBSERVE NUCLEUS= ^1H
##.DELAY= (6, 6)
##.ACQUISITION MODE= SIMULTANEOUS
##.ACQUISITION SCHEME= undefined
##.AVERAGES= 8
##.DIGITISER RES= 18
##SPECTROMETER/DATA SYSTEM= spect
##.PULSE SEQUENCE= zg30
##.SOLVENT NAME= CDCl3
##.SHIFT REFERENCE= (INTERNAL, CDCl3, 0, 15.7039)
##AUDIT TRAIL= $$ (NUMBER, WHEN, WHO, WHERE, WHAT)
$$ ##TITLE= Audit trail, XWIN-NMR		Version 3.5
$$ ##JCAMPDX= 5.01
$$ ##ORIGIN= Bruker BioSpin GmbH
$$ ##OWNER= she
$$ F:/spectra/data/she/nmr/H-F/1/audita.txt
$$ ##AUDIT TRAIL=  $$ (NUMBER, WHEN, WHO, WHERE, WHAT)
(   1,<2019-10-18 15:41:45.64 +0400>,<she>,<DPX200>,
      <created by zg, POWCHK disabled, PULCHK disabled
       configuration hash MD5:
       00 E9 B6 7A A2 85 ED C7 34 08 36 98 17 FE 4E 26
       data hash MD5: 16K
       4A 63 AA 1B 0C 99 71 8B 7B 97 52 9F 2C B1 01 D9>)
$$ ##END=
$$ 
$$ hash MD5
$$ 74 A2 AF CD 26 0F BF 7D DF 45 96 98 43 30 00 9E
##$RELAX= 
##$RELAX= 
##$RELAX= 
##$RELAX= 
##$RELAX= 
##$RELAX= 
$$ Bruker specific parameters
$$ --------------------------
##$DU= <F:/spectra>
##$EXPNO= 1
##$NAME= <H-F>
##$PROCNO= 1
##$TYPE= <nmr>
##$USER= <she>
##$AMP= (0..31)
100 100 100 100 100 100 100 100 100 100 100 100 100 100 100 100 100 100 
100 100 100 100 100 100 100 100 100 100 100 100 100 100 
##$AQSEQ= 0
##$AQ_mod= 1
##$AUNM= <au_zg>
##$AUTOPOS= <>
##$BF1= 200.13
##$BF2= 200.13
##$BF3= 200.13
##$BF4= 200.13
##$BF5= 200.13
##$BF6= 200.13
##$BF7= 200.13
##$BF8= 200.13
##$BYTORDA= 1
##$CFDGTYP= 0
##$CFRGTYP= 5
##$CHEMSTR= <none>
##$CNST= (0..31)
1 1 145 1 1 1 1 1 1 1 1 1 1 1 1 1 1 1 1 1 1 1 1 1 1 1 1 1 1 1 1 1 
##$CPDPRG= <>
##$CPDPRG1= <>
##$CPDPRG2= <>
##$CPDPRG3= <>
##$CPDPRG4= <mlev>
##$CPDPRG5= <mlev>
##$CPDPRG6= <mlev>
##$CPDPRG7= <mlev>
##$CPDPRG8= <mlev>
##$CPDPRGB= <>
##$CPDPRGT= <>
##$D= (0..31)
0 1.2 0 0 0 0 0 0 0 0.06 0 0.03 0 0 0 0 0.0002 0 0 0 0 0 0 0 0 0 0 0 0 
0 0 0 
##$DATE= 1571398905
##$DBL= (0..7)
120 120 120 120 120 120 120 120 
##$DBP= (0..7)
150 150 150 150 150 150 150 150 
##$DBP07= 0
##$DBPNAM0= <>
##$DBPNAM1= <>
##$DBPNAM2= <>
##$DBPNAM3= <>
##$DBPNAM4= <>
##$DBPNAM5= <>
##$DBPNAM6= <>
##$DBPNAM7= <>
##$DBPOAL= (0..7)
0.5 0.5 0.5 0.5 0.5 0.5 0.5 0.5 
##$DBPOFFS= (0..7)
0 0 0 0 0 0 0 0 
##$DE= 6
##$DECBNUC= <off>
##$DECIM= 24
##$DECNUC= <off>
##$DECSTAT= 4
##$DIGMOD= 1
##$DIGTYP= 9
##$DL= (0..7)
0 120 120 120 120 120 120 120 
##$DP= (0..7)
150 150 150 150 150 150 150 150 
##$DP07= 0
##$DPNAME0= <>
##$DPNAME1= <>
##$DPNAME2= <>
##$DPNAME3= <>
##$DPNAME4= <>
##$DPNAME5= <>
##$DPNAME6= <>
##$DPNAME7= <>
##$DPOAL= (0..7)
0.5 0.5 0.5 0.5 0.5 0.5 0.5 0.5 
##$DPOFFS= (0..7)
0 0 0 0 0 0 0 0 
##$DQDMODE= 0
##$DR= 18
##$DS= 0
##$DSLIST= <SSSSSSSSSSSSSSS>
$$ [...]
##$SUBNAM2= <"">
##$SUBNAM3= <"">
##$SUBNAM4= <"">
##$SUBNAM5= <"">
##$SUBNAM6= <"">
##$SUBNAM7= <"">
##$SUBNAM8= <"">
##$SUBNAM9= <"">
##$SW= 24.0689530833862
##$SWIBOX= (0..15)
0 0 2 0 0 0 0 0 0 0 0 0 0 0 0 0 
##$SW_h= 4816.95568400771
##$TD= 16384
##$TD0= 1
##$TE= 0
##$TE2= 300
##$TE3= 300
##$TEG= 300
##$TL= (0..7)
0 120 120 120 120 120 120 120 
##$TP= (0..7)
150 150 150 150 150 150 150 150 
##$TP07= 0
##$TPNAME0= <>
##$TPNAME1= <>
##$TPNAME2= <>
##$TPNAME3= <>
##$TPNAME4= <>
##$TPNAME5= <>
##$TPNAME6= <>
##$TPNAME7= <>
##$TPOAL= (0..7)
0.5 0.5 0.5 0.5 0.5 0.5 0.5 0.5 
##$TPOFFS= (0..7)
0 0 0 0 0 0 0 0 
##$TUNHIN= 0
##$TUNHOUT= 0
##$TUNXOUT= 0
##$USERA1= <user>
##$USERA2= <user>
##$USERA3= <user>
##$USERA4= <user>
##$USERA5= <user>
##$V9= 5
##$VALIST= <valist>
##$VCLIST= <CCCCCCCCCCCCCCC>
##$VD= 0
##$VDLIST= <DDDDDDDDDDDDDDD>
##$VPLIST= <PPPPPPPPPPPPPPP>
##$VTLIST= <TTTTTTTTTTTTTTT>
##$WBST= 1024
##$WBSW= 4
##$XGAIN= (0..3)
0 0 0 0 
##$XL= 0
##$YL= 0
##$YMAX_a= 358407
##$YMIN_a= -501462
##$ZGOPTNS= <>
##$ZL1= 120
##$ZL2= 120
##$ZL3= 120
##$ZL4= 120
##$ABSF1= 10
##$ABSF2= 0
##$ABSG= 5
##$ABSL= 3
##$ALPHA= 0
##$AQORDER= 0
##$ASSFAC= 0
##$ASSFACI= 0
##$ASSFACX= 0
##$ASSWID= 0
##$AUNMP= <proc_1d>
##$AZFE= 0.1
##$AZFW= 0.1
##$BCFW= 1
##$BC_mod= 2
##$BYTORDP= 1
##$COROFFS= 0
##$CY= 11.3945322036743
##$DATMOD= 1
##$DC= 2
##$DFILT= <>
##$DTYPP= 0
##$F1P= 20.1720416913024
##$F2P= 0.152960286110954
##$FCOR= 0.5
##$FTSIZE= 0
##$FT_mod= 4
##$GAMMA= 1
##$GB= 0.15
##$INTBC= 1
##$INTSCL= 1
##$ISEN= 128
##$LB= 0.24
##$LEV0= 0
##$LPBIN= 0
##$MAXI= 10000
##$MC2= 0
##$MEAN= 0
##$ME_mod= 0
##$MI= 1.114404
##$NCOEF= 0
##$NC_proc= 0
##$NLEV= 6
##$NOISF1= 3.799351
##$NOISF2= 2.8
##$NSP= 1
##$NTH_PI= 0
##$NZP= 0
##$OFFSET= 15.70392
##$PC= 1
##$PHC0= -9571.985
##$PHC1= 16.00089
##$PH_mod= 1
##$PKNL= yes
##$PPARMOD= 0
##$PSCAL= 0
##$PSIGN= 0
##$REVERSE= no
##$SF= 200.130013532006
##$SI= 16384
##$SIGF1= 3
##$SIGF2= 2
##$SINO= 400
##$SIOLD= 16384
##$SREGLST= <1H.CDCl3>
##$SSB= 0
##$STSI= 0
##$STSR= 0
##$SW_p= 3612.71676300578
##$SYMM= 0
##$S_DEV= 0
##$TDeff= 0
##$TDoff= 0
##$TI= <>
##$TILT= no
##$TM1= 0
##$TM2= 0
##$TOPLEV= 0
##$USERP1= <user>
##$USERP2= <user>
##$USERP3= <user>
##$USERP4= <user>
##$USERP5= <user>
##$WDW= 1
##$XDIM= 8192
##$YMAX_p= 0
##$YMIN_p= 0
$$ End of Bruker specific parameters
$$ ---------------------------------
##NTUPLES= NMR FID
##VAR_NAME=  TIME,          FID/REAL,        FID/IMAG
##SYMBOL=    X,             R,               I
##VAR_TYPE=  INDEPENDENT,   DEPENDENT,       DEPENDENT
##VAR_FORM=  AFFN,          ASDF,            ASDF
##VAR_DIM=   8192,          8192,            8192
##UNITS=     SECONDS,       ARBITRARY UNITS, ARBITRARY UNITS
##FACTOR=    0.0002076,     1,               1
##FIRST=     0,             0,               0
##LAST=      1.7004516,     0,               0
##MIN=       0,             -501462,         0
##MAX=       1.7004516,     358407,          0
$$ Real data points
##PAGE= N=1
##DATA TABLE= (X++(R..R)), XYDATA
$$ [...]
2158B423k421j905J63J139J439J246m98k084j538Q65K223Q56O4j206j785j026
$$ 2423 2 -1903 -1740 -601 838 2084 1586 -498 -2036 -1171 1052 1908 1972 766 -1019 -2045
2174b045K157K762k85k211j315L13K04J449J710j4k699j826P04K279J144k3r96
$$ -2045 112 2874 2589 378 -937 -624 -420 1029 2739 2725 26 -1800 -1096 1183 2327 2304 1308
2191A308k092o72J626K204K54j376j623n58J72J519K284j063k211j294P64J703
$$ 1308 -784 -1456 170 2374 2628 1252 -371 -929 -757 762 3046 1983 -228 -1522 -758 945
2207I45Q40K8q98j570p19O70J982R87j150j947r71R96K143N93j173j407p51J02
$$ 945 1785 1813 915 -655 -1374 -704 1278 2265 1115 -832 -1803 -807 1336 1929 756 -651 -1402 -1300
2225a300J249J658k03j459j464k71J348J365O07j056j887q28J311J540R2o04o19
$$ -1300 -51 1607 1404 -55 -1519 -1790 -442 923 1530 474 -1413 -2241 -930 610 702 98 -521
2242e21j065n30J146J805K11j629j543N72Q66P22M56m22q58q61K27J365P88o78
$$ -521 -1586 -2116 -970 835 1046 -583 -2126 -1554 -688 34 490 68 -790 -1651 -1424 -59 729 51
2260E1r45p47R9J021J295m19j148m41M74K53M41L46L21j131j146P43J650J01r99
$$ 51 -894 -1641 -1542 -521 774 355 -793 -1234 -760 -507 -66 280 601 -530 -1676 -933 717 818 -181
2279a81n48pN1J202j79k13n33k55K48J99J029P7k86j937P4J891R77n53p59n94
$$ -181 -729 -736 -685 517 338 125 -408 -663 -415 -216 813 890 604 -1333 -1259 632 1609 1056 297 -297
2299b97q1o3R33J230n48r32j110N68J066R50j94j207r16R1J297P32l89l54n07
$$ -297 -378 -441 492 1722 1174 242 -868 -300 766 1716 1522 315 -601 -510 787 1519 1130 776 269
2318B69m42j19J251J204q68j960M3P13R33M16k58q35p56L0P25R84J85o81j540
$$ 269 -173 -292 959 2163 1295 -665 -622 91 1024 1440 1182 347 -409 -379 346 1330 1515 834 -706
2337g06j61Q06J281L24j164p05p01M65J079R05l60r07j633O9J101J799r6j563
$$ -706 -867 -61 1220 1544 380 -325 -1026 -561 518 1423 1063 156 -1477 -1408 -307 1492 1396 -167
2355a67j500q8J245J486J12m93j243j280K54J616J416m02j901j175L39J353J045
$$ -167 -1667 -1755 -510 976 1088 595 -648 -1928 -1674 -58 1358 956 -945 -2120 -1781 -428 617
2372F17K66j313j220l26O36J030J107J04j521j534jK460J038m34j877p14K00R71
$$ 617 883 -430 -1650 -1976 -1340 -310 797 901 -620 -2154 -2155 305 1343 909 -968 -1682 -1482 -511
2390e11J011P00p13j695j300Q03K116R39o24j612j209O68J272J573k6j289j167
$$ -511 500 1200 487 -1208 -2508 -1705 411 1350 726 -886 -2095 -1427 -155 1418 1392 103 -1064
2407a064l21P14J670J061j173j931p95J154J833O61l71j611p53k34Q36K006L93
$$ -1064 -1385 -671 999 2060 887 -1044 -1839 -685 1148 1809 1438 -173 -926 -1160 -324 1682 2075
2424B075j348j673p62J550J754M25p98j412j090R30J085J228m2j197j417l60J513
$$ 2075 727 -946 -1708 -158 1596 2021 1223 -189 -1279 -349 736 1964 1922 725 -692 -1052 461
2441D61J441K95j469j286j39P21J304Q43m15j845j052K21J519J341k83j261j345
$$ 461 1902 2197 728 -558 -697 24 1328 2171 1756 -89 -1141 -920 599 1940 1657 396 -949
2458i49k84J492J741n97o09j113n16K40J053J407m29j945j034O54J562N32J12
$$ -949 -1233 259 2000 1403 794 -319 -835 -595 458 1865 1436 -509 -1543 -889 673 1205 1317
2475A317j115j307l63J177J124J09l87j345p65L43J550J111q32j913m66M97R23
$$ 1317 202 -1105 -1468 -291 833 942 555 -790 -1555 -1212 338 1449 617 -1296 -1762 -1265 -342
2492c42O55O18q80j359n49O44K017K13o09j633j306J373J601L30p41q10p25M1
$$ -342 313 931 51 -1308 -1857 -1213 804 1017 408 -1225 -2531 -1158 443 773 32 -778 -1503 -1462
2510a462Q67R74L58j247j172o3R13J127O25o17j531k17N39J030P08m05n33j259
$$ -1462 -595 379 737 -510 -1682 -1745 -832 295 920 303 -1228 -1445 -906 124 832 427 -106 -1365
2528a365l30J510J670m26j609p53M59P44P26O44n75j180r22Q98J463P6Mr98r66
$$ -1365 -1695 -185 1485 1059 -550 -1303 -844 -100 626 1270 695 -485 -1407 -509 954 1030 1034 36 -930
2547i30n8J656J010p54p54o42j47O24J243L01m48j381p06R46J499J33m57q48p33
$$ -930 -988 668 1678 924 170 -472 -619 5 1248 1549 1101 -280 -986 -40 1459 1592 1135 287 -446
2566d46K80R04N90Q1r79p80l67Q45J328M99j583p79l79J068N28K42J17r05q68
$$ -446 -166 738 1328 1409 430 -350 -717 128 1456 1955 372 -407 -786 282 810 1052 1169 264 -604
2585f04l2J314R39k27j276p61n47J303J405l41q02j240J28M89N07P56p1j383j290
$$ -604 -636 678 1617 1390 114 -647 -1194 109 1514 1173 371 -869 -741 -252 255 1011 940 -443 -1733
2604a733N73J401J160p25p52j201K22Q10O70J61l75j151p48N54J157R22n13j028
$$ -1733 -1160 241 1401 676 -76 -1277 -1055 -245 425 586 211 -940 -1688 -1134 23 945 432 -596
2622e96r72K62J448M21o33o46l00q2J12J298J01l71j200n72P18J342K74n29m90
$$ -596 -1568 -1306 142 563 -70 -716 -1016 -1098 -986 312 413 42 -1158 -1730 -1012 330 604 75 -415
2641d15r62l5R97R98o3j039p54J7J043O43Q3l30o00o13N80R40J86R2j088j000
$$ -415 -1377 -1412 -415 583 520 -519 -1273 -1256 -213 430 513 183 -417 -1030 -450 490 676 768 -320 -1320
2661a320M00O40Q36P10j257j093L12J231M07k41k98l32q18M11R36J164q51j226
$$ -1320 -920 -280 556 1266 9 -1084 -772 459 866 625 327 -5 -823 -412 524 1688 837 -389
2679c89j97M27P97L47p8n34p67J25R64N68j5n18q67n24M90J439N29r92j233J70
$$ -389 -586 -159 638 985 907 373 -394 -269 695 1263 1248 730 -137 -661 -171 1268 1797 805 -428 -258
2699b58O03N07J63j94p31m70l19J094J145j70q88j076l30R75Q35K91o14j020J86
$$ -258 345 852 1015 821 90 -380 -699 395 1540 1370 482 -594 -924 51 886 1177 563 -457 -271
2718b71J51O47K13K9j194p85P53N05R32n00n26p27j39P66O09M43j002j021l10
$$ -271 -120 527 740 769 -425 -1210 -457 48 980 480 -46 -773 -912 -146 463 906 -96 -1117 -1427
2737a427N61J002N31n48j115l86L93J001J20l5m16p23l35L35J390N48o02j727
$$ -1427 -866 136 667 119 -996 -1382 -989 12 132 97 -319 -1042 -1377 -1042 348 896 294 -1433
2755a433n19J142Q49M14l10o73o55p6P75J012J14p67j223l29R58J291L74r27p59
$$ -1433 -1952 -810 39 453 143 -530 -1185 -1261 -486 526 640 -127 -1350 -1679 -721 570 944 17 -742
2774g42n06P25N70K75K90p84q66l63P35J781L7j602o08K06Q97O41K39k37r21p66
$$ -742 -1248 -523 47 322 612 -172 -1038 -1401 -666 1115 1152 -450 -1058 -852 45 686 925 688 -233 -999
2794i99qJ673Q33o42q19j256J96J115J454L41j441j183M6P41P26Q30j43j242j509
$$ -999 -1007 666 1499 857 38 -1218 -1022 93 1547 1888 447 -736 -690 51 777 1607 1464 222 -1287
2813a287N48J742R26p40j104l98m89O86J215P85j088j239k70N56R35Q09j19j692
$$ -1287 -739 1003 1929 1189 85 -313 -802 -116 1099 1884 796 -443 -713 -157 778 1587 1468 -224
2831b24p56M37J114N74j56p26n31m57K70J647L01j054j252k05Q49Q42M78j57j150
$$ -224 -980 -543 571 1145 989 263 -268 -725 -455 1192 1493 439 -813 -1018 -169 673 1151 994 -156
2850a56r57J74J128P04K40j043j014m41J199J115k64o49p76p9rO83N14J65o95
$$ -156 -1113 -939 189 893 1133 90 -924 -1365 -166 949 685 36 -740 -819 -828 -145 369 534 -161
2869a61q99n15J171R80P2p05j070J69L6P12M14k70n48o06J37Q53M46m6p12o18
$$ -161 -1060 -1575 -404 576 648 -57 -1127 -958 -922 -210 204 -66 -614 -1220 -1083 -230 216 170 -542 -1160
2889a160l0R01O35o1n28o24j8j14R69N34jj023q97N33J219L23m50l13m62n12P37
$$ -1160 -1190 -289 346 285 -243 -867 -885 -999 -30 504 503 -520 -1417 -884 335 658 208 -105 -567 -1079 -342
2910c42J092N6n02o45p43M72R94Q60o03r94m27M27O31K31j6p2n97l62L64J300
$$ -342 750 806 304 -341 -1084 -612 382 1242 639 -355 -782 -355 276 507 491 419 -178 -540 -176 1124
2930A124N5q11n81r9Q09J80K66N7q45m29J45O57L55j70n11l47j49O91P00N4r88
$$ 1124 1179 368 -213 -312 497 677 943 1000 155 -274 -129 528 883 713 202 -145 -294 397 1097 1151 163
2951A63n41M45N86j30K6J54m81p01K63R19L25l48r51k58N33O56K17k99n19q38
$$ 163 -378 67 653 523 549 703 222 -479 -216 703 1028 680 -271 -529 4 660 877 578 59 -779
2971g79J42O94Q79k25l32j019k48M53R17K15o90m50N3O8K93N96l82k56q98J17
$$ -779 -637 57 936 711 379 -640 -888 -435 482 697 7 -443 -390 -322 -29 567 185 -71 -969 -852
2991h52Q09Q90l96p98n70P4K87P75J26l25l54o82j29Q77N80j4q28m98L95N61M99
$$ -852 -43 847 451 -347 -917 -843 -556 219 345 20 -334 -1016 -1145 -268 312 298 -530 -1028 -633 -72 427
3012D27k43l88n16l67O50N71M06n32r95k24M70Q72K91j49j018q9J05M34O24Q4
$$ 427 184 -204 -720 -1087 -437 134 540 8 -987 -1211 -741 131 422 273 -745 -834 -729 -295 329 413
3032D13k28p62m12P18J059L38q53m96m20M61M66J72J61n86o17n4M37J200J87q06
$$ 413 185 -577 -989 -271 788 1126 273 -223 -643 -182 284 456 617 31 -586 -640 -203 997 1184 378
3052C78p96l21O18J016K56p97l46j95j03L63J101L52j093j163J7J166R80l93o87
$$ 378 -418 -739 -121 895 1151 354 8 -187 -290 73 1174 1526 433 -730 -713 453 1433 1040 353
3071C53p26J11L41O31J34O7o83r28N83R09K33k1q22l13k08L71R97k51n01p08K81
$$ 353 -373 -262 79 710 844 911 228 -700 -117 792 1025 1004 182 -131 -339 32 1029 778 277 -431 -150
3092a50k1M31O77j50p97j033Q43N44N75p96k33j99m94J94R54N70q00r25OK96O79
$$ -150 -171 260 937 787 -10 -1043 -200 344 919 123 -110 -309 -803 -609 345 915 115 -810 -804 -508 171
3113A71L75l00r06m70P21N76K32P1n79r31j36O46M34L52n66m08l59M70O27L14
$$ 171 546 246 -660 -1130 -409 167 399 470 -109 -1040 -1176 -530 -96 256 -310 -718 -1077 -607 20 334
3133C34m82m14l83K07J21J082P2n26j157J70J126M34l68l53k56l30j79P45O59
$$ 334 -148 -562 -945 -738 -617 465 537 11 -1146 -976 150 584 216 -137 -393 -723 -902 -157 502
3152E02m54o45m08M54L98P21N4j000m26J52O08N91k64L13j285nJ49J042N21k55
$$ 502 48 -597 -1005 -551 -153 568 622 -378 -804 -652 -44 547 283 596 -689 -694 -545 497 1018 763
3172G63j002l96L69P04K70L3p12m82J46L02P28O95p12q95p58J272O41J60o71k92
$$ 763 -239 -635 -266 438 708 741 29 -453 -307 -5 723 1418 706 -189 -947 325 966 1126 455 163
3192A63n48M39N95N98j22n21q39QM72L57P23q14r89j21P19L40M33m8p30l41n15
$$ 163 -385 54 649 1247 1125 604 -235 -227 245 602 1325 511 -478 -599 120 460 893 845 115 -226 -741
3213g41J172O23l82o02l74l7L46N03K20m68m96k97M22N89P14n16q23r37M56P19
$$ -741 431 1054 672 70 -304 -341 5 508 728 260 -236 -533 -111 478 1192 676 -147 -1084 -628 91
3233I1K94R1r32r5Q2j1M60M02k54o03n31K24Q62M26l50n36o68J82P89J23O2k70
$$ 91 385 476 -456 -551 -469 -480 -20 382 128 -475 -1006 -782 80 506 156 -380 -1048 -866 -77 46 108 -162
3255a62o55k40M61P66M56o11n80o02M22K23N86m3j56j104M03N21L36K2j29o23
$$ -162 -817 -1057 -596 170 626 15 -565 -1167 -745 -522 64 21 -135 -1239 -836 -315 21 43 -86 -709
3275g09l75M17R87R7l18n93n29R53J40P21k89n71l88M7O42J53K01j22n63l71L09
$$ -709 -1084 -667 320 417 99 -494 -1023 -70 70 791 502 -69 -457 -410 232 385 586 464 -99 -470 -161
3296a61N79J94l98n09k17J19P78M89K2p85j20k43L74N70J23j41p16k05P9N15M89
$$ -161 418 612 214 -295 -512 -393 385 874 896 111 -9 -252 122 692 815 674 -42 -247 -168 347 836
3317H36l75j76n00O5Q22K39n53k15l39M43l6O6N93p60l70J14J83K51J03j33k26
$$ 836 461 285 -215 -150 672 911 358 143 -196 247 211 277 870 110 -260 -146 37 288 391 258 32
3338C2k22J57K26J47j03k06r2j50M59NO15r41j11j22M99L15q4m02l59Q6r0O22
$$ 32 -190 -33 193 340 237 31 -61 -211 248 253 868 -73 -184 -306 193 508 424 22 -337 -251 -341 281
3360B81l6J06o02l43L08K75J85K02p36k69j42O37L64l17j26r8m08J00O19K64l08
$$ 281 245 351 -251 -594 -286 -11 174 376 -360 -629 -771 -134 230 -87 -213 -311 -719 -619 0 264 -44
3381d4m90n62N34M94N2J4j53n68j8N02N35J96r44n36L28K63L15K15j84n03k03
$$ -44 -534 -1096 -562 -68 -16 -2 -155 -723 -741 -239 296 492 -452 -988 -660 -397 -82 133 -51 -554 -757
3402g57M39O90j84j52n48k77J95N13Q51l86n91n32K61K31O50N7J06o86q65O54
$$ -757 -318 372 188 36 -512 -789 -594 -81 770 384 -207 -739 -478 -247 403 460 566 -120 -985 -331
3422c31P16J91N6p66j23j79M34P36k8n91l55J4L09L10O42l28o12p17M87J151l4
$$ -331 385 576 632 -134 -257 -436 -2 734 706 115 -240 -226 83 393 1035 707 95 -622 -135 1016 982
3443I82n72j85l17o9P19P9O8j1q83j30M47N80l7j04m26n59K91P19qj07l48m44
$$ 982 410 225 -92 -161 558 637 705 694 -189 -319 128 708 671 567 141 -418 -127 592 584 477 129 -315
3465c15K34K38M01M50o43q39j74M66M51L03j49m72m29l28Q24M43N6o63k97j88
$$ -315 -81 157 558 1008 365 -474 -648 -182 269 572 423 -49 -478 -806 18 461 517 -146 -443 -631
3485f31K47O90K85l67p09j13P7M94K92q7j18q63n0M65N94k43l27k92j00M08J08
$$ -631 -384 306 591 224 -485 -598 -521 -27 265 178 60 -803 -853 -388 206 -37 -364 -656 -756 -348 -240
3506b40O51k80q02l38L81L66P01m26j81m45l25M79Q61k69n8n29m32J60Q17M59
$$ -240 411 131 -671 -1009 -628 -262 439 13 -168 -613 -938 -459 402 133 75 -454 -886 -726 91 550
3526E50n34m29m58L82O43k1j94K7o18O7J04R94K96o95n55M3L73L08K73n4p30l98
$$ 550 16 -413 -871 -489 154 133 -61 -34 -652 -585 -481 513 809 114 -441 -398 -25 283 556 502 -228 -626
3548f26N49M01L21l93j55k25l69M40M51M78m30n55L8L55L74p9j15l50l45L40J68
$$ -626 -77 324 645 252 97 -128 -497 -57 394 872 442 -113 -75 280 654 575 460 110 -235 105 273
3569B73J60J89l62m00o4M36O26j68k84n98J1N17L24L9j19m44j18L64J60Q7j73
$$ 273 433 622 260 -140 -204 232 858 690 406 -192 -181 336 660 699 580 136 18 382 542 629 456
3590D56o08M6J96m5K39K11M3p35n6L19P4K88m89m5o05L71M64R2k27k9K0L0k32
$$ 456 -152 -106 90 45 284 495 538 -197 -253 66 140 428 -61 -106 -711 -340 124 216 -11 -40 -20 10 -222
3613b22K22K50j36o81j17L91N38m19R2k26k48o3M24L46q6m21j82q1K80L72J01
$$ -222 0 250 114 -567 -684 -293 245 -174 -82 -308 -556 -619 -195 151 65 -356 -538 -619 -339 33 134
3634A34op20j5L23N38j97k72j53l97j86N90M94q9m21k02L0M31L61L41n82o55K0
$$ 134 128 -592 -607 -284 254 57 -215 -368 -765 -951 -361 133 44 -377 -579 -549 -118 243 584 2 -653 -633
3656f33L39M25L33m28n66k02K92O42K54l26l71j32j69Q11o7K77j90m52K0KN62
$$ -633 -294 131 464 36 -530 -732 -440 202 456 130 -241 -373 -542 269 202 479 289 -163 -143 -141 421
3677D21J40l36n22J17N64r7K91r9k57l35q9O51J04K9l76j75j80L34L53m6k63k76
$$ 421 561 225 -297 -180 384 287 578 479 222 -113 -202 449 553 582 206 31 -149 185 538 492 229 -47
3699d7J62J96R4J41l7l32r9k4M86L89n56k83oj8%M63J79m80m98J7K33M35lO3m16
$$ -47 115 311 405 546 509 177 78 54 540 929 373 90 84 66 66 529 708 228 -270 -253 -20 415 412 475 59
3724E9n54L98OK79k78K93l39j92M5L19N05k86k47m47J1L87J30K32n54m50J19M82
$$ 59 -495 -97 -91 188 -90 203 -136 -328 -283 36 541 255 8 -439 -428 -41 89 321 -233 -683 -564 -82
3746h2J18J57j69k89n21O82J00L76p27l72R8L40J48K43N9q09r0l5N03j7N32n84
$$ -82 36 193 24 -265 -786 -104 -4 372 -355 -727 -629 -289 -141 102 161 -648 -738 -773 -270 -287 245 -339
3768c39l84RN93L02l04N3n59K99j04M30K91k77m64p6J20M54Q9j12L0n47K49L22
$$ -339 -723 -714 -121 181 -123 -70 -629 -330 -434 -4 287 10 -454 -530 -410 44 133 21 51 -496 -247 75
3790G5J97j67o5m01k41L22P85J2m08j91m4k06N51J93o2l68L9l32M96K71j77K15
$$ 75 272 105 40 -361 -602 -280 505 517 109 -82 -126 -332 219 412 350 -18 21 -311 185 456 279 494
3812D94p22r8K46M06K04q2m63n9j17M17M52n0m32o6o6O4L88J13j50m49l77K99
$$ 494 -228 -326 -80 326 530 448 -15 -74 -191 226 678 628 196 130 64 128 516 629 479 30 -347 -48
3834d8N90M1l04m5k40j84M63N2L44l00l68j45J89L59j83pm02j66M5J82N32J18
$$ -48 542 583 279 234 -6 -190 273 325 669 369 1 -144 45 404 221 214 -188 -354 -309 -127 405 523
3856E23n71n12L70K71K74l4m71q2J76k55M69N7k73k60l87J82M90J82j59k2n43
$$ 523 -48 -560 -190 81 355 321 -150 -232 -56 -311 158 215 -58 -318 -705 -523 -33 149 -10 -32 -575
3877e75K27n2J32O27l98m46k76M70M25J02n14m12MK76K33L30o8l48k65p8O34J1
$$ -575 -348 -400 -268 359 -39 -485 -761 -291 134 236 -278 -690 -686 -410 -177 153 85 -263 -528 -606 28 39
3899C9L30m36k75j51K27L41K44n14l50L47m35M43M90k6j70m86J5L10L54J15n54
$$ 39 369 -67 -342 -493 -266 75 319 -195 -545 -198 -633 -190 300 274 104 -382 -367 -57 297 412 -142
3920a42r0L9K10L11O8J07m93m15K3O73J54O8o04L09j87R1K36J95k51k29J94n60
$$ -142 -232 -193 17 328 396 503 10 -405 -382 291 445 513 -91 218 31 122 358 553 302 73 267 -293
3942b93N60K49m1m41j50j28L20M11j29j60j32n9o0M67M0r4m22m08O20N43k28k59
$$ -293 267 516 475 34 -116 -244 76 487 358 198 66 7 -53 414 454 360 -62 -470 150 693 465 206
3964B06J02l18r3L32J33J53k05n26qJ72L93M81p01l38j05L45L92k18n6l41j15
$$ 206 308 -10 -103 229 362 515 310 -216 -224 -52 341 822 121 -217 -322 23 415 197 141 -200 -315
3985c15K57K27j13J46j70p33M59J81L66j19m84J32k63n8K24L72j97q7l73J98M24
$$ -315 -58 169 56 202 32 -701 -242 -61 305 186 -298 -166 -429 -487 -263 109 -88 -175 -548 -350 74
4006G4Qr5m73k83P0K63L99Q7l45k26Q4K43K81k91M5j58J34jl46Q91m15k10k69
$$ 74 82 -13 -486 -769 -699 -436 -37 50 -295 -521 -437 -194 87 -204 -159 -317 -183 -184 -530 361 -54 -264 -533
4029e33K16K27Q9J71l52j98P7Q7M54j76l14Q0J5K32L5j39J45j19j86j16L42L73
$$ -533 -317 -90 -1 170 -182 -380 -303 -216 238 62 -252 -172 -157 75 110 -29 116 -3 -189 -305 37 410
4051D10l00j41J54l4m7K5K64j59k15j95N61k52J24Q6l35k03R5L30J42K06n9p99
$$ 410 110 -31 123 89 42 67 331 172 -43 -238 323 71 195 281 -54 -257 -162 168 310 516 457 -342
4073c42L04K57J12M38m57n39M03K90j85J02K5P1o98J77J83N18m03j08k49J13Q5
$$ -342 -38 219 331 769 312 -227 176 466 281 383 408 479 -219 -42 141 659 256 148 -101 12 97
4094I7K32P5O8r39J22L03L43L85k98l94m87J12N26K08R5k44m41J71k18L67K29
$$ 97 329 404 472 -467 -345 -42 301 686 388 -6 -493 -381 145 353 448 204 -237 -66 -284 83 312
4115C12j13o46J37J88L78j05l4k71k64j80M32K07n7l40q4L22o0J34K89l77l18
$$ 312 199 -447 -310 -122 256 151 117 -154 -418 -598 -166 41 -16 -356 -440 -118 -178 -44 245 -132 -450
4136d50j61K52L96R4j9l80n3l35O55L21M3m40k83J51k82L19K82O3n33M8J02K28
$$ -450 -611 -359 37 131 112 -268 -321 -656 -1 320 363 -77 -360 -209 -491 -172 110 173 -360 -312 -210 18
4158A8j3K67o74N7j11J70O34J2l94l9l23L35L55M8k6n59j84L02L96k87k8K52j32
$$ 18 5 272 -402 -345 -456 -286 348 360 -34 -73 -396 -61 294 342 316 -243 -427 -125 271 -16 -44 208 76
4181G6N8J34J02O0m89J06l13L94J57P8R2l28l42K54J74K32k28J53j88k13M7M26
$$ 76 134 268 370 430 -59 47 -266 128 285 363 455 127 -215 39 213 445 217 370 182 -31 16 442
4203D42jK0m64J3J43J7M53k53r3m72J68L4N21l0mn03J60P8N52j67m63l05K9J96
$$ 442 441 461 -3 10 153 170 623 370 277 -195 -27 7 528 498 494 -9 151 229 781 614 151 -154 -125 71
4227G1N2l2K85m35m32L63K40L15l03k78J68k45J33M34q1j50m95P1J21lL66j75
$$ 71 123 91 376 -59 -491 -128 112 427 124 -154 14 -231 -98 336 255 105 -390 -319 -198 -201 165 -10
4249a0k64j25j2J76N55l52k84k49r4O42L20q8J4n45m20P15n7O4j17j06k30l04
$$ -10 -274 -399 -411 -235 320 -32 -316 -565 -659 -17 303 215 229 -316 -736 -21 -78 -14 -131 -237 -467 -771
4271g71O02K52J01o72J68L8K02L27q6m11m52N61J1K61J29j76n89M68l49O27p0
$$ -771 -169 83 184 -488 -320 -282 -80 247 161 -250 -702 -141 -130 131 260 84 -505 -37 -386 241 171
4292A71K18m55l20J73J91K95k2l04J62j61J63P6J93l5m25j93K73K15j37L39k78
$$ 171 389 -66 -386 -213 -22 273 251 -53 109 -52 111 187 380 345 -80 -273 0 215 78 417 139
4313A39k70R9R6M10j73k11k65K20J75J0K49j1m36k15k14Q17j46j67J64J3k74K24
$$ 139 -131 -32 64 474 301 90 -175 45 220 230 479 468 32 -183 -397 420 274 107 271 284 10 234
4335B34n5L73n00J74j35J44OK5K22p32O3J27J53J99O8K56q66K27J42r5K70j7j44
$$ 234 179 552 52 226 91 235 241 266 488 -244 -181 -54 99 298 366 622 -244 -17 125 30 300 283 139
4358A39m00J53L18N5l36L00k42k42L92k75L41j80l86J81k29N17l7k19j97R0l48
$$ 139 -261 -108 210 265 -71 229 -13 -255 137 -138 203 23 -363 -182 -411 106 69 -150 -347 -257 -605
4379f05K49M36J77l19m49J05J30J21K26k02k13P1J57K8Q1j82M5j96L06l1J62r3
$$ -605 -356 80 257 -62 -511 -406 -276 -155 71 -131 -344 -273 -116 -88 -7 -189 -144 -340 -34 -65 97 4
4401Dk27J05l3J6L20p7k44j65M4K05n0n8J88m4J7q6J4O2Q2l6pk30J80k2K08j08
$$ 4 -223 -118 -151 -135 185 108 -136 -301 -257 -52 -102 -160 28 -16 1 -85 -71 -9 73 37 30 -200 -20 -42 166 58
4427E8l63K5M51j23J34K9m23K02K81j33L3O8Pm68L22K69k36K44k26j12k43K34
$$ 58 -305 -280 171 48 182 211 -212 -10 271 138 171 239 246 -222 100 369 133 377 151 39 -204 30
4449C0N90n35j06J19L8J11k5K94k42pn60N27j11J20K95o37N9J17J94L3R3j06p0
$$ 30 620 85 -21 98 136 247 222 516 274 267 -293 234 123 243 538 -99 -40 77 271 304 397 291 221
4472B21j69K8J70j99L7m78J50L32J3R0Kk05nm09M08L80k50j39l7n2RK86J67m50
$$ 221 52 80 250 51 88 -390 -240 92 105 195 197 -8 -13 -422 -14 366 116 -23 -60 -112 -103 183 350 -100
4496a00j85k53K92J46K39k38q6j0j90K36N91n97r2k77j43L57J56K83k38k74j7
$$ -100 -285 -538 -246 -100 139 -99 -185 -195 -385 -149 442 -155 -247 -524 -667 -310 -154 129 -109 -383 -400
4517d00K22j1q8K04k65l17l0M55K34j30Kk65L21k57J03K07J79l93j95O1N14R8
$$ -400 -178 -189 -277 -73 -338 -655 -685 -230 4 -126 -124 -389 -68 -325 -222 -15 164 -229 -424 -363 151 249
4539B49j43l57j51JM05M4k0m4r4j59K02K96lj07j55k62Q2O65j09j20o1n16M48
$$ 249 106 -251 -402 -401 4 48 28 -16 -110 -269 -67 229 226 119 -36 -298 -216 449 340 220 159 -357 91
4562I1l57N52k49K76j38m15R1L77J32o8r0k64K64J33q1Pp7j62J44j2J42M1o5l94
$$ 91 -266 286 37 313 175 -240 -149 228 360 292 202 -62 202 335 254 261 184 22 166 154 296 337 272 -122
4586a22r3K1N67K01q4l74m36L79l6L02j00J23n81L38j10N25k57l53J79k40J09
$$ -122 -215 -194 373 574 490 116 -320 59 23 325 225 348 -233 105 -5 520 263 -90 89 -151 -42
4607d2k07P12m68j47K0j00J7M28k59J1Q7l56K27J61J40l62l68K81k47L26J74K7
$$ -42 -249 463 -5 -152 -132 -232 -215 213 -46 -35 52 -304 -77 84 224 -138 -506 -225 -472 -146 28 55
4629E5l04j55K4J67N08l07J6k83j53J49L30k42L16k04o2k07L91L5m25J27L25n70
$$ 55 -249 -404 -380 -213 295 -12 4 -279 -432 -283 47 -195 121 -83 -145 -352 39 74 -351 -224 101 -469
4651d69j6K30J44rJ41j79L42%j40J9j80q6j44O38p6m0j56j73J33p6L48J50m05
$$ -469 -485 -255 -111 -120 21 -158 184 184 44 63 -117 -203 -347 291 215 175 19 -154 -21 -97 251 401 -4
4674do0K5L7q8L09k33J15l16L34j38J08j32Q0K38l09J89j40P50n71j39N5K64j85
$$ -4 -64 -39 -2 -90 219 -14 101 -215 119 -19 89 -43 37 275 -34 155 15 765 194 55 110 374 189
4697A89m5J91j05l41J52L09o6j0K3k69j49J84K58J26m73j82L02J61j76P6J92k30
$$ 189 144 335 230 -111 41 350 284 274 297 28 -121 63 321 447 -26 -208 94 255 79 155 347 117
4719A17m0O1J66J19l72Jk63K95j25K22P9k71K03j18O7N5J17k72j49P8O5q4J95
$$ 117 77 138 304 423 51 52 -211 84 -41 181 260 -11 192 74 141 196 313 41 -108 -30 35 -49 146
4742A46o7j31j53p8N63j48j56N7l68p6L52J32l25K61j28l5qk3J18M9p5j23M9j14
$$ 146 79 -52 -205 -283 280 132 -24 33 -335 -411 -59 73 -252 9 -119 -154 -162 -185 -67 -18 -93 -216 -167 -281
4766b81J50J02n9Q2l74L10K14j76l03J29Q1m0J70J84j22J9j64O6J42k34J18J35
$$ -281 -131 -29 -88 -6 -380 -70 144 -32 -335 -206 -125 -165 5 189 67 86 -78 -12 130 -104 14 149
4788A49j3k69j80N17j03p9r6J39Q3j86J61j62o7k74J41L10J77R3L2l9o88L15J75
$$ 149 136 -133 -313 204 101 22 -74 65 148 -38 123 -39 -106 -380 -239 71 248 341 373 334 -354 -39 136
4811A36J54k22j3J5R5R1q5O7j76j55J77J70pk19j34K24OJ24L2q3R6k19j1o4L71
$$ 136 290 68 55 70 165 256 171 238 62 -93 84 254 247 28 -106 118 124 248 280 197 293 74 63 -1 370
4836C70j19j75J05n04J34K03K00m05L14o9OM12l47M7Kl04j9R7J90R5j76j86j47
$$ 370 251 76 181 -323 -189 14 214 -191 123 54 60 472 125 172 174 -130 -149 -52 138 233 57 -129 -276
4859b76LL25K50j18n91N27pq1J7R2Ol60r0K20J40L02k32j55l26J19J38L26k31
$$ -276 -273 52 302 184 -407 120 113 32 49 141 147 -213 -303 -83 57 359 127 -28 -354 -235 -97 229 -2
4882bk15qJ17m9L19l17J5j99l31L49K16K18m14K5q2o2L4M67m09J30l25M85l6j41
$$ -2 -217 -225 -108 -157 162 -155 -140 -339 -670 -321 -105 113 -301 -276 -358 -420 -386 81 -328 -198 -523 -38 -74 -215
4906b15K08p3n46M59M5n6J65J54l75R0j39L80P1J6r0l45K87M3J82n6J07m60M9
$$ -215 -7 -80 -626 -167 -122 -178 -13 141 -234 -144 -283 97 168 184 94 -251 36 79 261 205 312 -148 -99
4929i9r0L73k49L82j62l59J98M3J02l6j92M5J14jK73l45K38j76m64L03M74j0r4
$$ -99 -189 184 -65 317 155 -204 -6 37 139 103 -89 -44 70 69 342 -3 235 59 -405 -102 372 362 268
4952B68k81J03j05J99l3m5J44k92J33kK25j24n3J23n77K52J82O3R5l92J22lm2
$$ 268 -13 90 -15 184 151 106 250 -42 91 89 314 190 137 260 -317 -65 117 180 275 -117 5 2 -40
4975d0K72p8L4l53k2P1N49k16j78Rm83L50K15j10Q0J56n29K14J49M6J35n04Q0
$$ -40 232 154 188 -165 -187 -116 433 217 39 48 -435 -85 130 20 100 256 -273 -59 90 136 271 -233 -153
4998a53j30K99j72J25J78k43l76K05O8L13L01m98K7kk14K39k17J20k22P5K70q0
$$ -153 -283 16 -156 -31 147 -96 -472 -267 -199 114 415 -83 -56 -58 -272 -33 -250 -130 -352 -277 -7 -87
5020h7j11K33J38m89N43m55K64j34lj0o1P5O4J5j42J92k01k5N5K67k06J02J19
$$ -87 -198 35 173 -316 227 -228 36 -98 -101 -111 -172 -97 -33 -18 -160 32 -169 -194 -139 128 -78 24 143
5043A43n21N04j6K6l0k42J6J11J08m9L1j27N1J64M8Q6jl91o1J21K37K0K8m44J75
$$ 143 -378 126 110 136 106 -136 -120 -9 99 50 81 -46 5 169 217 303 302 -89 -150 -29 208 228 256 -188 -13
5068a3K09l0j73J98j98K35k62Q8L37j32l34k28N55J47l02Nk0mLJ16j33K57%j6
$$ -13 196 166 -7 191 -7 228 -34 54 391 259 -75 -303 252 399 97 102 82 78 81 197 64 321 321 305
5092C05l78K92J29l78J33J68k11j59K96K5j73K25k45j45J71J27j25nL4o0O2l30
$$ 305 -73 219 348 -30 103 271 60 -99 197 222 49 274 29 -116 55 182 57 52 86 26 88 -242
5114b42M91j63qn4j93K04Ol4j92K69m75J88K39J39q3k36n8m2N0q6J49l0K02j31
$$ -242 249 86 78 24 -169 35 41 7 -185 84 -391 -203 36 175 92 -144 -202 -244 -194 -280 -131 -161 41 -90
5138i0j14m8M59k22m4M8j48K8L26Pm66L8l4J54J13j3j07q0J09k04N26q4o5j82
$$ -90 -204 -252 207 -15 -59 -11 -159 -131 195 202 -264 -226 -260 -106 7 -6 -113 -193 -84 -288 238 154 89 -93
5162i3k54P4K29K82n99M64j37j74L32j88K67k41j17j42K30L20j56q8K74k47l41
$$ -93 -347 -273 -44 238 -361 103 -34 -208 124 -64 203 -38 -155 -297 -67 253 97 9 283 36 -305
5183c05K27J43L08j65k33k34J61L76k00K09j0m61J6N47k2n3l9m83K16pK65J35
$$ -305 -78 65 373 208 -25 -259 -98 278 78 287 277 -184 -168 379 357 304 265 -218 -2 -9 256 391
5205C91p0j99j71J39J2J86O7l66K20n9j23N10n50J47Pk00M4M50p7k23k78j11J03
$$ 391 321 122 -49 90 102 288 355 -11 209 150 27 537 -13 134 141 -59 -15 435 358 135 -143 -254 -151
5228a51NM52k62J01j45Q3m86O72j84k47L8k07K86J91P3k35n0j84L60rj39j76L92
$$ -151 -146 306 44 145 0 83 -403 269 85 -162 -124 -331 -45 146 219 -16 -66 -250 110 101 -38 -214 178
5251A78m00r3J97P1j01j4k16kL65q4K86j89%k40k29J48Q08o56K80l29l04M11m2
$$ 178 -222 -315 -118 -47 -148 -162 -378 -380 -15 -99 187 -2 -2 -242 -471 -323 485 -171 109 -220 -524 -113 -155
5274a55R9j43l8L9L4J11J37j96P2J0o7OJ26k21j21J84j4k41M09n6Q6j96j78L40
$$ -155 -56 -199 -237 -198 -164 -53 84 -112 -40 -30 -97 -91 35 -186 -307 -123 -137 -378 31 -25 61 -135 -313 27
5298B7LK80m55K21l15J25L01j61M1j73o0J3J89J42N7l58j51L57J54j66j47N9J48
$$ 27 30 310 -145 76 -239 -114 187 26 67 -106 -166 -153 36 178 235 -123 -274 83 237 71 -76 -17 131
5321A31J39j51m42L28L7J01M5j76N9L2j29o5J11j97L55j18L46m39O5O9j29M20
$$ 131 270 119 -323 5 42 143 188 12 71 103 -26 -91 20 -177 178 60 406 -33 32 101 -28 392
5343C92j40k57J53n8l82M69O4n9k20k06J49L0K26l58M65l27j86L78j74N25n16
$$ 392 252 -5 148 90 -292 177 241 182 -38 -244 -95 -65 161 -197 268 -59 -245 133 -41 484 -32
5364c2Rl07M05k0m2j54J9j64K91J04l02p6N7L67j90l18J79L39l51P2l1Q7j33J62
$$ -32 -23 -330 75 55 13 -141 -122 -286 5 109 -193 -269 -212 155 -35 -353 -174 165 -186 -114 -145 -58 -191 -29
5388b9P9r9j19N7k92K98N3Ok4k22J93j3R1j4k33L8J42j72K23J9k88L53n5J7j29
$$ -29 50 -49 -168 -111 -403 -105 -52 -46 -70 -292 -99 -112 -21 -35 -268 -230 -88 -260 -37 -18 -306 47 -8 9 -120
5413a20J27L2j24j6r7J80J04qk07J00Q2K34k78J56l72J21N2n9K14J91k93j7o7
$$ -120 7 39 -85 -101 -198 -18 86 78 -129 -29 53 287 9 165 -207 -86 -34 -93 121 312 19 2 -65
5436f5K47j77P3Q5k30L30J5k62J48o8P2Q5m67L01J24Jj21Rk81J68L66j60n3j9
$$ -65 182 5 78 163 -67 263 278 16 164 96 168 253 -214 87 211 212 91 100 -181 -13 353 193 140 121
5460A21j8j17J28Q3j28J19K24n18K41K14k85N82n45o9k73J35Q0j02J15K93R7j97
$$ 121 103 -14 114 197 69 188 412 -106 135 349 64 646 101 32 -241 -106 -26 -128 -13 280 377 180
5482A80j29m4j1l03N4K41L4k33M27j50J85j90Q7k25o2j0K3K63j12N2O2k47Oo2
$$ 180 51 7 -4 -307 -253 -12 22 -211 216 66 251 61 148 -77 -139 -149 -126 137 25 77 139 -108 -102 -164
5506a64j48M78n51K03O7K45j42j90J51l6k31m0L49o8J02P5l26J91j17k0L39k57
$$ -164 -312 166 -385 -182 -115 130 -12 -202 -51 -87 -318 -358 -9 -77 25 100 -226 -35 -152 -172 167 -90
5528i0J27q9J06k09Q7K90l84J95l01K8P3K84pm92J08M64l50J39K8p4j24J7K75
$$ -90 37 -52 54 -155 -68 222 -162 33 -268 -240 -167 117 110 -382 -274 190 -160 -21 7 -67 -191 -174 101
5551A01r2K03j15O6l56M4J8J50q0J01j29j13L24K08j38r0pm87J92L26J48l5m19
$$ 101 9 212 97 163 -193 -149 -131 19 -61 40 -89 -202 122 330 192 102 95 -392 -200 126 274 239 -180
5574a80K88r4n5J15r8J00J93k03J92j75M65l49m06K33k11N6M99k9j92j63Q5K16
$$ -180 108 14 -41 74 -24 76 269 66 258 83 548 199 -207 26 -185 -129 370 341 149 -14 71 287
5596B87p1j8l36j41P3Q0P9J74N7j41P1p5k98N64k27k58N5K0j68M21o7r7k74M21
$$ 287 216 198 -138 -279 -206 -126 -47 127 184 43 114 39 -259 305 78 -180 -125 -105 -273 148 81 -16 -290 131
5620A31l54J97O0o6J07l25L28p4p6L23k02j37j50k8J19J32Q2l19k05L04j18L13
$$ 131 -223 -26 34 -32 75 -250 78 4 -72 251 49 -88 -238 -266 -147 -15 67 -252 -457 -153 -271 42
5642D2L4j96K1k42K10m0J84j6l30J86R4m3n2O3k3j41M3M8J82p7L83m51l54N26
$$ 42 76 -120 -99 -341 -131 -171 13 -3 -333 -147 -53 -96 -148 -85 -108 -249 -206 -158 24 -53 330 -121 -475 51
5666E1j97K69k96O4k16M4J81O4K76P0n65L8j8O43l32j22j27J93K87k8j58J9j97
$$ 51 -146 123 -173 -109 -325 -281 -100 -36 240 310 -255 -217 -235 408 76 -46 -173 20 307 279 121 140 -57
5689e7n9J31K98k54k70L41j48J18P0M2O4l70J72J29l66M07p5K9k06N1j03j4J91
$$ -57 -116 15 313 59 -211 130 -18 100 170 212 276 -94 78 207 -159 248 173 202 -4 47 -56 -70 121
5712A21r7K58k70K54j68l80L26j02J03M01l86Q3PK44l13K34l02J74k17j34M08
$$ 121 24 282 12 266 98 -282 44 -58 45 446 60 143 150 394 81 315 13 187 -30 -164 244
5733B44l22J69j84J58J68j46N8kk80j4J01J37k13J38Q3j%p4j12J54l7j44J56K30
$$ 244 -78 91 -93 65 233 87 145 143 -137 -151 -50 87 -126 12 95 94 94 20 -92 62 25 -119 37 267
5757B67n23RJ06J71R9l50K71l45M67N5j81l72M55k31l54M99L2q1ro5pj38m3L83
$$ 267 -256 -247 -141 30 129 -221 50 -295 172 227 46 -326 129 -102 -456 43 75 -6 -15 -80 -87 -225 -268 115
5781A15J77o54L75O6j32K86m69k4L0K28j31J13rn0M5r5j58L3L01J40o41L57O0
$$ 115 292 -362 13 79 -53 233 -236 -260 -230 -2 -133 -20 -29 -79 -34 -129 -287 -254 47 187 -454 -97 -37
5804c7J72K30m41K03j3k11L61l36J20j46K51m76R3j7K67K19l45Rm8K62q3K44j16
$$ -37 135 365 -76 127 114 -97 264 -72 48 -98 153 -323 -230 -247 20 239 -106 -97 -145 117 34 278 162
5827A62l20M64p7k17L24k40P2l42Q5L6q1L12j12j81K80k46L28o9J5j78k31K22
$$ 162 -158 306 229 12 336 96 168 -174 -89 -53 -134 178 66 -115 165 -81 247 178 193 15 -216 6
5849FQ4K79l63M59m87N8LN7pJ18j75lK29k70L1l39K16J67k3j20n2J21p4j07j87
$$ 6 90 369 6 465 -22 36 39 96 89 207 32 29 258 -12 19 -320 -104 63 40 -80 -132 -11 -85 -192 -379
5874c79L6L95j04P5l83K45K8R1J55l70J46l1l4n1K05l8k63J24L8j4J5J77l44J43
$$ -379 -343 52 -52 23 -360 -115 -87 4 159 -211 -65 -96 -130 -181 24 -14 -277 -153 -115 -129 -114 63 -281 -138
5898a38j67J92L70l92J21q8j58Q2P7J64J98k89k49L11J95o8k88K35m49J89jJ1
$$ -138 -305 -113 257 -135 -14 -102 -260 -178 -101 63 261 -28 -277 34 229 161 -127 108 -341 -152 -153 -142
5920a42J23j32j29L11j17L12m58M49k16j27J37L6M4p6J11k72JK33J76j40l56K7
$$ -142 -19 -151 -280 31 -86 226 -232 217 1 -126 11 47 91 15 126 -146 -145 88 264 124 -232 -205
5942b05K38J0K08o5l5l27N2J32m6P1j1o5j87K5L32oj56k9M3J59P4r4J62j85O0
$$ -205 33 43 251 186 151 -176 -124 8 -38 33 22 -43 -230 -205 127 121 -35 -64 -21 138 212 118 280 95 155
5967A55k41K63p2L10k08k47q3J73L1k44L49n9j61L24j81n7Nm5r4r1j08K83J0J55
$$ 155 -86 177 105 415 207 -40 -123 50 81 -163 186 127 -34 290 109 52 57 12 -82 -173 -281 2 12 167
5991A67k56J03l40M01l3Q2Oj70j43J55j3L86l50k5J29r9R4k21j54J5l7M15k24
$$ 167 -89 14 -326 75 42 124 130 -40 -183 -28 -41 345 -5 -30 99 0 94 -127 -281 -266 -303 112 -112
6014a12R7Jl10K16m38O13j37m9K45l30M8n0K50l23J97K30m89L27R0J05k85L3j8
$$ -112 -15 -14 -324 -108 -546 67 -70 -119 126 -204 -156 -206 44 -279 -82 148 -341 -14 76 181 -104 -71 -89
6037h9M22r2l25K61o08L72k53J79L13k15K87k00K10m07l66N21k48L94j52M5l37
$$ -89 333 241 -84 177 -431 -59 -312 -133 180 -35 252 52 262 -145 -511 10 -238 156 4 49 -288
6058b88J78R3J79R8m60j67L22j9J29j2j2J15l99K96j45L63n59oJ76L59m89M92
$$ -288 -110 -17 162 260 -200 -367 -45 -64 65 53 41 156 -243 53 -92 271 -288 -294 -118 241 -248 244
6080B44l36K01O6%L7l99K15L8p9j5J45j95J7J52k2l8K35l86K52m5P7j88K19Qj75
$$ 244 -92 109 175 175 212 -187 28 66 -13 -28 117 -78 -61 91 69 31 266 -120 132 87 164 -24 195 203 28
6105B8j8J03K5k85J77N2J7j22j4Pm0K80j34k78L39k01L8J75O0l73L46n07K94j71
$$ 28 10 113 138 -147 30 82 99 -23 -37 -30 -70 210 76 -202 137 -64 -26 149 209 -164 182 -325 -31 -202
6129b02J28K10p8j08j87L31k79N1J35mm04N11J03l68J66r6N9j75L83k75L18k01
$$ -202 -74 136 58 -50 -237 94 -185 -134 1 -3 -407 104 207 -161 5 -91 -32 -207 176 -99 219 18
6151A8j73j32K22J03l72L94k6J93j01K07j24k52p8J18J75l20J89j27l9J79k11
$$ 18 -155 -287 -65 38 -334 60 34 227 126 333 209 -43 -121 -3 172 -148 41 -86 -125 54 -157
6172a57J86j18L13j18l7k12K53j66j50K63j8k45L79k33k40L16J01k1j4l5J63k61
$$ -157 29 -89 224 106 69 -143 110 -56 -206 57 39 -206 173 -60 -300 16 117 96 82 47 210 -51
6194e1J43l33J26J16L21k73Q7k67K69P1k02p8J68j20J11o5J93N0l10J9l5J39q8
$$ -51 92 -241 -115 1 322 49 136 -131 138 209 7 -71 97 -23 88 23 216 266 -44 -25 -60 79 -9
6217iL4R0r2k8M5n8N6J38Q9k99L6L34l94k54M15k37K48k37J09K02k00o6K9k3k04
$$ -9 25 115 23 -5 40 -18 38 176 265 -34 2 336 -58 -312 103 -134 114 -123 -14 188 -12 -78 -49 -72 -276
6242b76M10k99j60J31M36l10k4l0L11l90L23j68j65l8K16J60j78K75l90M62j19
$$ -276 134 -165 -325 -194 242 -68 -92 -122 189 -201 122 -46 -211 -249 -33 127 -51 224 -166 296 177
6263A77o2n03N8J31p5K58m8N8j90q6L71P7k74m6j13j4L65J81l10j24R5p4J63o5
$$ 177 115 -388 -330 -199 -274 -16 -64 -6 -196 -282 89 166 -108 -154 -267 -281 84 265 -45 -169 -74 -148 15 -50
6287e0J4Ok3P9l7l2n1p6L44r5k89J58J29j37J63j53L6K3m4j31J59qK7M0R3J35
$$ -50 -36 -30 -53 26 -11 -43 -94 -170 174 79 -210 -52 77 -60 103 -50 -14 9 -35 -166 -7 -15 12 52 145 280
6313B80l66N6J75k43J87k75R9K45L0l67L81N6k53K20j40l73K01L67k12r0L18m8
$$ 280 -86 -30 145 -98 89 -186 -87 158 188 -179 202 258 5 225 85 -288 -87 280 68 -22 296 248
6335B48j47L0k31J17o2J04j10R6J83j6j87Lj17J00m4L99n02K42l2O3J64l65M22
$$ 248 101 131 -100 17 -45 59 -51 45 228 212 25 28 -89 11 -33 366 -136 106 74 137 301 -64 358
6358C58k83k90jJ01j63L49M1k84j28K00J4M05j13m13N12j79q0l6k56K87l37J35
$$ 358 75 -215 -216 -115 -278 71 112 -172 -300 -100 -86 319 206 -207 305 126 46 10 -246 41 -296 -161
6380a61J90k57M21p9j25r3L26rl3k61L2J49k70oK8L61O0j78k81J44p8J08k02K07
$$ -161 29 -228 193 114 -11 -104 222 213 180 -81 -49 100 -170 -176 -148 213 273 95 -186 -42 -120 -12 -214 -7
6404gj69KJ97L7J3l7l85L19J3l5L14l35J97j32j92M5J20L78m52k39L40K15k06
$$ -7 -176 -174 23 60 73 36 -349 -30 -17 -52 262 -73 124 -8 -200 -155 -35 343 -109 -348 -8 207 1
6427Al6j22L38r6L1r3O0j30L25l40N22l97k52N21l64K38k27j68M33j63m1r4R1
$$ 1 -35 -157 181 85 116 23 83 -47 278 -62 460 63 -189 332 -32 206 -21 -189 244 81 40 -54 37
6450C7J2j21M46l85O6KJ94j80K30J31l77J10q8J2K54j92k4k10P5Q7q9m0L2L78
$$ 37 49 -72 374 -11 55 57 251 71 301 432 55 165 77 89 343 151 127 -83 -8 79 -10 -50 -18 360
6474C60m70J39j8R5M8m16M05P4k23j15N17l36l1O9J54k91K4r3J11j06O7k3K78
$$ 360 -110 29 11 106 154 -262 143 217 -6 -121 396 60 29 98 252 -39 -15 -108 3 -103 -36 -59 219
6497B19j13J25k88J21L7J1j08K73k46p5K32k19K6k2O2k94O09l37l7O3Kj13Q4n1
$$ 219 106 231 -57 64 101 112 4 277 31 -44 188 -31 -5 -27 35 -259 350 13 -24 39 41 -72 12 -39
6521c9J9O7K01o17K74J14k7O9j07k94k46N33o3L46j24l84J83r9K7K36j38J46k15
$$ -39 -20 47 248 -369 -95 19 -8 61 -46 -340 -586 -53 -116 230 106 -278 -95 -194 -167 69 -69 77 -138
6544a38n4K38j53J64j80r1J25m8L78m10M16j93j4k69K16K32k30k45N36l59J24
$$ -138 -192 46 -107 57 -123 -214 -89 -137 241 -169 247 54 40 -229 -13 219 -11 -256 280 -79 45
6565D5q1j18P7R9k19K59K9J4J57o5J14m01J39j13j11N34k76p5j47k37J21M65k23
$$ 45 -36 -154 -77 22 -197 62 91 105 262 197 311 -90 49 -64 -175 359 83 8 -139 -376 -255 210 -13
6588a3L85m53J10p4K8j9k22K27K44p8Lpl75M14j13L8j18K14q9j58O6N1J4j97n7
$$ -13 372 -81 29 -45 -17 -36 -258 -31 213 135 138 131 -244 170 57 95 -23 191 102 -56 10 61 75 -122 -179
6613a79J41k38M35j98j31P1o6K46k60K15m4J18j47K8j08j96K08m0J91j38J58J99
$$ -179 -38 -276 159 -39 -170 -99 -165 81 -179 36 -8 110 -37 -9 -117 -313 -105 -145 46 -92 66 265
6635B65m35L81k22m3k18J22J82N5J02k90J29k18P3J39K0j76J7j58M77j85o9J68
$$ 265 -170 211 -11 -54 -272 -150 32 87 189 -101 28 -190 -117 22 42 -134 -117 -275 202 17 -52 116
6657A16k76L0K01j8J33r8j06N1j30j20L49K58n26oK41m04N5J89J47n9k64M9N82
$$ 116 -160 -130 71 53 186 88 -18 33 -97 -217 132 390 -136 -142 99 -305 -250 -61 86 27 -237 -188 394
6680C94n28L0K95m6Nj45j8J74m4l55J15M1K74j40K89j51l04KJ16j76L86m09O1
$$ 394 -134 -104 191 145 150 5 -13 161 117 -238 -123 -82 192 52 341 190 -114 -112 4 -172 214 -195 -134
6703a34L74O6j50p4N7p0k23L37j9J1j65k05K99j0r0J76M7m62mL16K5K08k84lJ26
$$ -134 240 306 156 82 139 69 -154 183 164 175 10 -195 104 94 4 180 227 -235 -239 77 102 310 26 23 149
6728A49k51O9O5j95J92m7L1R5q7KK30l21J89J47j34n5j19j07R1K17k60N14l12
$$ 149 -102 -33 32 -163 29 -18 13 108 21 23 253 -68 121 268 134 79 -40 -147 -56 161 -99 415 103
6751A03N9m38M0N33l71r8K40R0k83OJ06J14Jk64L14j95k0k31J55P1n3J15k05K56
$$ 103 162 -276 -236 297 -74 -172 68 158 -125 -119 -13 101 102 -162 152 -43 -63 -294 -139 -68 -121 -6 -211 45
6775D5jl36K40L77m74J60J72l18J93j02K36M8l20k8L11k22J63j31k54N09l27l
$$ 45 44 -292 -52 325 -149 11 183 -135 58 -44 192 240 -80 -108 203 -19 144 13 -241 268 -59 -62
6797f2K74l09J21L4J03k69K08j48j4L8m7J09J72q6k7J94l90O3J42j6J18l94L42
$$ -62 212 -97 24 58 161 -108 100 -48 -62 -24 -71 38 210 124 97 291 -99 -36 106 90 208 -186 156
6820A56M0k98M21k16N0Nj49J03j93K7K17N7k08j16M07j08j79k37P6J80R4j84J52
$$ 156 196 -102 319 103 153 158 9 112 -81 -54 163 220 12 -104 303 195 16 -221 -145 35 129 -55 97
6843I7K4l62L88q2Q5j95j02K98J84l11J93j10l92K50m6J17j27J37k4m9R0J23j78
$$ 97 121 -241 147 65 150 -45 -147 151 335 24 217 107 -285 -35 -81 36 -91 46 22 -27 63 186 8
6866HNk00J10K3K5N4k79M26p2k24J66OJ25l57M4OL5N5k3J58j42M2o5K00j41K30
$$ 8 13 -187 -77 -54 -29 25 -254 172 100 -124 42 48 173 -184 -140 -134 -99 -44 -67 91 -51 -9 -74 126 -15 215
6892B15m89K52m8k0p5M0J05k23L18k91N71k93l00L49Jr3n1j2m6L11j02n20R5M46
$$ 215 -274 -22 -70 -90 -165 -125 -20 -243 75 -216 355 62 -238 111 112 19 -32 -44 -90 221 119 -401 -306 140
6916A40n0r0j87K07k17P3J07l90M07L13k97M4k63L17J69l82K05j32k88K48K49
$$ 140 90 0 -187 20 -197 -124 -17 -407 0 313 16 60 -203 114 283 -99 106 -26 -314 -66 183
6937A83m01K93j34K12k47O8L94l64K35k11l3n9K59p3l89M15j03J42j26K44k34
$$ 183 -218 75 -59 153 -94 -26 368 4 239 28 -5 -64 195 122 -267 148 45 187 61 305 71
6958G1K8j3mk97J31K69K1l39o7L36j50L82l99J2m7J85L2j50M5l6K28o8l01j24
$$ 71 99 86 82 -215 -84 185 206 -133 -200 136 -14 368 -31 -19 -66 119 151 1 46 10 238 170 -131 -255
6982b55J58lL9L54j31k33q0J05N4k05MK68L22q3l62qJ25n5l03M07m16L80R2l28
$$ -255 -97 -100 -61 293 162 -71 -151 -46 8 -197 -193 75 397 314 -48 -56 69 14 -289 118 -298 82 174 -154
7006a54m5J46J8o9LR8M0m96N94Q9k49j31K75j12m08K08o7M31m58L56k10J21j78
$$ -154 -199 -53 -35 -104 -101 -3 37 -459 135 224 -25 -156 119 7 -401 -193 -260 171 -287 69 -141 -20 -198
7029a98JL21j98O3k46K08J00j65j43L10k19J7J73j06k2K25J79m61P1L01j53O3
$$ -198 -197 124 -74 -11 -257 -49 51 -114 -257 53 -166 -149 24 -82 -104 121 300 -161 -90 211 58 121
7051A21m06L05K43m03M80j63l09J26o4L6J68j07P2j72N5j31J11L96k23m2j91J18
$$ 121 -285 20 263 -140 340 177 -132 -6 -70 -34 134 27 99 -73 -18 -149 -38 358 135 93 -98 20
7073B0J46k3jj7M0m03L07J6j55K14k82L56k17Q7R9l21K1K70J88n1q7n1k93j55
$$ 20 166 143 142 125 165 -238 69 85 -70 144 -138 218 1 88 187 -134 -113 157 345 294 207 156 -137 -292
7097b92J58K20k22K67j27j32Q1J95K0Rl24K81Q3k99J83k42K47r2J04l39J62L4
$$ -292 -134 86 -136 131 4 -128 -47 148 168 177 -147 134 217 -82 101 -141 106 14 118 -221 -59 -25
7119b5m9Qk05L74j35K0j37K26j98L39k80J88r8N0k30J19O4J70k94J90j96L74n56
$$ -25 -74 -66 -271 103 -32 -12 -149 77 -121 218 -62 126 28 78 -152 -33 31 201 -93 97 -99 275 -281
7142b81L04N4j08q8L4%Q7k68J93J9J9r5O4L45j76m0j17J84m48K43J09m2N8oo2
$$ -281 23 77 -31 -119 -85 -85 2 -266 -73 -54 -35 -130 -66 279 103 63 -54 130 -318 -75 34 -8 50 44 -18
7167a8M7J27J79l60J0m5J91k92K76j75M8p4j79N28k25j96j79O18l45L7m23L28
$$ -18 29 156 335 -25 -15 -60 131 -161 115 -60 -12 -86 -265 263 38 -158 -337 281 -64 -27 -450 -122
7189a22L98k50j98J31K4L22k79Jl3k1l7n9L32k04j39K14m4J25j14k93K54J69l26
$$ -122 276 26 -172 -41 -17 305 26 27 -6 -27 -64 -123 209 5 -134 80 36 161 47 -246 8 177 -149
7212a49M7K09J96l59J41K22n26K43K49j45k40O9J99m37K57o6P2J29k22K5L55q2
$$ -149 -102 107 303 -56 85 307 -219 24 273 128 -112 -43 156 -281 -24 -90 -18 111 -111 -86 269 187
7234A87j3k61j43M13n0n02J83J51J08L8j17O9m67K35J43n9j40p1Q2M32k15k3l14
$$ 187 174 -87 -230 183 133 -369 -186 -35 73 111 -6 63 -404 -169 -26 -85 -225 -296 -214 218 3 -20 -334
7257c34L66j46j0J15L9n4m9j7R5j05L5O6n6j20J64q9L36j15k12k45L18M1l3p6
$$ -334 32 -114 -124 -9 30 -24 -73 -90 5 -100 -65 1 -55 -175 -11 -100 236 121 -91 -336 -18 23 -10 -86
7281h6j16J20J49P3n53N25m49Q0L09L64m84j0k4k86K63L6J56k4J37l77K32r3j9
$$ -86 -202 -82 67 140 -413 112 -337 -257 52 416 -68 -78 -102 -388 -125 -89 67 43 180 -197 35 -58 -77
7304g7O3p0K62j35J28O2k83m7J99j75J78l9m4k6m2k01J84P3r8R9n7j4M02l20j64
$$ -77 -14 -84 178 43 171 233 -50 -97 102 -73 105 66 22 -4 -46 -247 -63 10 -88 11 -46 -60 342 22 -142
7329a42K74K5o5K02k86n1n1K17j92L7M22j61j31M2j38K05o8Q2j67J88l34O4K33
$$ -142 132 157 92 294 8 -43 -94 123 -69 -32 390 229 98 140 2 207 139 221 54 242 -92 -28 205
7352B05m73L07L9J97k70j02Q0J66k13J04m5k91N67q9k13K9K72j25p7k70O01n28
$$ 205 -268 39 78 275 5 -97 -17 149 -64 40 -5 -296 271 182 -31 -2 270 145 68 -202 399 -129
7374a29K54l77N2N17m11K26k92K51q5j35L08j17J18m53K28R1K7Q1n9k01p2O0J21
$$ -129 125 -252 -200 317 -94 132 -160 91 6 -129 179 62 180 -273 -45 46 73 154 95 -106 -178 -118 3
7397CJ31p7J35l22J08j2q1q1J71L3j84N4J47k24N2J52R4qPl21N7J78j14N3J66
$$ 3 134 57 192 -130 -22 -34 -115 -196 -25 8 -176 -122 25 -199 -147 5 99 91 98 -223 -166 12 -102 -49 117
7422A17j77l1K92o8M6k56j36L04k85K92l5j47J0K53J27k73J34K7k64J00J4J27
$$ 117 -60 -91 201 133 179 -77 -213 91 -194 98 63 -84 -74 179 306 33 167 194 -70 30 44 171
7444A71j46k50J55J86R3j73j9P1N7k45L14q2r9j45K69j48J00j88M78o09n9M27
$$ 171 25 -225 -70 116 209 36 17 88 145 -100 214 132 33 -112 157 9 109 -79 399 -210 -269 158
7466A58j16j23J95N8q8j15N0j42k5K63j90j4J24k15K44M3l02J93j7j09J63q9J99
$$ 158 42 -81 114 172 84 -31 19 -123 -148 115 -75 -89 35 -180 64 107 -195 -2 -19 -128 35 -54 145
7489A45j15J47k51K0n4J97L0j42j62L27j15M2J2J46k42Jk9P7JK72k76k16J94k28
$$ 145 30 177 -74 -54 -108 89 119 -23 -185 142 27 69 81 227 -15 -14 -43 34 35 307 31 -185 9 -219
7513b19J64M7k02K88L00l32j19R8n9L0k09M50m41K38m3L55l55o0p7K04j77l9j4
$$ -219 -55 -8 -210 78 378 46 -73 25 -34 -4 -213 237 -204 34 -9 346 -9 -69 -146 58 -119 -158 -172
7536a72j69K43o0L67k38J46j22m4j1j76K66j1j62K06k61J98L9j96K1J15j17J66
$$ -172 -341 -98 -158 209 -29 117 -5 -49 -60 -236 30 19 -143 63 -198 0 39 -157 -136 -21 -138 28
7558B8k23M46k93J0J23j78K5K51j86p2L53r6k99j82K09O9L40l13Mj23L4L03o02
$$ 28 -195 251 -42 -32 91 -87 -62 189 3 -69 284 188 -111 -293 -84 -15 325 12 16 -107 -73 230 -372
7581c72N34q4j81j92K36L18m76J32J47o6J40j73j62L69j02k55K32L16k32k88J62
$$ -372 162 78 -103 -295 -59 259 -217 -85 62 -4 136 -37 -199 170 68 -187 45 361 129 -159 3
7602Co1j0L75p14J26L43j80J28kr1J42N4k12K22q0r7J50J44m20l5K71r5l2M1R
$$ 3 -58 -68 307 -407 -281 62 -118 10 8 -83 59 113 -99 123 43 -54 96 240 -180 -215 56 -39 -71 -30 -21
7627b1K77j25k19K7L15l29K12m43M45j65j80K96k15O9r5Lm4J90M8J63K5J61m83
$$ -21 256 131 -88 -61 254 -75 137 -306 139 -26 -206 90 -125 -56 -151 -148 -192 -2 46 209 234 395 -88
7650h8J13j22J60J72j5m48J28J65n7K36j13k99J77k32J57j42J20j26j51O18l68
$$ -88 25 -97 63 235 220 -228 -100 65 8 244 131 -168 9 -223 -66 -208 -88 -214 -365 253 -115
7671a15K34j08k9j15K06n6J9L8%M4k14M7O3J18K43n05N0M3K12j60o3n7J18j89
$$ -115 119 11 -18 -133 73 17 36 74 74 118 -96 -49 14 132 375 -130 -80 -37 175 15 -48 -105 13 -176
7695a76j10J33K18j77J83m6N8N5l11K91j56m1J65Jk14j44L06l0O3j84J6n4L04
$$ -176 -286 -153 65 -112 71 25 83 138 -173 118 -38 -79 86 87 -127 -271 35 5 68 -116 -100 -154 150
7718A50k0N1Pm16K37j11j29N34m13Q0J46q7k16kL87J08j50J00k23J68k64k29J34
$$ 150 130 181 188 -228 9 -102 -231 303 -110 -30 116 29 -187 -189 198 306 156 256 33 201 -63 -292 -158
7741a58L95k14n8qJ13k00j22L96j53mM1J27l64K53j10K64j97l8J3j98J66n4k01
$$ -158 237 23 -35 -43 70 -130 -252 144 -9 -13 28 155 -209 44 -66 198 1 -37 -24 -222 -56 -110 -311
7764c11L58j24o1J38N3k41L88m16J31J34q2J61q8P8l35K59l4J72k74nj04J47J47
$$ -311 47 -77 -138 0 53 -188 200 -216 -85 49 -33 128 40 118 -217 42 8 180 -94 -99 -203 -56 91
7787I1q9R8k56J86L2l1r6r5O5j53k6J58J64j98J53J45P0m00M39l17J17J33l3m32
$$ 91 2 100 -156 30 62 31 -65 -160 -95 -248 -274 -116 48 -150 3 148 218 -182 257 -60 57 190 157 -275
7811b75L61m5O1Rj86K72l84k80O32j48j7K51k29K25m91K69J5J88Rj8k27K4r6K9
$$ -275 86 41 102 111 -75 197 -187 -467 165 17 0 251 22 247 -244 25 40 228 237 219 -8 16 -80 -51
7835e1M22k02j53K13m36N6j6K00K2j63m6R1L65k44O7K7p1J78l30N2M2N3k0q0M8
$$ -51 371 169 16 229 -207 -151 -167 33 55 -108 -154 -63 302 58 125 152 81 259 -71 -19 23 76 56 -24 24
7860B4L5j3m0j09J40o2R3P9k26j32K37k6m59M54K5J66K26m97J55k5p5J06m2J86
$$ 24 59 46 6 -103 37 -25 68 147 -79 -211 26 0 -459 -5 20 186 412 -85 70 45 -30 76 34 220
7884B20j47j50N5j10J45l75K27Q7J37j16P7p1Q7o7J01j63K70k3j78p7Q8PK5J35
$$ 220 73 -77 -22 -132 13 -362 -135 -48 89 -27 50 -21 66 -1 100 -63 207 184 6 -71 17 24 49 184
7908A84N3j31p4k08L07l03rO2K30k31J42J8j40J54J8k49L98k35K53j92l03J91
$$ 184 237 106 32 -176 131 -172 -181 -119 111 -120 22 40 -100 54 72 -177 221 -14 239 47 -256 -65
7930f5J60k57NK79pk83o9K28k45J82J03Q6k07K28o7R7n14L15J88k75L08j23j95
$$ -65 95 -162 -157 122 115 -168 -237 -9 -254 -72 31 117 -90 138 71 168 -346 -31 157 -118 190 67 -128
7953a28K99j53j13J9J97l66J16j5J70K95l93J82Q4j68J2K1l7j88J13P5J11j13
$$ -128 171 18 -95 -76 121 -245 -129 -144 26 321 -72 110 194 26 38 59 22 -166 -53 22 133 20
7975B0O9j1lj77j19L55P2k87J46l4L14o45K35J03p8Q8n2j29K57k00jK05j41j63
$$ 20 89 78 75 -102 -221 134 206 -81 65 31 345 -300 -65 38 -40 48 -4 -133 124 -76 -77 128 -13 -176
7999a76L00J16J00m2l0J16k70N6j62Lk1k51J77K42l74M59m74j05L23k45K09k34
$$ -176 124 240 340 298 268 384 114 170 8 11 -10 -261 -84 158 -216 243 -231 -336 -13 -258 -49 -283
8021b83K96k77Q0M35k55J23O4k15k32K35R6L9j69j0J47k20K70k51N10n00L70o8
$$ -283 13 -264 -184 251 -4 119 183 -32 -264 -29 67 106 -63 -73 74 -146 124 -127 383 -117 253 185
8043A85j84J2K78m22j33P08o2k04k62R6J22m43o6J87J97j37o2L53j46j66q8K07
$$ 185 1 13 291 -131 -264 444 382 178 -84 12 134 -309 -375 -188 9 -128 -190 163 17 -149 -237 -30
8065c0J39j65L82l62j64K56o7J95k47o0K09J46j93j49p4K40j66R7j89L61k5J39
$$ -30 109 -56 326 -36 -200 56 -11 184 -63 -123 86 232 39 -110 -184 56 -110 -13 -202 159 134 273
8087B73k77M2j3J61m17J14J34k03M04j24j96N6N3j45J01k47L16n9J60k29N7K85
$$ 273 -4 38 25 186 -231 -117 17 -186 218 94 -102 -46 7 -138 -37 -284 32 -27 133 -96 -39 246
8109B46l24j5R6O8J83m41K04k77L94j24K76j57j05q4JJ21L2n8m0O08o81m4N0j68
$$ 246 -78 -93 3 71 254 -187 17 -260 134 10 286 129 24 -60 -59 62 94 36 -4 604 -77 -121 -71 -239
8133b39k0J56O2k16K58k06o3K77p9Q2J08M1j60j02M1P2j7P2j5q1J3J02Q0l6l59
$$ -239 -259 -103 -41 -257 1 -205 -268 9 -70 12 120 161 1 -101 -60 12 -5 67 52 -29 -16 86 166 130 -229
8158b29J93j1K03j13R9K12M0n56J97k0J60j22j74L31k00jn6m9K45O7k13J95l70
$$ -229 -36 -47 156 43 142 354 394 -162 35 15 175 53 -121 210 10 9 -47 -96 149 216 3 198 -172
8181a72M21m25J79p1J40k57J55j29J56J00
$$ -172 249 -176 3 -68 72 -185 -30 -159 -3 97
8191I7
$$ Imaginary data points
##PAGE= N=2
##DATA TABLE= (X++(I..I)), XYDATA
0@%%%%%%%Qj6J6j6K4l2L2l9M8n7O8p7R1j10J28j45J67j94K21k50K85l24L63m06
$$ 0 0 0 0 0 0 0 0 8 -8 8 -8 16 -16 16 -23 25 -32 36 -41 50 -60 68 -77 90 -104 117 -133 152 -172 191 -215
31b15M58n14N73o37P09p91Q77r69J074j191J318j459J617j793J990k213K468k763
$$ -215 243 -271 302 -335 374 -417 460 -509 565 -626 692 -767 850 -943 1047 -1166 1302 -1461
49a461L109l520M019m636N424o468P927j0107J3689k0577L8304j61035l66130
$$ -1461 1648 -1872 2147 -2489 2935 -3533 4394 -5713 7976 -12601 25703 -135332 -501462
62e01462M85652L74217l30318k80448L02106J55460l37317j27114L74827J41939
$$ -501462 -15810 358407 28089 -252359 49747 205207 -132110 -259224 115603 257542
72B57542l33881j49668K64197R5806k04282j0346K24104l8262k70648O915K75014
$$ 257542 -76339 -226007 38190 133996 -70286 -80632 143472 105210 -165438 -158523 116491
83A16491M1398k16695m3435J64037J14j64555J7444J89270n21j98261l7341J72943
$$ 116491 157889 -58806 -102241 61796 61910 -102645 -85201 104069 103548 -94713 -132054 40889
95D0889N7231j26224l8699R4650q631j05440L9146J40968k0677j36703M473R7698
$$ 40889 98120 -28104 -66803 27847 19216 -86224 -47078 93890 73213 -63490 -59017 38681
107C8681k6618o8909P5274P9022j00789r9865R1883J01839o8037p1810N5186K1135
$$ 38681 12063 -56846 18428 97450 -3339 -103204 -11321 90518 22481 -49329 5857 26992
119B6992p8105O068J08386n23j05377q40P6176l6223p3217Q0758J07927q1704
$$ 26992 -51113 -45045 63341 62818 -42559 -43399 32777 -3446 -76663 4095 112022 30318
131C0318j33794N4170J27518l0245r9743L1017P8665l9077p2054M4427P6458l2966
$$ 30318 -103476 -49306 78212 47967 -51776 -20759 57906 18829 -53225 -8798 67660 34694
143C4694p0086J3819M1476k0619j4731N0388J7795p5959m2151P4277N4075o6847
$$ 34694 -35392 -21573 19903 -716 -15447 34941 52736 -23223 -65374 8903 62978 -3869
155c869n3121O6163N0295p0113m8507P6374N2665p9035o1528O9381O3174m7250
$$ -3869 -56990 9173 59468 -10645 -59152 17222 69887 -9148 -70676 -1295 61879 14629
167A4629m3908L7625J7252m3963m006M9929J155m5554K181L2987j6503k4560L3502
$$ 14629 -29279 8346 25598 -18365 -22371 27558 28713 -16841 -14660 18327 1824 -22736 10766
180A0766K4174m8528l6891M4803M3506k8316l0484J9770R353k9642m601L8853
$$ 10766 34940 -13588 -50479 -5676 37830 9514 -20970 -1200 8153 -21489 -26090 12763
192A2763J3860l0986j5065J8836O296j4997M879K1748j0075l4206K395M4230J4427
$$ 12763 26623 -4363 -19428 -592 5704 -9293 -4414 17334 7259 -26947 -24552 19678 34105
205C4105m0389k7588K6671K2097k2911j2958L0661J0987l8639j4877L9057J5053
$$ 34105 -6284 -33872 -7201 14896 -8015 -20973 9688 20675 -17964 -32841 6216 21269
217B1269l5012r161L1213m022l2192K3294M6723l0948o3052K1946O5518j0119
$$ 21269 -13743 -22904 8309 4287 -27905 -4611 42112 11164 -51888 -29942 35576 25457
229B5457m9269J5242L5070k9764l5000L6450M1309k9520l7481J4867J9499j0271
$$ 25457 -23812 -8570 26500 -3264 -38264 -1814 39495 9975 -27506 -12639 6860 -3411
241c411M356K1603j5930l7113P347L6845J779j8270P722P783k4686j5117L0293
$$ -3411 945 22548 6618 -30495 -23148 13697 15476 -2794 4928 12711 -11975 -27092 3201
254C201K9547j7518k9711J60J6393P929J504j27p509j0279k380P060J0306Q165
$$ 3201 32748 15230 -14481 -14321 2072 10001 11505 11378 3869 -6410 -8790 -1730 8576 16741
268A6741k973j6408j2722N293J7904J1158o499j7861r976J0733J7490P82j0890
$$ 16741 13768 -2640 -15362 -10069 7835 18993 12494 -5367 -15343 -4610 12880 13662 2772
281B772k437n8q947J96K2787J3069k0836k2637O931J3943j545K557J2726q403
$$ 2772 335 277 -8670 -8474 14313 27382 6546 -16091 -9160 4783 3238 5795 18521 10118
295A0118k8069k609K8743J3922j5507j2037Q61m508k204J7521J4896j3146k1397
$$ 10118 -17951 -20560 8183 22105 6598 -5439 -4578 -9086 -11290 6231 21127 7981 -13416
308a3416j451R359M904P327R350r957k4210l055K2643J4827q200j0437k802m829
$$ -13416 -14867 -5508 -604 6723 16073 6116 -18094 -21149 1494 16321 8121 -2316 -5118 -9947
322i947k492J2573J7095m729k2266j2197R663J5515O207k260q203j1281m961R707
$$ -9947 -12439 134 17229 12500 -9766 -21963 -12300 3215 9422 7162 -1041 -12322 -17283 -7576
336g576J4949L386j0294j1157l719L543J1977J3485l012k1265j3400J1327J9667
$$ -7576 7373 10759 465 -10692 -14411 -10868 1109 14594 11582 -9683 -23083 -11756 7911
349G911M048p460n397n986q443M228J9817J0152j4671k0064j425J3607J1079L015
$$ 7911 11959 4499 -898 -6884 -15327 -11099 8718 18870 4199 -15865 -17290 -3683 7396 10411
363A0411m199j0376j0333J083J4362J4213j119j5262j2397J581J0905J1320M481
$$ 10411 6212 -4164 -14497 -13414 948 15161 14042 -1220 -13617 -12036 -1131 10189 14670
376A4670n702j5896r329J1039J8072K403r860o527m682o688P645K3786O473k6333
$$ 14670 8968 -6928 -16257 -5218 12854 15257 5397 -1130 -5812 -12500 -4855 18931 25404 -929
390i29k0602J2315J7714q05o41O192j0210k1618N250K8389P738j7204j0480L59
$$ -929 -21531 -9216 8498 7693 7052 13244 3034 -18584 -13334 15055 22793 5589 -4891 -4532
404d532m123M817K2456P637k5715k1033J1293J5928Q42K585N617j4969k3398P409
$$ -4532 -8655 -3838 18618 26255 540 -20493 -9200 6728 7570 10155 15772 803 -22595 -15186
418a5186K9736P799j8199j1805N03o92L920J5081P441j5015j8132o83J2010J2631
$$ -15186 14550 22349 4150 -7655 -7152 -7844 -3924 11157 18598 3583 -14549 -15232 -3222 9409
432I409P810o478j8552j1305R134J7411P389n775j1908j0332J97J0798J0940L700
$$ 9409 17219 10741 -7811 -19116 -9982 7429 14818 9043 -2865 -13197 -13000 -2202 8738 12438
446A2438p271j6124j1925J0839K4522O054j8328j3816K721K391J256J4876J1966
$$ 12438 5167 -10957 -22882 -12043 12479 18533 205 -13611 -10890 -8499 -7243 7633 19599
459A9599j7194k5013L847K2830O810o500j197n768j5381K302K4332J0383j6973
$$ 19599 2405 -22608 -18761 4069 10879 4379 3182 -2586 -17967 -15665 8667 19050 2077
472B077j3312L062r12k138J5890J6101j5005k7611J149K2590P773o598K69j577
$$ 2077 -11235 -8173 -9085 -11223 4667 20768 5763 -21848 -20699 1891 9664 3066 3335 1758
486A758j4021m911J8492J8781p726j9049o356N786P020P999O871n441j7027r397
$$ 1758 -12263 -17174 1318 20099 12373 -6676 -13032 -7246 -226 7773 14644 9203 -7824 -17221
500a7221J0095J7361M682q111j0527n897J05R293J3513M07j4824j1848N808J0778
$$ -17221 -7126 10235 14917 6806 -3721 -9618 -9513 -220 13293 13700 -1124 -12972 -7164 3614
514C614K486J093L398p827j5891O75K2287J2019j3758j5658L029P173r56J899
$$ 3614 6100 7193 10591 2764 -13127 -12452 9835 21854 8096 -7562 -4533 2640 1684 3583
528C583P804k241j4039n366R897R519m66m180n738p180O23J2563Q444q166j1028
$$ 3583 11387 9146 -4893 -10259 -362 9157 8691 4511 -1227 -8407 -7784 4779 13223 5057 -5971
543e971P76O656j496j76P995J913j3063r071J0484J5421l336j3159k533N338m17
$$ -5971 -5195 1461 -35 -211 7784 9697 -3366 -12437 -1953 13468 10132 -3027 -5560 -222 -639
558f39n79O809K129r553p245N423N189j513J016K205o865p827O767J2074l299
$$ -639 -1218 5591 7720 -1833 -9078 -3655 1534 21 1037 3242 -3623 -11450 -4683 7391 4092
573D092j0721Q94O272l387j789Q384J771j1064l890J0478L596q295j12P585l767
$$ 4092 -6629 -5735 537 -2850 -4639 3745 5516 -5548 -9438 1040 4636 -3659 -3771 3814 47
588D7r656N598J1654m398j2872J446Q052K53j346K654k861p884K239J0089L22
$$ 47 -9609 -4011 7643 3245 -9627 -8181 -129 124 -1222 1432 -1429 -9313 -7074 3015 3337
603C337p100J284M051o164m235J0567R659p618j3287N03R237N450q07l251l869
$$ 3337 -3763 -2479 1572 -4592 -8827 1740 11399 3781 -9506 -9003 234 5684 4877 1626 -2243
618b243j028J093R47J158N584J873r955r946O869J4969J580j1405p063K921N146
$$ -2243 -3271 -2178 -1231 -73 5511 7384 -2571 -12517 -5648 9321 10901 -504 -7567 -4646 500
633E00K752J867n75l065k652l088P27R041Q368o111j5170k538J2985Q923l770
$$ 500 3252 5119 4544 1479 -1173 -4261 -3534 5507 13875 7764 -7406 -9944 3041 11964 8194
648H194p340l062j695J532O786N393l408o538m382k621L950J3080O438j2685j6121
$$ 8194 854 -2208 -3903 -2371 4415 9808 6400 -138 -4520 -7141 -3191 9889 16327 3642 -12479
663a2479K750J3735N071k207j124m730r581J39J3741Q628n637r384n066k509M003
$$ -12479 -9729 4006 9077 6870 5746 1016 -8565 -8426 5315 13943 8306 -1078 -6144 -8653 -4650
678d650J3022P773j0138j5631l338Q888R004L577k359q738p589J767Q000N133
$$ -4650 8372 16145 6007 -9624 -12962 -4074 4930 8507 6148 -2590 -10179 -8412 -412 4721
692D721K224k474j0236r990O907J7772N817j2280j2153o27N087O101N442L25q117
$$ 4721 6945 4471 -5765 -15755 -8848 8924 14741 2461 -9692 -10319 -5232 869 6311 6636 -1481
707a481p173L64M148O253O022k101j4573j0376J1323J8632J499j4624q500K551
$$ -1481 -8654 -8290 -4142 2111 8133 6032 -8541 -18917 -7594 11038 12537 -2087 -10587 -8036
721h036K444K937P272M506p285j1368l355P371J1751O649o796j6248n956J2231
$$ -8036 -5592 -2655 4617 9123 1838 -9530 -12885 -5514 6237 12886 6090 -10158 -16114 -3883
735c883J3759p10q960l010j944m715K853J4133Q300j1279j6624j889J1120R871
$$ -3883 9876 9166 206 -2804 -4748 -9463 -6610 7523 15823 4544 -12080 -13969 -2849 7022
749G022L290l849j0103p569M090J2359N505m849n615m056l626K469J2203R002
$$ 7022 10312 6463 -3640 -11209 -7119 5240 10745 5896 281 -3775 -7401 -4932 7271 16273
763A6273q492j6161l137J0230R214J493k612n988p710o8J0233P825m098p710l253
$$ 16273 7781 -8380 -11517 -1287 7927 9420 6808 820 -6890 -6958 3275 11100 7002 -708 -3961
778c961J28K381O548O379l954j2679n770Q066J1190L283n891r116l497L867P256
$$ -3961 -3833 -1452 5096 11475 7521 -5158 -10928 -2862 8328 11611 5720 -3396 -6893 -3026 4230
793D230K950j018m262n966k796M469R522L973p549j0834l270P473J0081L194p102
$$ 4230 7180 6162 1900 -4066 -6862 -2393 7129 11102 3553 -7281 -10551 -3078 7003 10197 3095
808C095q858q08L847K224K543M163q82j0710o779Q229J2353J85r537o316N61M181
$$ 3095 -5763 -6571 -2724 -500 2043 6206 5324 -5386 -12165 -3936 8417 8602 -935 -7251 -6690 -2509
824b509N189K800l555n212j892K29R49N514O013m333j1957k304J0114O984l412
$$ -2509 2680 5480 1925 -3287 -5179 -4950 -4001 1513 7526 3193 -8764 -11068 -954 6030 2618
839B618n301j850n78J301N074K859l105m982j987M39L472P350Q74q504p227L504
$$ 2618 -2683 -4533 -5111 -3810 1264 4123 1018 -3964 -5951 -5512 -2040 5310 6184 -2320 -9547 -6043
855f043P462J562o94j272m627m294L987R473J472o482n150m25K91M588O954L19
$$ -6043 1419 2981 2287 1015 -3612 -7906 -3919 5554 7026 544 -4606 -5031 -4740 -152 6802 7121
871G121q087o846K164N795M508K091k814q458l462P171P471o28m171k153k201
$$ 7121 -966 -7812 -5648 147 4655 6746 3932 -4526 -7988 -817 6654 6026 1855 -298 -2499
886b499k501N546Q175l35q960n887K873N458L948J622m892o845K9N871L588p83
$$ -2499 -5000 546 8721 8386 -574 -6461 -3588 1870 5818 7440 2548 -4297 -4268 1603 5191 4408
902D408j649j518m208j243P039O747k373r370m521M323O946K319j978l782l941
$$ 4408 2759 1241 -2967 -4210 2829 9576 7203 -2167 -6688 -2365 4581 6900 4922 1140 -2801
917b801j117L005N135L267k638p838m000M078P350L423m142o018l629K301M716
$$ -2801 -3918 -913 4222 7489 4851 -2987 -6987 -2909 4441 7864 3722 -2296 -5925 -3624 1092
932A092L851L91m003n637k644M102P410K145n196o295j187L547M296J974j451
$$ 1092 4943 5334 1331 -4306 -6950 -2848 4562 6707 1511 -4784 -5971 -2424 1872 3846 2395
947B395m159l155l40L749N060J335n297o692P2O507M641j845l343j857j663R7
$$ 2395 -1764 -4919 -5259 -1510 3550 4885 -412 -7104 -7032 -525 4116 2271 -1072 -2929 -4592 -4495
963d495M495M383k157o233k581K211M555L199k35n542m851K235N359K202n08q16
$$ -4495 0 4383 2226 -4007 -6588 -4377 178 3377 3142 -2400 -7251 -5016 343 2545 2037 1221
979A221l876m817J902Q925L687o121o300O3K610L081L723Q1n466m450J523M110
$$ 1221 -2655 -7472 -5570 3355 7042 921 -5379 -5316 -2706 375 4098 4179 -1287 -5737 -4214 -104
995a04L271J842k017p196l754O082Q088m04n442k119j027l40L645O266m75p412
$$ -104 3167 5009 2992 -4204 -7958 -1876 6212 5808 366 -1753 -2780 -3120 525 6791 6316 -1096
1011a096m364L100L917L070J486l461p245j232P212M741j420j827k372m302j406
$$ -1096 -5460 -2360 1557 4627 6113 2652 -4593 -5825 1387 6128 4708 2881 509 -3793 -5199
1026e199Q252O899l831q576k879L656M133L057R38m469o372k24M738M600J991
$$ -5199 3053 9952 6121 -2455 -5334 -1678 2455 5512 6450 1981 -4391 -4615 123 4723 6714
1041F714j284p156o132M143R336K718m948n303j933n54M129O383J536o365o701
$$ 6714 5430 -1726 -7858 -3715 5621 8339 3391 -1912 -3845 -4399 -270 6113 7649 1284 -5417
1056e417j002M519N670L941l318r252m165N853O987Q13j681k170n161m784N972
$$ -5417 -6419 -1900 3770 7711 4393 -4859 -9024 -3171 3816 4629 2948 778 -4383 -9167 -3195
1071c195J0373P17q984o164R29L550M478M362k202q001m951L538O356L303Pl450
$$ -3195 7178 7895 -1089 -7253 -6324 -2774 1704 6066 3864 -4137 -9088 -5550 806 4109 4116 666
1087F66p732k956P010R519N6p586n798J07K720M725M869n83p210p127J927Q380
$$ 666 -7066 -10022 -3012 6507 6563 -1023 -6821 -6714 -3994 731 5600 5017 -2193 -9320 -7393 987
1103I87N354j598n707n536o36M596O482K366l849o639l796K680O793N369j061
$$ 987 6341 4743 -964 -6500 -7136 -2540 3942 6308 2459 -4180 -7976 -5296 1497 6866 5805
1118E805p203o770J230P983N497r44m828m563k096K559O692M453k851p168m536
$$ 5805 -1398 -8168 -6938 1045 6542 5598 770 -3793 -5889 -3330 3362 7815 4964 -2204 -6740
1133f740K511O804M622j186n661n477R9M295O150K510l747p425l409M956O873
$$ -6740 -4229 2575 7197 6011 350 -5127 -5028 -733 5417 7927 4180 -3245 -6654 -1698 5175
1148E175K120l213m664l094j60M809N771L55n007n802p17L459N987L534m200q324
$$ 5175 7295 4082 -582 -3676 -3836 973 6744 7099 2092 -3710 -4427 -968 5019 8553 4353 -3971
1164c971j724N148N195n4j281j578m636k724M751P530K70o635n076Q52L652L804
$$ -3971 -5695 -547 4648 4594 3313 1735 -2901 -5625 -874 6656 6926 291 -4785 -3933 -281 3523
1180C523J345k379m470k018J363K995L301J109l781o047o83O059M795j507n139
$$ 3523 4868 2489 -1981 -3999 -2636 359 3660 4769 988 -5059 -5742 317 5112 3605 -1534
1195a534k124O9K116K702R01j497j702k347j647L382N328M88o360m184L073M310
$$ -1534 -3658 -3589 -1473 1229 2130 633 -1069 -3416 -5063 -1681 3647 4135 -2225 -6409 -3336 974
1211I74N3o51k12k938k167K586M655j85l221j086m60q27J873N205r47n898k038
$$ 974 1027 376 164 -2774 -4941 -2355 2300 2115 -1106 -2192 -2652 -3479 -1606 3599 2652 -3246 -5284
1228e284L457K495p47O67N51l829k918M702M485k143l671m9J103p06J268M205
$$ -5284 -1827 668 -79 588 1139 -2690 -5608 -906 3579 1436 -2235 -2284 -1181 -1887 -619 3586
1244C586r25m926k180L610K880K54r50j754k086R12L150J303j342j817j52j042
$$ 3586 2661 -2265 -4445 -835 2045 2299 1349 -405 -2491 -1579 1571 2874 1532 -285 -437 -1479
1260a479J74L554K743k569n143r71M336L473m43k754j941N8J199J349J102K96
$$ -1479 -1305 2249 4992 2423 -2720 -3691 645 4118 3675 921 -1020 -962 237 1586 2688 2984
1276B984j078k816k117L271N112M52n252m441J697M284K180r98j999j926o16K86
$$ 2984 1906 -910 -3027 244 5356 5808 556 -3885 -2188 2096 4276 3278 1279 -647 -1263 -977
1292i77K105K736N32l947l997N21M543L693j120m349l336M25L957K728P1k118
$$ -977 1128 3864 4396 449 -3548 -3027 1516 5209 4089 -260 -3596 -3171 786 3514 3585 1467
1308A467k591k415K40M269L894j008n493l204J829L775K341n19k457l659j123
$$ 1467 -1124 -3539 -3299 970 4864 3856 -1637 -4841 -3012 763 3104 2585 128 -3531 -4654
1323d654K954L750J472j972m126k628J071L887L997o69m295m098M35L944L693
$$ -4654 -1700 2050 3522 1550 -2576 -5204 -4133 -246 3751 3082 -1213 -5311 -4876 -932 2761
1338B761J44l397l724n89K456L493J523j193m039k242P11K959M225J258m448o104
$$ 2761 2905 -492 -4216 -4805 -2349 1144 2667 1474 -2565 -4807 -4096 -1137 3088 4346 -102 -6206
1354f206p49O710N000k069m014j864k52J68L520M056j079n511l348J540M036M625
$$ -6206 -6955 -245 4755 2686 -1328 -3192 -3444 -3276 244 4300 3221 -2290 -5638 -4098 -62 4563
1370D563R96n105o603N05O636L465j679j712j387l242p18N018N857j881o396l343
$$ 4563 5559 454 -6149 -5644 992 4457 2778 1066 -321 -3563 -4281 737 6594 4713 -1683 -5026
1386e026K178M590L095j19m266m140J171L160K215M01M36l001m746O10O277L905
$$ -5026 -2848 1742 4837 4718 452 -3688 -2517 643 2858 3259 3695 694 -4052 -3442 2835 6740
1402F740l359m640j227J013K878L020j7l469l267N71K065K635J660j184l904l876
$$ 6740 3381 -1259 -2486 -1473 1405 4425 4408 939 -2328 -1757 308 2943 4603 3419 -485 -4361
1418d361K158N308J809k134l140k082l53K619M386N42m460l707L93K744K765R75
$$ -4361 -2203 3105 4914 2780 -360 -2442 -2795 -176 4210 4752 292 -3415 -3022 -278 2487 3462
1434C462r66l390l541R99M265L413q72l921l145n2K877L395K36k421l294n75J457
$$ 3462 2496 -894 -4435 -3436 829 4242 3370 -551 -3696 -3748 -871 2524 2760 339 -2955 -3530 -2073
1451b073K420J560J72l080l526k45M389L901j317l974k472J768J742R73R14n01
$$ -2073 347 1907 2079 -1001 -4527 -4772 -383 3518 2201 -1773 -4245 -2477 -735 238 1152 651
1467F51k795k371J297L964K598k105m148k298J803L922K760j745l452j844N57
$$ 651 -2144 -4515 -3218 746 3344 1239 -2909 -5207 -3404 518 3278 1533 -1919 -3763 -3206
1482c206J690K649J454j213l708k805J772N352K938l089m681j874K884K809J503
$$ -3206 -1516 1133 2587 1374 -2334 -5139 -3367 1985 4923 1834 -2847 -4721 -1837 972 2475
1497B475K25j832m100r44L420M061P26k681l327j187J121L861K586j289m332j764
$$ 2475 2700 868 -3232 -4176 -756 3305 4031 1350 -1977 -3164 -2043 1818 4404 3115 -1217 -2981
1513b981J794K015K208J090k353m383j084M435L852j676k013j311q57J5L003K872
$$ -2981 -1187 828 3036 4126 1773 -2610 -3694 741 4593 2917 904 -407 -1264 -1249 1754 4626
1529D626q12m142k064J269K831K184j24k752l520K29L306J734O86j352k377k425
$$ 4626 3814 -328 -2392 -1123 1708 3892 3768 1016 -2504 -2275 1031 2765 3451 2099 -278 -2703
1545b703O20M478K366k188l643j261R13K126K307r6j920k692p32J487K106K350
$$ -2703 -2083 2395 4761 2573 -1070 -2331 -1418 708 3015 2919 999 -1693 -2425 -938 1168 3518
1561C518o51m578k377J921M590M03k320j248q19r50J082K956J499k547l204q08
$$ 3518 2867 -1711 -4088 -2167 2423 2826 506 -742 -1561 -2511 -1429 1527 3026 479 -2725 -3533
1577c533J700K575J676j602k819j763J785K455N04n75p59k256r91J946L288L88
$$ -3533 -1833 742 2418 816 -2003 -3766 -1981 474 978 403 -356 -2612 -3603 -1657 1631 2019
1593B019k989k246L78J850J321J006j311j701j493R08K021J582K07k191l066K36
$$ 2019 -970 -3216 -2838 -988 333 1339 28 -1673 -3166 -2258 -237 1345 1552 -639 -3705 -3469
1609c469L670K231j666k238m64m7R32J600J525j128k661j241J739K279J203m83
$$ -3469 201 2432 766 -1472 -1936 -1983 -1051 549 2074 946 -1715 -2956 -1217 1062 2265 1782
1625A782k431k263J490K726J166j421p62p76j193N33L082J647k375l584J022K097
$$ 1782 -649 -2912 -1422 1304 2470 1049 287 -489 -1682 -1149 1933 3580 1205 -2379 -1357 740
1641G40J286k71m83j478j056N53K444J050r69j867q68l4J329K797M71l060k473
$$ 740 2026 1755 1272 -206 -1262 -709 1735 2785 1816 -51 -919 -953 376 3173 3644 584 -1889
1658a889J402K102N82J26k12j899j746N81L296J677k093k733j032J182K079J707
$$ -1889 -487 1615 2197 2323 2111 212 -1534 -953 2343 4020 1927 -806 -1838 -656 1423 3130
1674C130q52k057j934k77J958K465P02j848l351r00K276K865N44j499k104j701
$$ 3130 2278 221 -1713 -1990 -32 2433 3135 1287 -2064 -2964 -688 2177 2721 1222 -882 -2583
1690b583O19K531J965o25k097k557m59K000L515Q68l318l469M99J948K070N99
$$ -2583 -1964 567 2532 1907 -190 -2747 -3206 -1206 2309 3177 -141 -3610 -3111 -1163 907 1506
1706A506k69k411k879J39L762L188j209l247k399K13K628K282J265k624k762j071
$$ 1506 1237 -1174 -4053 -3914 -152 3036 1827 -1420 -3819 -3606 -978 1304 2569 -55 -2817 -3888
1722c888J389K965K088m52l855l160Q24M451K583j376k736k079o73K275L287J491
$$ -3888 -2499 466 2554 2102 -1753 -4913 -4089 362 2945 1569 -1167 -3246 -3919 -1644 1643 3134
1738C134k098l245k345J457L929K855j015m095k709J110L481K207P4j897k955
$$ 3134 1036 -2209 -4554 -3097 832 3687 2672 -1423 -4132 -3022 459 2666 2740 843 -2112
1753b112j604K040M202K147k765l880j303J688L176K169m47l147l189M19L031
$$ -2112 -3716 -1676 2526 4673 1908 -1972 -3275 -1587 1589 3758 3311 164 -3025 -2606 425
1768D25K566R01j768l592k174K410M556J371k451l400q69R38K131K650O78l182
$$ 425 2991 3892 2124 -1468 -3642 -1232 3324 4695 2244 -1156 -2025 -1087 1044 3694 4372 1190
1784A190l944L25L117K856P6j604l060j784J752L349J808j665k926j765K32K750
$$ 1190 -2754 -2429 688 3544 3620 2016 -1044 -2828 -1076 2273 4081 2416 -510 -2275 -2043 707
1800G07K781J92l140l237j64K685K706Q05j602k654j875O36L349K174n46l495
$$ 707 3488 3680 540 -2697 -2861 -176 2530 3335 1733 -921 -2796 -2160 1189 3363 2817 -678
1816f78k516Q84K743K077m74j807k503q92J229K957J445j407l182j794J641L003
$$ -678 -3194 -2310 433 2510 2036 229 -2274 -3166 -1937 1020 2465 1058 -2124 -3918 -2277 726
1832G26J380q67k739j317M23J662J454O12o65k737j328J207L226J499j888l404
$$ 726 2106 1239 -1500 -2817 -2394 -732 722 1334 669 -2068 -3396 -2189 1037 2536 648 -2756
1848b756m14J551K032O13l78j405j547n39J990J764M85j205k401j078K033K681
$$ -2756 -3170 -1619 413 1026 648 -757 -2304 -2843 -853 911 1396 191 -2210 -3288 -1255 1426
1864A426K78j366k055m50J076J373J026Q3j606j446P6J657J637k6j282j875o20
$$ 1426 1704 338 -1717 -2167 -1091 282 1308 1391 -215 -1661 -1585 72 1709 1683 401 -1474 -2094
1881b094J812K105j07j173j089q73N12J833J356m82k074j165J077J447P69k51
$$ -2094 -282 1823 1716 543 -546 -1419 -907 926 2282 1800 -274 -1439 -362 1085 1854 1603
1897A603l26k015n11J506K470J12k284j244K45R09R63J117n88j952j010Q84J355
$$ 1603 1277 -738 -1249 257 2727 2839 555 -689 -444 465 1428 2545 1957 5 -1005 -121 1234
1914A234N42L04j134k186p14K209K808m49k843j065R31Q28n1J441K50j946k059
$$ 1234 1776 2080 946 -1240 -1954 255 3063 2614 -229 -1294 -363 465 414 1855 2105 159 -1900
1931a900L85K731J261o12j942j690J62K328J656j126j893m84Q5Q9R01J834k57
$$ -1900 -1515 1216 2477 1865 -77 -1767 -1605 723 2379 1253 -640 -1124 -1039 -950 -49 1785 1528
1948A528k786j638Q36K783J041j030j784j333L20J837J196L0j420j093j000R46
$$ 1528 -1258 -2896 -2060 723 1764 734 -1050 -2383 -2063 -226 970 1000 -420 -1513 -2513 -1567
1964a567K443J271j741k613r02J345K499O86o88k142j259m3K414J238K2j609j510
$$ -1567 876 2147 406 -2207 -3109 -1764 735 1421 733 -1409 -2668 -2711 -297 941 963 -646 -2156
1981b156o47J430K354Q23j666k094p04R25J953K107o63k753j763J091K288R75
$$ -2156 -2803 -1373 981 1804 138 -1956 -2660 -1735 218 2325 1662 -1091 -2854 -1763 525 1500
1997A500j8j166j682q29J328J982R22q73j981j446O11K523K142j179k933j092
$$ 1500 1482 316 -1366 -2195 -867 1115 2037 1164 -817 -2263 -1652 871 3013 1834 -1099 -2191
2013b191J587J206N63R07p18j918r44J216K269J317j913j912r44P99K807J009
$$ -2191 -604 602 1165 2072 1354 -564 -1508 -292 1977 3294 1381 -531 -1475 -676 2131 3140
2029C140j595k024j27K69N73J299J784j391k979j296K673K243O0j612j877n87
$$ 3140 1545 -479 -606 -337 236 1535 3319 1928 -1051 -2347 326 2569 2629 1017 -860 -1447
2045a447P00J747J473p68j536j352l6R86J769J459j535l039q41K101K260K21j392
$$ -1447 -747 1000 2473 1705 169 -1183 -1219 -233 1536 2995 1460 -1579 -2420 -319 1941 2162 770
2062G70j207r18k61J547K238j00k443j969M14J885J476l2j214j718j301J603K304
$$ 770 -437 -1355 -1616 -69 2169 2069 -374 -2343 -1929 -44 1432 1400 186 -1532 -2833 -1230 1074
2079A074J004j663j997q08M53K100J399l56k613j379O28J986J188k13p01k263
$$ 1074 2078 415 -1582 -2390 -1937 163 1562 1206 -1407 -2786 -2158 -172 1016 803 102 -2161
2095b161j266J845K677J212j988k762m96J120J980J145o37j631j404k98J739K385
$$ -2161 -3427 -1582 1095 2307 319 -2443 -2939 -1819 161 1306 669 -962 -2366 -2664 -925 1460
2111A460O04j955k869k62K433K116L45j344k121j047J032K010J474l63j598j954
$$ 1460 2064 109 -2760 -3022 -589 1527 1872 528 -1593 -2640 -1608 402 1876 1513 -85 -2039
2127b039m31K291K647p2k581k190Q80J226J409Q33n84j979j618R29K357J653p55
$$ -2039 -2470 -179 2468 2396 -185 -2375 -1495 -269 1140 1973 1389 -590 -2208 -1279 1078 2731 1976
2144A976j291k436J17J907K594l77k150q84M7K56J542J507n93k700j596J946J667
$$ 1976 685 -1751 -1634 273 2867 2490 340 -544 -497 -241 1301 2808 2215 -485 -2081 -135 1532
2161A532Q97k61j548j733m80J884J938M0r78j623j070L37K592J746j281k713q34
$$ 1532 2429 2168 620 -1113 -1593 291 2229 2269 1291 -332 -1402 -1065 1527 3273 1992 -721 -1555
2178a555R37J177O31R34q35k538j161K099K497k97j077j423r85K31J804J725o50
$$ -1555 -618 559 1190 2124 1289 -1249 -2410 -311 2186 1889 812 -611 -1596 -1365 439 2164 1514
2195A514k458r52M71Q14J432J183j457k670n32K281J648m4j234j075r34L08J399
$$ 1514 -944 -1896 -1425 -611 821 2004 547 -2123 -2655 -374 1274 1230 -4 -1079 -2013 -1705 -306
2212c06R73M65j661j907O5J745K421j130j404j077k4Q79J182P69n60j822j117
$$ -306 667 1132 -529 -2436 -2371 -626 1795 665 -739 -1816 -1840 -961 221 990 430 -1392 -2509
2229b509Q36J655J066k79j355j758K35K257J052p08j044q58K4R2J295J590l91
$$ -2509 -1673 -18 1048 769 -586 -2344 -2109 148 1200 492 -552 -1410 -1386 -1294 1 1591 1200
2246A200k513o52J086J686J94n87m51p87k61P81J326L78j036j005j20M01J141
$$ 1200 -1313 -1965 -879 807 1001 414 -37 -824 -1085 -304 1022 1400 364 -641 -761 -360 781
2263G81P48n48j502n3N62Q86j12q4M9r48l06J035J092j59j055q07L42J074J56
$$ 781 1529 981 -521 -574 -12 874 762 678 727 -221 -527 508 1600 1441 386 -421 -79 995 1151
2282A151R7o68p04J29N50N27L79k58q01j384N68J702N90o92j358j30N14M91K56
$$ 1151 1248 580 -124 5 555 1082 1461 1203 402 -982 -414 1288 1878 1186 -172 -302 212 703 959
2301I59M61m92j356l24Q18R28O92p88j309n71P21J090L58o97p22k47k27K30Q73
$$ 959 1420 928 -428 -752 66 994 1686 898 -411 -982 -261 829 1187 490 -232 -479 -706 -476 397
2320C97J039j402j718L02J503O73k27p83q85k81L73J272K08l15q76j076K60J085
$$ 397 1436 34 -1684 -1382 121 794 567 -216 -1101 -1382 -1009 263 471 156 -720 -1796 -1536 -451
2338d51J345k57j443j046K86J231Q29N9q38p45p31M19J521R96p29j857p93O91
$$ -451 894 637 -806 -1852 -1566 -335 494 553 -285 -1030 -1761 -1342 179 1175 446 -1411 -2204 -1513
2356a513J596P27m88r10q77o32J170J652L17j049j772m22J213J786N33o90j251
$$ -1513 83 810 322 -588 -1465 -2097 -927 725 1042 -7 -1779 -2201 -988 798 1331 641 -610
2373f10p88J88J349M70O16q38j346r47J111K273N71j428j554o63R73J368O30j58
$$ -610 -1398 -1210 139 609 1225 387 -959 -1906 -795 1478 2049 621 -933 -1596 -623 745 1375 1217
2391A217r48j523K1J691J353N4j298j584k85J483J488O16j186r08j157Q73J174
$$ 1217 269 -1254 -1233 458 1811 1865 567 -1017 -1302 181 1669 2285 1099 191 -966 -93 1081
2408A081J105l11j134j936R2J974J201k38j001j563m11O42J514Q56j31j925j504
$$ 1081 2186 1875 741 -1195 -1103 871 2072 1834 833 -730 -1141 -499 1015 1871 1740 -185 -1689
2425a689P32J774J079n40j051j371K80R16J143P63j083j589q19P11J455R80l47
$$ -1689 -957 817 1896 1356 305 -1066 -786 130 1273 2036 953 -636 -1455 -744 711 1691 1344
2442A344k086r11M44J336P04L00j200j324l04Q74J763L43p80j682q99O42J881
$$ 1344 -742 -1653 -1209 127 831 1131 -69 -1393 -1697 -823 940 1283 503 -1179 -2078 -1436 445
2459D45Q19j142j185n36P5O10J354M43n86k291l39J708J229K60r34j348n47K40
$$ 445 1264 122 -1063 -1599 -1524 -914 440 883 297 -1994 -2333 -625 604 864 -70 -1418 -1965 -1725
2477a725J833Q54n24j167q94J56K57K057L70j500j687K78J377R62k30k83o68q22
$$ -1725 108 962 438 -729 -1623 -1467 -1210 847 1217 -283 -1970 -1692 -315 647 417 134 -534 -1356
2495a356M1J224J411j45j503j587P82J114J256k21j034q21k04R14N82N71q7j223
$$ -1356 -1315 -91 1320 1175 -328 -1915 -1133 -19 1237 1016 -18 -839 -1043 -129 453 1024 937 -286
2513b86p79R7J603Q27p1j380p86J24J123O62m5l83j004k43N25J137P96o08j433
$$ -286 -1065 -968 635 1462 1391 11 -775 -651 472 1134 1089 706 -298 -541 -16 1121 1917 1309 -124
2532a24p64J129J141q4o2j036o65k25J172J091Lj137q18l41N35J225O77o60j664
$$ -124 -888 241 1382 1298 1236 200 -465 -690 482 1573 1576 439 -379 -720 -185 1040 1717 1057 -607
2551f07j44M79Q28M14N01j644n29n5J308Q76n08p44q40p5O36J170j21m98q68p18
$$ -607 -751 -272 556 970 1471 -173 -702 -757 551 1427 919 175 -665 -740 -104 1066 945 447 -421 -1139
2571a139Q3J372Q41j60j722q84O06J137N40n71m19m32p28P25J168M10m62j446
$$ -1139 -1056 316 1157 997 -725 -1609 -1003 134 674 103 -316 -748 -1476 -751 417 827 365 -1081
2589a081k62K16J040P31m84j069q26P22N15P71Mj09j556l94O84J556L41j081j149
$$ -1081 -1343 -1127 -87 644 160 -909 -1735 -1013 -498 273 277 168 -1388 -1782 -1098 458 799 -282 -1431
2608a431k76P30R64L99k07o62q41n4Q31J133N43j404j037o0R60R38K09o09j075
$$ -1431 -1707 -977 -13 386 179 -483 -1324 -1378 -547 586 1129 -275 -1312 -1372 -412 526 735 126 -949
2627i49M3P51M95N07j35q35q44M38Q05R13l55o44m47k04L10J232M25n47j175n78
$$ -949 -906 -155 340 847 712 -123 -967 -529 276 1189 834 190 -257 -461 -151 1081 1506 959 -216 -794
2647g94L54J218N98o85o14j84k68Q19P31J09k42j396j25N07R91L90k62j290o74
$$ -794 -440 778 1376 691 77 -107 -375 444 1175 1284 1042 -354 -479 28 1019 1409 1147 -143 -817
2666h17Q31J375n7o50m42l73j99N69J062K00q78j235j58J217P56l55j97j065J16
$$ -817 14 1389 1332 682 240 -133 -332 237 1299 1499 621 -614 -772 445 1201 846 649 -416 -300
2685c00J13Q66N03k37j323L9l09Q42Q63k53j198q47N75J110p1j60m37n42j72J50
$$ -300 -187 679 1182 945 -378 -339 -648 194 1057 804 -394 -1241 -666 444 373 213 -224 -766 -938 -788
2705g88J218M45n72j156m73O63O86J028p30j071m90M30M07P28l20k24q95m71O12
$$ -788 430 875 303 -853 -1326 -663 23 1051 321 -750 -1240 -810 -403 325 5 -219 -1114 -1585 -973
2724i73J284J65n34r47n25P17N82P72n12p38m88k62J138P90j70o61q23N9P07R66
$$ -973 311 476 -58 -1005 -1530 -813 -231 541 29 -709 -1197 -1459 -321 469 299 -362 -1185 -1126 -419 547
2744E47L44q47o77m03K75O08R46j47o33j197r7J784N73k50p62q89m8L65J037N12
$$ 547 891 44 -633 -1036 -761 -153 793 646 13 -1184 -1281 503 1076 826 64 -825 -873 -508 529 1041
2764A041k95j104n63O67P47O31Q5j073q19J13R98O17K07q91l31j060Q98R11J565
$$ 1041 746 -358 -921 -254 493 1124 1209 136 -683 -570 428 1045 1252 361 30 -1030 -132 779 2344
2783B344r23j688p96P60J030Q37m31r04n16p47J053J509O1q54j345J13L24J155
$$ 2344 1421 -267 -1063 -303 727 1564 1133 229 -287 -1034 19 1528 1589 735 -610 -497 -173 982
2801I82Q27j70j935q41P53P29Q34n6n83j456l41J102J676M8j061j225j96P15O01
$$ 982 1809 1639 -296 -1137 -384 345 1179 1123 540 -916 -1257 -155 1521 1569 508 -717 -913 -198 403
2820D03J032k85j465j171J19J470J093j79j069j348j31J024J200J7p93r37l50
$$ 403 1435 1150 -315 -1486 -1367 103 1196 1017 -52 -1400 -1531 -507 693 710 -83 -1020 -1370
2837a370M59N68J175k21j301r77K62J316Q00k81m67j258j70Q88P29N80n17r76
$$ -1370 -911 -343 832 611 -690 -1667 -1405 -89 711 430 -37 -1295 -1465 -577 152 732 215 -761
2855g61q87J55J376J104n48j085o85M08O41R51q6j22j576l53O23J161N65k82j191
$$ -761 -1648 -1493 -117 987 439 -646 -1331 -923 -282 669 583 461 -1115 -1468 -845 316 881 599 -592
2874e92m02L53P15O33J64q15m82n20M68J276J54q09n55k18L12P16O32l47j066
$$ -592 -994 -641 74 707 871 56 -426 -946 -478 798 952 143 -412 -630 -318 398 1030 683 -383
2893c83j69J51N67N59K07k62q95l10R44O12l0o16m73k83O26K87O26J29j257m40
$$ -383 -552 -401 166 725 932 670 -225 -535 409 1021 991 375 -98 -381 245 532 1158 1287 30 -410
2913d10j06R07N25P0l56q33k12J126M80k49n63J9n33J90O12O05j15j471k55L3
$$ -410 -516 391 916 986 630 -203 -415 711 1191 942 379 398 -135 55 667 1272 1157 -314 -569 -536
2933e36J201K12l57k57n59o2L35O98J21m93p95j09K48N82N35l80j333k99J057
$$ -536 665 877 520 263 -296 -358 -23 675 796 303 -492 -601 -353 229 764 384 -949 -1248 -191
2952a91M36L0m37j35m36K10J13P62J42q20q44K31Q31L8K86q33j35l38L82Q92J17
$$ -191 245 275 -162 -297 -733 -523 -410 352 494 -326 -1170 -939 -108 -70 216 -617 -752 -1090 -708 184 301
2973C01l23n12o54N07N44M36j00r99j43J88M21O92j76k14q33l01L49J129K23o86
$$ 301 -22 -534 -1188 -681 -137 299 199 -800 -943 -755 -334 358 182 -32 -865 -1166 -817 312 535 -151
2993a51m70n60R13K74K93q0m78j03l68L51Q16K19l95r11J52L52O10J84o75l54
$$ -151 -621 -1181 -268 6 299 219 -259 -362 -730 -379 437 656 261 -650 -498 -146 464 648 -27 -381
3013c81k6R2M42P32k05n22q69K78O05Q91j7j078m21o8O14O39R1j36n04n00O3O17
$$ -381 -407 -315 127 859 654 132 -737 -459 146 1037 1020 -58 -479 -547 67 706 797 661 157 -343 -280 337
3035C37J196n34p32p30J46R45M20J26r18j00o55L05Q79P37l17r79p51L01Q54M04
$$ 337 1533 999 267 -463 -317 628 1048 1174 256 156 -499 -194 685 1422 1105 126 -625 -324 530 934
3055I34o6p98m75k5N03M02P12l93j158p30O08Q28P15m80r65o44M74O30M66k01
$$ 934 868 70 -405 -430 73 475 1187 794 -364 -1094 -486 342 1057 577 -388 -1032 -558 72 538 337
3075C37l50m79n76P44P89L95j082n15m01O49N40N58o55n80n70N36L82N47PO5j523
$$ 337 -13 -492 -1068 -324 465 860 -222 -737 -1138 -489 51 609 -46 -626 -1196 -660 -278 269 276 341 -1182
3096a182j09Q59J040K4j062k41k56K06L05O34K33p34p25K08M87O77K45r63n57
$$ -1182 -1291 -432 608 632 -430 -671 -927 -721 -416 218 451 -283 -1008 -800 -313 364 609 -354 -911
3115i11j75O73P78J66m26q19k78K52J053M04k56j124l14K66O96O64oo64k95k56
$$ -911 -1086 -413 365 531 105 -714 -992 -740 313 717 461 -663 -977 -711 -15 649 643 -21 -316 -572
3135e72N55K58L21Q0j113l38L57J370K1o26o89K42r2P8J030j43l49o19k48Q10
$$ -572 -17 241 562 642 -471 -809 -452 918 939 313 -376 -134 -226 -148 882 739 390 -229 -477 333
3155C33P91k25K2q88k58N27M18J74l52j98m26l82R47N50o1l37p95j17K45J014
$$ 333 1124 899 921 33 -225 302 720 894 542 344 -82 -464 483 1033 972 635 -160 -277 -32 982
3175I82J4m62n83l46M61L60M03J96q69p48R6J082N08k22p56l99l83O41M29N63
$$ 982 996 534 -49 -395 66 426 829 1025 156 -592 -496 586 1094 872 116 -283 -666 -25 404 967
3195I67n40p45o01J61J212K6J72j185n96K99J055K06j70l03o60K2N3R78M63p52
$$ 967 427 -318 -919 -758 454 480 652 -533 -1129 -830 225 431 261 -42 -702 -680 -627 351 814 62
3215F2n87l92L62O87P2J79p88m91j56P57O42L9m62r04l52P33O10N71o39o82k56
$$ 62 -525 -917 -555 132 204 383 -405 -896 -1052 -295 347 386 -76 -980 -1332 -599 11 582 -57 -739 -995
3236i95N29K95mM32o83p37L69L49Q82K14o17p62j63M21P98K25n32l86l74m5R39
$$ -995 -466 -171 -175 257 -426 -1163 -794 -445 437 651 34 -728 -891 -470 328 553 21 -365 -739 -784 155
3257A55M90k8o07p68K82P19K01K49p04k63l06K55N09N28o4q26l69J89Q07M95k83
$$ 155 645 617 10 -758 -476 243 444 693 -11 -274 -580 -325 184 712 648 -178 -547 -358 449 944 661
3278F61m56n42J04N33M23J34l01n77Q4J54O36l7O4r83l82N06L10N07k4m13n92
$$ 661 205 -337 -233 300 723 857 556 -21 63 217 853 816 880 -103 -485 21 331 838 814 401 -191
3299a91l5K86O70L07n23q25J5N06K85j78%k17m98L52K48M29m18n7l48l92Q11J13
$$ -191 -226 60 730 1037 514 -311 -296 210 495 317 317 100 -398 -46 202 631 213 156 -192 -584 227 340
3321C40J19k82m20j33K01J11K07K5k22n61N9K93L24M3k19l09o9J97M22q9m24l2
$$ 340 459 177 -243 -376 -175 -64 143 168 -54 -615 -556 -263 61 104 -115 -424 -493 -296 126 37 -387 -419
3343d19K4O5J86K93j82k95o31M87Q06k19m78j93jjJ50L08J08j83l85o2L20N06
$$ -419 -395 -330 -144 149 -33 -328 -959 -472 334 115 -363 -556 -557 -558 -408 -100 8 -175 -560 -622 -302 204
3365B04p0j93l94j17lN42M95l45o05l46O84L6K40J40l60l24j30O82L55k98j6n90
$$ 204 134 -59 -453 -570 -573 -31 464 119 -486 -832 -148 -112 128 268 -92 -416 -546 136 491 193 177 -413
3387d13j18QO24O49k65l44n53K74M04N83l69m05r4k07N47O16j95l74k69j10J04
$$ -413 -531 -523 101 750 485 141 -412 -138 266 849 480 75 -19 -226 321 937 742 368 99 -11 93
3408I3N06L19k35p80m11N53O20L82m69l48q64J71Q43M73J69p68n34K24M8N20L85
$$ 93 599 918 683 -97 -508 45 665 1047 578 230 -634 -463 380 853 1022 254 -280 -56 -8 512 897
3429H97l23o34l84M95L18K25j31r5p28k50O62Q24p4p19n47K6M00L93K32m81l17
$$ 897 574 -60 -444 51 369 594 463 368 -360 -610 52 876 802 83 -464 -438 -38 355 587 106 -211
3450b11n88M06N40M2J61o93l81pO22M33N11q10p49K35K1M44M23j88o64o61J57
$$ -211 -799 -393 147 189 350 -343 -724 -731 -109 324 835 25 -724 -489 -468 -24 399 211 -453 -1114 -957
3471i57R17K94j75m78l42j05q1Q69L70k50n81m10M63J17N98l4k87n69k99O52L20
$$ -957 -40 254 79 -399 -741 -846 -927 -58 312 62 -519 -929 -466 -349 249 215 -72 -641 -940 -288 32
3492C2L8q0k52o61L45J067K48p03n86J31Q9K69J50L98l89n86r5L02P75j45l48
$$ 32 70 -10 -262 -923 -578 489 737 34 -552 -421 -332 -63 87 485 96 -490 -585 -283 492 347 -1
3513am12J3J71M95L94o0p85k44K83M46R7J14J19r25l83R70N19J55n97l83m9J4
$$ -1 -413 -400 -229 266 660 600 -185 -429 -146 300 397 511 630 -295 -678 292 811 966 369 -14 -63 -49
3535d9M33L42j42m30l41q3O54J67l4m25j24P1O0L60J39J8p39q8J37M38O37k85
$$ -49 384 726 584 154 -187 -270 384 551 517 92 -32 39 99 459 598 616 -123 -211 -74 364 1001 716
3557G16n96n80L75L06K44m72K86l93l16M96M19J05m59l02l50M86K41K3K31n83
$$ 716 120 -460 -85 221 465 -7 279 -114 -430 66 485 590 131 -171 -521 -35 206 229 460 -123
3577a23k40j5O74J25j33m38n6l35Q0M87K59n93k43Q4N8L60J9J07l24p09J20O25
$$ -123 -363 -378 296 421 288 -150 -206 -541 -461 26 285 -308 -551 -467 -409 -49 -30 77 -247 -956 -836 -211
3599b11M50k84l37m44Q6K85N11J37k10n06N1K73J87J40l82J50n40q7O18L85m18
$$ -211 239 -45 -382 -826 -740 -455 56 193 -17 -523 -472 -199 -12 128 -254 -104 -644 -731 -113 272 -146
3620a46J3j91k65J44L46L8L02p71j79O07K3P5J16k00n39L09N10J18k3l50kl39
$$ -146 -133 -324 -589 -445 -99 -61 241 -530 -709 -102 -79 -4 112 -88 -627 -318 192 310 287 -63 -65 -404
3642d04J64P42J86n65l84j20L89K51J01L73o67k9o3N27M85j97m85m85L27j39M99
$$ -404 -240 502 688 123 -261 -381 8 259 360 733 66 37 -26 501 986 789 304 -181 146 7 506
3663E06L05l46q16M83R3L79j67K04k68m68l66J001M39n08j95n29j15P87M30n23
$$ 506 811 465 -351 132 225 604 437 641 373 -95 -461 540 979 471 276 -253 -368 419 849 326
3683C26j49m13j57J06N32M23k88l13m37J10O82L52m59m86k24j49O85K50l12j75
$$ 326 177 -236 -393 -287 245 668 380 67 -370 -260 422 774 315 -171 -395 -544 141 391 79 -96
3703i6j29j28K42L11L18m40n36j0K64J78L24j02l32k53m10P48J5qPm99m13L76
$$ -96 -225 -353 -111 200 518 78 -458 -468 -204 -26 298 196 -136 -389 -799 -51 -36 -44 -37 -536 -949 -573
3725e73R07k76l28k99q6K25L37M00k42m76j22l0K98M97m26J2j12k25K96K56j53
$$ -573 334 58 -270 -569 -655 -430 -93 307 65 -411 -533 -563 -265 232 -194 -182 -294 -519 -223 33 -120
3746a20K9p8k01q1L06M42L2n23l4K47n7J71K57l37l63k44M31M16K28r9o63M8J55
$$ -120 -91 -169 -370 -451 -145 297 329 -194 -228 19 -38 133 390 53 -310 -554 -123 293 521 422 -241 -193 -38
3769c8M12j36Nm1l29M80o7J59M43r27k72k9M68L88M0k01r2m21MN19J61k01j14
$$ -38 374 238 243 202 -127 353 286 445 888 -39 -311 -340 128 516 556 355 263 -158 -154 365 526 325 211
3792B11o53K12K39O74N6n25k47J36K07j13K47j0j72l31J06K31L68j95j32k46j45
$$ 211 -442 -230 9 683 739 214 -33 103 310 197 444 434 262 -69 37 268 636 441 309 63 -82
3813h2K14N58l43j70l35j0K61K06K20k91n88j21J78O17J23k63m83o5j46Q16O7
$$ -82 132 690 347 177 -158 -168 93 299 519 228 -360 -481 -303 314 437 174 -309 -374 -520 296 363
3834C63k6l00m06l15L80M26O7j51k66k84J81M96J2o7l62l93j61O95K45J63l66
$$ 363 337 37 -369 -684 -304 122 189 38 -228 -512 -331 165 177 110 -252 -645 -806 -111 134 297 -69
3855f9n56l16N00L43M87m11k68k14j21O88J38j52l63j66j04N23L66K3k04o90j17
$$ -69 -625 -941 -441 -98 389 -22 -290 -504 -625 63 201 49 -314 -480 -584 -61 305 328 124 -566 -683
3876f83N02M22L6k45m67J78m5J04Q12j85n42n82L04O11J52N5j52p67L13l5M93
$$ -683 -181 241 277 32 -435 -257 -302 -198 614 429 -113 -695 -391 220 372 427 275 -492 -179 -214 279
3897B79m4K70n12k64k6Q69O7n5l72k91J16K5L22k9J04n46n1M2M37N01l17m80k98
$$ 279 235 505 -7 -271 -297 572 639 584 212 -79 37 62 384 355 459 -87 -138 -96 341 842 525 45 -253
3920b53M5M85K15k97J45n07m6K22N27q5J8j08m69JO19k92J82l39m71L09J71K14
$$ -253 -208 277 492 195 340 -167 -213 9 536 451 469 361 -108 -107 512 220 402 63 -408 -99 72 286
3942B86k9k04l47k37K86M54l2q3l42j52M20J80J4J78j42r95K95M35K42k06j08
$$ 286 257 53 -294 -531 -245 209 177 94 -248 -400 20 200 214 392 250 -745 -450 -15 227 21 -87
3963h7k13j01J29K16J30k13k80j28NK22M84k90k65l63L58K82J66o3l11j81J18
$$ -87 -300 -401 -272 -56 74 -139 -419 -547 -542 -320 164 -126 -391 -754 -396 -114 52 -11 -322 -503 -385
3984c85J12L17J49o1l84l58N30n9L30k57k31k54j60M86j04N67m98l16Q8K95L13
$$ -385 -273 44 193 132 -252 -610 -80 -139 191 -66 -297 -551 -711 -225 -329 238 -260 -576 -488 -193 120
4005A20j5o0k08k51M25K01J27l84J23o7m43M15J00J48k60j89j45N26L94j71k10
$$ 120 105 45 -163 -414 11 212 339 -45 78 11 -432 -17 83 231 -29 -218 -363 163 557 386 176
4026A76l36k1O5M40j89%j75J28J06oN61k70k50o85L50M22j68K89j49l36L30j1
$$ 176 -160 -181 -116 324 135 135 -40 88 194 188 749 479 229 -456 -106 316 148 437 288 -48 282 271
4048B71K72k9o96K55L20l45K17K09J29l59m44L65K78m80J62J63m61m7K50K04K29
$$ 271 543 514 -182 73 393 48 265 474 603 244 -200 165 443 -37 125 288 -173 -220 30 234 463
4069D63m12L0j0k46L96K36n80J5k64K80j2P5O1q0q6j42J20K70J23k64k72o9K33
$$ 463 51 81 71 -175 221 457 -123 -108 -372 -92 -104 -29 32 -48 -134 -276 -156 114 237 -27 -299 -368 -135
4092a35K54k47M34j04p76J11O22k92K63j85m31J86J03j3N42k87k11m11L11J97
$$ -135 119 -128 306 202 -574 -463 159 -133 130 -55 -486 -300 -197 -210 332 45 -166 -577 -266 -69
4112f9K84k00l46l14J01O23M9J27l03k08k74M76LN21q99j5J02j33N93N7J27m47
$$ -69 215 15 -331 -645 -544 79 128 255 -48 -256 -530 -54 -51 470 -429 -444 -342 -475 118 175 302 -145
4134a45j56j3K31N09l4n52l18M31k98N51J4Jj61l36L10J71L80K74o69m44J75M08
$$ -145 -301 -314 -83 426 392 -160 -478 -47 -345 206 220 221 60 -276 34 205 585 859 190 -254 -79 329
4156C29pp9j42j36KPK01M52m22Kq30R20Q6k05J52k91l70L56q9M82p2O4l20l35
$$ 329 322 243 101 -35 -33 -26 175 627 205 207 -623 297 383 178 330 39 -331 25 -64 418 346 410 90 -245
4180b45M34j23N01p7m23j71P8J68P2R2%m01j71M82J61k58K27o33j54M95N2M84
$$ -245 189 66 567 490 67 -104 -26 142 214 306 306 -95 -266 216 377 119 346 -287 -441 54 106 590
4202E90n31k5l10J29J02PJ07j3j97j73L76p1oJ54m58o7L06kQ1Q6k64l34k2M68
$$ 590 59 34 -276 -147 -45 -38 69 56 -141 -314 62 -9 -15 139 -319 -386 -80 -82 -1 85 -179 -513 -535 -67
4226f7J76j48k06N1l53J72L99J70j87k65R9j04K08o9k06K92n43p0N44M97o39J31
$$ -67 109 -39 -245 -194 -547 -375 24 194 7 -258 -159 -263 -55 -124 -330 -38 -581 -651 -107 390 -249 -118
4248a18j96L5q5M81K89j35n64k98O82j16K98l73j27k59L51K85Q5j56l29j40J5
$$ -118 -314 -279 -364 117 406 271 -293 -591 91 -25 273 -100 -227 -486 -135 150 235 79 -250 -390 -375
4269c75N25o7K34j60k91l1L09J8J91kn38J02q6M55P8j26j61ll13J48M54L65p43
$$ -375 150 83 317 157 -134 -165 144 162 353 351 -187 -85 -171 284 362 236 75 72 -241 -93 361 726 -17
4292a7K1k83L37M15n5J66m89p3Q8J82J41P8n14L40k09J16p7K56ml22k66j5P05
$$ -17 4 -279 58 473 418 584 95 22 110 292 433 511 -3 337 128 244 167 423 419 97 -169 -184 521
4315E21k2m9l61j01L2mM94K9m09o9k08K82QN3k01o9k67K70L02n6r3k92K0P3qK12
$$ 521 499 450 89 -12 20 16 510 539 130 61 -147 135 143 196 -5 -74 -341 -71 231 175 82 -210 -190 -117 -125 87
4341H7J75n27K1k82K39L20l0j60q4K61k07J51L41k94l30K00p47P78M06L4n84o8
$$ 87 262 -265 -244 -526 -287 33 3 -157 -241 20 -187 -36 305 11 -319 -119 -866 -88 318 352 -232 -300
4363c00KJ07P5N1J85n09j00J48J91K27r7l6P1n77L29K20J24O8n14n3L01L52j12
$$ -300 -298 -191 -116 -65 120 -389 -489 -341 -150 77 -20 -56 15 -562 -233 -13 111 179 -335 -388 -87 265 153
4386A53k68M7j17P0j46P62m26Q1L02m81LK34M4J15o48K23L12p4j13M78p16R4K75
$$ 153 -115 -68 -185 -115 -261 501 75 156 458 -23 -20 214 258 373 -275 -52 260 186 73 551 -165 -71 204
4409B04K37m65K17k73K32l5J17nQ1m64J28J20L09j94j17N19n88m1j08N59J3k19
$$ 204 441 -24 193 -80 152 117 234 229 310 -154 -26 94 403 209 92 611 23 -18 -126 433 446 227
4431B27j68k7q3K10L33q4l26OJ47J39p0p5l22M0QJ40p3j54L9J9j9n4L25j53J35
$$ 227 59 32 -51 159 492 408 82 88 235 374 304 229 -93 -53 -45 95 22 -132 -93 -74 -93 -147 178 25 160
4456A60n23K92n1K22J46j47k84j73K11n4n6L39l69L4k35K88N4J25p6q7m24J77
$$ 160 -363 -71 -122 100 246 99 -185 -358 -147 -201 -257 82 -287 -253 -488 -200 -146 -21 -97 -184 -608 -431
4478d31J30J01Q8L7m26j15K27K72K72j19j00m10P3J72K45K25m20r5r5K77K13k50
$$ -431 -301 -200 -112 -75 -501 -616 -389 -117 155 36 -64 -474 -401 -229 16 241 -179 -274 -369 -92 121 -129
4500a29j6k0k10N19k7j7n5j62k32m1N92L10l73l55K30j16K64k10K33r1l21j9J78
$$ -129 -145 -165 -375 144 117 100 45 -117 -349 -390 202 512 139 -216 14 -102 162 -48 185 94 -227 -246 -68
4523f8N0L88m96J76l24L01P0K04j3l13k9r9K20J38M18m01j56k55J06K46J98K19
$$ -68 -18 370 -126 50 -274 27 97 301 288 -25 -54 -153 67 205 623 222 66 -189 -83 163 361 580
4545E80k43l03J32j61L65j20n02L91l52L62K85j04p7j25K5j2j01M38j77K0m42
$$ 580 337 34 166 5 370 250 -252 139 -213 149 434 330 253 128 153 141 40 478 301 321 -121
4566a21q8L30L06j35J76k42n81N60q6K03k32k76k14K08K86j6J37n12L4J07P8J59
$$ -121 -209 121 427 292 468 226 -355 205 119 322 90 -186 -400 -192 94 78 215 -297 -263 -156 -78 81
4588H1j18j53J2j79L9L2L43J19n25j34K79P2K59k19O0l41n5O8K56L38k82l1l47
$$ 81 -37 -190 -178 -357 -318 -286 57 176 -349 -483 -204 -132 127 -92 -32 -373 -428 -360 -104 234 -48 -79 -426
4611d26J26M4L90l91l55M34n60P73q7J63l83N1l6K95J89O0n24o0L6K39K50K71
$$ -426 -300 -256 134 -257 -612 -178 -738 35 -52 111 -272 -221 -257 38 227 287 -237 -297 -261 -22 228 499
4633D99l50j23n5j35K48K00l68J69k14K83qj07K07L5m12J85lj6J99k84J87k70
$$ 499 149 26 -29 -164 84 284 -84 85 -129 154 146 39 246 281 -131 54 51 35 234 -50 137 -133
4655a33K10oj49K52J25m14P4P4K21j62J13k47Q2J13K64j67N3J28n74J23M07k55
$$ -133 77 71 -78 174 299 -115 -41 33 254 92 205 -42 40 153 417 250 303 431 -143 -20 387 132
4677A32qJ35j82k26L74K1J59l15k53L43K73k53K88j40j48l93j11L68J35j84j8
$$ 132 124 259 77 -149 225 246 405 90 -163 180 453 200 488 348 200 -193 -304 64 199 15 -3
4698cJ44k65n1Q6rN6k16J65J79j7P7J14m27RK33J5J64j14k41j59K63m2Q4j94Q9
$$ -3 141 -124 -175 -89 -98 -42 -258 -93 86 69 146 260 -167 -158 75 90 254 140 -101 -260 3 -39 45 -149 -60
4723f0j86J19kL04k1k61jl27M40Mp9O6l31k0K05K0n5J17k77M25k62j25M11J04
$$ -60 -246 -127 -129 175 154 -107 -108 -435 5 9 -70 -4 -335 -355 -150 -130 -185 -68 -345 80 -182 -307 104 208
4747B08l62n5j52L72J47k79M88o88Q7J00K02k12o1J74K64n81K85j6P5J0O5j45
$$ 208 -154 -209 -361 11 158 -121 367 -321 -234 -134 68 -144 -205 -31 233 -348 -63 -79 -4 6 71 -74
4769g4J21J39mm9j04J53m85K43J58K57l33J10r3q7K68K85m32j19q8K41N8J41J
$$ -74 47 186 182 133 29 182 -303 -60 98 355 22 132 39 -48 220 505 73 -46 -134 107 165 306 307
4792C07J36l78qR7J40n7r8l87K30K42k25R9Q5j1o7j40K57K43m38L58m58j0L47
$$ 307 443 65 57 154 294 237 139 -248 -18 224 -1 98 183 172 105 -35 222 465 27 385 -73 -83 264
4815B64j17r0M24l80k12J00J80R5j2k57j55J74K38J13j54p2l63L29j75L27k11
$$ 264 147 57 481 101 -111 -11 169 264 252 -5 -160 14 252 365 211 139 -224 105 -70 257 46
4836D6l48K17n7o6J45L96k45m37L00j29L06o0P0k96k09M75j97O0k22L41j74l09
$$ 46 -302 -85 -142 -208 -63 333 88 -349 -49 -178 128 68 138 -158 -367 108 -89 -29 -251 90 -84 -393
4858c93k17J022m70N1o74L44K08n9L22k83q7K3k8j24L91j20j16j0L1K35J65m07
$$ -393 -610 412 -58 -7 -681 -337 -129 -188 134 -149 -236 -213 -241 -365 26 -94 -210 -220 -189 46 211 -196
4880a96K39m8j97N6k1L25q8j74j07j41N71k73j0L3j00l7L2M02M3k76o0J2J47p6
$$ -196 43 -5 -202 -146 -167 158 70 -104 -211 -352 219 -54 -64 -31 -131 -168 -136 266 309 33 -27 -15 132 56
4904E6K39j58J4qk00K14J65K0j30k4j15k09P6M19P5m27Kn6P2J06J0K05l81L15
$$ 56 295 137 151 143 -57 157 322 342 212 188 73 -136 -60 359 434 7 9 -47 25 131 141 346 -35 280
4928B80j46M7k19J84j06l14J65N94p0l80j4m0O6J46O1M3l81J74j32j78L88l27
$$ 280 134 181 -38 146 40 -274 -109 485 415 35 21 -19 47 193 254 297 -84 90 -42 -220 168 -159
4950a59L72m48J64j05L69j32k86K00l79L78J46o1J92j8k35q3o5K28L57n25p0k49
$$ -159 213 -235 -71 -176 193 61 -225 -25 -404 -26 120 59 251 233 -2 -85 -150 78 435 -90 -160 -409
4972d09K88K15K41k39l78j52J81L96m18M18m7m32J3L51l25N83l13j31j31o4K91
$$ -409 -121 94 335 96 -282 -434 -253 143 -275 143 96 -336 -323 28 -297 286 -27 -158 -289 -353 -62
4993f2N6j07J7Q4l05Q1M54L6j89q5k82Q9M5J66j8O7k78K0J26k8M7L6J58j11P2
$$ -62 -6 -113 -96 -12 -317 -236 218 254 65 -20 -302 -213 -168 -2 -20 47 -231 -211 -85 -113 -66 -30 128 17 89
5018H9K20j80l71K43r0K2M5j43L13O9k86L91Q6k26r5j26%M9P7Q4J83j18m08L50
$$ 89 309 129 -242 1 -89 -67 -22 -165 148 217 -69 322 408 182 87 -39 -39 10 87 171 354 236 -172 178
5042A78k76J0K71j70K36j36J61M8m32M96k71k5P6k87M29q2P5l85RK27p4l2K68
$$ 178 -98 -88 183 13 249 113 274 322 -110 386 115 90 166 -121 308 226 301 -84 -75 152 78 46 314
5065C14k77m14P28l99J66O8k05M77m80m3J3K81l0k83L6l9j79M94j83k23j89L12
$$ 314 37 -377 351 -48 118 186 -19 458 -22 -65 -52 229 199 -84 -48 -87 -266 228 45 -178 -367 -55
5087e5K08q1K4n8j1l28K45J19j19k8k32p9m6L45J3Q6k29k4J17k00K70J68m43K36
$$ -55 153 72 96 38 27 -301 -56 63 -56 -84 -316 -395 -441 -96 -83 3 -226 -250 -133 -333 -63 105 -338 -102
5111a02K56r5j30j87r6L81l89M47o9l08K71l61l0K14M7N3j17K2p5L32k60K22o0
$$ -102 154 59 -71 -258 -354 27 -362 85 16 -292 -21 -382 -412 -198 -151 -98 -215 -193 -268 64 -196 26 -34
5134c4k46r1K91K21j68lJ82k1k15K8J08k6q9k5K12r7j17L11j21l40J65j51J59
$$ -34 -280 -371 -80 141 -27 -30 152 131 -84 -56 52 26 -63 -88 124 27 -90 221 100 -240 -75 -226 -67
5157f7J53k3j94J09k28L10r4L65j52j09J94M9m8j04k6K9m2j65L59j1O9k42j97
$$ -67 86 63 -131 -22 -250 60 -34 331 179 70 264 313 265 161 135 164 122 -43 316 305 374 132 -65
$$ [...]
8191A21
##END NTUPLES=NMR FID
##END=
