##TITLE=1H_Lac-DMe-A2-1
 CDCl3, 8 sc, 
 22.11.2019
##JCAMPDX= 6.0         $$ Bruker NMR JCAMP-DX V2.0
##DATA TYPE= NMR FID
##DATA CLASS= NTUPLES
##ORIGIN= UXNMR, Bruker Analytische Messtechnik GmbH
##OWNER= root
$$ XWIN-NMR		Version 3.5
$$ Fri Nov 22 14:47:22 2019 Russian Standard Time (UT+4h)  she@DPX200
##.OBSERVE FREQUENCY= 200.1315
##.OBSERVE NUCLEUS= ^1H
##.DELAY= (6, 6)
##.ACQUISITION MODE= SIMULTANEOUS
##.ACQUISITION SCHEME= undefined
##.AVERAGES= 8
##.DIGITISER RES= 18
##SPECTROMETER/DATA SYSTEM= spect
##.PULSE SEQUENCE= zg30
##.SOLVENT NAME= CDCl3
##.SHIFT REFERENCE= (INTERNAL, CDCl3, 0, 15.7039)
##AUDIT TRAIL= $$ (NUMBER, WHEN, WHO, WHERE, WHAT)
$$ ##TITLE= Audit trail, XWIN-NMR		Version 3.5
$$ ##JCAMPDX= 5.01
$$ ##ORIGIN= Bruker BioSpin GmbH
$$ ##OWNER= she
$$ F:/spectra/data/she/nmr/H-F/1/audita.txt
$$ ##AUDIT TRAIL=  $$ (NUMBER, WHEN, WHO, WHERE, WHAT)
(   1,<2019-11-22 14:46:07.29 +0400>,<she>,<DPX200>,
      <created by zg, POWCHK disabled, PULCHK disabled
       configuration hash MD5:
       00 E9 B6 7A A2 85 ED C7 34 08 36 98 17 FE 4E 26
       data hash MD5: 16K
       FD 35 1D 7D 15 A1 C9 67 4F 62 71 79 B4 69 AB D3>)
$$ ##END=
$$ 
$$ hash MD5
$$ 27 57 FD A1 00 23 1F 36 F8 89 93 3F CB DC 9E D5
##$RELAX= 
##$RELAX= 
##$RELAX= 
##$RELAX= 
##$RELAX= 
##$RELAX= 
$$ Bruker specific parameters
$$ --------------------------
##$DU= <F:/spectra>
##$EXPNO= 1
##$NAME= <H-F>
##$PROCNO= 1
##$TYPE= <nmr>
##$USER= <she>
##$AMP= (0..31)
100 100 100 100 100 100 100 100 100 100 100 100 100 100 100 100 100 100 
100 100 100 100 100 100 100 100 100 100 100 100 100 100 
##$AQSEQ= 0
##$AQ_mod= 1
##$AUNM= <au_zg>
##$AUTOPOS= <>
##$BF1= 200.13
##$BF2= 200.13
##$BF3= 200.13
##$BF4= 200.13
##$BF5= 200.13
##$BF6= 200.13
##$BF7= 200.13
##$BF8= 200.13
##$BYTORDA= 1
##$CFDGTYP= 0
##$CFRGTYP= 5
##$CHEMSTR= <none>
##$CNST= (0..31)
1 1 145 1 1 1 1 1 1 1 1 1 1 1 1 1 1 1 1 1 1 1 1 1 1 1 1 1 1 1 1 1 
##$CPDPRG= <>
##$CPDPRG1= <>
##$CPDPRG2= <>
##$CPDPRG3= <>
##$CPDPRG4= <mlev>
##$CPDPRG5= <mlev>
##$CPDPRG6= <mlev>
##$CPDPRG7= <mlev>
##$CPDPRG8= <mlev>
##$CPDPRGB= <>
##$CPDPRGT= <>
##$D= (0..31)
0 1.2 0 0 0 0 0 0 0 0.06 0 0.03 0 0 0 0 0.0002 0 0 0 0 0 0 0 0 0 0 0 0 
0 0 0 
##$DATE= 1574419566
##$DBL= (0..7)
120 120 120 120 120 120 120 120 
##$DBP= (0..7)
150 150 150 150 150 150 150 150 
##$DBP07= 0
##$DBPNAM0= <>
##$DBPNAM1= <>
##$DBPNAM2= <>
##$DBPNAM3= <>
##$DBPNAM4= <>
##$DBPNAM5= <>
##$DBPNAM6= <>
##$DBPNAM7= <>
##$DBPOAL= (0..7)
0.5 0.5 0.5 0.5 0.5 0.5 0.5 0.5 
##$DBPOFFS= (0..7)
0 0 0 0 0 0 0 0 
##$DE= 6
##$DECBNUC= <off>
##$DECIM= 24
##$DECNUC= <off>
##$DECSTAT= 4
##$DIGMOD= 1
##$DIGTYP= 9
##$DL= (0..7)
0 120 120 120 120 120 120 120 
##$DP= (0..7)
150 150 150 150 150 150 150 150 
##$DP07= 0
##$DPNAME0= <>
##$DPNAME1= <>
##$DPNAME2= <>
##$DPNAME3= <>
##$DPNAME4= <>
##$DPNAME5= <>
##$DPNAME6= <>
##$DPNAME7= <>
##$DPOAL= (0..7)
0.5 0.5 0.5 0.5 0.5 0.5 0.5 0.5 
##$DPOFFS= (0..7)
0 0 0 0 0 0 0 0 
##$DQDMODE= 0
##$DR= 18
##$DS= 0
##$DSLIST= <SSSSSSSSSSSSSSS>
$$ [...]
##$SUBNAM2= <"">
##$SUBNAM3= <"">
##$SUBNAM4= <"">
##$SUBNAM5= <"">
##$SUBNAM6= <"">
##$SUBNAM7= <"">
##$SUBNAM8= <"">
##$SUBNAM9= <"">
##$SW= 24.9337058887773
##$SWIBOX= (0..15)
0 0 2 0 0 0 0 0 0 0 0 0 0 0 0 0 
##$SW_h= 4990.01996007984
##$TD= 16384
##$TD0= 1
##$TE= 0
##$TE2= 300
##$TE3= 300
##$TEG= 300
##$TL= (0..7)
0 120 120 120 120 120 120 120 
##$TP= (0..7)
150 150 150 150 150 150 150 150 
##$TP07= 0
##$TPNAME0= <>
##$TPNAME1= <>
##$TPNAME2= <>
##$TPNAME3= <>
##$TPNAME4= <>
##$TPNAME5= <>
##$TPNAME6= <>
##$TPNAME7= <>
##$TPOAL= (0..7)
0.5 0.5 0.5 0.5 0.5 0.5 0.5 0.5 
##$TPOFFS= (0..7)
0 0 0 0 0 0 0 0 
##$TUNHIN= 0
##$TUNHOUT= 0
##$TUNXOUT= 0
##$USERA1= <user>
##$USERA2= <user>
##$USERA3= <user>
##$USERA4= <user>
##$USERA5= <user>
##$V9= 5
##$VALIST= <valist>
##$VCLIST= <CCCCCCCCCCCCCCC>
##$VD= 0
##$VDLIST= <DDDDDDDDDDDDDDD>
##$VPLIST= <PPPPPPPPPPPPPPP>
##$VTLIST= <TTTTTTTTTTTTTTT>
##$WBST= 1024
##$WBSW= 4
##$XGAIN= (0..3)
0 0 0 0 
##$XL= 0
##$YL= 0
##$YMAX_a= 523506
##$YMIN_a= -403727
##$ZGOPTNS= <>
##$ZL1= 120
##$ZL2= 120
##$ZL3= 120
##$ZL4= 120
##$ABSF1= 10
##$ABSF2= 0
##$ABSG= 5
##$ABSL= 3
##$ALPHA= 0
##$AQORDER= 0
##$ASSFAC= 0
##$ASSFACI= 0
##$ASSFACX= 0
##$ASSWID= 0
##$AUNMP= <proc_1d>
##$AZFE= 0.1
##$AZFW= 0.1
##$BCFW= 1
##$BC_mod= 2
##$BYTORDP= 1
##$COROFFS= 0
##$CY= 11.3945322036743
##$DATMOD= 1
##$DC= 2
##$DFILT= <>
##$DTYPP= 0
##$F1P= 16.9975609425685
##$F2P= -3.02152046262296
##$FCOR= 0.5
##$FTSIZE= 0
##$FT_mod= 4
##$GAMMA= 1
##$GB= 0.15
##$INTBC= 1
##$INTSCL= 1
##$ISEN= 128
##$LB= 0.24
##$LEV0= 0
##$LPBIN= 0
##$MAXI= 10000
##$MC2= 0
##$MEAN= 0
##$ME_mod= 0
##$MI= 1.114404
##$NCOEF= 0
##$NC_proc= 0
##$NLEV= 6
##$NOISF1= 3.799351
##$NOISF2= 2.8
##$NSP= 1
##$NTH_PI= 0
##$NZP= 0
##$OFFSET= 15.70392
##$PC= 1
##$PHC0= -9788.428
##$PHC1= 16.00086
##$PH_mod= 1
##$PKNL= yes
##$PPARMOD= 0
##$PSCAL= 0
##$PSIGN= 0
##$REVERSE= no
##$SF= 200.130013532006
##$SI= 16384
##$SIGF1= 3
##$SIGF2= 2
##$SINO= 400
##$SIOLD= 16384
##$SREGLST= <1H.CDCl3>
##$SSB= 0
##$STSI= 0
##$STSR= 0
##$SW_p= 3612.71676300578
##$SYMM= 0
##$S_DEV= 0
##$TDeff= 0
##$TDoff= 0
##$TI= <>
##$TILT= no
##$TM1= 0
##$TM2= 0
##$TOPLEV= 0
##$USERP1= <user>
##$USERP2= <user>
##$USERP3= <user>
##$USERP4= <user>
##$USERP5= <user>
##$WDW= 1
##$XDIM= 8192
##$YMAX_p= 0
##$YMIN_p= 0
$$ End of Bruker specific parameters
$$ ---------------------------------
##NTUPLES= NMR FID
##VAR_NAME=  TIME,          FID/REAL,        FID/IMAG
##SYMBOL=    X,             R,               I
##VAR_TYPE=  INDEPENDENT,   DEPENDENT,       DEPENDENT
##VAR_FORM=  AFFN,          ASDF,            ASDF
##VAR_DIM=   8192,          8192,            8192
##UNITS=     SECONDS,       ARBITRARY UNITS, ARBITRARY UNITS
##FACTOR=    0.0002004,     1,               1
##FIRST=     0,             0,               0
##LAST=      1.6414764,     0,               0
##MIN=       0,             -403727,         0
##MAX=       1.6414764,     523506,          0
$$ Real data points
##PAGE= N=1
##DATA TABLE= (X++(R..R)), XYDATA
0 0 0 0 0 0 -8 8 0 8 -12 16 -16 24 -31 35 -40 48 -64 72 -86 102 -120 142 -163 188 -219 250 -283 323 -368
29 -368 416 -468 526 -595 663 -738 825 -919 1021 -1134 1258 -1394 1543 -1707 1889 -2093
45 -2093 2320 -2576 2867 -3196 3579 -4026 4559 -5206 6007 -7034 8408 -10339 13267 -18287
59 -18287 29057 -98906 322853 503043 -166468 -345803 76528 242476 -157396 -217470 206403
70 206403 323146 -136790 -325006 44212 284805 14846 -163761 42141 144978 -118378
80 -118378 -222141 72002 257927 11532 -206591 -58477 110858 -15518 -126141 39439
90 39439 167967 -19351 -192048 -25880 190862 82252 -130731 -72674 108357 65294 -85105
101 -85105 -25867 134119 80636 -93525 -79382 60567 46291 -63281 -19823 96526 34896
112 34896 -110739 -68104 80355 57033 -77917 -61883 58297 39772 -64035 -26327 84998
123 84998 46986 -69612 -37888 69842 29816 -75604 -11788 133163 85902 -96889 -113030
134 -113030 45511 94867 -22601 -64611 38939 65867 -60027 -111853 20871 116182 6659
145 6659 -122956 -63828 61898 46016 -38186 -11226 58033 1641 -93324 -36651 90520 64369
157 64369 -58146 -43319 74194 56312 -75436 -69993 66511 76302 -59705 -83539 46568
168 46568 78084 -49217 -92877 25275 73464 -40528 -98946 5046 74114 -7876 -65537
179 -65537 11403 63089 -20052 -83021 -5048 75968 28672 -37394 -2467 40741 -7076 -47952
191 -47952 12393 65405 1316 -70022 -18142 62117 28422 -48065 -28014 31007 -731 -63228
203 -63228 -24518 57019 37168 -38486 -29260 26434 1094 -51519 -375 81177 33388 -72000
215 -72000 -46859 67336 72446 -22428 -40325 23011 20009 -38999 -13827 65579 47852 -42507
227 -42507 -47201 20459 15250 -44538 -17258 62982 40282 -59797 -62615 32871 58001 -14885
239 -14885 -39500 18320 35374 -21231 -32586 35761 67775 7910 -46771 -21362 22285 16619
251 16619 -3133 12198 32603 9703 -32758 -38132 -3241 24079 17739 -4662 -17874 -19119 -11756
264 -11756 6192 23146 13995 -19994 -36043 -9276 22653 19249 3870 14072 22277 -12686 -50376
277 -50376 -18692 49881 54762 -9657 -43009 -8089 17392 -6474 -18612 13247 22218 -27091
289 -27091 -56470 -9099 43666 24926 -20939 -24611 -10612 -24517 -25777 23167 59751 17667
301 17667 -43693 -36982 8178 15742 3743 20434 27657 -20037 -57347 -7356 61485 40450 -31665
314 -31665 -44047 -6533 -5669 -23936 11073 57469 19033 -62614 -63613 8508 39080 8684 -2923
327 -2923 11720 -7824 -38835 -6566 53090 40387 -25700 -37679 8369 22580 -2252 4340
339 4340 35880 17094 -37317 -40002 10472 28966 1163 -6651 12200 2358 -29629 -21216 20308
352 20308 25361 -9688 -22235 1715 14886 5241 4234 14236 6724 -8866 -4724 10039 10212
365 10212 4370 13399 19188 2251 -15928 -9108 5464 5265 1582 7499 4664 -12249 -15296 2696
379 2696 10778 -3564 -10374 535 2476 -9705 -5259 20186 24865 -2748 -22915 -11384 7645
392 7645 15401 19668 16574 -5437 -22779 -5956 20632 12400 -13673 -12243 6100 339 -15981
405 -15981 -1470 18769 -2402 -34521 -18243 20585 11960 -23629 -16048 21001 17639 -17063 -17024
418 -17024 11582 7811 -16356 -3609 29006 17112 -19653 -16432 11613 3440 -17657 2900 28171
431 28171 -5345 -49372 -17817 41933 26203 -36683 -38649 9462 11460 -26536 -13516 38054
443 38054 31060 -31955 -48158 2273 32552 11580 -1679 10677 2141 -25686 -16000 29090 39059
456 39059 308 -28792 -21465 -7288 3073 23410 33677 60 -48050 -44378 5425 34951
468 34951 18819 -3784 -9933 -15043 -19960 -919 30432 33014 -350 -28563 -21058 7352 28960
481 28960 31650 14468 -11578 -25516 -13529 10351 21396 17160 8038 -4608 -19970 -22100 -2739
494 -2739 19824 19909 -201 -17788 -20486 -8778 11186 26347 19913 -5780 -25574 -19792 3050
507 3050 25868 34687 20015 -12522 -31260 -13964 17627 26388 11945 1054 -5633 -18753 -19880
520 -19880 7913 32052 11826 -26197 -28871 -3626 3666 -1495 13729 24805 -6049 -43259 -23797
533 -23797 23747 27816 -1513 -1985 15894 -4318 -35075 -9679 42241 33314 -22994 -34324 3271
546 3271 12907 -9023 -483 27864 4578 -49769 -43559 19602 40824 -1098 -24917 -4816 46
559 46 -22614 -15216 25180 28735 -13198 -29564 1513 18891 152 -4689 16128 12343 -22872
572 -22872 -27710 11836 32045 5428 -15773 -3531 871 -20148 -21027 14393 29937 -2001 -29151
585 -29151 -14775 6689 1327 -3842 11756 14206 -14292 -27529 3517 34232 19161 -11200 -10648
598 -10648 4178 1283 -6296 8196 24891 11558 -15160 -16161 3548 9625 -1136 -4642 3116
611 3116 4644 -4912 -7865 -189 4775 287 -1737 2819 2312 -5442 -5666 11394 21924 7205 -13143
626 -13143 -7425 11695 9637 -5820 1938 24281 16039 -20473 -26822 10022 28880 724 -21661
639 -21661 -3604 13279 -3489 -16886 3605 18963 -2006 -22199 -7694 10252 3091 -989
651 -989 15386 13587 -18923 -27148 11043 33953 4354 -21053 783 20523 -5563 -26455 5069
664 5069 34582 2864 -39825 -22248 20923 18147 -12184 -9557 8740 -6279 -29830 -9286 26259
677 26259 16276 -16810 -12792 10817 -776 -22669 660 35215 13195 -32745 -22479 22635
689 22635 19725 -17220 -10652 24172 9242 -38660 -30374 24592 33861 -9959 -23484 3332 366
702 366 -29896 -15395 34773 32419 -21684 -38192 647 19737 -1656 -2678 22478 12119 -31479
715 -31479 -32099 19435 44067 11079 -19928 -12654 -4260 -11286 -756 27691 25347 -14475 -35085
728 -35085 -11577 14323 12768 3736 4267 -3338 -20232 -17159 13876 32335 13081 -16508 -21315
741 -21315 -4395 9096 13553 16362 12119 -4712 -19569 -12212 10302 21694 11856 -3581 -10392
754 -10392 -10921 -6526 6393 19958 13818 -10344 -24968 -11691 10598 17254 9966 3817 -2644 -14187
768 -14187 -16004 3468 24714 19155 -4575 -13307 -4072 952 -796 7669 18281 5501 -20062
781 -20062 -19432 7322 17845 1751 -6040 5062 454 -22759 -20665 15980 32012 2033 -24257
794 -24257 -11092 5846 -3574 -6962 15692 22503 -9853 -31469 -6204 22922 12977 -6249 -1897
807 -1897 1113 -17161 -18164 15989 32773 -1914 -34135 -15235 14786 5978 -12526 -427 15047
820 15047 -4055 -26137 -8628 20112 12727 -12057 -11976 2049 -408 -5556 8151 16157 -4463
833 -4463 -21061 -3671 15853 2638 -13377 2754 18527 -2986 -27361 -7153 25228 13203
845 13203 -20009 -17127 11582 12340 -10107 -8513 12407 8817 -13045 -11725 9815 12053 -4054
858 -4054 -5285 6992 3861 -6074 1702 11749 -2306 -16712 2285 26103 10606 -21190 -16689
871 -16689 11739 14327 -4771 -4491 11802 5094 -17787 -13533 15545 23748 1360 -14955 -8757
884 -8757 1136 3599 8431 13684 5863 -9898 -13096 -1631 8286 11302 9344 2324 -9938 -13259
898 -13259 -1029 11666 10626 1410 -3641 -6141 -8949 -4450 9147 16709 5631 -12381 -16942 -5211
912 -5211 8841 14342 8388 -4340 -12128 -9626 489 9113 10744 4750 -6993 -14813 -8729 6942
926 6942 13721 4725 -6953 -9761 -6990 -3980 2468 9921 7773 -5930 -14650 -8874 911 5851 7056
941 7056 4840 -5628 -14334 -8141 5403 8589 2498 869 288 -10742 -17840 -852 22422 16235
955 16235 -11609 -20898 -5813 3048 -945 4990 15724 3370 -23489 -23120 7339 23154 7086
968 7086 -8911 -5650 -3808 -10140 -4535 15560 18911 -2852 -17805 -9287 1973 3587 8511 15068
982 15068 3273 -20880 -19920 8369 22388 6066 -7331 -1309 -214 -11718 -7842 17275 24510
995 24510 -2281 -23692 -11064 9255 10732 5214 7528 2293 -13983 -14151 8032 20293 6135
1008 6135 -7451 -3228 -355 -7099 -1113 17926 15796 -10536 -20035 2390 16556 1456 -9152
1021 -9152 5877 13934 -5584 -18798 -430 19519 9050 -9367 -6263 4236 -142 -5642 3502
1034 3502 11675 2153 -9061 -4120 2659 -804 -2102 7577 9751 -5501 -16054 -3627 11888 7521
1048 7521 -4625 -3555 3178 -1607 -9396 -2541 10747 9073 -6165 -11820 -3052 4921 2788 -810
1062 -810 463 1247 -3268 -7983 -5415 3358 8357 3158 -6677 -9831 -3176 4466 4838 446 -3578 -3678
1078 -3678 -2399 -586 724 491 679 1183 -1453 -6017 -5100 3074 7614 -437 -7903 -2414 4747 -611
1094 -611 -7892 -477 9237 2104 -9875 -4981 6539 1785 -7837 -35 11477 2083 -14609 -7719
1108 -7719 11559 10228 -3888 -3321 5031 -2492 -12888 1019 20546 10208 -14941 -13776 6998
1121 6998 8061 -5305 -134 14610 3744 -19800 -13825 14635 19769 -1109 -9355 441 -574
1134 -574 -9760 1233 22536 14890 -14496 -19764 3669 14650 3216 -1255 9271 4839 -15286
1147 -15286 -14543 11051 21703 2924 -11419 -5455 -201 -5678 -344 16968 15173 -10682 -22168
1160 -22168 -3673 12581 7656 808 5441 2122 -13502 -14195 8698 21765 5732 -11679 -7601
1173 -7601 538 -2703 -1681 11445 14020 -5848 -21180 -9881 8841 10715 3096 -578 -4389 -11681
1187 -11681 -9817 5381 13676 4203 -7110 -6015 -2432 -4957 -2239 9889 14069 -1761 -18451
1200 -18451 -13403 6065 14638 6678 -3605 -6165 -6577 -8080 -3697 7708 13645 2606 -15317 -17976
1214 -17976 -1535 12029 8974 -1518 -5940 -5978 -7275 -4039 7416 14243 4715 -10007 -12772 -3742
1228 -3742 4719 9464 10549 2173 -11952 -13260 1534 12479 5209 -4161 -837 1838 -8448 -12424
1242 -12424 5793 21286 7156 -17820 -17120 3579 11714 4133 2856 6220 -3043 -14432 -5002
1255 -5002 15236 15905 -1185 -8421 -1004 803 -1930 5705 13994 2497 -15401 -10169 9773 10974
1269 10974 -3152 -3419 6086 400 -12382 -4724 14374 10732 -9789 -10206 8450 10828 -5519 -7002
1283 -7002 8259 9655 -5320 -7195 7748 9489 -5040 -7357 6993 9389 -5630 -10426 2918
1296 2918 9094 -1627 -6454 2399 5037 -5551 -9565 723 6731 1002 -3196 1223 1232 -5831 -5048
1311 -5048 6149 9713 -1009 -9754 -3753 4400 3937 1018 2148 1002 -6376 -9622 -1276 8024 6716
1326 6716 -2471 -7516 -7275 -4942 -38 5139 4880 -3017 -9239 -6460 1663 6005 3550 -1739 -4305
1341 -4305 -3945 -697 2081 3147 2627 1470 -1198 -4649 -4194 273 3028 2146 381 -931 -3148 -5260
1357 -5260 -3096 2309 3833 -329 -3138 -3607 -3942 -1369 5366 8434 737 -8710 -6356 3197 5804
1372 5804 3352 4594 5113 -3506 -11224 -2751 11683 11137 -1987 -6741 -2150 -1280 -1794 5161 11222
1387 11222 437 -13793 -9246 5836 8321 707 2279 6426 -3070 -15704 -5813 17690 19820
1400 19820 -1721 -14202 -5085 4918 4497 4970 8708 2615 -9787 -11042 2491 10791 7271 1781
1414 1781 -2573 -9573 -12158 813 15861 11059 -6530 -12466 -2336 3239 -540 981 8027 5242
1428 5242 -6961 -10922 108 10842 8418 -223 -5308 -5469 -2984 1490 4358 3126 710 -320
1442 -320 -4649 -9418 -5486 6790 9966 -1300 -11495 -7480 1839 3492 93 225 486 -3573 -6008
1457 -6008 -1379 4744 5869 2418 -1896 -6320 -6617 29 8277 5760 -2937 -5648 -2596 -2225 -2938 1720
1473 1720 5935 -167 -10078 -8190 2488 6037 861 -1429 -92 -4607 -8876 -1156 10937 9631
1487 9631 -2545 -6768 -1839 -147 -1402 4016 10450 2309 -10527 -7523 5986 8282 -1352 -3399
1501 -3399 2065 -990 -8669 -3109 10217 8883 -5544 -8972 998 3994 -3022 -2111 7972 7738 -4284
1516 -4284 -6950 4450 8335 -328 -4243 3429 6747 -415 -3204 3663 5614 -2139 -4732 2390 4591
1531 4591 -3392 -6031 2639 7090 -89 -5481 -434 2416 -2958 -4559 4014 9062 1597 -5398 -1794
1546 -1794 3520 1757 8 3904 4627 -2692 -5949 933 8553 4562 -3562 -5826 -2793 -1324 247
1561 247 4118 3853 -2345 -7299 -6626 -990 3162 4000 1608 -2929 -6152 -3417 3142 6557 3197 -2676
1577 -2676 -5788 -3969 1313 5200 5034 1847 -2155 -6460 -7670 -2451 6365 7928 -2274 -9737 -5486
1592 -5486 1746 -472 -3817 797 5115 -2571 -11391 -5189 7847 8457 -914 -4018 -753 -3234 -4951
1607 -4951 2594 10774 5927 -4426 -5345 -1090 -2551 -3372 6664 11641 -2063 -16690 -8712 9197
1621 9197 8742 -3237 -4393 1633 -3212 -11789 -1812 16315 13669 -6811 -14876 -2881 6645 4014
1635 4014 4658 9232 2948 -10632 -9190 7027 14001 3775 -4301 -2464 -3121 -6690 907 14820
1649 14820 10743 -10171 -18044 -3140 9129 5458 1095 4668 1183 -11129 -10790 7542 18151
1662 18151 5608 -8677 -6523 1234 2131 4043 10478 7533 -7173 -13470 -1318 10583 7059 -464
1676 -464 -210 -1063 -8310 -8358 3685 10978 2086 -9092 -6173 2200 1589 -1935 1348 6035 842 -7393
1692 -7393 -4855 4645 7759 3054 -807 -396 -1952 -4304 -1329 4798 5951 -947 -5404 -3729 -947
1707 -947 -1390 -1569 1348 1220 -4641 -7926 -2129 5529 3474 -3713 -4804 -48 294 -2834 -346 6276
1723 6276 6077 -2681 -6314 -531 3726 1222 -883 2541 2606 -4035 -6539 995 6294 -360 -7145 -3610
1739 -3610 1427 -1348 -4310 2457 6887 -2332 -11146 -4074 7689 4996 -3186 -1165 6056 1907 -5686
1754 -5686 -865 8186 4074 -5109 -2020 6630 3129 -5226 -1057 7066 1503 -8867 -4200 6749
1768 6749 2695 -7194 -1911 9577 3648 -11061 -8007 7541 9132 -2192 -3313 5978 5419 -4752
1782 -4752 -4031 7357 8605 -1561 -4804 2203 4278 -739 249 5565 2144 -7582 -6856 3401 5145
1797 5145 -2037 -2601 4204 1576 -9269 -8102 5709 11306 317 -7378 -1506 4993 1505 -1697
1811 -1697 4126 6915 -1094 -8317 -2913 7781 8173 1180 -3433 -4204 -4852 -2929 2900 5969 963
1826 963 -6399 -6467 -1549 63 -72 1839 2038 -3261 -8159 -3092 6331 8224 580 -5482 -3522 -341
1842 -341 52 817 5399 6334 -891 -9017 -7288 2450 6286 1606 -3261 -3797 -3173 -4457 -1449 4552
1858 4552 4080 -3581 -8495 -4646 1651 3277 3673 4180 249 -7275 -6966 3268 9321 3615 -2248 -531
1874 -531 620 -4061 -3247 5528 8416 -1414 -9958 -4811 4066 2911 -654 1872 2778 -5727 -10941 -1441
1890 -1441 9923 6943 -2705 -3184 388 -1752 -3087 4960 11346 3118 -8622 -5373 5445 6940
1904 6940 1475 1453 3826 -3275 -9485 -1863 11135 8230 -4167 -7260 -800 225 -3337 1241 8231
1919 8231 3243 -8606 -7338 4846 8494 465 -2037 2666 1352 -4632 -1689 9110 9118 -2202 -7039
1934 -7039 -793 3167 -634 -923 3891 3217 -4999 -6675 177 3807 -257 -2941 -955 -170 -2777 -1854
1950 -1854 3218 3806 -1472 -4042 -248 2019 -636 -1001 3156 4083 120 -4002 -2200 2028 1651 -1161
1966 -1161 -1560 -40 182 -2011 -3120 -1702 1156 461 -2529 -3758 -2212 228 1262 684 -539 -1472
1982 -1472 -1754 -903 362 1061 1722 2564 898 -2560 -3578 429 4373 2165 -3152 -3826 1099 2193
1998 2193 -1884 -3157 629 2443 -2994 -6183 -1629 4138 2830 -1701 -2055 -268 -853 -1259 1521 3553
2014 3553 2073 -153 725 992 -1490 -940 4598 5706 -1803 -6718 -415 6265 2777 -2999 -581 2814
2030 2814 -1837 -7278 -1317 8079 6255 -3216 -6099 -604 1431 -235 3056 6147 1512 -4684 -3174
2045 -3174 3698 5114 2115 1504 1479 -2879 -5741 601 8759 6295 -3439 -6878 -2673 -262 -119 2852
2061 2852 5898 361 -7866 -7252 1759 6733 3647 -398 -1928 -3519 -3692 1983 8276 6381 -1740
2076 -1740 -6954 -4069 729 4236 5169 3434 -2801 -7474 -5525 1358 4835 2431 -1561 -4221 -5559
2091 -5559 -3342 1914 5126 2434 -3598 -6263 -3685 701 3854 4612 2009 -2903 -5513 -3289 1633
2106 1633 4927 3964 522 -3955 -5099 -1392 2775 3296 872 -2122 -4547 -4782 -1827 3380 4650 -508
2122 -508 -4841 -4488 -1027 351 1252 3457 3399 -1970 -5117 -1579 3532 3769 1131 430 207 -2176 -2600
2139 -2600 1721 4995 2350 -2000 -3070 -1737 -2118 168 4433 4858 -2399 -6886 -3346 2876 3302 498
2155 498 1417 1768 -1762 -3847 898 6690 5029 -1125 -3277 -883 1651 2724 4365 2740 -1162 -4077
2171 -4077 -1931 1989 2002 774 1164 934 -2800 -4386 363 5331 2557 -3136 -3736 469 2379 1277
2187 1277 543 1821 1098 -1924 -2201 1266 3761 2877 313 -1201 -1643 -882 1626 2089 -497 -2511 -1011
2204 -1011 1473 -314 -2806 -1467 1515 664 -2647 -2615 381 1485 107 -855 240 1163 -490 -2133
2220 -2133 -1695 779 3282 2846 -1033 -3949 -2268 956 1416 -229 -479 47 -1987 -4205 -2016 2594
2236 2594 2632 -1630 -4636 -3637 -765 1179 2703 1992 -1614 -3995 -2468 552 1549 1837 2586 1458 -3246
2253 -3246 -4506 1117 5507 2430 -3005 -2885 -379 -406 -1360 1187 3793 -169 -5338 -4299 764 2270
2269 2270 979 478 70 -1958 -3246 165 3946 2515 -657 -290 717 -600 -686 3227 5019 869
2285 869 -3401 -2453 1625 2225 866 2010 2098 -1884 -5335 -2090 3782 4136 451 -1548 -1290 -2393 -1990
2302 -1990 2813 6282 2672 -3909 -4563 219 3733 3803 3260 1834 -2087 -5478 -1770 4915 6808 2501
2318 2501 -2647 -4578 -3745 -819 3739 5441 775 -5191 -5457 -1414 2487 3354 2761 113 -3659 -5478
2334 -5478 -1572 4633 6657 2141 -3109 -4657 -2030 1435 3575 2715 275 -2574 -3720 -2458 1057
2349 1057 3572 2504 -2307 -5957 -3927 655 2841 1145 -976 -2715 -2775 -1978 -58 2277 2487 406
2365 406 -1724 -2797 -1457 1720 3753 1817 -2336 -3189 -467 1497 398 -262 803 497 -2867 -4710
2381 -4710 -1288 3479 2385 -1391 -2766 -1398 -1248 -836 1279 2570 1291 -1543 -1824 -455 864 2489
2397 2489 3635 1620 -2955 -3838 1042 4843 2013 -1551 -17 790 -2156 -3652 1462 5799 1838
2412 1838 -4642 -3501 1415 2404 389 -48 1637 -181 -2150 -260 3134 2638 571 356 507 -749
2428 -749 -770 2774 4211 161 -2707 -171 2698 393 -2050 -384 2952 922 -2727 -1298 1806 1272
2444 1272 -1501 -1427 1090 1482 -993 -696 796 1167 505 792 448 -310 -1003 416 1823 1662 -325 -577
2462 -577 -438 -1040 -971 678 2234 429 -2956 -3332 -362 1616 1125 -87 -1522 -2715 -2420 -146 2334
2479 2334 2763 -60 -2417 -2476 -1342 1070 2787 2346 -685 -2964 -3190 -603 2646 2776 -398 -3248
2495 -3248 -3908 -1788 513 1866 1730 -154 -3116 -4766 -1946 2481 4072 1055 -2366 -3083 -1910 -117
2511 -117 2010 3556 1598 -2100 -3630 -1277 1891 2757 2272 990 -2324 -4388 -1745 3571 4255 -164
2527 -164 -2720 -1890 -593 -1463 46 3425 3059 -2008 -4430 -900 2812 2540 793 530 -234 -2044 -1256
2544 -1256 1877 3910 1885 -628 -1026 -942 -1601 293 4322 4215 -1401 -4763 -1458 2515 2245 172
2560 172 989 818 -2072 -3792 92 5226 3757 -402 -2857 -2338 -237 1953 3954 3116 -1725 -4008
2576 -4008 -1161 1406 1430 1588 2447 593 -4244 -4819 1507 6199 2594 -3456 -3891 -784 431 178 1416
2593 1416 2827 -203 -3915 -3710 487 3782 2968 275 -2418 -3222 -1011 1893 2998 310 -1720 -1221
2609 -1221 -684 -673 -53 1883 1688 -1910 -4199 -2000 1533 2229 -32 -1806 -1498 -759 -604 -657 -93 991
2627 991 654 -1120 -1852 -573 920 1273 -474 -1199 -141 -43 -1028 -943 733 1190 109 -1134 -1454 -557
2645 -557 -244 1035 1180 -50 -1445 -1190 -22 551 497 1016 1188 -326 -2078 -564 2705 2348 143
2662 143 -1131 3 -11 -1009 436 2902 1921 -1677 -2247 365 1499 765 604 1161 565 -1637 -1402 1665
2680 1665 2764 223 -872 407 731 -342 -200 2484 2433 -504 -1928 353 1653 -55 -63 1979 1487
2697 1487 -1593 -2251 329 1910 750 -587 759 386 -1895 -2279 1852 3679 476 -2505 -1550 416
2713 416 147 99 2294 2460 -1304 -3998 -1494 1902 2714 1133 -355 -1550 -2925 -1786 1907 3444
2729 3444 621 -2405 -2490 -1502 -794 921 2786 1831 -2779 -5220 -1867 3010 3253 799 -1835 -2356 -2117
2746 -2117 -1395 1363 3118 2081 -1655 -4033 -3266 482 3426 2891 -644 -4233 -4005 -485 2175 2308
2762 2308 466 -960 -2425 -3321 -1204 2051 3844 1563 -2909 -4534 -1669 2159 3426 1375 -1304
2777 -1304 -1996 -1464 -659 334 2340 3262 396 -3752 -3303 758 3870 2604 -299 -1055 -2035 -1254 311
2794 311 2117 2008 409 -946 -1481 -1325 -37 3175 3309 -93 -3479 -1907 1736 2381 518 892 1226
2811 1226 -410 -3135 -1324 3265 4143 783 -2502 -1832 -237 575 1794 2805 1075 -2131 -2752 -1
2827 -1 2030 1863 1477 775 -1729 -3355 -471 3762 3680 -213 -2783 -1334 -104 122 1379 2618 1148
2844 1148 -2594 -3541 -287 2643 2235 -93 -1329 -1506 -2004 -515 2055 2255 -566 -2258 -1427 -203
2860 -203 465 606 825 115 -2215 -2051 365 1983 531 -1148 -1121 44 -403 -789 137 510 -475 -1449
2878 -1449 -563 298 -357 -737 54 306 -211 -682 -256 -348 -738 -684 247 918 173 -1271 -1376 -220 1227
2897 1227 903 -70 -552 -956 -693 -206 591 1209 612 -1079 -2146 -818 1502 2152 264 -658 -1378 -867
2915 -867 487 1502 1669 157 -961 -1560 -151 629 1519 1944 285 -2060 -2296 342 2839 2176 -701
2932 -701 -1370 56 395 -164 982 2206 1224 -1350 -2029 538 2080 1680 736 251 -381 -1102 290 1756
2950 1756 1466 70 -54 712 -519 -1919 243 3154 1905 -1570 -2016 350 988 -228 39 1743
2966 1743 1347 -1828 -3199 25 2646 1859 33 -1112 -1380 -1604 324 2283 1727 -570 -1731 -1495
2982 -1495 -1149 217 1944 2684 -292 -4019 -3350 891 3264 1605 -1083 -1499 -1146 -1563 -693 1989 2721
2999 2721 -188 -3556 -3133 -403 2098 2314 560 -2015 -2918 -1729 1044 1869 1230 -388 -2010 -2443
3015 -2443 -1645 1096 3165 1851 -1789 -3553 -1750 1022 2204 858 -150 -1158 -1541 -1182 379 1582
3031 1582 2109 168 -2056 -2320 -313 1994 1791 432 -721 -1086 -580 -111 529 1479 944 -346 -1531
3048 -1531 -951 437 1007 1301 685 -782 -1193 -501 782 1163 1057 751 881 -477 -1447 345 2280 1498
3066 1498 -379 -1467 -236 165 360 1004 1416 74 -1415 -1278 636 1594 953 510 517 -544 -1547 31
3084 31 2334 2136 -450 -1596 -457 605 376 594 1087 479 -1546 -1305 460 1574 675 -523 -476 -785
3102 -785 -873 563 1676 786 -1131 -1286 23 759 -325 -549 837 724 -1287 -1240 417 1713 -166
3119 -166 -1265 -346 533 173 -900 -994 -157 334 68 -14 -1030 -1197 -669 410 352 -521 -553 -105 -975 -1323
3139 -1323 -237 1566 1768 -1111 -2593 -1229 1306 1608 568 -609 -1107 -1131 -991 -156 1341 1773 49
3156 49 -2364 -2573 -336 1954 2051 -195 -1568 -1387 -284 701 1406 1309 540 -1116 -2257 -966 1296 2684
3174 2684 1526 -992 -2460 -1153 1449 2344 1112 -243 -157 -393 -898 -223 1754 2733 122 -2516 -1999
3191 -1999 803 2575 1679 -139 -362 -463 -865 -47 1413 2033 1090 -483 -1117 -913 391 1902 2489
3208 2489 -305 -1548 -1018 280 721 604 1261 1253 -963 -2897 -1551 2042 3023 486 -1274 -1525 -713
3225 -713 -245 911 2405 1583 -1044 -2289 -1415 822 1765 1988 441 -2068 -2879 -1397 1869 2672 806
3242 806 -1272 -1956 -1726 -901 1001 2657 1125 -1933 -3598 -1345 1429 1934 758 -671 -1614 -2172 -931
3259 -931 1749 2475 806 -1670 -2619 -1144 74 1400 1638 320 -2177 -2940 -870 1141 1676 522
3275 522 -1107 -1888 -1353 -356 985 1280 291 -1158 -1643 -941 539 1442 1288 -186 -1192 -1147 -211 875
3293 875 1471 636 -352 -647 -720 -24 -94 739 826 263 -1023 -1040 337 1046 287 -244 122 643 -412 -743
3313 -743 281 1823 1192 -487 -1036 -311 477 543 822 701 384 -601 -424 475 575 1017 1138 -48 -1518
3332 -1518 -1250 917 2307 852 -1194 -1189 135 246 -390 549 1821 841 -1530 -1936 500 1714 1115
3349 1115 -222 -474 -466 -7 782 985 456 -566 -694 -106 -605 -214 1003 1554 -253 -1952 -1303 1079
3367 1079 1032 -343 -818 296 997 -788 -1260 199 1319 422 -899 -983 -10 -89 4 177 100 -179 -441
3386 -441 -1148 -918 -252 476 1351 -185 -2052 -1797 237 1211 529 -400 -630 -871 -1298 -1016 792 2238
3404 2238 697 -1739 -2457 -725 1659 1783 694 -1009 -1343 -1515 -324 856 1433 845 -1073 -2465
3420 -2465 -1635 500 1991 1596 -384 -2147 -1709 -250 1393 1907 868 -559 -1380 -1328 78 2056 2502
3437 2502 714 -1501 -1754 -190 1508 1881 1048 -513 -733 -1247 -714 1533 2187 708 -1232 -1484 -595
3454 -595 322 1054 1322 752 -963 -1431 -452 1361 1586 1011 231 -87 -506 -961 974 1959 1181 -471 -1083
3473 -1083 -692 168 622 1305 1048 -547 -1864 -1313 510 987 905 346 -36 -1630 -1640 129 2056 1937
3491 1937 -702 -1471 -951 442 632 1153 1255 84 -1658 -1977 -141 1879 1526 75 -1581 -1960 -1136
3508 -1136 515 1358 711 -805 -1459 -1117 -203 53 1147 1094 -407 -2361 -1898 858 2021 1063 -1461
3525 -1461 -1336 -614 20 -72 363 1147 -184 -1144 -1462 -87 1002 791 -409 -1139 -1023 -58 694 494 -170
3544 -170 -688 177 10 -515 -504 219 1342 209 -859 -407 673 591 -163 -508 263 1142 156 -1076 -761
3563 -761 628 811 -61 -366 -177 98 -38 -315 242 543 755 -323 -794 -53 928 1617 776 -499 -947
3582 -947 -149 809 1654 352 364 417 0 -447 81 1407 1999 -171 -1878 -889 1189 1114 132 -46 267
3601 267 -483 -725 -38 965 1128 286 -340 -631 -356 334 1187 999 -355 -804 84 511 143 -217 433
3620 433 638 -707 -1390 -576 818 1031 -536 -785 -299 -125 -553 -491 649 624 -45 -1050 -808 -231 500
3639 500 1073 564 -817 -1452 -1004 287 1194 463 -120 -886 -1052 -1226 269 1276 1113 -638 -2128 -1936
3657 -1936 -8 1121 1200 226 -973 -2048 -994 567 1627 1400 -139 -1285 -1659 -589 937 2109
3673 2109 1167 -1248 -2555 -1450 938 2098 1010 -317 -1087 -1466 -516 600 1247 1191 -564 -2060 -1690
3690 -1690 398 1834 1633 196 -732 -1065 -459 1039 1454 884 -24 -857 -372 -179 681 1387 839 -112
3708 -112 -1706 -807 829 1587 -132 -10 180 -265 -462 -503 735 1695 595 -607 -662 177 500 560 683
3727 683 37 -27 -32 -243 18 701 739 535 -482 -1313 -740 749 1683 292 -1052 -1039 -48 78 -406 710
3747 710 1282 63 -1838 -1254 615 1793 867 -289 -1092 -799 -411 737 1279 727 -458 -705 -784 -648
3765 -648 464 1125 571 -1254 -2131 -862 1093 822 47 -1108 -71 -617 -813 -528 739 651 -748 -1417
3783 -1417 -539 633 655 189 -632 -517 -338 98 62 -310 -327 -60 -135 -281 -621 -490 333 159 -795 -566 357
3804 357 271 -587 -824 -39 898 634 -625 -669 317 794 501 310 -97 -141 -547 -756 601 988 709 -107
3824 -107 -868 -725 175 1211 1060 245 -876 -1037 -370 786 1168 730 169 -737 -874 -226 1208 1588 743
3843 743 -751 -1016 -26 1256 979 1140 213 -575 -1216 -143 1010 1761 423 -287 -1135 -839 -302 884
3861 884 1511 156 -1026 -1229 -78 893 497 43 245 -136 -973 -933 473 1182 584 -129 -822 -476 -278
3880 -278 199 860 641 -123 -965 -500 -263 180 615 895 -58 -1387 -1913 3 1550 711 -425 -941 -889
3899 -889 -889 -164 854 1531 533 -1192 -1828 -703 1172 1543 313 -1033 -1155 -1122 -116 890 921 15 -747
3918 -747 -1489 -1292 -13 1298 1382 61 -2022 -1775 86 1636 1122 -290 -885 -1006 -897 -306 893 1732
3936 1732 688 -1460 -2169 -641 1241 1767 453 -866 -1237 -444 557 766 1087 234 -427 -1114 -1109 65
3954 65 1251 1166 46 -1432 -760 506 1376 694 140 284 443 -505 -520 394 1578 807 -487 -447 -125
3973 -125 493 379 274 -10 288 -119 -395 85 345 651 469 -202 -383 -481 194 958 541 -235 -275 57 -102
3994 -102 -314 176 1213 617 -733 -1180 -45 1193 730 52 -591 -620 -801 -578 271 723 416 -621 -773
4013 -773 -524 113 691 629 -154 -1059 -765 515 869 273 -271 -230 -346 -742 -400 430 683 -48 -1049 -858
4033 -858 -240 57 56 114 -348 -197 -577 -496 -196 -13 -368 -199 -198 -658 -526 132 577 358 -175 -138 -51 -352 -406
4056 -406 -160 352 464 57 -967 -539 -85 518 314 170 -565 -643 -592 94 588 459 183 -282 -564 -413
4076 -413 451 1222 1118 4 -1035 -747 667 1065 755 29 -429 -485 -402 176 1233 1346 222 -1169 -1360
4095 -1360 128 1228 1319 152 -451 -921 -480 167 714 852 195 -433 -948 -628 573 1655 1300 -428
4113 -428 -1323 -373 551 904 636 39 -241 -247 -971 -242 778 1172 -309 -1340 -928 330 606 550 -45 -221
4133 -221 -223 -386 -126 78 124 593 182 -760 -948 -115 816 910 -120 -901 -424 -399 -684 -412 771 1095 -401
4154 -401 -1673 -1227 387 1038 87 -450 -742 -589 -277 194 844 835 -243 -772 -1072 -432 639 1401 434
4173 434 -1095 -1327 -724 621 918 151 -85 -528 -1267 -798 204 1216 621 -823 -1808 -740 813 1053
4191 1053 484 -152 -749 -726 -446 732 978 384 10 -942 -863 151 721 1105 152 -822 -639 125 522 605
4211 605 90 174 -189 -238 -165 261 861 292 -116 -406 -66 158 266 218 200 355 243 106 64 40 -82 289
4233 289 392 -69 -115 -185 223 195 305 29 247 -148 -9 -21 142 794 406 -479 -701 163 567 531 373 -334
4255 -334 -176 -668 -23 170 430 376 -236 -430 -545 -16 615 643 -97 -676 -924 -273 773 390 34 -149
4275 -149 -217 -373 -471 407 602 285 -475 -745 -226 53 294 172 -55 -267 -111 -350 -143 -6 441 186 -361
4296 -361 -791 -661 125 453 -73 -700 -591 -112 -390 -566 121 488 367 -502 -1130 -612 413 702 -22 -356
4316 -356 -571 -447 -77 78 550 731 -36 -597 -1122 -510 1052 1036 143 -835 -1404 -313 411 829 554 289
4336 289 -494 -1077 -357 915 1798 1027 -608 -1556 -307 1018 1458 1091 -5 -560 -618 -247 698 1220 932
4355 932 -270 -1105 -1064 282 1131 1080 -133 -847 -754 -323 911 700 662 175 13 -808 -361 699 1422 727
4375 727 -879 -1288 -617 729 588 578 223 -290 -638 -621 42 790 756 -64 -430 -660 -365 471 831 -53
4395 -53 -341 -428 -400 -104 -285 405 434 284 -627 -1119 25 905 737 66 -200 -510 -640 -344 277 588 66
4416 66 -337 -1238 -698 -5 655 528 -38 -755 -1101 65 343 644 38 -358 -712 -706 -216 458 838 336 -1003
4437 -1003 -987 -188 645 570 543 -192 -728 -745 -67 354 399 161 -573 -648 -506 250 276 662 118 -750 -815 -43
4459 -43 710 458 -55 -164 55 64 -272 29 707 211 -263 -198 -38 279 144 5 52 172 229 85 -121 -348
4481 -348 433 627 497 -47 -540 -231 318 389 219 208 -100 160 -478 -310 787 1051 468 -842 -682 476
4501 476 853 914 256 -86 -335 -392 -125 553 632 269 -547 -772 -392 236 1237 676 -652 -718 -250 302 641
4522 641 149 192 -64 -604 -693 -263 802 1255 -270 -874 -636 91 607 267 -15 -306 -283 -248 -110 372 476
4543 476 345 -246 -926 -739 98 509 305 -546 -593 -311 118 -144 -168 560 534 -180 -973 -383 702 610 155
4564 155 -589 -618 -333 -176 -100 547 608 40 -797 -838 -237 319 777 414 -425 -829 -810 430 600 528 191 -114
4586 -114 -909 -730 192 1362 1223 -285 -1163 -956 263 643 724 88 -490 -736 -470 2 1348 1091 55
4605 55 -813 -951 20 881 1284 509 -580 -847 -592 518 1250 529 6 -65 -274 -582 276 1214 694 -199
4625 -199 -772 -396 236 752 283 261 -425 -349 -246 193 450 502 171 -274 -210 -404 682 697 534 -245 -529
4646 -529 -249 -244 16 254 140 -7 -286 -529 -368 120 623 413 -85 -261 -465 -97 238 -75 191 -6 -383
4667 -383 -330 -209 95 568 339 -338 -778 -283 58 606 184 -201 -218 -469 -579 -374 395 223 -209 -930 -786
4688 -786 302 780 256 -124 -400 -448 -324 0 377 71 62 -247 -387 -521 260 591 247 -361 -629 -226 590
4709 590 150 -199 -311 269 35 -414 -388 91 298 166 -162 -208 169 365 33 -295 253 492 574 -350 -232
4730 -232 -116 406 574 109 -277 -470 15 264 222 -5 474 270 -264 -426 102 972 607 -435 -763 -297
4750 -297 402 516 373 234 -62 -478 -405 70 566 884 53 -650 -620 226 855 829 354 -459 -722 -139 295
4771 295 537 720 464 -102 -998 -578 714 1197 565 -325 -590 -434 109 316 666 354 -352 -375 -590 108
4791 108 652 383 62 -452 -606 -191 471 346 -8 -346 -435 -241 -265 93 18 312 16 -463 -513 189 381
4812 381 287 104 -354 -406 -378 -175 184 553 14 126 -367 -288 196 679 517 -123 -707 -958 -366 446 361 120
4834 120 -445 -820 -772 -508 548 922 324 -510 -1007 -512 436 737 536 -68 -734 -794 86 617 851 655
4854 655 -215 -833 -636 52 963 1064 361 -604 -581 -175 757 595 282 -268 -41 -363 -149 488 927 600
4874 600 -356 -538 28 313 728 551 -157 -343 -53 -16 179 277 324 287 -173 -321 -135 333 327 223 -716 -125
4896 -125 212 330 106 124 109 285 -18 -307 97 7 483 64 -227 7 -218 109 98 -81 298 95 -378
4917 -378 -806 -415 359 691 17 -636 -648 134 71 -55 151 93 112 -534 -781 175 680 419 -414 -807 -407
4938 -407 16 512 -147 -142 -383 -611 -363 -99 477 381 82 -308 -702 -87 382 389 -136 -168 -271 -146 -191 -53
4960 -53 201 560 138 -389 -396 103 226 219 -162 -212 109 25 -190 334 60 242 93 -380 -245 54 227 423
4982 423 443 48 -141 -231 268 224 314 655 16 -437 -445 171 774 670 193 -692 -470 -200 510 482 322 128
5004 128 -423 -651 240 330 670 283 -214 -894 -549 407 591 585 -96 -491 -339 33 399 999 573 -53 -648
5025 -648 -688 241 1030 1072 126 -665 -509 -95 502 713 84 -399 -824 -396 -134 485 409 257 -315 -630 -644
5046 -644 168 557 435 -329 -832 -172 -105 253 250 307 -59 -347 -463 -277 301 368 102 -200 -403 -273 -104 273
5068 273 10 100 73 -270 -287 -485 79 278 -2 -453 -660 28 205 323 109 -171 -88 -535 -644 -167 223
5089 223 428 -124 -885 -564 -159 401 586 276 -293 -695 -143 12 276 310 127 -321 -830 -405 256 966
5109 966 410 -81 -592 -387 326 362 32 -305 -14 -105 -272 176 868 453 61 -342 -101 556 448 255 -170
5130 -170 -626 -159 -110 76 180 495 305 51 -111 -47 167 338 -143 -159 -149 209 308 -69 33 211 332 -229
5152 -229 -92 86 50 193 173 199 186 133 -201 95 -326 250 267 -88 -372 -392 -520 292 555 -43 -380 -217
5174 -217 58 -194 117 177 158 -446 -894 -306 230 648 203 -400 -410 -562 -113 157 170 15 -410 -283 -376 -56
5196 -56 221 431 -124 -378 -552 -94 316 476 37 -401 -570 -329 -3 181 294 117 -133 -247 -534 317
5216 317 218 388 -105 -106 -122 -71 129 135 -121 309 171 -293 -316 124 403 568 34 -227 -617 -392 266 80 327
5239 327 119 -450 -428 -60 133 1063 580 -3 -467 -181 133 841 383 89 84 -266 -174 283 508 418 439 -613
5261 -613 -579 71 969 872 8 -480 -628 -80 205 413 815 44 -111 -528 44 429 943 771 -93 -805 -432
5282 -432 22 674 461 199 -403 -71 -10 233 550 325 237 -403 -517 -15 521 625 26 -280 -303 -32 343
5303 343 -53 122 116 -261 -546 -313 -59 256 96 -157 -111 3 -243 -3 -97 -118 168 -237 -196 -199 -218 309 85
5326 85 -108 -94 -135 -40 88 -277 -140 67 -134 -430 -230 -45 662 482 -194 -486 -242 -43 136 305 -481
5347 -481 13 -586 -344 -139 633 521 39 -758 -464 146 367 263 150 -248 -236 -126 -111 287 685 -156 -372
5368 -372 -593 226 191 438 373 -135 -369 148 284 173 -123 111 -192 -153 -228 -280 93 99 387 -387 -40 169
5390 169 326 221 -187 -130 140 125 -39 -237 -125 547 230 96 -99 7 89 35 89 159 -117 203 -493 -345
5412 -345 -57 313 345 -102 -52 -92 70 448 188 204 -378 -330 -25 15 283 67 197 -271 -807 -7 426 533
5434 533 174 -633 -668 -409 356 339 422 -122 -300 -339 -470 -160 594 197 -162 -618 -490 -141 397 361 -272 -562
5456 -562 -176 -256 167 92 29 -141 -349 -446 -164 162 242 180 -185 -243 -223 -68 61 -14 93 -154 -166 -346 -530
5479 -530 541 420 30 -301 -308 -283 192 345 194 26 127 -274 -230 52 770 727 -108 -316 -468 381 172
5500 172 23 -54 86 -103 -79 -135 99 987 486 -557 -712 -270 404 727 388 60 -498 -272 198 393 139
5521 139 472 -93 -313 -419 85 1099 824 216 -668 -363 -104 516 334 318 -34 -479 -584 -251 528 258
5541 258 141 -169 -790 -192 -14 367 652 -174 -335 -77 -279 144 457 280 -99 -322 -497 -62 302 85
5561 85 125 -257 -293 197 -221 -108 -57 203 21 -263 33 9 140 344 32 -161 -241 -46 50 -174 179 57
5583 57 112 -201 -445 -254 167 193 -107 -7 -430 -63 216 401 281 168 84 -322 -29 194 169 22 70 -374
5605 -374 -190 105 469 495 86 -480 -27 -154 -102 -105 243 21 -60 -272 -311 385 267 124 -106 -417 -165 258
5627 258 -187 374 204 97 -115 -144 181 223 337 107 -200 151 328 435 266 32 -467 202 340 14 -17
5648 -17 194 341 380 -10 -118 9 197 49 175 487 42 -305 -164 31 162 639 262 -356 -229 -261 329
5669 329 635 -36 -2 -226 10 -101 0 206 145 -111 -256 -471 157 890 265 53 -215 -416 -116 470 376
5690 376 178 -241 -250 -367 161 582 210 123 -379 -733 -336 35 346 -52 -338 -465 76 -246 19 285 275
5711 275 -376 -662 -509 189 478 -23 -313 -439 -583 -224 90 194 218 126 -520 -253 -81 140 136 35 -381
5732 -381 -528 46 363 206 -124 117 -109 130 -176 200 130 251 172 -515 45 131 383 183 -105 317 33
5753 33 -85 -464 188 392 98 -25 -96 -622 97 387 554 163 -228 -452 -415 -178 197 610 200 49 -598
5774 -598 -239 372 841 322 -68 -50 87 593 274 473 112 -214 -447 -69 159 399 259 83 -134 -410
5794 -410 -342 363 228 117 -70 -314 172 -43 178 156 169 -460 -275 -227 383 161 104 -178 -176 45 136 148 203
5817 203 -296 -159 78 -188 -100 -398 26 241 475 -420 -380 -352 -210 14 -148 67 35 -550 -459 47 268 322
5839 322 107 -152 -244 -123 -178 153 52 -142 -122 -212 -147 -7 431 122 -498 -321 -292 6 321 59 -156 -130
5861 -130 -92 -147 -15 78 404 179 -205 -412 -476 576 230 3 -442 -163 16 260 79 217 159 -53 -75 3
5883 3 210 454 279 -5 -304 -101 106 356 192 -66 393 67 -49 -35 72 283 678 261 16 -286 252
5904 252 7 161 24 235 -195 12 -219 463 409 451 157 -293 -258 167 449 249 60 -108 -419 -234 34
5925 34 262 377 243 -257 -649 -131 539 617 -52 -465 -340 -43 -180 206 135 200 -324 -496 -590 -24 668 240
5947 240 -215 -318 -557 140 420 343 -154 -235 -107 -469 94 326 -9 205 -774 -413 -306 241 331 -1 -498
5968 -498 -418 -202 -20 232 325 -114 -183 -126 -45 -301 393 275 -615 -234 -150 216 190 -28 103 -149 -156 -244 -158 204
5992 204 393 112 -137 -117 -402 -121 73 227 18 -189 -8 -45 46 21 306 394 -249 -114 -175 54 277 455
6014 455 -144 -216 -211 -287 386 -65 377 240 -386 -378 -166 218 323 114 -106 -189 -99 239 292 131 123 104 -193 -27
6038 -27 305 210 131 -124 -118 -173 -60 635 72 -204 -300 -259 26 -62 -32 198 -118 -112 -29 -278 218 294 192 -199 -149
6063 -149 113 -128 302 75 32 257 113 -196 -445 122 34 655 -180 -126 -145 -64 -222 -230 129 175 133 -526 -468
6086 -468 -53 515 303 -406 -397 -164 -207 -121 286 52 43 -393 -419 -60 51 624 99 -222 -634 -31 240 352
6108 352 284 52 26 -243 54 -96 363 151 -189 -600 -4 238 501 372 -37 -320 -314 -96 447 175 25
6129 25 233 -240 -244 -346 100 388 129 -173 -191 -171 -94 216 -25 -2 -131 -131 -261 131 104 128 253 -530 -26 9
6153 9 148 118 171 208 -52 -25 -52 406 611 412 54 -267 32 110 321 513 212 -98 -175 -280 -113 -78 233
6176 233 -69 81 -168 -262 210 328 235 -207 -399 -216 281 293 444 221 -118 -407 -179 -273 467 166 -197
6197 -197 -209 -612 -132 -157 256 87 -241 -534 -481 154 139 482 379 -288 -360 -459 43 597 308 -166 -337 -150
6219 -150 89 193 -148 168 104 -346 -439 10 183 -18 83 -173 -188 -373 -82 16 -30 -19 -360 133 -138 -293
6241 -293 163 101 24 -226 -148 213 51 337 -126 -288 -1 85 -93 -243 -94 201 414 -106 -190 214 140 191
6263 191 -25 256 -195 -105 1 -297 107 95 48 -366 -291 94 80 368 182 -109 -117 53 267 367 118 82 -85
6286 -85 -369 -346 398 299 -139 -85 87 -162 482 19 231 385 169 -118 20 118 28 133 300 -417 -259 -61
6308 -61 196 220 -209 -146 134 -100 104 -142 -99 -3 -50 -166 -305 46 -210 -34 255 -57 163 2 -27 -216
6330 -216 -157 -57 114 -3 -416 -271 362 214 216 78 109 -257 -379 68 221 99 -303 -590 -426 227 66
6351 66 92 -143 -110 -305 -186 14 270 -190 -69 -300 -550 -43 229 331 303 -179 -522 -89 564 159 -3
6372 -3 -334 -230 -53 263 16 127 165 -85 -199 -410 -74 278 237 -169 -308 -155 -19 448 425 89 -34 -204
6394 -204 -201 -187 -94 98 352 148 -320 -215 267 14 159 -27 25 283 -77 130 69 50 123 -88 91 -225 58
6417 58 289 204 -13 -224 -378 101 375 157 104 293 -130 -431 -97 203 355 86 -353 -220 -92 -37 154
6438 154 280 74 -203 -203 -535 203 640 320 176 -382 -14 103 -47 408 -160 -344 -42 -123 31 -112 11
6459 11 47 82 -373 -88 259 415 -97 -432 -191 -144 242 301 181 -260 -187 -214 -233 -190 292 343 -250 -455 -61
6482 -61 -34 226 -215 -85 -50 -224 250 -284 -79 268 47 156 -198 257 -170 53 131 3 25 61 138 -173
6504 -173 -55 50 148 -152 -332 141 -124 163 309 -12 111 136 -113 -229 -137 313 187 -23 -165 55 24
6525 24 454 418 -17 -232 -57 207 140 185 433 18 -21 -145 160 65 321 72 -97 -107 -157 417 197 237 -61
6548 -61 -156 5 170 238 64 123 137 -354 193 91 117 240 -211 -134 47 42 -82 128 309 147 -105 -108 193 -246
6572 -246 184 338 384 41 -7 -86 -288 33 -258 -18 203 -192 -87 -119 173 145 -52 16 -393 -366 147 181 31
6595 31 114 -122 -354 -67 -56 56 310 -174 -240 -316 38 128 320 159 4 -299 -345 15 233 -2 -19 -259 -500
6618 -500 -231 299 189 -48 -128 -231 43 94 238 -25 61 -143 -378 -316 198 466 13 19 -285 54 155 70
6640 70 85 142 128 -192 44 36 310 253 -85 -12 -215 -24 210 401 69 -197 130 -25 -113 151 -268 251 -189
6663 -189 -259 -60 267 434 148 140 -4 88 70 16 28 168 146 233 -248 123 67 279 59 100 -201 -38 87 118
6687 118 79 210 467 -207 -326 -77 566 353 552 -157 -160 -442 279 149 250 198 -78 -237 -266 -112 353 13
6709 13 -82 -180 -357 75 290 295 -107 -66 219 -82 -136 0 23 -161 26 -76 -180 174 169 -1 -61 -134 -159 8
6733 8 -197 82 -196 27 -141 -100 -227 90 110 -10 -276 -206 304 -60 142 39 55 -128 -96 -407 -126 -145 45
6756 45 401 29 -324 214 -45 -22 14 -312 105 -451 -286 -166 235 369 170 -283 -209 -209 -174 510 613 -55
6778 -55 -43 -208 168 72 -101 148 -23 -247 -145 130 193 272 -52 -163 -237 61 237 262 74 56 -79 -109 -85
6801 -85 231 158 67 -31 -346 108 235 113 -127 -374 -99 -129 124 24 97 146 135 -12 -102 -5 255 179 118 -142
6825 -142 -60 -33 57 -66 163 440 164 -81 -329 -143 86 305 452 -51 -324 -26 -120 -24 -77 79 -111 -422
6847 -422 -83 -60 345 127 -159 -202 -33 -149 355 95 18 -49 -381 -350 -98 112 271 -3 -166 -368 -158 292
6869 292 245 172 -172 -431 -132 -166 82 -150 -3 25 -41 -392 -49 259 394 -296 -308 -53 -171 -50 -119 242
6891 242 1 -25 -361 -4 118 349 56 -400 -262 249 -178 141 53 226 -260 117 -1 -135 -156 -223 5
6912 5 -308 14 -254 452 -112 -7 22 -9 -241 -186 148 1 360 198 -68 -482 15 -26 166 140 313 -188
6934 -188 -2 351 324 286 -90 90 -18 130 -115 278 250 149 -95 -142 219 -64 301 279 -49 50 25 -38 126
6957 126 38 82 167 -359 -74 152 342 -1 52 169 124 76 41 -95 -129 -101 -304 -63 153 339 -165 69 -256
6980 -256 -214 62 -281 33 -277 273 -116 103 -442 -23 64 -49 106 -314 -167 -19 -280 73 -73 -270 -111
7001 -111 -75 -370 -394 268 -233 223 -315 -26 69 -74 -22 -157 5 -108 -213 -284 131 354 558 -170 -130 -106
7023 -106 226 10 269 211 -435 -227 -173 -16 279 389 69 -161 -254 -46 -105 222 268 -203 140 57 -110 38
7045 38 288 3 -315 -20 -216 8 344 228 -20 -44 -62 196 99 219 -165 -119 -111 -178 -10 -88 355 147 -256
7068 -256 -527 -266 207 8 -250 117 83 -93 -53 -204 34 -18 263 254 -290 -134 -23 124 184 49 -63 -31
7090 -31 -66 -85 305 89 155 -134 -60 -184 -34 415 222 58 -244 70 -164 171 61 220 42 -25 -170 -96
7112 -96 74 185 -40 -220 -484 -215 274 52 -216 83 -322 -365 14 92 343 -98 50 -320 355 43 19
7133 19 73 -376 -208 34 216 2 -86 282 243 -358 -163 -27 398 -104 -221 -356 -101 176 119 81 -70 23
7155 23 19 -341 181 108 310 271 -113 -147 -1 110 103 -14 9 0 -55 -15 23 -96 17 -212 131 219 -38 -32 54 5
7181 5 -268 -273 -300 19 2 -134 -179 133 92 -321 -184 107 165 295 -19 -219 -189 -252 20 328 41 -132 253 356
7205 356 -290 32 -95 25 -222 -172 -250 152 123 -37 -179 65 -3 -297 -260 317 400 243 -120 -455 272 317
7227 317 -185 -7 112 118 -157 -165 -175 -11 -210 144 62 -1 -90 22 185 -156 -183 -132 76 -27 -6 41 175 -219
7251 -219 16 -185 173 34 28 109 120 60 -42 -86 -7 -68 110 -251 -231 -329 73 92 30 -12 -385 -180 -78 -25 -83
7276 -83 -300 -232 -234 -7 -78 343 207 -210 -192 -305 -128 294 130 -43 -223 -83 -212 -106 228 -10 113 -192
7298 -192 -361 -190 230 345 -146 -219 -217 220 182 48 -59 -67 0 18 -29 -160 24 58 131 -194 11 49 186 218
7322 218 -197 -207 -60 116 179 258 -77 -42 54 30 193 -54 310 303 333 46 -50 169 148 -3 -91 138 -10 -191
7346 -191 -202 12 31 44 142 -31 -94 -19 -181 165 64 151 206 -78 -24 -27 85 153 244 -55 -62 150 377 56 -77
7371 -77 92 0 123 -177 272 120 -11 -255 61 123 98 168 110 -76 -314 -117 178 -94 -116 182 -186 -109 -233
7394 -233 -111 42 -186 -201 -171 -319 272 113 -95 -65 201 94 -443 47 -80 95 -92 24 21 -145 -85 330
7416 330 -156 152 -154 221 116 36 -185 39 410 48 -24 85 197 -146 11 278 382 348 -154 178 -64
7437 -64 1 215 51 -12 -329 130 203 204 -166 194 188 -181 160 156 76 198 -30 -43 130 280 21 205 -182 -131
7461 -131 196 401 452 -152 231 -28 -194 -264 -74 5 21 -215 -57 -101 315 65 -151 -22 -244 271 -239 106
7483 106 -130 167 68 -211 -149 55 -3 -21 -33 -191 -101 85 38 101 220 234 9 82 71 -15 119 194 111 -51 29
7508 29 -77 130 15 -141 45 -302 -97 -378 -217 139 236 -92 -323 -523 20 165 7 -118 -213 82 -222
7529 -222 -333 226 348 84 43 66 140 81 132 86 25 -202 -38 43 -42 376 179 -37 97 -325 -172 310 443
7552 443 131 -348 49 81 -17 101 -62 -20 -117 56 -371 6 181 133 -211 -41 -41 -95 251 -35 -181 84 -84
7575 -84 -90 -109 3 403 326 -154 -147 -108 212 144 309 -3 101 1 -116 -379 -126 10 207 215 89 -172 6 244
7599 244 34 18 -425 383 -121 -162 267 -220 307 -195 -194 2 41 35 67 -229 -154 57 156 70 -83 69 45 -153
7623 -153 23 5 17 -4 -242 -289 -62 -49 28 54 236 -352 -69 5 -145 9 99 122 -47 -297 -98 103 120 -68
7647 -68 -173 -297 -41 81 -262 -122 101 -114 8 -58 104 -26 179 421 -89 -152 -11 16 139 -90 248
7668 248 142 -80 -156 189 -148 72 -109 -211 32 -77 289 24 158 321 -281 -324 -88 -122 486 557 -229
7689 -229 -65 -177 -6 153 87 54 -273 -143 -299 80 133 259 108 86 -39 -307 -23 214 -125 -62 -384 -137
7711 -137 242 71 -67 28 -246 -116 -376 -11 102 0 7 -188 -95 44 111 -177 -340 -142 84 153 103 85 258
7734 258 -121 -32 -18 81 -154 416 -142 52 -139 -143 145 208 -10 119 49 -184 22 48 -41 318 -306 39 -169
7757 -169 -5 -99 108 150 -28 120 -449 -214 -212 171 136 -49 -351 -60 -46 -46 415 79 155 -164 -192 117 8
7780 8 135 70 29 -88 -99 76 243 201 38 -207 -381 83 -213 226 -32 13 106 -95 -161 81 173 69 56 -315
7804 -315 -261 149 125 45 227 -44 -82 272 243 232 54 187 -44 85 203 277 120 -40 166 -121 -134 -81 -81 2
7828 2 86 59 -136 -5 4 98 -110 18 -30 194 -196 113 -5 11 -197 9 226 -330 274 165 -5 49 -16 137
7852 137 113 -78 -151 157 335 164 -230 -93 29 -9 203 58 -75 -84 -25 212 -20 9 -106 43 -120 415
7874 415 69 11 22 -40 -62 -250 314 -221 61 -226 -61 -9 -208 131 95 328 20 -201 69 -181 209 67
7896 67 -390 17 13 -76 5 -197 100 -103 -54 31 -33 -47 -1 -173 -32 60 30 45 76 -200 120 186 94 41 -83 -136
7922 -136 146 340 -9 27 -55 106 131 -52 -60 -68 104 116 -253 -13 5 -196 -19 -195 62 169 348 50 92
7945 92 -2 -33 -48 -193 287 -69 107 99 -206 169 220 114 -218 -173 -30 32 -114 200 27 -229 -36 37 -2 202
7969 202 -268 37 141 -251 -190 82 45 77 60 24 -106 117 -9 74 -189 -135 -310 263 61 44 189 -45 -150
7992 -150 2 110 -1 -224 -29 58 -200 112 -219 -64 -13 144 279 -73 -25 -341 -359 16 -53 263 111 120
8014 120 -316 -192 40 154 160 -197 -241 -485 111 2 104 -256 -216 -218 -298 -34 65 -65 -130 82 -577 294 -63
8037 -63 7 -140 -36 -44 22 20 379 -82 -117 -212 -650 -362 32 136 -170 -6 -284 281 203 169 -173 18 -55 -124
8061 -124 5 158 129 144 -80 -80 -36 -104 378 76 -63 134 -101 -146 301 53 -138 94 -165 172 -8 325
8083 325 10 31 -217 -69 -118 -117 -35 -51 200 -203 46 -287 -226 -61 243 197 146 -1 247 18 -151 -68 -104 158
8107 158 -297 40 -277 -49 5 238 144 -83 -211 15 -150 -132 74 247 -399 85 -95 197 -9 127 -278
8128 -278 -144 -117 -133 110 22 -506 27 56 -172 147 -270 189 -33 -193 -300 78 -4 -170 -232 -68 -127 96
8150 96 137 178 -345 21 58 -177 204 74 220 -205 41 -80 61 33 -71 35 208 -209 -177 -145 -2 -201
8172 -201 151 77 56 -247 -5 219 105 -141 -11 -219 -124 -175 -22 272 -93 -34 -335 -99 -53
8191e3
$$ Imaginary data points
##PAGE= N=2
##DATA TABLE= (X++(I..I)), XYDATA
0 0 0 0 0 -8 8 -8 8 -16 16 -16 24 -32 40 -48 64 -77 88 -104 128 -149 173 -200 232 -269 309 -350 403 -460
28 -460 517 -584 657 -740 830 -925 1032 -1151 1278 -1419 1576 -1746 1931 -2139 2368 -2624
44 -2624 2908 -3225 3586 -3997 4469 -5021 5675 -6463 7432 -8666 10290 -12537 15856 -21274
58 -21274 31630 -58500 268790 523506 -263288 -403727 90244 306522 -110546 -194729 193890
69 193890 281897 -184751 -327456 85955 318560 -8599 -222633 -5394 136142 -95412
79 -95412 -180001 104625 251637 -32500 -242129 -49537 155719 29274 -100609 42322
89 42322 156015 -26880 -174403 6717 204926 64461 -156372 -77790 121509 74321 -88212
100 -88212 -39988 109468 45708 -126538 -94086 67016 58935 -61726 -34531 74224 17112
111 17112 -114022 -58153 93469 63232 -78419 -58430 70380 55744 -53686 -25932 79539
122 79539 38768 -77779 -43698 69056 36248 -67485 -15799 104424 40192 -130699 -114730
133 -114730 62657 101365 -35498 -84960 20188 51982 -60763 -94834 39410 113375 -11379
144 -11379 -125546 -37840 97222 64948 -40787 -25157 45289 2493 -75820 -13614 100233
155 100233 57743 -71721 -55333 61882 43236 -81564 -68153 66663 69108 -67974 -85100
166 -85100 47953 75306 -52945 -89932 33500 80599 -34089 -84895 27088 92782 1327
177 1327 -63404 13522 66741 -13640 -68466 16225 90131 25876 -52059 -16195 36333 -3776
189 -3776 -43821 10668 55883 -8245 -70887 -11772 65546 22585 -58234 -33531 35052 11503
201 11503 -44844 -5373 68698 37595 -44178 -32672 32895 19566 -30317 9839 74580 21260
213 21260 -74788 -37158 74912 64572 -44110 -60762 16834 27085 -29975 -14361 53434 27832
225 27832 -62064 -56571 24311 29119 -29848 -11423 56488 27884 -64215 -52625 49297 65772
237 65772 -19017 -45947 17908 38851 -16217 -28849 33160 51369 -18037 -64420 -20912 31683
249 31683 20006 -11226 -4067 11347 -11821 -44036 -32194 11337 31133 10435 -17361 -23292
261 -23292 -11502 2649 15380 19661 3212 -23782 -26586 7474 35263 21081 -5274 -4079 3199
274 3199 -20509 -40393 -2131 53577 37661 -34311 -57714 -8466 24315 -2006 -20339 6415
286 6415 14843 -26261 -42139 10724 54199 19754 -33948 -29350 1878 2430 1337 35003 50558
299 50558 -1355 -55226 -30849 26760 32042 4356 4503 8760 -25728 -45507 8349 62677 23599
312 23599 -52340 -50835 6656 19879 -2231 15721 44096 838 -65754 -43444 40676 62150
324 62150 11222 -14436 2945 -2096 -21485 7949 53607 27624 -39130 -40534 17332 33944
336 33944 120 -5843 17967 1197 -43519 -32648 24481 37597 -1156 -16660 3839 1531
348 1531 -22432 -9959 28743 27868 -11761 -21012 9516 23132 7249 -886 6650 1381 -11967
361 -11967 -5215 11393 9994 -1005 1739 4285 -11053 -23597 -10401 8155 5844 -3071 -1092
374 -1092 -2743 -14305 -12905 6072 12951 -3160 -10749 1954 7430 -2892 -590 17912 15332 -13457
388 -13457 -26882 -5748 16497 16250 7265 -2390 -18550 -25861 -4974 18493 6187 -21355 -17420
401 -17420 5054 2624 -13404 -3482 13700 -4100 -29625 -8809 28391 17006 -19488 -12044 24376
414 24376 17985 -18854 -17264 14644 13560 -11820 -3137 23876 9016 -27892 -20584 12183 8139
427 8139 -15381 -1746 19808 -8461 -41685 -6804 46595 22330 -41205 -35191 22499 28170 -11943
440 -11943 -5552 37214 24004 -35781 -39257 21260 47393 12048 -13071 77 212 -18448 -6135
453 -6135 31200 29042 -17094 -39359 -15251 11209 16736 20141 15710 -17254 -47393 -24105 31328
466 31328 48469 13780 -16876 -15895 -6582 -1452 14755 33437 22139 -14850 -32363 -9459 23186
479 23186 32179 16044 -8679 -27445 -26368 -3356 19672 20981 4386 -10047 -17620 -20313 -11684
492 -11684 9597 23927 12671 -11064 -21873 -11614 6703 21413 22420 5586 -18220 -26005
504 -26005 -7243 18928 30005 19875 -5291 -30595 -32721 -4084 25745 22045 -3571 -18247
516 -18247 -17021 -16744 -10259 13013 25696 -1205 -35097 -25722 9324 18486 5199 6945 11810 -14032
530 -14032 -37264 -8926 37658 31571 -9579 -15560 4846 -5283 -27340 -1757 39997 20036
542 20036 -37048 -39893 8213 21910 -5505 -7029 14475 -4076 -44588 -26053 37673 46654 -7557
555 -7557 -34089 -4826 11163 -6796 -2541 29679 26092 -17933 -28769 8513 26948 2740 -9208
568 -9208 8121 6206 -22042 -20531 19305 32209 -3108 -26751 -8891 4529 -9416 -8311 21372
581 21372 28238 -7580 -30634 -6938 20179 13018 467 9610 11134 -11343 -17739 14428 36633
594 36633 11869 -21634 -16318 6632 7075 -2249 6932 16666 222 -23353 -17138 7545 12822 -1402
608 -1402 -6664 1991 3821 -4363 -5884 3218 7989 2232 -1349 2546 3619 -2153 -723 11885 16033
623 16033 -1852 -18948 -9079 11692 9580 -7486 -3670 13142 3448 -27435 -25342 13304 26764
636 26764 -6107 -28078 -5532 15106 -1462 -15841 3306 17110 -4616 -22212 -2981 18064
648 18064 8109 -3601 5939 4936 -19712 -21431 15619 31469 -3470 -29536 -5318 16868 -6324
661 -6324 -25699 3932 27947 -5610 -41859 -15937 29767 20927 -16496 -16017 6945 -918 -19198
674 -19198 1127 31332 15461 -20830 -15241 12574 6342 -14486 3708 30526 5847 -35801
686 -35801 -19257 27547 22099 -19264 -16233 17929 6331 -34100 -19759 34375 34487 -16857 -30971
699 -30971 3225 10527 -14101 -2553 37488 26773 -28153 -36011 12623 33307 4218 -6899
711 -6899 13256 6426 -28239 -20434 30284 42733 -2813 -34643 -16104 5199 2211 6105 22819
724 22819 12838 -24090 -33430 990 27986 17038 -2292 -3910 -4843 -12214 -3607 22542 29646 1136
738 1136 -25750 -19089 6919 19120 13995 6563 -1908 -14298 -19229 -4388 16999 19684 971
751 971 -15216 -15392 -6645 2048 10801 14213 2352 -18653 -22632 -1380 20479 18328 1466 -8064
765 -8064 -9837 -11471 -6595 11428 23344 8864 -16864 -20338 -3044 6041 2138 3945 7944 -4634
779 -4634 -23527 -15638 12781 19349 -2650 -14096 -2247 -616 -16021 -10017 21652 28178 -7802
792 -7802 -31216 -9705 13696 5184 -3619 11205 13541 -15244 -29459 1040 28518 10880 -15861
805 -15861 -10521 29 -9494 -8816 18366 25506 -11223 -36977 -9293 24066 12366 -11934 -2436
818 -2436 13621 -2756 -20809 -911 25536 12620 -15384 -12669 7362 7437 -971 6819 11351 -7102
832 -7102 -19347 727 19900 4913 -13182 535 15571 -3740 -23044 -1028 27768 11034
844 11034 -22056 -15182 17070 16264 -8816 -8260 12502 9452 -11703 -8736 13850 14409 -5037 -6858
858 -6858 6616 5307 -5365 -276 8986 -1884 -13224 3978 22442 3827 -24959 -14684 16777
871 16777 16948 -6322 -8987 7437 3510 -15132 -7718 18817 20352 -7158 -21166 -6421 8313
884 8313 8642 5923 5887 -3326 -15127 -11658 3871 12470 8072 49 -7496 -13131 -10263 3926 13177
899 13177 5813 -6743 -10374 -7025 -4322 938 10394 10993 -4133 -18036 -14021 3274 14549 11215
913 11215 -853 -12029 -13253 -4826 6476 10692 5589 -4207 -12342 -12508 -1919 11134 11970 -1842
927 -1842 -13419 -10751 -1701 3029 6200 7812 1555 -10533 -13794 -2342 8770 9618 4783 -1224
941 -1224 -8145 -11298 -1624 11804 10659 -456 -4725 -3097 -7268 -8654 7726 22980 9324 -18515
955 -18515 -20926 1826 13737 5832 3806 8827 -2300 -21644 -13063 18187 27380 2639 -15911
968 -15911 -8154 1599 -807 3004 16593 13799 -9466 -19726 -3529 11828 10166 6696 7003 -4066
982 -4066 -19849 -11159 17548 24725 1374 -14877 -5333 2627 -4524 -721 17470 17557 -10481 -25750
996 -25750 -5076 17920 13947 467 -1640 -3404 -12222 -8055 13171 19542 -5 -15154 -6574
1009 -6574 2575 -1312 1385 13993 8082 -16130 -20049 5936 18803 318 -12435 1296 9578
1022 9578 -7457 -17183 3083 19785 4446 -16107 -9874 4893 2130 -4928 1765 8306 -2049
1035 -2049 -12358 -4741 4913 1745 -2331 3341 4516 -8986 -14841 290 13987 5691 -8994 -7158
1049 -7158 1783 -701 -7358 -473 10187 4734 -10262 -12703 153 7851 3270 -2745 -2211 -548
1063 -548 -3291 -5394 -476 6668 7177 -567 -8617 -7596 1698 8127 5191 -1802 -4564 -2545 554
1078 554 1901 2718 1639 189 -119 -1312 -3479 -1485 5646 7293 -1233 -7766 -1409 6706 1282 -5079
1094 -5079 1298 9545 2074 -8816 -2951 8904 4683 -4879 514 10475 1357 -12383 -3641 15358
1108 15358 10942 -6350 -6898 4050 588 -7895 3810 18586 5006 -18559 -12797 10962 12294
1121 12294 -4108 -2584 9459 850 -17798 -8175 19449 18658 -7036 -15476 -619 4534 -3647
1134 -3647 3269 17770 6500 -20533 -19457 8748 19044 1584 -7671 1477 429 -14446 -10016
1147 -10016 13892 19032 -4302 -19166 -7104 3645 192 1625 12660 6482 -16344 -21307 2495
1160 2495 18585 7684 -5344 -2511 -2128 -11636 -8713 12218 18934 -2080 -19185 -9942 3964
1173 3964 2389 41 7136 6491 -11870 -21038 -3450 15597 11967 -2999 -7480 -6365 -7485 -2927
1187 -2927 9871 13380 -173 -11713 -6980 1445 1657 2029 8905 8085 -7687 -18275 -6185 13558
1201 13558 16126 1210 -10313 -9118 -3596 -741 2985 9981 9819 -3779 -16884 -10941 8075 18136
1215 18136 7701 -5996 -8023 -2741 109 3689 10966 11504 -1236 -13437 -9497 3983 11550 9595
1229 9595 4019 -4512 -12751 -8256 7677 15433 3498 -8269 -3704 2006 -3934 -5578 9732 18870
1243 18870 936 -20728 -12479 12325 17828 3467 -2764 789 -4077 -10652 778 17506 12276
1256 12276 -8225 -13201 -1132 4327 651 3453 8094 -3297 -16607 -7028 12832 11557 -5822
1269 -5822 -7683 3279 587 -9227 -1579 14581 8184 -11878 -10337 8631 10077 -6847 -8730 6785
1283 6785 8294 -7109 -8887 5938 7642 -7347 -9515 4519 6676 -8105 -11577 2889 8744
1296 8744 -2927 -8793 321 3903 -5081 -8119 2831 8455 256 -5549 -835 1306 -3803 -2793
1310 -2793 6742 7773 -4567 -11042 -2168 6520 4078 -2079 -2197 -2063 -6320 -6433 2402 9045 3598
1325 3598 -6522 -8947 -4204 1121 4531 6074 2835 -4335 -7440 -1409 6708 7787 2346 -3084 -4239
1340 -4239 -914 2597 4347 3288 742 -1158 -2868 -3947 -1640 2964 4825 1420 -1388 -2168 -2681
1355 -2681 -2213 505 5228 4889 -594 -3308 -1221 1346 3331 6598 6098 -1869 -8266 -3133 7589
1370 7589 8585 2231 -148 580 -5040 -8443 1428 12715 7998 -7166 -10199 -1458 2663 1155 4300
1385 4300 6941 -3371 -13091 -5137 11324 11072 -795 -2965 2086 -3652 -10967 524 19351 14196
1399 14196 -9806 -18814 -3618 9273 5722 994 1339 -3239 -11898 -8350 6108 11166 2679 -6294
1413 -6294 -8183 -8223 -5644 6629 15506 5297 -12815 -13831 1096 8107 1789 -32 4144 1098
1427 1098 -9235 -9017 3548 11614 4010 -7053 -9034 -5093 -215 3231 3601 30 -3228 -4117 -5138
1442 -5138 -5926 -320 8785 8106 -4778 -11807 -3951 7037 6522 216 -1431 -147 -1892 -2681 2113
1457 2113 6781 4457 -1606 -4740 -5599 -2769 4453 8499 3246 -6163 -7233 -1266 1377 295 2832
1472 2832 5211 -1484 -8704 -3915 7545 8786 593 -3025 -200 -1267 -2836 4286 12648 7051 -6192
1487 -6192 -8638 119 4080 2112 4472 6693 -1394 -11241 -5568 8580 8687 -2956 -6020 702 663
1502 663 -4743 486 10923 6937 -7561 -9255 3377 7700 -159 -855 7273 5986 -5976 -6920 4901
1517 4901 8319 -2144 -6047 2083 5522 -2200 -5640 1317 3589 -3841 -6150 1496 3574 -3544 -5785
1532 -5785 2754 6392 -1442 -6591 -1138 3509 -850 -2317 4846 7135 -1728 -7876 -2456 4442 1742
1547 1742 -1701 587 1170 -4437 -6473 939 6552 550 -8053 -7588 -1345 1765 1763 2112 806 -4345
1563 -4345 -7689 -3235 3501 5633 3187 -572 -4238 -4436 -5 5569 5940 -27 -5771 -5725 -912 3928
1579 3928 5386 2295 -2954 -6094 -6626 -3687 2149 7860 5002 -5657 -10277 -2814 5359 3276 -1693
1594 -1693 1564 4757 -1628 -7849 220 11880 8516 -3304 -5944 -126 973 -634 4755 9509
1608 9509 2124 -8808 -7177 622 1751 98 5559 7078 -5713 -15308 -3339 14009 10150 -5032
1622 -5032 -6955 1735 1070 -5285 3481 17053 9228 -11752 -14920 2823 12995 6219 1109 3030
1636 3030 -1592 -11242 -6571 9875 12818 -1347 -10338 -5009 -605 -2131 3356 11394 4009 -14421
1650 -14421 -16357 3548 15210 6730 -2740 -604 -992 -8685 -5192 11250 16327 -243 -13990 -7545
1664 -7545 4498 5386 2554 4163 0 -11766 -12711 2391 12319 4728 -6573 -5933 -3208 -5706 -4235
1679 -4235 6195 10053 -1038 -11051 -5195 5274 4600 -1317 771 3741 -792 -6954 -2871 6633
1693 6633 7318 -990 -5526 -3460 -2204 -2887 -159 4414 2861 -4576 -7733 -3566 1250 840 -502 1193
1709 1193 777 -3663 -4808 1937 7606 3580 -4016 -3790 2039 3392 312 1292 5626 3449 -4956 -6746
1725 -6746 776 5577 1179 -2175 303 813 -4365 -5117 2453 5979 -993 -7092 -1823 4563 2139
1740 2139 -1287 3272 6347 -2142 -8744 483 11683 6903 -3606 -1867 5480 2041 -5053 -908
1754 -908 7658 2829 -6583 -3351 5747 2161 -6162 -2311 5693 825 -8529 -2923 7946 4132 -6091
1769 -6091 -1691 8974 3085 -9988 -5032 10925 10734 -3368 -5233 4529 4532 -4838 -4189 6548 6268
1784 6268 -4842 -7515 943 4177 -2188 -2588 2195 -1069 -8598 -5707 5252 6094 -2693 -4060 1973
1799 1973 742 -7284 -4313 8670 10885 -2716 -9764 -1151 6398 2105 -2667 1000 3747 -3852
1813 -3852 -8904 -1489 8044 5274 -5145 -8282 -5343 -2384 88 3813 4277 -2074 -7871 -4980 1757
1828 1757 3571 1775 1392 1080 -3094 -5136 1085 9106 7138 -2715 -7422 -3255 2275 2344 1388 3135
1844 3135 2220 -4696 -9681 -4253 5673 7178 -55 -5794 -4124 -845 71 1682 5340 3219 -3906
1859 -3906 -6311 467 7097 6413 3112 1694 -1558 -5799 -2924 6876 10062 1234 -5435 -2657 745
1874 745 -1610 -1485 5121 6291 -4352 -10414 -2125 7390 4866 -1383 -454 1384 -4345 -6211 3867
1889 3867 12711 6256 -5398 -5419 1510 2213 461 5465 8174 -922 -10525 -4254 7351 6965 -1843
1904 -1843 -3533 -313 -3754 -7167 1017 10666 4739 -8352 -9718 883 3775 -272 1733 6493
1918 6493 1007 -8936 -5355 7372 8763 -1415 -5045 774 1090 -4028 -925 7304 4806 -6884
1932 -6884 -10337 -1241 4519 -243 -2518 916 471 -5819 -6438 1566 4889 -499 -4012 -1106 1004
1947 1004 -905 -344 3560 3142 -2543 -4282 612 3462 619 -1203 1360 2008 -2481 -5242 -1950 1970
1963 1970 1539 -1857 -2487 -137 -28 -2158 -2370 -355 2017 851 -1567 -2152 271 2874 2565 675
1979 675 -763 -880 70 848 2022 2082 1539 880 -667 -2832 -2714 1409 4615 1038 -4096 -3424 2035
1996 2035 3041 -1364 -2597 1322 2785 -1713 -3759 1667 6731 3424 -1851 -1952 1206 1687 729 2534
2012 2534 3849 1061 -1577 -560 767 -936 -580 3527 3203 -3828 -6700 616 6356 1940 -4861
2027 -4861 -2241 2373 -915 -4642 1450 8668 4314 -5886 -6434 1412 4360 2000 1867 3626 -598
2042 -598 -5768 -2678 4841 4363 -794 -2849 -1913 -3457 -4354 2179 7659 1970 -8151 -8621 -1061 3213
2058 3213 1570 1831 2581 -2230 -7980 -4477 5432 8166 1838 -4002 -3458 -2503 -715 3547 6757 2010
2074 2010 -6698 -8415 -2184 3959 4582 2312 -1788 -5873 -7448 -2379 4221 5446 568 -4203 -4687
2089 -4687 -2808 631 4567 5227 172 -4962 -5015 -95 4468 5746 2968 -1047 -4309 -4431 -322 4297
2105 4297 5023 1531 -3144 -5155 -3461 1178 4115 2829 -1585 -3243 -3286 -1398 2067 5331 4109 -1537
2121 -1537 -4847 -1795 2879 3905 2823 2973 1797 -2750 -4040 712 5555 3672 -308 -1631 -816
2136 -816 -1524 -1076 2669 3930 329 -4076 -3408 172 793 1782 4325 2398 -3697 -6202 252 6118
2152 6118 4779 118 -48 728 -1004 -2171 2554 6166 2467 -3885 -4368 55 2656 2165 1349 -409
2168 -409 -3439 -4600 -970 3096 2075 -786 -1028 -1097 -2731 -2755 1891 5189 1204 -4559 -3411 1810
2184 1810 3596 763 -623 58 -348 -2693 -1619 1798 2648 585 -2356 -3115 -2026 -714 1181 794
2200 794 -1987 -3489 -1256 1381 -386 -2673 -999 1685 605 -2377 -1751 1578 2312 -37 -1101 153
2216 153 903 -516 -1830 -432 1877 2469 804 -2795 -4287 -1287 2127 2042 -756 -1738 -593 -1664
2232 -1664 -2222 444 3556 2171 -2614 -4157 -908 2719 3644 2666 1120 -1708 -3373 -33 3139 3241
2248 3241 1449 1133 -289 -3483 -2848 2480 5657 1252 -4535 -3261 881 1415 -15 1460 2598 -1118
2264 -1118 -5000 -2135 3691 4754 1410 -277 -183 -1059 -1124 2156 4973 2116 -1686 -1078 1036 326 -14
2281 -14 2140 3031 -1149 -4550 -2392 2527 2674 -209 -230 -157 -2716 -4297 -303 5090 3951 -1226 -3142
2298 -3142 -1255 -421 298 3414 4999 178 -5460 -4292 2320 5161 2346 -820 -2107 -4449 -4396 6
2314 6 5487 4773 -2262 -6370 -4947 -1534 1767 3783 2619 -2134 -6243 -4471 1888 4522 3032 58
2330 58 -2151 -3831 -3137 1725 6240 4569 -1683 -6368 -4629 65 3383 3299 765 -2884 -4251 -3135
2346 -3135 -540 2366 2989 -132 -4081 -4970 -1253 3700 3833 900 -2186 -2714 -1250 686 2684 3224
2362 3224 1607 -559 -2220 -1776 568 3058 3214 69 -3061 -2880 804 2391 592 -864 97 -53
2378 -53 -2331 -2873 1640 4913 2553 -1991 -2605 -12 1253 1385 2130 2945 811 -1662 -1252 1544 2125
2395 2125 2256 1898 -125 -3405 -2462 2794 4877 779 -2975 -1457 686 -1375 -2135 2484 5150 249
2411 249 -5429 -2864 3388 3867 214 -752 782 -119 -1567 595 3456 2238 -932 -1325 -260 -645
2427 -645 -818 1908 2277 -1516 -4113 -851 2378 -168 -2634 -291 2048 -250 -3183 -1210 1926 1041
2443 1041 -1997 -1593 1453 1251 -757 -1002 597 989 -71 -678 -466 -854 -1342 -175 1429 92 -1866
2460 -1866 -2252 -1363 -892 -700 405 1024 -837 -3234 -2368 829 2165 654 -798 -1672 -1674 -550 1659
2477 1659 2896 1477 -1284 -2959 -1929 949 2714 2391 429 -2475 -3165 -1442 1206 3063 1548
2492 1548 -1745 -3663 -2602 684 2872 2310 479 -1178 -2656 -2624 934 4690 4102 -387 -3167 -2462
2508 -2462 469 2512 2967 2645 74 -2925 -2771 865 3685 2531 566 -977 -2692 -2567 733 4943
2524 4943 3459 -1305 -3706 -1369 1353 983 1474 3346 1746 -2519 -3637 987 4324 2761 -464
2539 -464 -847 -764 -1068 18 2626 3509 -213 -2834 -1988 -245 -315 822 3523 1656 -3468 -5138 -443
2556 -443 3995 2273 -690 -710 -382 -1872 -2122 1741 4760 1758 -3136 -4134 -1089 1092 2390 2486 322
2573 322 -3851 -4343 -757 2350 1519 -139 -242 -1538 -4475 -3005 2745 5586 364 -5667 -4085 687
2589 687 2250 857 808 743 -1812 -3826 -2387 2145 4011 1094 -2074 -3611 -2470 473 2736 1869
2605 1869 -1082 -3021 -1550 117 135 801 1537 484 -2433 -3434 -339 2698 2721 -758 -2001 -822
2621 -822 520 1032 497 555 1094 308 -752 -1094 536 1900 1321 -602 -715 108 457 -233 -214 1062 1249
2640 1249 -384 -1286 -300 627 950 1154 1047 9 -688 -508 1229 1506 1063 995 509 -389 -1257 279 3022
2659 3022 1917 -810 -1503 -87 806 -91 445 1969 969 -2232 -2388 823 2380 407 -460 376 171
2676 171 -1640 -580 1911 2306 -496 -1821 -275 873 -461 -174 1621 1128 -1880 -2613 56 1126
2692 1126 -105 -793 428 472 -2121 -2613 356 2149 -237 -1505 -523 -166 -2086 -1333 2251 2891 -933
2709 -933 -3759 -1474 1243 1027 62 1034 684 -2642 -3590 -622 2787 2682 -723 -2134 -2377 -1783 -335
2726 -335 2558 2490 -688 -3713 -2322 126 1160 1362 2084 516 -3456 -3920 228 4737 3194 -964
2742 -964 -3253 -2277 -274 578 2685 2741 243 -3146 -3485 -884 2768 3903 1317 -2459 -4277 -1867
2758 -1867 2181 4117 1826 -775 -1780 -1873 -1117 1127 3884 3579 -177 -3428 -3387 880 4377 3430 198
2775 198 -2754 -1626 -141 1477 1593 2405 1865 -1264 -4079 -1697 2625 3852 1682 -1738 -1986 -707
2791 -707 299 1634 2658 1192 -769 -1529 -974 -26 1523 2955 2120 -1845 -3756 -1112 2930 2806
2807 2806 81 -346 -72 -1115 -2221 -35 3817 2884 -1863 -4026 -1641 771 1372 1349 1354 -880 -2898
2824 -2898 -1832 957 2506 1139 -503 -1343 -2494 -2443 814 3306 2381 -2411 -3868 -1377 1001 679
2840 679 466 971 -583 -3675 -3252 1208 3305 1342 -1675 -2447 -1664 -743 383 1877 1130 -1532 -2843
2857 -2843 -1139 1023 1042 297 520 -828 -2226 -1536 1132 2276 85 -1664 -1189 226 303 -141 484
2874 484 779 -347 -1061 -252 600 255 -21 40 906 -13 -348 -31 224 183 182 805 1009 -116 -1252 -182
2894 -182 840 1540 741 -396 -605 -237 476 490 1237 1069 -182 -1012 -973 530 2277 1601 -315 -1421
2912 -1421 -1369 238 1214 1934 1073 -511 -1700 -705 603 1577 1505 747 -530 -1976 -1492 1396 3140 1189
2930 1189 -1930 -1955 303 935 151 409 1328 -151 -2233 -1895 1037 2117 859 -1010 -914 -829 -659 333
2948 333 1376 763 -1133 -780 -53 -839 -1239 580 2528 435 -3158 -2422 692 1381 -138 -507 664
2965 664 104 -2616 -2510 879 2869 765 -1965 -2150 -1413 -323 846 1935 604 -2024 -2417 -921
2981 -921 280 659 1820 1098 -1748 -3828 -1552 2539 3538 414 -2489 -1827 -271 -171 812 2024 1755
2998 1755 -1449 -3802 -2027 1540 3487 1556 -1090 -2690 -2112 198 2235 2572 507 -1387 -1853 -1531
3014 -1531 650 2469 2694 491 -2341 -2811 143 3003 2772 137 -920 -1259 -599 467 1519 2258
3030 2258 1036 -826 -2321 -1017 1395 2581 1553 -560 -1318 -770 337 793 1159 1372 432 -934
3046 -934 -1347 32 1300 1664 999 -442 -1270 -814 287 1508 1093 571 -358 -408 -719 -833 718 2015
3064 2015 553 -1539 -1669 -226 714 560 435 376 -327 -1784 -1022 822 1831 568 -647 -609 -1016 -875
3082 -875 505 2040 867 -1823 -2189 -156 716 272 -218 222 -367 -1851 -1694 1153 1375 -62 -1475
3099 -1475 -1322 -676 -450 613 1001 209 -1699 -1256 561 938 -304 -493 751 244 -1498 -1274 643
3116 643 1264 -448 -1517 -654 603 167 -977 -526 297 312 -210 -275 -753 -727 13 942 333 -339 -430 45
3136 45 37 -334 148 2034 802 -1624 -2041 -510 2006 2028 165 -1309 -803 -499 -151 376 1657 1264 -714
3155 -714 -1969 -1240 1324 2757 1924 -1359 -2023 -529 913 1811 1161 751 -229 -1253 -907 558 2044
3172 2044 2075 472 -2023 -1957 150 2311 2270 -83 -1244 -1273 -292 -147 550 1985 1549 -1025 -2688 -1035
3190 -1035 1904 2545 956 -978 -1120 -382 -474 593 1538 1273 -613 -1517 -1308 -465 723 1999 687
3207 687 -1572 -2280 -1039 634 1002 464 10 4 -1709 -2252 -395 2514 2291 -937 -2520 -1422 -51
3224 -51 786 1481 1141 -78 -2417 -2583 -380 1731 1795 209 -1115 -2657 -2486 243 2357 1810 -937
3241 -937 -2369 -1575 -521 572 1636 2012 -340 -2788 -2941 315 2808 2199 -208 -1731 -1684 -1141 537
3258 537 2278 2275 -586 -2189 -1871 -8 1521 1944 952 -1022 -2180 -1632 617 2389 1650 -245 -1409
3275 -1409 -1155 -201 1317 1732 1560 161 -1334 -1152 489 1696 2094 552 -773 -1080 -424 666 1339
3292 1339 888 166 -643 -616 269 495 833 626 441 -353 -849 -7 1401 1694 544 -504 90 634 -186
3311 -186 -443 718 1927 719 -1282 -1294 -105 910 637 332 141 -575 -1087 -233 408 770 314 28
3329 28 -762 -1434 -890 1093 1827 -24 -1942 -1075 537 519 -122 367 1164 -392 -2066 -1670 1093 1568
3347 1568 157 -1259 -1430 -548 207 368 281 -361 -1026 -764 -247 -475 -251 508 554 -1092 -2250 -579 1551
3366 1551 1296 -853 -1077 200 467 -1089 -1175 607 1386 109 -1392 -1093 143 224 336 133 -104 -455
3384 -455 -572 -551 -204 172 1066 809 -787 -1934 -1070 1296 1946 744 -847 -664 -160 -6 120 1515
3402 1515 1663 188 -1873 -1599 1020 2550 1859 18 -1313 -1267 89 1048 1754 1232 207 -1516 -1719
3419 -1719 -147 1659 2480 715 -1089 -1791 -596 1540 2246 1607 -101 -1476 -1131 -272 1279 2076 1258
3436 1258 -585 -2250 -1345 848 2228 1266 -51 -1434 -1346 -703 630 1719 1644 -314 -1487 -1454 358
3453 358 1265 856 504 -281 -1560 -1074 164 1704 1058 -219 -777 -800 -817 -196 878 1311 -62 -1630
3471 -1630 -1587 -260 609 475 708 180 -1517 -1938 -529 1104 1374 60 -590 -821 -1164 -997 829 2364
3489 2364 489 -1900 -1932 -480 1299 359 425 253 -899 -2211 -1468 643 1917 701 -1118 -1909 -1529
3506 -1529 -75 939 1381 105 -1524 -1477 -183 576 968 934 612 -802 -1815 -743 1895 2254 -20
3523 -20 -1719 -1241 -7 410 407 324 450 -335 -1249 -676 590 1687 508 -733 -955 -403 724 1061 882
3542 882 -139 103 96 619 -166 241 978 629 -392 -712 -169 1067 957 -296 -497 331 747 -151 -736
3561 -736 -210 899 701 51 -566 -31 16 392 230 5 618 192 -329 -574 358 851 1263 184 -1180
3580 -1180 -1128 159 1328 839 -46 -888 -450 -507 -574 16 1154 507 -1263 -2021 -438 1170 1236 -228 -589
3599 -589 -483 -399 -513 205 1228 334 -739 -1283 -659 36 517 648 72 -881 -1071 -263 728 227 -441 -291
3619 -291 -353 -717 -1198 -129 1424 1024 -893 -1275 -225 124 -245 223 691 115 -819 -1169 -94 318 843
3638 843 448 141 -658 -1255 -245 1082 926 -29 -968 -995 -729 -62 829 1285 550 -1082 -1804 -305 1224
3657 1224 1628 988 -551 -1208 -1127 300 1622 1867 408 -980 -1482 -583 739 1943 1764 17 -1779
3674 -1779 -2027 42 1775 1735 318 -922 -1722 -511 844 1649 1481 777 -1090 -1846 -239 1491 2218
3691 2218 1084 -868 -1636 -834 750 1640 1341 214 -603 -629 -489 350 816 847 334 -1425 -1543 -169
3709 -169 1143 1155 -546 -1065 -346 -27 -109 -320 854 927 -312 -1053 -869 408 1075 339 5 -41 -231 -378
3729 -378 -102 -155 184 72 -362 -823 -1369 -240 1006 1277 -718 -1461 -855 121 264 -36 497 581 -479
3748 -479 -1794 -998 1311 1731 122 -1505 -1237 -794 148 693 496 -140 -1029 -1098 -538 396 752 886 0
3767 0 -1514 -1447 502 1907 791 -546 -1075 246 321 -296 63 949 463 -855 -1075 -157 1098 780 -213
3786 -213 -342 -216 -64 171 -32 7 86 49 27 -63 98 -15 471 66 -94 124 459 260 -331 124 841 1178
3808 1178 239 -879 -903 573 1214 676 -10 -107 -217 -233 -3 809 853 316 -541 -814 -272 750 1108 499
3828 499 -533 -1088 -484 374 990 992 61 -761 -634 -522 447 1189 1104 -177 -1489 -1078 307 1475 1084
3847 1084 -92 -736 -1222 -967 129 1020 1030 -378 -1177 -1244 -398 700 883 790 -281 -1607 -1186 329
3865 329 1244 278 -135 -348 -463 -572 -534 831 1221 -8 -1240 -1157 -429 597 624 320 258 -1211 -1189 -538
3885 -538 362 477 512 -124 -815 -1692 -880 715 1676 396 -960 -1322 -383 170 502 529 739 -122 -1383
3904 -1383 -1466 439 1770 834 -417 -1537 -904 -354 820 1486 502 -458 -1081 -801 150 1228 1495 1056
3922 1056 -856 -1857 -766 1027 2145 1089 -762 -983 -228 138 706 1239 1213 -209 -1540 -1170 649
3939 649 2068 1255 -67 -1387 -1016 243 740 1463 421 -185 -915 -658 -64 978 1495 810 -600 -1141
3957 -1141 -359 1235 1298 355 -430 -342 -164 -52 -78 468 1032 150 -1068 -1192 249 947 505 -294 -308 -209
3977 -209 -393 -360 338 404 379 189 -663 -831 -43 460 776 -319 -1153 -728 -226 -114 -372 106 507 -146 -1435
3998 -1435 -910 278 932 382 -759 -962 -331 -297 36 282 846 -138 -821 -963 -89 512 481 81 -467 -1391
4018 -1391 -759 514 965 50 -420 -544 -500 -742 -199 574 483 -159 -973 -503 309 407 296 62 50 -53 -173
4039 -173 103 634 290 -153 -245 -86 -264 -61 25 471 291 -23 -210 -7 16 -69 198 607 614 -496 -489 58
4061 58 719 1047 305 -260 -487 -485 -20 759 885 246 -184 -292 -399 287 980 1154 792 -757 -1081 -186 954
4082 954 936 368 -725 -416 -491 -248 768 825 1049 -970 -1577 -708 504 1540 440 -448 -1220 -462 167
4101 167 783 863 473 -526 -1011 -876 14 1126 1135 -330 -1393 -1594 -389 858 868 -65 -1026 -761 -443 -414
4121 -414 493 867 790 -599 -1597 -943 362 821 196 -406 -566 -293 -624 -69 81 305 174 -463 -1456 -886
4141 -886 -59 965 407 -840 -1181 -271 329 -287 -170 818 447 -824 -1562 -442 948 1092 89 -615
4159 -615 -732 -368 323 959 782 -17 -448 -869 -426 321 1040 886 -99 -1450 -1045 338 1204 910 -118
4178 -118 -619 -527 -247 -8 813 1035 386 -938 -1115 98 1222 1046 -164 -348 -897 -136 385 946 834
4197 834 94 -683 -797 -38 608 1043 499 -103 -651 -439 321 1152 66 117 -90 -250 -251 -222 638 853 306
4218 306 -480 -379 243 581 132 7 -123 -25 -153 -297 23 200 99 -277 -169 -33 -105 -160 -100 164 -84
4239 -84 -89 -143 -180 -72 -277 260 611 -148 -739 -662 148 490 139 3 -534 -733 -164 -41 620 125 -368 -463
4261 -463 -590 -338 -94 521 305 -530 -1184 -686 376 770 100 -377 -467 -170 -498 -178 321 625 99 -935
4281 -935 -714 51 493 265 -133 -468 -309 -5 -10 160 193 376 -199 -154 -511 -233 506 540 385 -585 -605 76
4303 76 132 8 347 477 650 -699 -750 40 1043 1047 -44 -491 -600 88 229 645 431 414 -499 -696 -455
4324 -455 581 1378 1123 -143 -1270 -696 558 1403 813 74 -277 -359 -332 204 1120 1582 77 -1492 -1203
4343 -1203 25 1225 1168 252 -628 -678 -466 164 910 977 105 -767 -1156 -338 622 1172 493 -519 -1263 -639
4363 -639 767 879 847 -30 -354 -677 -765 24 833 1105 -377 -1129 -1150 107 807 464 -9 -193 -568 -747
4383 -747 -285 95 688 209 -606 -913 -478 -98 646 320 -294 -694 -626 -384 180 295 405 216 -361 -934
4403 -934 -1010 211 820 208 -519 -693 -491 -109 260 784 776 -27 -928 -818 -284 453 945 369 -707 -1003
4423 -1003 -540 650 1027 971 140 -481 -824 -330 425 693 476 90 -1162 -774 190 938 933 -21 -809 -410
4443 -410 -260 332 829 311 26 -479 -384 158 579 722 414 -417 -365 -184 841 715 115 -318 -22 239
4463 239 289 194 372 425 -20 138 -354 160 401 346 -199 -51 34 309 71 44 -52 223 325 -40 -246 -548
4485 -548 205 258 650 246 -279 118 -87 -320 118 698 384 -536 -1388 -646 612 891 341 -521 -690 -469
4505 -469 -131 237 429 466 -108 -803 -1032 19 824 733 -203 -1202 -1101 -136 802 624 -121 -531 -4 -518
4525 -518 -558 167 784 178 -814 -1026 -557 701 591 66 -553 -583 -152 -215 51 442 397 -57 -499 -797 -249
4546 -249 553 651 198 -402 -498 -186 473 10 245 196 69 -728 -705 -141 925 689 -23 -320 -454 260 106
4567 106 578 465 423 -314 -666 -210 328 1420 934 232 -779 -505 231 818 1095 606 -54 -574 -589 61
4587 61 806 1072 735 -773 -1310 -104 993 888 541 -581 -486 -664 -237 605 1131 693 -734 -914 -607
4606 -607 483 1064 663 -99 -877 -954 -220 733 710 236 -314 -390 -362 -75 640 500 218 -929 -998 -292 354
4627 354 464 -41 -275 -241 -595 -249 146 277 309 -366 -489 -477 -50 322 347 -85 -832 -383 -29 245 45
4648 45 -34 -44 -205 -358 -609 -141 112 471 -6 -482 -401 -277 -3 238 271 148 -271 -595 -555 176 250 409
4670 409 237 -589 -683 -178 244 462 -4 -296 -425 49 134 9 298 552 -146 -625 -228 366 688 510 -111
4691 -111 -569 -287 -199 700 148 146 248 -120 -490 -145 527 395 384 -473 -524 546 613 361 -396 -198 308 182
4713 182 143 -173 378 486 222 -459 -113 242 420 103 -97 -81 414 -90 -386 -10 235 360 426 81 -585
4734 -585 40 291 97 -113 138 4 -363 -193 -371 376 986 80 -640 -638 162 650 339 223 -153 -436 -532
4755 -532 -149 298 969 294 -637 -811 -499 228 725 474 -146 -1009 -543 -134 196 455 260 -316 -924 -844
4775 -844 5 649 741 -63 -953 -493 -77 264 261 72 -421 -544 -486 -252 124 824 280 -653 -793 -433 162
4796 162 617 231 -120 -488 -122 -179 215 267 179 141 -25 -459 -541 556 529 357 -165 -160 -94 104 -155 294 375
4819 375 230 -404 -386 7 740 703 498 -214 -900 -542 174 876 589 34 -398 -538 -204 434 885 868 156
4840 156 -609 -701 350 635 909 556 -402 -555 -169 345 954 1093 264 -482 -661 -546 560 881 689 -40
4860 -40 -842 -482 306 830 741 -161 -258 -332 -20 283 718 791 -139 -799 -653 76 581 536 26 -534 -548 -78
4882 -78 23 50 37 147 11 -270 -450 83 384 400 -589 -672 -158 358 27 -160 -125 137 -103 -526 -772 -425
4904 -425 352 170 -400 -261 -114 -64 64 -29 45 160 -161 -583 -545 -79 451 473 -155 -487 -139 178 150 101
4926 101 -228 -208 -141 -446 -104 469 685 270 -473 -557 57 647 419 66 127 -204 -21 55 21 572 204 -150
4948 -150 -441 -342 9 749 296 -164 -221 -158 296 -19 264 168 456 394 117 -172 261 372 366 -395 -240 129
4970 129 238 177 -69 279 412 -163 -298 -396 161 646 448 -177 -434 -283 -27 229 155 145 258 -78 -535
4991 -535 -728 415 805 310 -226 -969 -571 178 453 316 -173 -435 -812 -173 220 622 424 51 -605 -730
5011 -730 -123 636 1124 -245 -654 -861 -438 238 635 381 -176 -508 -548 -391 503 907 475 -463 -704 -635
5031 -635 2 600 437 57 -728 -586 -150 338 594 96 104 -147 -988 -227 376 698 -52 -567 -547 -212 192
5052 192 -37 85 -260 -468 -372 -346 200 326 469 0 -520 -446 80 325 466 61 -245 -198 -96 2 4 493
5074 493 552 -8 -775 -645 181 626 254 243 190 176 -356 213 515 282 498 -218 -301 -380 451 444 686 -150 -420
5097 -420 -174 354 239 674 576 140 -246 -341 423 743 718 49 -536 -390 -80 609 375 225 -141 -315 -441
5118 -441 -132 285 782 170 -279 -406 -416 261 504 64 -427 -461 -439 -173 160 -11 219 -32 -179 -468 -143
5139 -143 234 259 -304 -127 3 17 41 -82 36 11 -29 -173 -255 -49 62 56 -95 -360 164 -183 -83 -246 -86
5162 -86 225 205 -74 -684 -144 183 430 93 -349 -578 -302 111 131 114 246 -80 -436 -485 -9 175 531 -189
5184 -189 -748 -394 91 288 553 115 183 -213 -419 -69 -20 526 121 -138 -511 -269 343 422 152 -302 -305 -149
5206 -149 -81 303 408 -63 383 -115 -171 -87 388 435 285 -336 -196 -211 103 121 283 195 -98 -286 -199 -153 495
5229 495 376 92 -219 -152 -289 344 296 188 192 -19 -125 -244 153 228 738 427 -205 -668 -377 683 744 263
5251 263 -51 -201 -311 -32 322 469 289 -451 -631 -479 164 688 561 -313 -744 -451 113 354 170 219
5271 219 -218 -633 -330 -27 633 398 -57 -855 -887 -218 663 418 175 -585 -597 -257 227 258 256 362 -431 -740
5293 -740 -700 448 770 270 -701 -573 -392 460 69 147 194 -274 -71 -472 -228 286 471 117 -400 -255 -165
5314 -165 94 137 47 -320 -160 -14 -472 -183 163 244 45 -289 -487 -96 161 177 147 78 14 165 -246 309
5336 309 26 512 37 -405 -388 -140 254 505 259 -242 -219 336 83 278 828 -61 -326 -473 -16 467 635
5357 635 691 -567 -239 127 333 445 206 245 173 -299 -96 146 689 554 145 -397 -22 -87 419 193 18
5378 18 -225 -37 -205 134 240 451 284 -193 -336 123 -44 288 262 -1 14 -74 40 72 -176 -144 272 65
5400 65 -167 -340 -73 264 104 116 -126 -3 -322 -212 -182 540 -6 109 -312 -712 -180 12 499 110 -216
5421 -216 -443 -299 -235 77 42 110 -256 -472 -394 4 470 442 5 -293 -662 23 296 313 -14 45 -440 -553
5443 -553 -102 555 193 35 -160 -579 -318 490 556 310 -176 -825 -264 236 442 99 -11 -52 -337 -391 -269
5464 -269 709 188 -42 -435 -106 275 300 440 139 -212 -307 -225 -216 332 523 517 -296 -441 -158 186 135 286 -95
5487 -95 46 116 -267 -52 216 559 205 -310 -490 -350 282 677 4 -134 -243 -47 -167 127 324 400 137
5508 137 -512 -634 -71 584 770 164 -297 -579 -360 397 320 287 67 -418 -372 -336 305 882 350 -292 -848
5529 -848 54 548 336 180 -49 -326 -572 -217 47 381 303 -129 -317 -662 -38 345 274 203 -550 -499 40
5550 40 114 57 87 127 -28 -193 -233 -143 344 191 -143 -274 -379 99 31 85 -34 -47 -164 -189 -3 -22 -8 48 164
5575 164 -252 -346 185 480 34 -182 -68 -9 -247 -100 -23 49 482 31 -188 -55 40 -289 329 129 6 -261
5597 -261 -184 154 457 244 181 -330 -225 19 295 655 241 87 -247 -286 249 362 353 370 -20 -132 -288 40
5619 40 346 231 -31 -382 -12 108 20 237 -163 155 -94 -298 143 -64 -69 -23 236 74 -268 110 409 247
5641 247 34 -201 157 -87 -210 79 -3 372 -95 -265 -178 262 237 -205 -269 -154 140 -199 -131 60 432 -112
5663 -112 -135 -324 -461 92 612 564 103 -164 -259 -2 0 -293 153 -37 -244 -790 -483 302 680 103 -547 -317
5685 -317 -26 234 146 79 -157 -508 -567 43 78 89 169 -105 -592 -379 189 669 414 33 -442 -294 -154 -15
5707 -15 228 401 132 -573 -689 -285 562 445 101 -364 -590 -76 186 123 58 239 -381 -90 -3 165 281
5728 281 249 -34 -83 -310 67 50 328 111 273 76 96 -154 6 587 387 194 -262 -541 7 167 248 -42
5750 -42 222 -85 -123 -41 271 571 305 -230 -141 -144 79 486 135 -52 -249 -306 68 22 555 208 111 -139 -389
5773 -389 -199 368 414 164 -470 -368 137 275 161 346 -540 -540 -271 -159 498 146 220 -388 -477 59 -92 426
5795 426 45 -318 -470 -420 -196 -147 237 -23 -112 -256 -208 11 405 -116 -170 -534 -304 -161 -132 -67 98 -17
5817 -17 -105 -77 -59 -69 -139 -337 347 -250 -172 -209 62 234 210 86 -17 34 -222 -216 70 410 98 -555 65 67 -225
5842 -225 0 363 37 -222 -145 -188 -89 276 405 -110 -166 -504 -482 161 506 62 -398 56 69 103 266 32
5864 32 339 -75 -312 -49 -72 566 150 -124 -298 -60 -37 275 114 361 -1 -79 -142 -3 289 279 152 -474
5886 -474 6 249 -20 197 112 22 337 69 -49 -163 100 210 333 -94 -260 -91 180 268 107 -30 112
5907 112 -25 -154 -4 450 303 -87 -486 -331 -16 308 166 141 -309 -364 -274 -11 -218 73 416 -179 -663
5928 -663 -539 -20 456 467 51 -461 -637 151 198 254 132 -135 -747 -410 341 417 290 -35 -641 -664 -222 68
5950 68 553 284 -81 -350 -235 -42 185 239 180 -446 -767 -289 46 510 163 -49 -94 -41 27 203 340 478
5972 478 -28 -363 -119 148 95 138 13 -75 -203 -33 240 461 14 -235 -12 58 -40 -87 44 214 -6 12
5994 12 404 84 24 235 283 -7 -54 13 219 162 316 272 255 -285 -312 185 302 148 333 -234 -358 -547 11
6017 11 401 199 124 147 -247 -22 -144 417 245 -101 -456 -675 -131 517 301 -7 -153 337 -100 -141 286
6038 286 95 496 -155 -346 -257 161 215 85 -84 -298 -77 -126 -98 -37 -122 -157 109 -467 -133 345 253 -353 -274
6061 -274 -102 45 102 -68 -152 87 -15 -163 -237 -298 52 194 117 -135 -308 -111 -17 16 -37 -52 99 -115 -102
6084 -102 -84 337 197 195 -380 -419 242 264 81 58 70 -280 -276 -26 156 145 325 -330 -579 -433 334 234 133
6107 133 -11 -68 -251 -23 -3 297 365 187 -498 -366 -7 420 548 113 -213 -109 -358 273 363 -2 -89 -125
6129 -125 -443 -378 -171 265 483 -348 -281 -124 268 500 235 181 -94 -187 127 -48 414 418 335 -24 -380 52
6151 52 333 365 82 -320 -103 211 -107 -181 -197 191 -149 -89 -289 -219 -39 296 335 -193 -218 -350 164 127 87
6174 87 223 -39 -225 -255 -479 -51 250 5 -287 -386 -34 280 -67 23 -59 -459 -460 -438 30 418 314 -254 -743
6197 -743 -589 189 267 335 -205 -197 -552 -47 -96 166 230 34 -240 -612 -343 144 384 -100 -437 -576 -72 116
6219 116 163 -158 -82 -322 -395 1 141 346 58 82 -258 -135 -130 240 -17 -18 -11 -75 32 222 -158 406 -137 -76
6243 -76 -166 -9 115 31 42 -432 -128 -93 248 42 171 194 104 284 123 -202 220 363 554 173 -50 147
6265 147 -9 55 88 342 321 65 -304 3 -17 444 190 53 -265 -62 149 158 193 142 215 -102 -299 -100 422
6288 422 449 -131 -196 -51 107 -10 -247 -246 -373 -186 269 -86 41 -104 310 231 -9 -173 -73 135 -203 -426
6310 -426 72 233 120 -219 -443 69 188 -293 -316 -92 -44 99 66 46 -177 -55 -270 -293 308 45 4 279
6332 279 -386 -649 -119 202 112 -335 -127 -280 -337 -143 -8 -17 -18 68 -167 -141 374 339 303 -114 -159 13 -139 432
6356 432 394 -65 -386 -531 -3 151 525 249 -223 -321 -165 -202 240 566 -158 -29 -304 -60 -2 456 217
6377 217 244 78 -231 45 223 292 71 98 81 -78 55 357 177 -291 -146 -23 301 101 -48 32 218 -152
6399 -152 -142 -202 -13 210 -41 -320 59 74 -109 -89 423 72 370 -106 51 -103 149 284 131 -111 -153 -9
6421 -9 221 106 186 9 263 -281 -201 -85 190 251 -328 -315 -468 100 76 27 289 -45 -30 -240 125 243 100
6444 100 114 -437 -271 -244 24 313 132 -136 -111 -173 4 181 67 -6 62 -223 -299 14 197 293 -433 -701 -268
6467 -268 259 -26 -39 33 33 -16 -162 -253 -68 50 -10 -144 26 -90 277 -206 173 208 -51 47 -267 -119 36
6490 36 -220 139 149 -354 -112 -16 87 143 86 344 245 -338 3 203 218 100 -166 246 84 117 159 -79 212
6513 212 -77 -10 -48 43 95 452 241 28 -294 40 703 282 298 1 -177 -242 85 122 32 137 -54 -42 -360
6536 -360 36 273 181 -336 -119 -339 85 112 41 205 -315 -278 -56 71 251 54 31 -139 63 -53 352 70
6558 70 -168 -165 78 138 214 -288 -82 -214 -46 -408 45 -188 181 138 -7 118 -69 26 -99 113 -77 213
6580 213 -83 -170 -281 -369 -62 171 183 -324 -508 -398 129 308 85 249 -91 -158 -214 224 295 151 -118 -425
6602 -425 26 -17 -88 407 142 -386 -300 -339 -131 -23 164 -5 -452 -311 -279 422 317 134 -116 -104 -176 132
6624 132 95 291 107 -308 -366 -165 -42 577 119 73 -421 -320 221 333 202 -46 -40 -4 -313 186 18 111
6646 111 402 -212 -240 161 311 312 260 7 -235 -313 177 -35 143 -3 46 -377 -220 -99 91 407 -61 -168
6668 -168 -296 -128 7 -72 26 298 264 -180 -162 -266 -44 285 -55 -326 28 -175 -85 -93 -28 4 -66 -501 -202
6691 -202 -51 125 50 8 -377 -340 436 -21 -10 -149 -148 -225 -318 -258 184 42 18 -51 -220 -250 270 199 -57 -305
6715 -305 -153 167 -165 142 158 14 -78 -358 -54 -110 267 231 -183 -331 -244 -38 130 212 -228 132 -127 -241
6737 -241 -384 -88 190 120 -174 -81 -281 163 93 -29 159 148 207 -97 -172 145 -46 336 -24 -260 21 159
6759 159 121 258 33 244 56 65 134 187 370 252 72 -219 -287 -403 211 189 320 1 -141 -241 -61 217
6781 217 145 187 -198 40 -163 85 124 154 -307 -241 -6 469 473 174 -349 -151 -105 -233 61 154 124 -70 -455
6804 -455 24 181 -149 136 216 268 -216 246 -27 19 129 -91 -271 -315 -443 43 74 -184 -169 66 -121 111
6826 111 260 -178 -14 50 111 -53 -437 185 276 101 -103 -214 -241 -263 180 51 -163 38 -53 -395 63 -82
6848 -82 232 211 -81 -199 179 182 226 171 -146 -224 -167 100 -125 69 352 -49 -352 -466 108 385 241 8 -309
6871 -309 -270 -237 436 45 186 -297 -137 -260 -85 230 175 242 -470 -270 -20 -8 2 137 55 75 -203 -108 151
6894 151 125 112 -85 -89 -348 162 374 234 147 -111 16 -29 -206 138 225 238 154 18 -137 4 372 46 -206
6917 -206 -98 -91 -88 -18 -262 62 119 -154 -175 -352 145 396 29 -59 109 -55 192 -12 50 193 32 -17 -336
6940 -336 -102 -11 -169 -363 -84 -126 -64 304 -17 203 69 -164 -233 -288 -347 71 -131 -12 -4 -171 -133 170 237
6963 237 31 -144 -172 60 -14 266 -96 -3 -25 10 39 171 287 124 -321 67 131 31 204 177 32 55 -5
6986 -5 252 -195 5 45 43 88 31 105 -186 210 117 202 28 248 263 -32 -40 -10 -254 -29 -156 124 -67 -73 229
7011 229 118 -290 -183 -539 -12 195 350 -31 -61 -282 -390 286 224 108 80 -268 -322 185 174 61 -153 -121
7033 -121 -143 -166 214 346 216 -54 -238 -424 81 123 143 358 -138 -5 -25 -106 97 348 177 -105 -22 -335
7055 -335 172 106 -3 -199 -282 28 87 211 252 -159 250 -202 -21 51 113 326 -58 -199 -167 202 -197 -44
7077 -44 148 -4 -99 -174 -22 174 124 11 7 -374 -149 -68 83 -9 -233 195 -46 -261 -275 -149 188 136 50 -229
7101 -229 -41 329 301 -50 -208 -98 192 -224 -129 357 31 -23 -133 -555 -193 43 80 228 -183 -394 -168
7122 -168 -46 -120 165 -7 -143 -48 -358 -66 44 148 -119 -219 78 -39 263 148 122 290 172 -128 156
7143 156 264 445 185 -107 212 -85 102 291 -105 148 -96 -139 302 -161 449 24 1 25 19 -99 -30 155
7165 155 50 -25 -254 50 -142 -182 141 -120 9 -119 -196 -141 -81 146 -17 -71 304 -31 -44 -159 46 49 182
7188 182 -142 -36 -85 10 279 351 -149 -243 -312 77 220 123 101 -138 -154 -490 -32 -28 171 -280 -598 -191 70
7211 70 98 115 157 6 -31 54 -299 -44 -177 33 -220 -262 -233 -201 84 50 -5 -38 53 -112 11 46 -198 -18 -181
7236 -181 137 46 170 -120 126 28 -399 9 67 3 96 114 -17 -28 87 -265 179 82 237 -130 -13 117 70
7259 70 -59 -149 57 -60 96 44 -164 32 267 9 -396 -144 61 130 -27 23 -354 -197 178 166 86 392
7281 392 91 -54 -199 -153 63 295 195 -54 -203 -381 34 35 256 -43 4 -93 -22 391 334 161 218 -135 -367
7304 -367 188 103 288 -62 -29 -19 126 -237 2 320 123 39 -179 121 221 163 -31 -118 -104 -216 -78 133
7326 133 365 -57 39 -595 -82 -84 37 122 2 -62 -203 -127 38 -44 115 298 183 -8 -348 101 52 88 274
7349 274 52 -202 -261 38 -91 348 164 -342 -55 99 45 102 -40 52 -14 -178 -30 330 -37 153 -220 -164
7371 -164 -9 -301 128 149 -85 147 -199 28 37 41 8 18 -130 85 46 126 -2 134 0 -74 31 -20 375 225
7395 225 -62 -270 -124 -127 280 10 39 2 258 -151 -209 -151 35 122 47 39 -174 0 371 -99 297 91 127 418
7419 418 -29 27 -7 468 -169 -118 -188 201 -13 124 -33 -34 -231 22 -88 76 13 -73 -429 -207 10 -94 -185
7442 -185 21 -296 -200 -307 112 15 226 2 -224 233 25 -257 86 230 72 -305 -102 -37 -253 119 -88
7463 -88 -43 -25 -166 -36 195 146 183 -70 -251 -202 40 -61 412 -388 -221 -43 159 129 202 88 -5 6 -352
7486 -352 -310 -88 58 183 -69 -58 320 0 132 -41 47 -80 -5 -242 32 -57 174 24 -225 -436 -99 -30
7508 -30 -8 166 -34 7 -24 -273 -311 -65 91 -314 -115 -189 -99 334 266 154 -1 187 -154 -98 98 138 98 -70
7532 -70 -202 -61 185 328 123 -29 -266 -448 -22 21 134 20 86 36 -82 -38 362 209 97 24 -33 -145
7554 -145 -196 30 -175 237 -119 -154 -21 250 168 -198 -164 -160 -139 -63 -39 246 6 -164 62 -44 141 120 149 64
7578 64 -146 20 -71 -219 -66 279 16 -158 -84 372 96 -43 -158 9 -171 -43 -405 1 239 334 -31
7599 -31 -17 230 12 -125 299 130 -279 -195 -269 -129 259 267 36 -204 -305 -311 231 175 106 -321 139 -122 89
7622 89 208 -30 112 -151 -378 -208 -93 -7 0 -189 67 -148 -64 36 368 -75 -37 83 -63 -44 102 202
7644 202 -144 210 35 89 203 4 89 -376 -221 -17 -153 -109 111 200 80 -38 -100 7 -419 203 -100 -88
7666 -88 20 -192 40 145 -40 69 112 34 -271 -245 73 218 27 -10 -137 314 332 -195 43 34 -156 -173 -238
7689 -238 66 320 76 71 25 18 95 -216 372 353 169 57 -112 -41 150 279 -89 -46 -359 -167 -87 15 98 26
7713 26 -192 -59 -292 -159 111 39 -107 -124 -243 -225 153 248 -33 -45 -140 -50 64 -299 78 4 20 101 -162 170
7737 170 2 30 -68 -216 -275 -85 468 102 -114 19 -347 -345 -467 -3 -95 52 -141 82 -220 -294 313 -232
7759 -232 348 -59 166 64 116 -246 106 224 38 134 -225 10 137 336 121 -10 -260 -47 -284 -8 86
7780 86 229 141 -364 -95 -92 146 175 65 -332 -282 -42 150 142 159 117 10 -135 -228 5 306 73 -174 118 110
7804 110 184 284 123 -222 3 -4 94 336 -253 6 -160 -254 -293 -27 -80 -165 35 49 -293 -38 -200 -194 221 39
7828 39 -19 -195 -181 240 -31 -106 149 84 255 -87 -246 -292 -341 -68 22 57 -123 273 13 21 -167 -210 222 363
7852 363 -63 124 71 343 -100 -65 -227 305 -18 88 -132 -178 -344 -59 40 -34 -72 180 -154 -308 -20 -130
7874 -130 207 -215 -292 -129 117 310 310 -50 -15 -17 -137 8 -135 -89 -127 -137 -34 150 89 -30 43 -166 34 120
7898 120 -28 2 122 -151 -78 64 -95 19 -305 -60 6 -67 140 95 32 18 4 55 91 52 -37 60 70 56 20
7923 20 32 -51 -69 -111 -173 116 -185 -46 -114 11 40 261 133 64 -354 -82 85 258 336 5 -83 175 196 135
7947 135 -20 96 3 -6 92 -151 -144 209 1 5 -79 75 50 117 25 -136 -404 -152 -80 -55 374 44 55 102 52 -79
7973 -79 145 8 -90 -136 8 328 -440 14 274 261 -28 -207 -46 -5 29 21 82 -178 -10 35 174 133 -37 42
7997 42 137 -172 -155 -37 126 -198 -47 -165 -156 57 152 65 97 50 64 -41 -226 -22 236 69 56 44 -373 41
8021 41 87 -8 -95 -231 -218 92 110 166 -27 -91 -79 176 -3 162 100 -244 -96 105 186 158 -80 363 25 -8
8045 -8 170 -87 157 26 142 -197 -153 -149 109 61 179 -105 6 220 -95 109 407 -174 95 -171 -151 -150 207
8068 207 89 -340 -267 23 188 -318 -88 -9 306 7 -18 -259 -61 1 216 -93 -292 -32 179 -286 -281 -216
8090 -216 95 104 -162 -81 -84 -9 139 -44 -195 -193 323 110 -140 194 171 203 -197 -42 100 -225 324 29 -365
8113 -365 -360 213 -216 -99 -30 -176 -147 -39 116 6 -75 53 -261 -273 -271 287 -164 23 -9 -161 79 52 325
8136 325 277 -40 72 -185 -188 -239 73 208 -249 -45 122 -168 102 59 -109 162 39 -41 -218 -228 -82 24
8158 24 137 47 -44 88 -192 10 -59 72 -72 129 -349 -7 109 -314 -102 -347 -191 16 31 113 18 -18 106
8181 106 240 20 183 244 160 221 -7 -172 323 -205
8191b05
##END NTUPLES=NMR FID
##END=
