##TITLE=1H_Lac-D3-crist
 Pyr-d5, 8 sc, 
 26.9.2019
##JCAMPDX= 6.0         $$ Bruker NMR JCAMP-DX V2.0
##DATA TYPE= NMR FID
##DATA CLASS= NTUPLES
##ORIGIN= UXNMR, Bruker Analytische Messtechnik GmbH
##OWNER= root
$$ XWIN-NMR		Version 3.5
$$ Thu Sep 26 15:40:22 2019 Russian Standard Time (UT+4h)  she@DPX200
##.OBSERVE FREQUENCY= 200.1315
##.OBSERVE NUCLEUS= ^1H
##.DELAY= (6, 6)
##.ACQUISITION MODE= SIMULTANEOUS
##.ACQUISITION SCHEME= undefined
##.AVERAGES= 8
##.DIGITISER RES= 18
##SPECTROMETER/DATA SYSTEM= spect
##.PULSE SEQUENCE= zg30
##.SOLVENT NAME= Pyr
##.SHIFT REFERENCE= (INTERNAL, Pyr, 0, 15.7039)
##AUDIT TRAIL= $$ (NUMBER, WHEN, WHO, WHERE, WHAT)
$$ ##TITLE= Audit trail, XWIN-NMR		Version 3.5
$$ ##JCAMPDX= 5.01
$$ ##ORIGIN= Bruker BioSpin GmbH
$$ ##OWNER= she
$$ F:/spectra/data/she/nmr/H-F/1/audita.txt
$$ ##AUDIT TRAIL=  $$ (NUMBER, WHEN, WHO, WHERE, WHAT)
(   1,<2019-09-26 15:39:10.85 +0400>,<she>,<DPX200>,
      <created by zg, POWCHK disabled, PULCHK disabled
       configuration hash MD5:
       00 E9 B6 7A A2 85 ED C7 34 08 36 98 17 FE 4E 26
       data hash MD5: 16K
       7C 4A CD F7 A7 23 69 7B 38 F2 A0 6A 3A 86 6A C6>)
$$ ##END=
$$ 
$$ hash MD5
$$ 76 A8 91 95 F4 44 5A 37 16 45 DE AE 6D 18 29 FA
##$RELAX= 
##$RELAX= 
##$RELAX= 
##$RELAX= 
##$RELAX= 
##$RELAX= 
$$ Bruker specific parameters
$$ --------------------------
##$DU= <F:/spectra>
##$EXPNO= 1
##$NAME= <H-F>
##$PROCNO= 1
##$TYPE= <nmr>
##$USER= <she>
##$AMP= (0..31)
100 100 100 100 100 100 100 100 100 100 100 100 100 100 100 100 100 100 
100 100 100 100 100 100 100 100 100 100 100 100 100 100 
##$AQSEQ= 0
##$AQ_mod= 1
##$AUNM= <au_zg>
##$AUTOPOS= <>
##$BF1= 200.13
##$BF2= 200.13
##$BF3= 200.13
##$BF4= 200.13
##$BF5= 200.13
##$BF6= 200.13
##$BF7= 200.13
##$BF8= 200.13
##$BYTORDA= 1
##$CFDGTYP= 0
##$CFRGTYP= 5
##$CHEMSTR= <none>
##$CNST= (0..31)
1 1 145 1 1 1 1 1 1 1 1 1 1 1 1 1 1 1 1 1 1 1 1 1 1 1 1 1 1 1 1 1 
##$CPDPRG= <>
##$CPDPRG1= <>
##$CPDPRG2= <>
##$CPDPRG3= <>
##$CPDPRG4= <mlev>
##$CPDPRG5= <mlev>
##$CPDPRG6= <mlev>
##$CPDPRG7= <mlev>
##$CPDPRG8= <mlev>
##$CPDPRGB= <>
##$CPDPRGT= <>
##$D= (0..31)
0 1.2 0 0 0 0 0 0 0 0.06 0 0.03 0 0 0 0 0.0002 0 0 0 0 0 0 0 0 0 0 0 0 
0 0 0 
##$DATE= 1569497950
##$DBL= (0..7)
120 120 120 120 120 120 120 120 
##$DBP= (0..7)
150 150 150 150 150 150 150 150 
##$DBP07= 0
##$DBPNAM0= <>
##$DBPNAM1= <>
##$DBPNAM2= <>
##$DBPNAM3= <>
##$DBPNAM4= <>
##$DBPNAM5= <>
##$DBPNAM6= <>
##$DBPNAM7= <>
##$DBPOAL= (0..7)
0.5 0.5 0.5 0.5 0.5 0.5 0.5 0.5 
##$DBPOFFS= (0..7)
0 0 0 0 0 0 0 0 
##$DE= 6
##$DECBNUC= <off>
##$DECIM= 24
##$DECNUC= <off>
##$DECSTAT= 4
##$DIGMOD= 1
##$DIGTYP= 9
##$DL= (0..7)
0 120 120 120 120 120 120 120 
##$DP= (0..7)
150 150 150 150 150 150 150 150 
##$DP07= 0
##$DPNAME0= <>
##$DPNAME1= <>
##$DPNAME2= <>
##$DPNAME3= <>
##$DPNAME4= <>
##$DPNAME5= <>
##$DPNAME6= <>
##$DPNAME7= <>
##$DPOAL= (0..7)
0.5 0.5 0.5 0.5 0.5 0.5 0.5 0.5 
##$DPOFFS= (0..7)
0 0 0 0 0 0 0 0 
##$DQDMODE= 0
##$DR= 18
##$DS= 0
##$DSLIST= <SSSSSSSSSSSSSSS>
$$ [...]
##$SUBNAM2= <"">
##$SUBNAM3= <"">
##$SUBNAM4= <"">
##$SUBNAM5= <"">
##$SUBNAM6= <"">
##$SUBNAM7= <"">
##$SUBNAM8= <"">
##$SUBNAM9= <"">
##$SW= 24.0689530833862
##$SWIBOX= (0..15)
0 0 2 0 0 0 0 0 0 0 0 0 0 0 0 0 
##$SW_h= 4816.95568400771
##$TD= 16384
##$TD0= 1
##$TE= 0
##$TE2= 300
##$TE3= 300
##$TEG= 300
##$TL= (0..7)
0 120 120 120 120 120 120 120 
##$TP= (0..7)
150 150 150 150 150 150 150 150 
##$TP07= 0
##$TPNAME0= <>
##$TPNAME1= <>
##$TPNAME2= <>
##$TPNAME3= <>
##$TPNAME4= <>
##$TPNAME5= <>
##$TPNAME6= <>
##$TPNAME7= <>
##$TPOAL= (0..7)
0.5 0.5 0.5 0.5 0.5 0.5 0.5 0.5 
##$TPOFFS= (0..7)
0 0 0 0 0 0 0 0 
##$TUNHIN= 0
##$TUNHOUT= 0
##$TUNXOUT= 0
##$USERA1= <user>
##$USERA2= <user>
##$USERA3= <user>
##$USERA4= <user>
##$USERA5= <user>
##$V9= 5
##$VALIST= <valist>
##$VCLIST= <CCCCCCCCCCCCCCC>
##$VD= 0
##$VDLIST= <DDDDDDDDDDDDDDD>
##$VPLIST= <PPPPPPPPPPPPPPP>
##$VTLIST= <TTTTTTTTTTTTTTT>
##$WBST= 1024
##$WBSW= 4
##$XGAIN= (0..3)
0 0 0 0 
##$XL= 0
##$YL= 0
##$YMAX_a= 277140
##$YMIN_a= -358622
##$ZGOPTNS= <>
##$ZL1= 120
##$ZL2= 120
##$ZL3= 120
##$ZL4= 120
##$ABSF1= 10
##$ABSF2= 0
##$ABSG= 5
##$ABSL= 3
##$ALPHA= 0
##$AQORDER= 0
##$ASSFAC= 0
##$ASSFACI= 0
##$ASSFACX= 0
##$ASSWID= 0
##$AUNMP= <proc_1d>
##$AZFE= 0.1
##$AZFW= 0.1
##$BCFW= 1
##$BC_mod= 2
##$BYTORDP= 1
##$COROFFS= 0
##$CY= 11.3945322036743
##$DATMOD= 1
##$DC= 2
##$DFILT= <>
##$DTYPP= 0
##$F1P= 20.1720416913024
##$F2P= 0.152960286110954
##$FCOR= 0.5
##$FTSIZE= 0
##$FT_mod= 4
##$GAMMA= 1
##$GB= 0.15
##$INTBC= 1
##$INTSCL= 1
##$ISEN= 128
##$LB= 0.24
##$LEV0= 0
##$LPBIN= 0
##$MAXI= 10000
##$MC2= 0
##$MEAN= 0
##$ME_mod= 0
##$MI= 1.114404
##$NCOEF= 0
##$NC_proc= 0
##$NLEV= 6
##$NOISF1= 3.799351
##$NOISF2= 2.8
##$NSP= 1
##$NTH_PI= 0
##$NZP= 0
##$OFFSET= 15.70392
##$PC= 1
##$PHC0= -9568.702
##$PHC1= 11.60095
##$PH_mod= 1
##$PKNL= yes
##$PPARMOD= 0
##$PSCAL= 0
##$PSIGN= 0
##$REVERSE= no
##$SF= 200.130013532006
##$SI= 16384
##$SIGF1= 3
##$SIGF2= 2
##$SINO= 400
##$SIOLD= 16384
##$SREGLST= <1H.CDCl3>
##$SSB= 0
##$STSI= 0
##$STSR= 0
##$SW_p= 3612.71676300578
##$SYMM= 0
##$S_DEV= 0
##$TDeff= 0
##$TDoff= 0
##$TI= <>
##$TILT= no
##$TM1= 0
##$TM2= 0
##$TOPLEV= 0
##$USERP1= <user>
##$USERP2= <user>
##$USERP3= <user>
##$USERP4= <user>
##$USERP5= <user>
##$WDW= 1
##$XDIM= 8192
##$YMAX_p= 0
##$YMIN_p= 0
$$ End of Bruker specific parameters
$$ ---------------------------------
##NTUPLES= NMR FID
##VAR_NAME=  TIME,          FID/REAL,        FID/IMAG
##SYMBOL=    X,             R,               I
##VAR_TYPE=  INDEPENDENT,   DEPENDENT,       DEPENDENT
##VAR_FORM=  AFFN,          ASDF,            ASDF
##VAR_DIM=   8192,          8192,            8192
##UNITS=     SECONDS,       ARBITRARY UNITS, ARBITRARY UNITS
##FACTOR=    0.0002076,     1,               1
##FIRST=     0,             0,               0
##LAST=      1.7004516,     0,               0
##MIN=       0,             -358622,         0
##MAX=       1.7004516,     277140,          0
$$ Real data points
##PAGE= N=1
##DATA TABLE= (X++(R..R)), XYDATA
0@%%%%Qj6J6j6K4l2L5m3N6p2Q8j06J30j57J84k18K57l00L48m02M65n34O08o92
$$ 0 0 0 0 0 8 -8 8 -8 16 -16 19 -24 32 -40 48 -58 72 -85 99 -119 138 -162 186 -216 249 -285 323 -369
28c69P87q90J006j132J269j421J589j773J973k194K438k704K994l314L668m062
$$ -369 418 -472 534 -598 671 -750 839 -934 1039 -1155 1283 -1421 1573 -1741 1927 -2135
44b135M500m989N538o159O870p692Q654r795J1179j2899J5104j8052K2212k8582
$$ -2135 2365 -2624 2914 -3245 3625 -4067 4587 -5208 5971 -6928 8176 -9876 12336 -16246
58a6246L9678o4473K14361m6548l26674K95292J81750k12616k24765K14124J47931
$$ -16246 23432 -41041 173320 126772 -199902 95390 277140 64524 -160241 53883 201814
69B01814k13467k02663J95615J90729j23256j71045J05516J18056r0329r0456
$$ 201814 -11653 -214316 -18701 172028 48772 -122273 -16757 101299 10970 -79486
79g9486J28523J09294j05475j40774N2131J06866k0568q4528j884L0386k3023
$$ -79486 49037 158331 52856 -87918 -35787 71079 50511 -34017 -35901 -5515 -28538
90b8538m5995P677M4941L6493p709n2848m0680N4277R7117j517r1762j6505P4369
$$ -28538 -74533 -66856 -21915 14578 6869 -45979 -86659 -32382 64735 63218 -28544 -45049 29320
103B9320K527q4434K843R8312n914j24968l0191J04564L8794p0318m411P9987
$$ 29320 31847 -52587 -49744 48568 42654 -82314 -112505 -7941 30853 -39465 -43876 36111
115C6111p547q8297K3752J29873K1214j10474l9818Q1577L1959p2403k8773O8881
$$ 36111 28564 -59733 -35981 93892 115106 4632 -35186 46391 78350 5947 -22826 46055
127D6055K7406q0031o2838N0179P9629J37n1424j4612K9109K2326J049M021J5231
$$ 46055 73461 -6570 -69408 -19229 60400 60537 9113 -5499 23610 45936 46985 51006 66237
140F6237M423k2013l1734l629K9498J5199l1436l8128K67J2536j3752r16M3041
$$ 66237 70660 48647 16913 13284 42782 57981 26545 -11583 -11316 1220 -12532 -13448 29593
153B9593J8608n6909l9166O0423O4924l8917n9376L3988M6826n7067p1820M7062
$$ 29593 48201 -8708 -47874 12549 77473 38556 -20820 13168 59994 2927 -68893 -21831
165b1831P8626m4266j03319M36P5492Q322m9076M469M5288p966m2642J4125N5481
$$ -21831 56795 12529 -90790 -90354 -14862 -6540 -55616 -51147 -5859 -13825 -56467 -42342 13139
178A3139P124l8458j2209J5414q791k3238J2294K6174j6643m4188r197L1062K1592
$$ 13139 20263 -18195 -30404 -14990 -23781 -47019 -34725 -8551 -25194 -69382 -78579 -47517 -25925
191b5925k109l120K141J391Q766J5930P058K139J0774l59l1094k1041L0590L4167
$$ -25925 -28034 -31154 -29013 -27622 -18856 -2926 4132 6271 17045 16686 -14408 -35449 -4859 29308
205B9308k6230m8258O335L6194k639k1846J9532L4557j0823k9262J6056L8686
$$ 29308 3078 -45180 -38845 -2651 -5290 -27136 -7604 26953 16130 -13132 2924 41610
217D1610K656j9055L236P289k1942j8240J9912J8858k6215l3407O083K1595m716
$$ 41610 44266 25211 28447 35736 13794 -4446 15466 34324 8109 -25298 -19215 2380 -2336
230b336j0150J5795J6731j2007j3938J4096J9456j628q074k093j1669j8431L203
$$ -2336 -12486 3309 20040 8033 -5905 8191 27647 26019 17945 15852 4183 -14248 -11045
243a1045J5898j0687k9785n762J5632l410j6040J1312K5570m840k1975O240K5141
$$ -11045 4853 -5834 -35619 -41381 -25749 -29159 -45199 -33887 -8317 -13157 -35132 -28892 -3751
256c751L133j2009K873L987j8895j4783J3362J0349k0674j8670J1064J0577j3927
$$ -3751 -618 -12627 -9754 -5767 -24662 -39445 -26083 -15734 -36408 -55078 -44014 -33437 -47364
269d7364m905K5870J7514j4985j1122K1270K0268m609p966P665J516j4092n542
$$ -47364 -52269 -26399 -8885 -23870 -34992 -13722 6546 1937 -6029 1636 3152 -10940 -16482
282a6482J0863M75j4704l979Q797jn211J1029J7755O13o272Q956J4614J648k319
$$ -16482 -5619 -5144 -19848 -23827 -15030 -15031 -20242 -9213 8542 9155 2883 11839 26453 28101 25782
297B5782P726J37j4597o078J1014M55j8137o718J2446M16j6762J054K4605P915
$$ 25782 33508 33645 19048 12970 23984 24439 6302 -416 12030 12446 -4316 -3262 21343 29258
311B9258j6954k569K1290R446j2759m773J0818n70j8669q996P188j229j4890p636
$$ 29258 12304 9735 31025 40471 27712 22939 33757 33187 14518 5522 12710 11481 -3409 -11045
325a1045M292r22o420L406R311J565l527L994P947j28k294K976j050j0588o845
$$ -11045 -6753 -7675 -14095 -10689 -1378 187 -3340 654 8601 8473 6179 9155 8105 -2483 -9328
340i328K866k429j2455o039N548m54r731K065J5583N196q363J646J6327P510p473
$$ -9328 -6462 -8891 -21346 -27385 -21837 -22291 -32022 -29957 -14374 -9178 -17541 -15895 432 7942 469
355D69j652J0400K79j2296m561O626k41j0961m054N890J150k619N044J0370K752
$$ 469 -1183 9217 9496 -2800 -7361 -735 -976 -11937 -15991 -10101 -8951 -11570 -6526 3844 6596
370F596n06P915J0508O38j768O131L401q150p046M548K090j0382q558M612M647
$$ 6596 6090 14005 24513 25151 23383 29514 32915 24765 17719 22267 24357 13975 5417 10029 14676
385A4676o560k797J1521Q809m725k078J1392Q970m454m216M345N96r397o277Q83
$$ 14676 8116 5319 16840 25649 20924 18846 30238 39208 34754 30538 34883 35479 26082 19805 20688
400B0688l024r699m732J126k660l664L588N734k477j735P400O093l464l179N180
$$ 20688 17664 7965 3233 4359 1699 -1965 1623 7357 4880 3145 10545 16638 13174 9995 15175
415A5175Q45j1024q211L437L74j2240r477M107K136p943l166R333O658m062j114
$$ 15175 16020 4996 -3215 222 596 -11644 -21121 -17014 -14878 -22821 -25987 -16654 -9996 -14058 -15172
430a5172R631P169k850k040M142O10n899m098K75k809n443j695M47j714l36O035
$$ -15172 -5541 1628 -1222 -3262 880 1490 -4409 -8507 -8232 -11041 -16484 -18179 -17732 -19446 -19782 -13747
446a3747N747p63J680R813P294j934l80P183L173o306n589K756J860p286o318
$$ -13747 -8000 -8763 -7083 2730 10024 8090 7710 14893 18066 11760 6171 8927 10787 3501 -2817
461b817J833K444k320o90O068M278l39K872P114L754q83R96L048k680n860j776
$$ -2817 -984 1460 -860 -1550 4518 8796 8457 11329 18443 22197 21314 22310 25358 22678 16818 15042
477A5042N93m607q246k530N24l545l125M172M083k905j489P184P334l462m973
$$ 15042 15635 11028 2782 252 776 -2769 -5894 -1722 2361 -544 -2033 5151 12485 9023 4050
492D050N014L905p200j0493K67M194p476j2254k485M442m34m565L8M523K525O92
$$ 4050 9064 12969 5769 -4724 -4457 -263 -7739 -19993 -22478 -18036 -18470 -23035 -22997 -18474 -15949 -15257
508a5257L592L107O16J752J041k660n175n02J995l518q738k846K759N72k510J750
$$ -15257 -11665 -8558 -7942 -6190 -5149 -7809 -12984 -13486 -11491 -15009 -23747 -26593 -23834 -23262 -25772 -24022
524b4022N236J389N65N828P336R31p59N324L988n440o683M546N708p140j0186
$$ -24022 -18786 -17397 -16832 -11004 -3668 -2737 -3496 1828 5816 376 -6307 -1761 3947 -3193 -13379
539a3379q2P464O82m003P19O278M687J277K331L499M385M258L18n589l500L071
$$ -13379 -13461 -5997 -5315 -9318 -8599 -2321 2366 3643 5974 9473 13858 18116 18434 12845 9345 12416
555A2416L114o216r996j550L905j588m831Q34N805K335k312P16N036M168J133
$$ 12416 15530 9314 -682 -2232 1673 85 -4746 -3912 1893 4228 1916 2632 7668 11836 12969
570A2969q19j640m550k454J328n07o909q000k222K093r32l992K02M715L448k233
$$ 12969 12150 10510 5960 3506 4834 4327 -2582 -10582 -12804 -10711 -11643 -15635 -15433 -10718 -7270 -9503
586i503j880M282P721L523n273p698q97O341O93r048p543J595K764m801n517M122
$$ -9503 -11383 -7101 620 4143 -1130 -8828 -9725 -3384 -2691 -11739 -19282 -17687 -14923 -19724 -25241 -21119
602b1119Q743K076l719k19O114P551M778j61m881k625L424L465l453o397j95K584
$$ -21119 -12376 -10300 -14019 -14238 -8124 -573 4205 4044 -837 -3462 -38 3427 -26 -6423 -6618 -4034
618d034k283n977J434R242N782k907l474M562P934N960J661j503l011j645K293
$$ -4034 -6317 -12294 -10860 -1618 4164 1257 -2217 2345 10279 16239 17900 16397 13386 11741 14034
633A4034J516m414n339Q31J910n414p510M212J2128L522q960n124Q124J0988J657
$$ 14034 15550 11136 5797 6628 8538 3124 -4386 -174 11954 15476 6516 1392 9516 20504 22161
648B2161n174l526J941J251m710o596r94M145j561j1353q645O141J0060L58o683
$$ 22161 16987 13461 15402 16653 11943 5347 4353 8498 6937 -4416 -13061 -6920 3140 3498 -3185
663c185j053M400L210J458K535J205l355l332p03k237m552k52L584k860j1603
$$ -3185 -4238 162 3372 4830 7365 8570 5215 1883 1180 -1057 -5609 -5861 -2277 -5137 -16740
678a6740n709Q473J1395l96q498q48Q352O658j185j919L919L822l531q673k653
$$ -16740 -22449 -13976 -2581 -2977 -11475 -12323 -3971 2687 1502 -417 3502 7324 3793 -4880 -7533
693g533O029N113m079j0256m742N276Q966K351k816l98N260M106J85Q02M604M644
$$ -7533 -1504 3609 -470 -10726 -15468 -10192 -1226 1125 -1691 -2089 3171 7277 7462 8264 12868 17512
709A7512j374p580n440K207O324J109p958q537J93O771M429j395l88L431K874
$$ 17512 16138 8558 3118 5325 11649 12758 4800 -3737 -3544 3227 7656 6261 5873 9304 12178
724A2178p89j024L791O367J033p164q156k925M813L331l293q502n915J742N215
$$ 12178 11389 10365 14156 20523 21556 14392 6236 3311 8124 11455 8162 -340 -6255 -4513 702
739G02J021k638J191N511J024o263k359R297R206n776j4352m998P064M045n536
$$ 702 1723 -915 276 5787 6811 548 -1811 7486 16692 10916 -3436 -8434 -1370 2675 -2861
754b861o855j558M99k105j755L380O008L165k409l623J013N560N671L28m191n959
$$ -2861 -9716 -11274 -10775 -12880 -14635 -11255 -5247 -2082 -4491 -8114 -7101 -1541 4130 4458 267 -5692
770e692m087K256M332j136n958l492K286K005k547J511R305O160n141p371L951
$$ -5692 -9779 -7523 -3191 -4327 -10285 -13777 -11491 -9486 -12033 -10522 -1217 4943 -198 -7569 -3618
785c618J2038N248n982p045n32K233r85k239J82O77j393l589k213L295P769N766
$$ -3618 8420 13668 7686 641 109 2342 1357 -882 -700 -23 -1416 -5005 -7218 -3923 3846 9612
801I612j604n778j086O733P293o81n138k732m77k512l257M81K493j293m846m754
$$ 9612 8008 2230 1144 7877 15170 14489 9351 6619 6142 3630 373 854 3347 2054 -2792 -7546
817g546P82N229N791K074l156l671J75N295L994j240m156l484j568k203l593L9
$$ -7546 -6764 -1535 4256 6330 3174 -497 -322 4973 8967 7727 3571 87 -1481 -3684 -7277 -7238
833g238K911J84o594o624K642R876N380m033l977J235L988J203o50J325M22l035
$$ -7238 -4327 -4143 -10737 -17361 -14719 -4843 537 -3496 -7473 -6238 -2250 -1047 -1697 -372 50 -2985
849b985o143l025K177L622L81m573m347L44M463N442K245j83j34L62J453J758
$$ -2985 -9128 -12153 -9976 -6354 -5973 -10546 -14893 -14549 -10086 -4644 -2399 -2582 -2716 -2354 -901 857
865H57K703J738j784m439m067k04K086K396o05k597l873K93N927N492J104j765
$$ 857 3560 5298 3514 -925 -4992 -5196 -3110 -714 -1319 -3916 -7789 -7496 -1569 3923 5027 3262
881C262J072K438q5r25K473L727k296p751l711J748L943k86l619l339K5J975K596
$$ 3262 4334 6772 6687 5762 8235 11962 9666 1915 -1796 -48 3895 3609 -10 -3349 -3324 -1349 1247
898A247K125J568J881k40k865j056M021L577j943o618l843j21M47j017m32k09
$$ 1247 3372 4940 6821 6581 3716 2660 6681 10258 8315 1697 -2146 -2267 -1820 -2837 -3269 -3478
914c478k353k600R54M431L643M3r89P05k35p22J582K431m05n873m782k1K670M54
$$ -3478 -5831 -8431 -7477 -3046 597 640 -349 356 121 -601 981 3412 3007 -2866 -7648 -7669 -4999 -4545
932d545k393j931K88O85N12J803M492L095l39l227k28L927L248j622l252j775
$$ -4545 -6938 -8869 -8581 -7896 -7384 -5581 -1089 2006 1667 -1560 -1788 2139 5387 3765 513 -1262
948a262p82j770n93J747J755j458k464L53L652L674J539J173M62k97j87R17K441
$$ -1262 -2044 -3814 -4407 -2660 -905 -2363 -4827 -4474 -822 2852 4391 5564 6026 5729 5542 6459 8900
965H900Mk818l488j898L64O94j12n80n87n92L78J742L030K189P98j214j263M10
$$ 8900 8904 6086 2598 700 1064 1758 1646 1066 479 -113 265 2007 5037 7226 8024 6810 5547 5957
983E957K305O48k886k809j181j502k286j139K071J003k978k079K349L883L42J5
$$ 5957 8262 8910 6024 3215 2034 532 -1754 -2893 -822 181 -2797 -4876 -2527 1356 1698 1713
999A713Q76J331j152j361P38N12j057l475k238r53J60k8N2q07l15N53J138J227
$$ 1713 2589 3920 2768 1407 2145 2657 1600 -1875 -4113 -5066 -4906 -4934 -4882 -5689 -6004 -5451 -4313 -3086
1017c086K058J920J098j444q17J832J417j611k589o99l80j138j965O76K383m21
$$ -3086 -1028 892 1990 546 -271 1561 2978 1367 -1222 -1921 -2301 -3439 -5404 -4728 -2345 -2766
1033b766j615J036K836K355L75O43J675P95j003m01M06N33j214k772j867Q56M99
$$ -2766 -4381 -3345 -509 1846 2221 2864 4539 5334 4331 3930 4336 4869 3655 883 -984 -128 371
1050C71j185o15J129J749j35j41J966L053N18j456l11J037L64j539j587r73l59
$$ 371 -814 -1429 -300 1449 1314 1173 3139 6192 6710 5254 4943 5980 6344 4805 3218 2245 1886
1067A886j692j969n64R47K36n83o05J602K157M09L7K14J520k86j315j449K97J53
$$ 1886 194 -1775 -2339 -1392 -1156 -1739 -2344 -742 1415 1824 1861 2075 3595 3309 1994 545 842 995
1085I95k197k958l76O46k83j602r0K282P31p81M91K530J986j163n76R85J175j678
$$ 995 -1202 -4160 -4536 -3890 -4173 -5775 -5865 -3583 -2852 -3633 -3142 -612 1374 211 -365 620 1795 117
1103A17k037k04J93j333k073j3Q66K87m53O75K049J548NM27J401J815J55j228
$$ 117 -1920 -2124 -1931 -3264 -5337 -5350 -4484 -4197 -4650 -3975 -1926 -378 -373 54 1455 3270 3425 2197
1121B197n31L73m97j576j058o33O50m95j053l46K100J685L40m80J053K054J190
$$ 2197 1666 2039 1542 -34 -1092 -1725 -1075 -1570 -2623 -2969 -869 816 1156 676 1729 3783 4973
1138D973q76l44P64k48j523j370p35j50q71r78j211J51J157M08L60P77J579r9
$$ 4973 4097 3753 4517 4269 2746 1376 641 491 -380 -1358 -2569 -2418 -1261 -853 -493 284 1863 1764
1156A764J16Q57R47p91j310j62j39j778j870l55Q87r85k362O8J739K024o74p64
$$ 1764 1880 2737 3684 2893 1583 1421 1282 -496 -2366 -2721 -1834 -2819 -5181 -5113 -3374 -1350 -2024 -2788
1174b788J034K383Q22j226n56J127N73j432k683k24P60K31j883k033P26K082P96
$$ -2788 -1754 629 1451 225 -331 796 1369 -63 -2746 -2970 -2210 -1979 -3862 -5895 -5169 -3087 -2291
1191b291q42m0K624J821n75l37J380J430o50j840n82m7p74o35J75l68j638M85
$$ -2291 -3133 -3173 -549 1272 697 360 1740 3170 2520 680 98 51 -723 -1358 -1183 -1551 -3189 -2704
1209b704J548J313n68p5J905J622K58r21K54J544P49k158k874K74J904m31l032
$$ -2704 -1156 157 -411 -486 1419 3041 3299 2378 2632 4176 4925 2767 -107 167 2071 1640 -1392
1226a392j759J425K416n72j382P04K484J471j288j006J282K402o00k957j616J218
$$ -1392 -3151 -1726 690 118 -1264 -560 1924 3395 2107 1101 2383 4785 4185 1228 -388 830
1242H30N47j593k231l89Q11k57k61K46P54N69J399M08m07L35J001J089j154k080
$$ 830 1377 -216 -2447 -2836 -2025 -2282 -2543 -2297 -1543 -974 425 833 426 761 1762 2851 1697 -383
1260c83j240R92M42q30k665q48J120J641m37j593J674K710Q90j916o26K342L253
$$ -383 -1623 -631 -189 -1019 -3684 -4532 -3412 -1771 -2208 -3801 -2127 583 1473 -443 -1069 1273 4526
1277D526j521l391j180K267J318k203k756P4J928J77j797n33K510K725j78j986
$$ 4526 3005 -386 -1566 701 2019 -184 -2940 -2866 -938 -761 -2558 -3091 -581 2144 1966 -20
1293b0J71K523J814o71j724p84K37O8q49p04n82n07j8K14o02p9J819K521m96k416
$$ -20 151 2674 4488 3817 2093 1309 1546 1614 765 61 -521 -1028 -1046 -832 -1434 -1513 306 2827 2331 -85
1313h5P5L526J993k049l409J49J975q1k777j667J004J601j528k329J94L110K420
$$ -85 -10 3516 5509 3460 51 200 2175 2094 -683 -2350 -1346 255 -1273 -3602 -3408 -298 2122
1330B122j252k753Q77L301J493j538k332n8J597q45k191o34J136O82j938j865
$$ 2122 870 -1883 -1006 2295 3788 2250 -82 -140 1457 612 -1579 -2213 -1077 -395 -2333 -4198
1346d198M33K241J982p0j140q55J698J606Q46r54j280j71J031j336j893k28K079
$$ -4198 -3765 -1524 458 388 -752 -1607 91 1697 2543 1589 309 138 1169 -167 -2060 -2288 -209
1363b09K53k526k069J536L166J695j414j731Q02K604J336j496j094J107J014k054
$$ -209 44 -2482 -4551 -3015 151 1846 432 -1299 -497 2107 3443 1947 853 1960 2974 920
1379I20l377N83L296Q77l816k643J347L154J284j059q64J149J219m50j22M97J172
$$ 920 -2457 -1874 1422 2299 -1517 -4160 -2813 341 1625 566 -298 851 2070 1620 1498 1995 3167
1396C167n66j862j645j75Q33R44p68j822j398Q39K228J483n85j143Q09J281l0
$$ 3167 2601 739 -906 -1081 -248 696 -72 -1894 -3292 -2453 -225 1258 673 -470 339 1620 1590
1413A590j238P29J675K65l476k960J181L177L61l344k481J743J982qn45Q78J881
$$ 1590 352 1081 2756 3021 -455 -3415 -2234 943 1304 -2040 -4521 -2778 -796 -804 -1349 -471 1410
1430A410N6k050p15K456K211o28l003k389Q57J846o6j406m86k67k81O79J176J041
$$ 1410 1466 -584 -1299 1157 3368 2740 -263 -2652 -1795 51 -15 -1421 -1907 -2174 -2455 -1776 -600 441
1448D41O41m2m34q74K82J920J350r97k694j807J042J753J3j278j277j01O69M06
$$ 441 1082 1040 606 -268 14 1934 3284 2287 -407 -2214 -1172 581 594 -684 -1961 -2062 -1393 -987
1466i87k04J942K027k34k921o03K177L075p85l440j513O75J090m89q15K29M32
$$ -987 -1191 751 2778 2544 -377 -980 1197 4272 3487 47 -1466 -791 299 -190 -1005 -776 -344
1483c44p98j659O03L128J756j054j730n52J056J400N01l07j500j287o84J83M32
$$ -344 -1142 -2801 -2198 930 2686 1632 -98 -650 406 1806 2307 2000 500 -787 -1471 -1288 -856
1500h56N47l45m58j242JJ009K115J588n55j850j354J643K274J25j522j666k11
$$ -856 -309 -654 -1112 -2354 -2353 -1344 771 2359 1804 -46 -1400 243 2517 2642 1120 -546 -757
1517g57pp21J23J095R10j466k659J01L518K572j116k167o7J473L70p3L99L29j246
$$ -757 -764 -1485 -1362 -267 643 -823 -3482 -3381 137 2709 1593 -574 -641 832 1202 1129 1528 1857 611
1536F11j918j082J133J401L55r91j847L1Q74J695J315M27r88j292j37J667Q91
$$ 611 -1307 -2389 -1256 145 500 -491 -2338 -2307 -1433 262 1577 2004 1016 -276 -413 1254 2145
1553B145l22p95j136r64p37M40J130J259j172k020n03J667K417M06r30l31M30
$$ 2145 1823 1028 -108 -1072 -1809 -1369 -239 1020 -152 -2172 -2675 -1008 1409 1815 885 554 984
1570I84q8m89O14J622p03k711j633M76K122L27r32j045n34N79M86J242J156P93
$$ 984 896 407 1021 2643 1940 -771 -2404 -1928 194 521 -411 -1456 -1990 -1411 -925 317 1473 2266
1588B266j346j313j7J791R61o83j608r14m63n38Q13J406K69j737j149K49K119
$$ 2266 920 -393 -410 1381 2342 1659 51 -863 -1326 -1864 -1051 355 624 -1113 -2262 -2013 106
1605A06J145J50l35j56p96l32N19J796L40k434j685p08J462Q20J16n31k89l06
$$ 106 1251 1401 1066 910 114 -218 301 2097 2437 3 -1682 -2390 -928 -108 8 -523 -812 -1118
1623a118m27Q81J860J016m93j780q33J426J254m02r12q99k38o82o86J563J181
$$ -1118 -1545 -664 1196 2212 1719 -61 -894 532 1786 1384 472 -427 -665 -1347 -2033 -470 711
1640G11r72j283l02J021J351P77m3m67l14o97l24J099J216n72j876j477N88J346
$$ 711 -261 -1544 -1846 -825 526 1303 1260 793 479 -218 -542 557 1773 1201 -675 -2152 -1564 -218
1658b18R4n41n2L0k36J35R50J638J44j107j126K98J024L75n93m33o63p14m77M63
$$ -218 -124 -665 -717 -687 -923 -788 162 1800 1944 837 -289 9 1033 1408 815 382 -281 -995 -1472 -1009
1678a009J414K53j069j056L08J657P02J25k19J42l56q61O1J327L68j721j397l18
$$ -1009 405 658 -411 -1467 -1159 498 1200 1325 1106 1248 892 31 92 1419 1787 66 -1331 -1649
1696a649J243N0j50r3L42o8o35J77J660R46n39j157n48J107K57o79l36k29k54
$$ -1649 -406 -356 -506 -599 -257 -325 -960 -783 877 1823 1284 127 -421 686 943 264 -72 -301 -555
1715e55r16n29J347O93L7j252k43J129N29L52K78R4k17p14m65O38R33p26j161
$$ -555 -1471 -2000 -653 40 77 -1175 -1418 -289 240 592 870 964 747 33 -432 206 1139 413 -748
1734g48j058O26P72o7pN26j17p77J05Q08J347P3j184j52L97L20l67m49K45k25
$$ -748 -1806 -1180 -408 -475 -482 44 -73 -850 -745 63 1410 1483 299 147 544 864 497 48 293 68
1754F8q03p59N02J243N48j005l89L15R39k3m36O43N46l26j325M20Q43J21j176
$$ 68 -735 -1494 -992 251 799 -206 -595 -280 659 636 200 843 1389 1063 -262 158 1001 1122 -54
1773e4j117J28P25J9m81O51J99l3j52k35J020L66K8n92p4M4j54j88j01lm53p57
$$ -54 -1171 -1043 -318 -299 -780 -129 70 37 -115 -350 670 1036 1064 472 398 442 288 100 -1 -4 -457 -1214
1795a214j87O18P37m30m87N92P48j39l71J87R95oj106p01Q65Q60j117r51k37J254
$$ -1214 -1401 -783 -46 -476 -963 -371 377 238 -133 54 1049 1043 -63 -764 101 961 -156 -1107 -1344 -90
1815i0q2j045K11Q72M42l97o88O44J091j47m80l25K64L77m31m81M4j84j94j9M10
$$ -90 -172 -1217 -1006 -134 308 -89 -777 -133 958 811 331 6 270 647 216 -265 -221 -405 -599 -618 -208
1836b08l10P22l41M28K1n2K55J87M06j29k06q87J92Q10n33j255K02R52n6q59n70
$$ -208 -518 204 -137 291 312 260 515 702 1108 979 773 -114 78 888 355 -900 -698 254 198 -661 -1231
1857a231Q20J656p33j238N3J542Q43j613k53Q04N54j071p53k62R24M58j225l56
$$ -1231 -411 1245 512 -726 -673 869 1712 99 -154 650 1204 133 -620 -882 42 500 -725 -1081
1875a081L77P31L0m27p2M64M92j83j1k02K56j89K6j16n25k32K48K19k07q90J24
$$ -1081 -704 27 57 -370 -442 22 514 331 320 118 374 185 211 95 -430 -662 -414 -195 -402 -1292 -1168
1896a168J012P88o53o22K19J241L24j104l97O24Q31n50j572j69J579K32j139r08
$$ -1168 -156 632 -21 -643 -424 817 1141 37 -360 264 1095 545 -1027 -1196 383 615 -524 -1432
1914a432Q84R46K23j307J9J363P22p01r58O57R16j39q38l84k56N68q4k94n10J2
$$ -1432 -548 398 621 -686 -667 696 1418 717 -241 416 1332 1193 355 -29 -285 283 199 -95 -605 -593
1934e93K46O94j19Lk34N86K54j55o27L6R28J03q86j150N63J032o7r80j041R96
$$ -593 -347 347 228 231 -3 583 837 682 55 91 1019 1122 236 -914 -351 681 614 -366 -1407 -411
1954d11O72j67j139J58J366Q83j141j022O62J164K09j613q62J067P44n35r64k70
$$ -411 261 94 -1045 -887 479 1362 221 -801 -139 1025 1234 -379 -1241 -174 570 35 -929 -1199
1972a199J211K08q18n78M76J181l24k91r8N54J20L63l53m43k73j84O58L6q66K01
$$ -1199 12 220 -598 -1176 -700 481 157 -134 -232 322 442 805 452 9 -264 -448 210 246 -620 -419
1992d19L70L74n69m72L23J223N91j429n19M65J800l53j563m21R89N71j264r15
$$ -419 -49 325 -244 -716 -393 830 1421 -8 -527 -62 1738 1385 -178 -599 390 961 -303 -1218
2010a218P88J076J47j607n75J770J092r50j100J61J198L46k89n22K4k9j65n45
$$ -1218 -430 646 793 -814 -1389 381 1473 523 -577 -416 782 1128 839 317 341 312 147 -398
2028c98Q3ML01j75n01p9J55J130L4l68m67j40O09M86l88n71k00O81l2o14p17Q75
$$ -398 -315 -311 -10 -185 -686 -765 -610 520 554 186 -281 -421 188 674 286 -285 -485 196 164 -450 -1167 -292
2050b92J067p18j440k33J395J350n44j836L67R99R26j129m56R33N23j002r99J75
$$ -292 775 57 -1383 -1616 -221 1129 585 -1251 -884 115 1041 -88 -544 389 912 -90 -1089 -914
2068i14J423K90j148j017M32R49J79k20J1j74L89m2K0K35j45L05n30k94q2J71
$$ -914 509 799 -349 -1366 -934 15 194 -26 -15 -189 200 158 178 413 268 573 43 -251 -333 -162
2088a62J47O90p35j003J71J115Q48p35q37K41O53K76p40k8Q19M15q53j509M0J791
$$ -162 -15 675 -60 -1063 -892 223 1071 336 -501 -260 393 669 -71 -99 720 1135 282 -1227 -1187 604
2108F04O25j253j509Q08P68K94o20M26M29k02n17k24O99N20l91o05o65R1Q47k15
$$ 604 1229 -24 -1533 -725 43 337 -283 143 572 370 -147 -371 328 848 457 -148 -813 -722 125 -90
2128i0J95j28p09j00N10M38J84l73p9L50j87m75J13R97Lp59r60J93R93J54k23
$$ -90 105 -23 -732 -832 -322 116 300 -73 -152 198 11 -464 -351 646 649 -110 -1070 -877 116 270 47
2149D7j337O99N64k52q7M02J144n22j250o01R98J544l08j053n15J66K74k22J58
$$ 47 -1290 -591 -27 -279 -366 36 1180 658 -592 -1193 -195 1349 1041 -12 -527 -361 -87 -309 -151
2168a51M62J46p55n32L37J079M40k00q31m46N90J61J96J74j15q89l36K86Q92K25
$$ -151 311 457 -298 -830 -493 586 1026 826 -5 -451 139 300 496 670 555 -334 -670 -384 508 733
2188G33p38k46o6P8k39Q45O56K51j420r16O55J203P4p21l08j05J05l89L31N06
$$ 733 -5 -251 -317 -239 -478 367 1023 1274 -146 -1062 -407 796 870 149 -159 -264 -159 -548 -217 289
2208B89N15o00j357L09R82R52n04o11l11K77l1m0O50L46q63q48l38Q68Q57O7m08
$$ 289 804 204 -1153 -844 138 1090 586 -25 -336 -59 -90 -130 520 866 3 -845 -1183 -315 542 609 201
2229B01m14m38J68J60J079J68m99j256K65Q87N49j45p01k14j2j77q7P34P07n07
$$ 201 -213 -651 -483 -323 756 924 425 -831 -566 321 870 725 24 -190 -202 -379 -466 268 975 468
2249D68j236j15O99J199k71n74l15K59o90J75J004L91j76j260q29O99R37J42l42
$$ 468 -768 -883 -184 1015 744 170 -145 114 -576 -401 603 994 818 -442 -1271 -572 365 507 165
2268A65l87R0k94J16K87J112j20q66r26JJ158K54k06k55j70l56j21Q5J147J29
$$ 165 -222 -132 -426 -310 -23 1089 969 103 -823 -822 336 590 384 129 -41 -397 -518 -433 714 843
2288H43j101r24L98J392kj51n53L92l00n97N19Q44K33q83j114Q9Q17N85l99l22
$$ 843 -258 -1182 -784 608 606 455 -98 294 -6 -603 -84 760 993 110 -1004 -915 -98 487 88 -234
2308b34J9J42m95k85J209P47o18j298R5O47M99k4l83R1l34o4m54Q17O24m65o20
$$ -234 -215 -73 -568 -853 356 1103 485 -813 -718 -71 428 404 21 112 -222 -286 -740 77 701 236 -384
2329c84m50O73Q04k36l4Jm87o57L01P64P36n24j089k41M46P00k55K47k54k26k69
$$ -384 -834 -161 643 407 373 374 -113 -770 -469 295 1031 507 -582 -823 -377 323 68 315 61 -165 -434
2350d34l00P99Q17p0p42j080Q29K35N24j22o26M53r85j03N15P82m6n92o19O33
$$ -434 -734 65 882 812 70 -1010 -181 54 578 456 -170 283 -702 -805 -290 492 446 -146 -765 -132
2370a32K40K55L5k74J27l35p83K36J024N27j011o59J52L75N09k10j45K17l40k90
$$ -132 108 363 398 124 251 -84 -867 -631 393 920 -91 -750 -598 -223 286 76 -69 148 -192 -482
2390d82K63N29M23n78o99R8K32N93l58K84k07l2p39J9P00Q55l93r41n0M74L98
$$ -482 -219 310 733 155 -544 -446 -214 379 21 305 98 66 -673 -654 46 901 508 -433 -483 -9 389
2411C89j21k46M63j58q07J95O13K90j12p14k40L87R7L4O7L58o4j029K04L61M92
$$ 389 268 22 485 327 -480 -285 328 618 506 -208 -448 -61 36 70 137 495 431 -598 -394 -33 459
2432D59L79j220oL89Q8j16n9L96J31p80m75O60O52J4p45o94P29L62n7k6K13L56
$$ 459 838 -382 -388 1 89 -27 -86 310 441 -339 -814 -154 498 512 -233 -927 -198 164 107 81 294 650
2454F50o75p14M59N91K78o82j42l2J09J15K50K27j52n24k99M91M90o4n22j43L13
$$ 650 -25 -739 -280 311 589 -93 -235 -267 -158 -43 207 434 282 -242 -541 -50 440 376 -146 -289 24
2475B4j70n4K69L70k2n73n82K30R07J01m29n31L06K47N8k69O9N94j54r14m36R96
$$ 24 -146 -200 69 439 417 -156 -738 -508 399 500 71 -460 -154 93 151 -118 -49 545 391 -523 -959 37
2497C7P33k18j171K10M10J82k57j04O38K2m89n79M25P39j74j68l54m2L33K03l87
$$ 37 770 552 -619 -409 1 183 -74 -178 460 482 -7 -586 -161 578 404 236 -118 -160 173 376 -11
2518a1M09k17q2k41K22L48j80k20L8L35j46m60J09R36l14n17n80M06R20l27o45
$$ -11 398 181 99 -142 80 428 248 28 66 401 255 -205 -96 840 526 9 -571 -165 755 428 -217
2539b17M8M28J93n73l71M22O86m35q49q5J272p7m02p15N88M92k89j76k9Q7K62
$$ -217 -169 259 452 -121 -492 -70 616 181 -668 -753 519 442 40 -675 -87 405 116 -60 -89 -2 260
2560B60n56k7J66N64r1k14j89j13l1P0M00j59L07o16K34M40m28k14m8O00nq97
$$ 260 -296 -323 -157 407 316 102 -87 -200 -231 -161 239 80 387 -229 5 445 17 -197 -245 355 350 -547
2582e47N1N34P53n40p13K77O55L08j071k55O56M27m24j90m48P53M10m47q42O83
$$ -547 -496 38 791 251 -462 -185 470 778 -293 -548 108 535 111 -79 -527 226 636 189 -653 30
2602C0M03oo90j4L70K21l83j27p4J83K87p9j07J82j65PL1o6J1l43J84M36k8l82
$$ 30 433 427 -263 -277 93 314 -69 -196 -270 -87 200 121 14 196 31 38 69 3 14 -329 -145 291 263 -119
2626a19k93M62N58p12m49O75P74m92r17K32Q09j40m98k02N78L73l02p74o9Q67
$$ -119 -412 50 608 -104 -553 122 896 404 -513 -281 528 388 -110 -312 266 639 337 -437 -506 361
2646C61L87o80m56Q7L81L60p90j89N17L69l33j09k53L45j3k6J31l3K63l00lO8
$$ 361 748 68 -388 -301 80 440 -350 -539 -22 347 14 -95 -348 -3 -16 -42 89 56 319 19 16 84
2668H4m0m12N44j19L53o49j63O21R3n28m69Q72L49n36k94j36N46O08o13p81L18
$$ 84 44 -368 176 57 410 -239 -402 219 312 -216 -685 187 536 0 -294 -430 116 724 111 -670 -352
2689c52P02J57r42k09P39M90m29n89R5O67j64n48j87N57O13m12p17O5K97K11r0
$$ -352 350 507 -435 -644 95 585 156 -433 -338 329 165 -383 -570 -13 600 188 -529 -464 -167 44 -46
2710d6j36M00j78L7j77K54J08k45m7M16j1l31n26N91L34p31J56P5J88O7m18k53
$$ -46 -182 218 40 77 -100 154 262 17 -30 386 375 44 -482 109 443 -288 -132 -57 131 198 -220 -473
2732d73N59N09m90r92N16Q27k91l82k44N21P82n80k38n19O72K12n32j90P13J15
$$ -473 86 595 105 -887 -371 456 165 -217 -461 60 842 262 24 -495 177 389 -143 -333 380 495
2752D95n20m41L26L78J61m81K34j61q0J48l45L34J54m04lM36K05l61j81L85q8
$$ 495 -25 -466 -140 238 399 -82 152 -9 -89 59 -286 48 202 -202 -205 231 436 75 -106 279 191
2773A91k12j94Q4O36op15k29L59M71n23j68m6L92ll89N4K57M41m93m72Q4P52J29
$$ 191 -21 -215 -131 505 499 -216 -445 -86 385 -138 -306 -352 40 37 -352 -298 -41 400 -93 -565 -481 271 400
2796D00l84l33K74K89N0n74L16J64j95n05n2N21K13l01q3L07k44k00K26L56K00
$$ 400 16 -317 -43 246 296 -278 38 202 7 -498 -550 -29 184 -117 -200 107 -137 -337 -111 245 445
2817D45m24o07K62M25L38m30l01M16l6k46j81M53R4J26q25J20M15P10n78n76N17
$$ 445 21 -586 -324 101 439 9 -292 124 88 -158 -339 114 208 334 -491 -371 44 754 176 -400 117
2838A17j9p3j71kO28m83l60j57N99K14K9l28k83J57J22j96K18N50m15j77n98N03
$$ 117 98 25 -146 -148 480 -3 -363 -520 79 293 322 -6 -289 -132 -10 -206 12 562 147 -30 -628 -125
2860a25N02k65r4Nk73L39l64K28L60J35m87m28M40O47m56j43n1L64l68l60N1O83
$$ -125 377 112 18 23 -250 89 -275 -47 313 448 -39 -467 -27 620 164 21 -30 334 -34 -394 -343 340
2882C40k0n01l93o2P90N52o61k27K03N2j34j6L04N25p48m07K25M26K81l55m69
$$ 340 320 -181 -574 -636 154 706 45 -182 21 73 -61 -77 227 752 4 -403 -178 248 529 174 -295
2903b95K21J21k14o5M20J88j24o96o4P75K43k42j18k09Q2K19j82m1N08k66n99
$$ -295 -74 47 -167 -232 188 376 252 -444 -508 267 510 268 150 -59 23 242 60 19 527 261 -338
2924c38j44Q69P4m19l4k92L20k89Q2J86M67j9r17l44O48L84K3k36k55L04j09k47
$$ -338 -482 387 461 42 8 -284 36 -253 -171 15 482 463 -454 -798 -150 234 257 21 -234 70 -39 -286
2946b86N85Q1P6p26o6L00M42O7n92KJ71K4p03L99P23j23n40k65J38K07l3L27k86
$$ -286 299 380 456 -270 -336 -36 406 473 -119 -117 54 78 -625 -226 497 374 -166 -431 -293 -86 -119 208 -78
2969g8j32L29l39J77L95J27p06l11M27J60J68l92L25k27L2j75qN62K18n09q49
$$ -78 -210 119 -220 -43 352 479 -227 -538 -111 49 217 -175 150 -77 -45 -220 -228 334 552 43 -806
2990h06J24P06q4M79k12n18L48k75j70P28L79o75n33j91O36J64lJ9Q3J02n21j26
$$ -806 -682 24 -60 419 207 -311 37 -238 -408 320 699 24 -509 -700 -64 100 97 116 199 301 -220 -346
3012c46N30L57j20p15j60L30K58l29J34j1L24n04j37K52O80j45o44j86M03l2M63
$$ -346 184 541 421 -294 -454 -124 134 -195 -61 -72 252 -252 -389 -137 543 398 -246 -432 -29 -61 402
3033D02k06K89l65o24K39k1P53j8n44n18J52M40n1OK32l00Q8m03K55K58K15m71
$$ 402 196 485 120 -504 -265 -286 467 449 -95 -613 -461 -21 -72 -66 166 -134 -46 -449 -194 64 279 -192
3055a92k06m1N19Ln0J63l0n22k64M94O11O3m70m57R9m9O80l15P16o78j82j16l95
$$ -192 -398 -439 80 83 33 196 166 -356 -620 -126 485 548 78 -379 -280 -329 351 36 752 74 -108 -224 -619
3078f19R24L57o40l87l3K37M43Q2k72J95p8m69n9O78K76j43q19NM9J12L10N21
$$ -619 305 662 22 -365 -398 -161 282 364 92 287 209 -260 -319 359 635 492 -327 -322 -273 -161 149 670
3100F70n80j2n57K96L82L90j94k00k86j37O6K54K4L11k44o41q3M89M68P5q65o5
$$ 670 90 78 -479 -183 199 589 395 195 -91 -228 -162 92 116 427 183 -458 -541 -52 416 491 -374 -439
3122d39K77K94k24n9M16l23k58o5Q2P98J50p48j90N1M17j61l28L70L59o81j03
$$ -439 -162 132 -92 -151 265 -58 -316 -381 -299 499 649 -99 -289 -238 179 18 -310 60 419 -262 -365
3143c65K94L89J38k82m21K25J50j47Q5N81n78j11j54k33M55K82k50j27L2L08l95
$$ -365 -71 318 456 174 -247 -22 128 -19 66 647 69 -42 -196 -429 26 308 58 -69 -37 271 -124
3164a24k42N73K50k53q34L21P75K63o78m33J28J55p4l91P56J98k53k91j22K83
$$ -124 -366 207 457 204 -630 -309 466 729 51 -382 -254 -99 -173 -564 192 390 137 -154 -276 7
3184GN64k04k55m3J26K9l41OJ49J90l93l14L86J55J27l09Nq0M9M0J39K29l1p16
$$ 7 571 367 112 69 195 224 -117 -111 38 228 -165 -479 -93 62 189 -120 -115 -195 -146 -106 33 262 231 -485
3208d85P7K25L00M9l23O2L40j57m70j04N45M85q92j64Q31Rk31m03K3M21J1j15
$$ -485 -408 -183 117 166 -157 -95 245 88 -382 -486 59 544 -348 -512 319 328 97 -306 -283 138 149 34
3230C4k82L75L79o24l33M3L06M85k51m33K52j5J37q8m5K86k3k34j07L11L8k96
$$ 34 -248 127 506 -118 -451 -408 -102 383 132 -301 -49 -64 73 -15 -60 226 203 -31 -138 173 211 -85
3252h5O3L07n31J90j05M49j12l44m46M73L78J63k22o54Q24j09j98k72L37K10q5
$$ -85 -22 285 -246 -56 -161 288 176 -168 -614 -141 237 400 178 -476 348 239 41 -231 106 316 231
3273B31k95m5K44J73m86j83J37L59l59L3Q9M60l65j10j14o0L9L53l46L91p7j35
$$ 231 -64 -109 135 308 -178 -361 -224 135 -224 -191 -102 358 -7 -117 -231 -291 -252 101 -245 146 69 -66
3295f6r9j6K06o7l74P1K92O7m3OJ98L0l20k21J0N37p1k31l15J66P37n35l93n8
$$ -66 -165 -181 25 -42 -416 -345 -53 14 -29 -23 175 205 -115 -336 -326 211 140 -91 -406 -240 497 -38 -431 -489
3319d89O48l24R9j02L03L21o81k97J35O43J25l04j45J75j26M4l30J93K50K77l56
$$ -489 159 -165 -66 -168 135 456 -225 -522 -387 256 381 77 -68 107 -19 25 -305 -112 138 415 59
3340E9k86J87M52m71L4J98m7k00J2J98Q9jm00n2N66j92l49p9L34K91k33m49N97
$$ 59 -227 -40 412 -59 -25 173 126 -74 -62 136 225 224 -176 -228 338 146 -203 -282 52 343 110 -339 258
3363B58J77k11l82l3M46M7n77o3L64J38m25n13M92K68K73p03j23O51R1K09l84
$$ 258 435 224 -158 -191 255 302 -275 -338 26 164 -261 -774 -282 -14 259 -444 -567 84 175 384 0
3384@RK10on29R6ML55l36j21K55J88o5m94P25m9l71k82K86J85K00m39q3N34j14
$$ 0 9 219 213 -316 -220 -216 139 -197 -318 -63 125 60 -434 291 242 -129 -411 -125 60 260 -179 -262 272 158
3408A58m66L6K61K54k11m32n6N69Lj67km5M45Km44l63Q78K7l99j32j95Q01k77
$$ 158 -308 -272 -11 243 32 -400 -456 113 116 -51 -53 -98 347 349 -95 -458 420 447 48 -84 -279 522 245
3431B45n19L34J85ml44p8K16m7J52l56M11J71k52j07K3L43l91k02L58M2P6o16
$$ 245 -274 60 245 241 -103 -181 35 -12 140 -216 195 366 114 7 30 373 -18 -220 138 180 256 -360
3453c60J69K0K65k85j08K26M55l09k12J2O67j81m95k37L5J5K16j7J20O3q0k44
$$ -360 -191 -171 94 -191 -299 -73 382 73 -139 -127 540 359 -136 -373 -338 -323 -107 -124 -4 59 -21 -265
3475b65Q1L54q5J15o60M25N6J46N3n26O16Q1o87R8J53K99l12O7LK49j13k11RK36
$$ -265 -184 170 85 200 -460 -35 21 167 220 -306 310 391 -296 -198 -45 254 -58 9 12 261 148 -63 -54 182
3499A82M8k4k72K59L39l48o8r1L67l09n8j56K09J16J11m25L82J6k04j15J05K16
$$ 182 230 206 -66 193 532 184 116 25 392 83 25 -131 78 194 305 -120 262 278 74 -41 64 280
3521B80M6p3j06k43M06l73P9L7K07J18l54m39M16K61j40k85J76M4R2j55l0K39
$$ 280 326 253 147 -96 310 -63 16 53 260 378 24 -415 1 262 122 -163 13 57 149 -6 -36 203
3543B03r5k88k02N24k59K96o05K23j01J61m8l8K92K70l53k52RN85j23m34M77k27
$$ 203 108 -180 -382 142 -117 179 -426 -203 -304 -143 -191 -229 63 333 -20 -272 -263 322 199 -235 242 15
3565A5J5l90K43L46j43K8l17p0K10J81j90o3J94J11j77k3N00k74k76q4L02K09
$$ 15 30 -360 -117 229 86 114 -203 -273 -63 118 -72 -135 59 170 -7 -30 470 196 -80 -164 138 347
3587C47o51K00J32j74L41m59K80m5L31l21r7j6K12J61l60R6l1J88l60k9K39M41
$$ 347 -304 -104 28 -146 195 -264 16 -29 302 -19 -116 -132 80 241 -119 -23 -54 134 -226 -255 -16 425
3609D25k01o16L18K19j4k47Q5m6L6l18o3K41L00L4n36P0J2K05L2l22K28j55J67
$$ 425 224 -392 -74 145 131 -116 -31 -77 -41 -359 -422 -181 119 153 -383 -313 -301 -96 -64 -386 -158 -313 -146
3632a46k55L04LM24o77k29L48J19j03K31P1J37m63jJ96J5L01m60m91M37M91j91
$$ -146 -401 -97 -94 330 -347 -576 -228 -109 -212 19 90 227 -236 -237 -41 -26 275 -185 -676 -239 252 61
3654F1j0R8k5m4l31J18RM55n25Q7L1K71k44l66O71J06k85l37k17N91M91m75r7
$$ 61 51 149 124 80 -251 -133 -124 331 -194 -107 -76 195 -49 -415 256 362 77 -260 -477 114 605 130 33
3677C3l49N08J89m36K05O4l37k0n1Q06j95k34k32n8K81J48k82o2l6j02q1L12p7
$$ 33 -316 192 381 -55 150 214 -123 -143 -194 612 417 183 -49 -107 174 322 40 -22 -58 -160 -241 71 -6
3700fL67K7o08J55K39j35m0k0L1k93K86l05K79M53k02l49k57J17N79k4l77r5J18
$$ -6 361 388 -220 -65 174 39 -1 -21 10 -283 3 -302 -23 430 228 -121 -378 -261 318 294 -83 -178 -60
3723f0l0k45n1L48L10l14n0o6N38o26N80k61n6k97k12P60K05k15o49J57M48j15
$$ -60 -90 -335 -386 -38 272 -42 -92 -158 380 -246 334 73 17 -280 -492 268 473 258 -391 -234 214 99
3745I9j18J29j44K71l10m01M94L37K54l88j80j48L83k8l39K36J32k41l44J62J84
$$ 99 -19 110 -34 237 -73 -474 20 357 611 223 43 -105 278 250 -89 147 279 38 -306 -144 40
3766D0K98j34k27nL02j66j23R9J02r2j68r6J71L82k96m24L03J42m20K17J13K11
$$ 40 338 204 -23 -28 274 108 -15 84 186 94 -74 -170 1 383 87 -337 -34 108 -312 -95 18 229
3788B29j47m26L15rM06j99j59j14K06Q1l97L03P8K60n26kK25K91k25j9l01n0M62
$$ 229 82 -344 -29 -38 368 169 10 -104 102 183 -214 89 167 427 -99 -101 124 415 190 171 -130 -180 282
3811B82k51RO1m7k86j39M72K07M7m49o3L56k0q0K6J51M8m44pN1L59K95k70l63
$$ 282 31 40 101 54 -232 -371 101 308 355 -94 -157 199 179 99 125 276 324 -120 -127 -76 283 578 308 -55
3835e5r0J66j2j51J1M19l05o0jL75k03m4k06J40L26j39j55K72m0k08k00J46N5
$$ -55 -145 21 9 -142 -131 288 -17 -77 -78 297 94 50 -156 -16 310 171 16 288 248 40 -160 -14 41
3858D1J90N7n30M21J52l59j44K64j47j72k00J86k8N33j28l43j67L95n6j21L70
$$ 41 231 288 -242 179 331 -28 -172 92 -55 -227 -427 -241 -269 264 136 -207 -374 21 -35 -156 214
3879B14j9j80m91O28k20K83j23l06LL23k26l9K23r5L7j78k4L09j7j89k37M07j09
$$ 214 195 15 -476 152 -68 215 92 -214 -211 112 -114 -153 70 -25 12 -166 -190 119 102 -87 -324 83 -26
3902b6p3k26M44K26j43k42n83M98N20j03l72l2J82L25k03j63K1K90l42j9n28M67
$$ -26 -99 -325 119 345 202 -40 -623 -125 395 292 -80 -112 70 395 192 29 50 340 -2 -21 -549 -82
3924h2j83L45J37k13p4Q7j52M82j72l45p0r5O71j61l23P8Q1j8j45j58L68K99o46
$$ -82 -265 80 217 4 -70 17 -135 347 175 -170 -240 -335 336 175 -148 -70 11 -7 -152 -310 58 357 -289
3947b89j10K8L29K6J8m08L91r5Q6n04L89L25R1l88m92P89j57M9j08k90L91L1k98
$$ -289 -399 -371 -42 -16 2 -406 -15 -110 -24 -528 -139 186 277 -111 -603 186 29 78 -30 -320 71 102 -196
3970a96j65K99L6m1k12J86M1j85Q7k31M02J43j11P3q5P1k12j16K1K56qj53J91
$$ -196 -361 -62 -26 -67 -279 -93 -52 -237 -150 -381 21 164 53 126 41 112 -100 -216 -195 61 53 -100 91
3993I1K34k16m79J09L20J09n16K48L55j63M3m33J42J10L21l58m1M09K33l01m25
$$ 91 325 109 -370 -261 59 168 -348 -100 255 92 135 -298 -156 -46 275 -83 -124 285 518 217 -208
4014b08M9M16k15o4m7n3M06k64l30K74L88j62m06M1L59k79k7K35K96m39K3P6K15
$$ -208 -159 257 42 -22 -69 -122 284 20 -310 -36 352 190 -216 -175 184 -95 -122 113 409 -30 -7 69 284
4037B84L1o45K36N0K94m56J38J89K20k46l28k43N17K54P5m56j62K92R0l75j68
$$ 284 315 -330 -94 -44 250 -206 -68 121 341 95 -233 -476 41 295 370 -86 -248 44 134 -241 -409
4058d09Q1N10k63j69K84O5j28K02l89N23j39M3j47J07J87l84L5l02O42j56M1J1
$$ -409 -328 182 -81 -250 34 99 -29 173 -216 307 168 211 64 171 358 -26 9 -293 349 193 234 245
4080B45k77M4J90m80M78k48K37k59j34M54J19m99r2O9M10j21l21J81M33k78N5
$$ 245 -32 12 202 -278 200 -48 189 -70 -204 250 369 -130 -222 -153 257 136 -185 -4 429 151 206
4101B06l32M3K14K2pK06j35j45m3J1n7O6l61J33J93K29m7l69j08N65m03Q0l3J30
$$ 206 -126 -83 131 153 146 352 217 72 29 40 -17 49 -312 -179 14 243 196 -173 -281 284 -119 -39 -72 58
4125E8J32j67J66k15j11J9Q7k50N32k16k13J45K53m6k98l9N49j3l54m50O34l0
$$ 58 190 23 189 -26 -137 -118 -31 -281 251 35 -178 -33 220 174 -124 -163 386 373 19 -431 203 173
4147A73k48j12N3L65j24k51k8K81K65m24J46l16L01P6k68K1K48P5j6o32N73j81
$$ 173 -75 -187 -134 231 107 -144 -172 109 374 -50 96 -220 81 157 -111 -90 158 233 217 -415 158 -23
4169b3QPJ03L01k32K7j95K07K42o44k18L81o3J10n0m0N0L28o25L39Q7K3j11j66
$$ -23 -15 -8 95 396 164 191 -4 203 445 -199 -417 -36 -99 11 -39 -79 -29 299 -326 13 100 123 12 -154
4193a54K83J00j07J60m21J32J37k39k30K11K53l19J48k83L88L54m31J07j24K12
$$ -154 129 229 122 282 -139 -7 130 -109 -339 -128 125 -194 -46 -329 59 413 -18 89 -35 177
4213A77l84m20L89K71J80m90L9L02j21J33p4J62J69l98N6j16L27o1k85o1J8N59
$$ 177 -207 -627 -238 33 213 -277 -238 64 -57 76 2 164 333 -65 -9 -125 202 141 -144 -205 -187 372
4235C72k33m25m0M40m00J38J51J50Nm03K20pl9K37pl46K28K52m76o8L42J61k42
$$ 372 139 -286 -326 114 -286 -148 3 153 158 -245 -25 -32 -71 166 159 -187 41 293 -183 -251 91 252 10
4258A0l89L76j69k00L57k58QN36n72J54K52J31k42j87K30K39r9k38J23j42P0k02
$$ 10 -379 -3 -172 -372 -15 -273 -265 271 -301 -147 105 236 -6 -193 37 276 177 -61 62 -80 -10 -212
4280b12O6M18Nm35M7j20K45k40K38k51K94O2j19j80J83J70J3l02j05O6K09m87
$$ -212 -146 272 277 -158 -111 -231 14 -226 12 -239 55 117 -2 -182 1 171 184 -118 -223 -157 52 -435
4302d35M40m5j94J8r4L70j67K20j17o1L6K07j39l01OL21j09jJ04L83n25K71l78
$$ -435 5 -40 -234 -216 -310 60 -107 113 -4 -65 -29 178 39 -262 -256 65 -44 -45 59 442 -83 188 -190
4325a90o4K76j6K07j84o3j82j34K06PM20k90k87L17O4j2k85O2L53j13k44N6M01
$$ -190 -254 22 6 213 29 -34 -216 -350 -144 -137 283 -7 -294 23 87 75 -210 -148 205 92 -152 -96 305
4348C05q1q5j77L57j76O4n33J59K95n7n9Q1j20J29j31O4j75L42N3l84L80m19K26
$$ 305 224 139 -38 319 143 207 -326 -167 128 71 12 93 -27 102 -29 35 -140 202 255 -129 251 -168 58
4371E8Ll61M50o9k23K95l47J71J79j99L32j32j14J8l21K14N89q43L61j09L76k28
$$ 58 61 -300 150 81 -142 153 -194 -23 156 -43 289 157 43 61 -260 -46 543 -300 61 -48 328 100
4393A00J16l16K54l2j99k09%N91j10k1n2m4j39M3j61L80L5P4k62K06j74j10K2
$$ 100 216 -100 154 122 -77 -286 -286 305 195 174 122 78 -61 -18 -179 201 236 310 48 254 80 -30 -8
4416hj86J30K53j89K9J70n7M9l93K85K33l78p9j56L94Q0m37L58j32J49j02j2l7
$$ -8 -194 -64 189 0 29 199 142 191 -202 83 316 -62 -141 -297 97 177 -260 98 -34 115 13 1 -36
4439c6J38M19l99j43j31p5L73l2k23L79l94L00j65K33K14o34mK76K08n46L37J00
$$ -36 102 521 122 -21 -152 -227 146 114 -109 270 -124 176 11 244 458 -176 -180 96 304 -242 95 195
4461A95j40R9l56J37M4n8o9J09P0J10m65K48K99j2m22J6J32J53J26k32j17j26
$$ 195 55 154 -202 -65 -21 -79 -148 -39 31 141 -324 -76 223 211 -211 -195 -63 90 216 -16 -133 -259
4483b59N28l54J7k46N36O6l29K5p2l1M36j81l98K57R6N5m50M47j4j3k17O3K68
$$ -259 269 -85 -68 -314 222 288 -41 -16 -88 -119 317 136 -262 -5 91 146 -304 143 129 116 -101 -38 230
4506B30o9k30N6j59K87j11J05k01K48l5l73K86J35k67N06l70l23J56j03K13R0
$$ 230 161 -69 -13 -172 115 4 109 -92 156 121 -252 34 169 -98 408 38 -285 -129 -232 -19 71
4527G1K26j81m58L03Q6L28n90l3M15j87Q8k22K91j2l37K31L8j03L33j79j38K44
$$ 71 297 116 -342 -39 47 375 -215 -248 167 -20 68 -154 137 125 -212 19 57 -46 287 108 -30 214
4549B14j92Q1k38m5M46j25n51K44l2K69k67J74n9L48j20l60L11j00Ok30J74j25
$$ 214 22 103 -135 -180 266 141 -410 -166 -198 71 -196 -22 -81 267 147 -213 98 -2 4 -226 -52 -177
4571a77O4L20l58qJ38n4K05j30L09j36m99K30J32M04l39q7l53N26P8m45L1M81
$$ -177 -113 207 -151 -159 -21 -75 130 0 309 173 -326 -96 36 440 101 14 -339 187 265 -180 -149 332
4593C32o2m90J10P9M53k86p6k01K62k37k42K60L79j01p5j69P1l4l6Q1j42K63k46
$$ 332 270 -220 -110 -31 422 136 60 -141 121 -116 -358 -98 281 180 105 -64 7 -27 -63 18 -124 139 -107
4616a07q0L16M5M1j51m82M96qRq2j75K11j15J77q3p5L00k03q3L9M6O6R1j1k34
$$ -107 -187 129 174 215 64 -418 78 70 79 -3 -178 33 -82 95 12 -63 237 34 -49 -10 36 102 193 182 -52
4641e2O3j49j10M32P9m05K02j13J47Op9k09K37P1k21k2K17J06j03q3j66O8J18
$$ -52 11 -138 -248 184 263 -142 60 -53 94 100 21 -188 49 120 -101 -123 94 200 97 14 -152 -84 34
4664C4Q8m71K83L25o6j09k81M50j03J24n92L59k08J49l7N9L54m19O4n5J61P8l21
$$ 34 122 -349 -66 259 193 84 -197 253 150 274 -318 41 -167 -18 -55 4 358 -61 3 -52 109 187 -134
4687a34l3o1L77J71n18J46nL44k28Q9J08j18j00j14K3m2K08j1l29L03p7k82M79
$$ -134 -167 -228 149 320 -198 -52 -57 287 59 148 256 138 38 -76 -53 -95 113 102 -227 76 -1 -283 196
4710A96j46K34m69K21l78N26k7k32j06L70Q0n61N38q9Q1l65j9J47r6J87Nk35j49
$$ 196 50 284 -185 36 -342 184 157 -75 -181 189 269 -292 246 157 238 -127 -146 1 -95 92 97 -138 -287
4733b87O64n55k02J32M54l8m17J49J55j95l00L74O2M97n41j86j13M03q9J18o8
$$ -287 377 -178 -380 -248 206 168 -249 -100 55 -140 -440 -66 -4 493 -48 -234 -347 56 -33 85 17
4754A7R9k08M12n35L41Q7k32k54Q3L34j6k3m40O43k05r0k7j34N02k91k55J36n9
$$ 17 116 -92 320 -215 126 213 -19 -273 -190 144 128 105 -335 308 103 13 -14 -148 354 63 -192 -56 -115
4777a15L03j58J35k59L45l32R8k08M39l10K01l07P9M72l85k19K57K82j83l02L16
$$ -115 188 30 165 -94 251 -81 17 -191 248 -62 139 -168 -89 383 -2 -221 36 318 135 -167 149
4798A49k78j64M24j84K38p3r4j01K25k93K16m22K12K67p1r4J4k59M32k50j11K49
$$ 149 -129 -293 131 -53 185 112 18 -83 142 -151 65 -357 -145 122 51 -43 -29 -288 144 -106 -217 32
4820C2J79k73J02k08J89L6m2K3j28L78l12k32K46J55j20k11K85r3k67K54k14j23
$$ 32 211 -62 40 -168 21 57 15 38 -90 288 -24 -256 -10 145 25 -186 99 6 -261 -7 -221 -344
4842c44M58n25L48j31M07m00K5Q0p1K74n20N45k08MJ83j92K16Q4k00k62J74L68
$$ -344 114 -411 -63 -194 213 -187 -162 -82 -153 121 -399 146 -62 -58 125 -67 149 233 33 -229 -55 313
4864C13o1p36L79K50j64L29l79N6j26K15l03Q7L55k66O4l3l22L29j33M04l61R7
$$ 313 252 -484 -105 145 -19 310 -69 -13 -139 76 -227 -140 215 -51 13 -20 -342 -13 -146 258 -103 -6
4886fJ00l2r3j5O45p16J25n17K40L99m07J20K02j83K87m49L57l3k4R1j35J18m0
$$ -6 94 62 -31 -46 599 -117 8 -509 -269 130 -277 -157 45 -138 149 -300 57 24 0 91 -44 74 34
4909C4Kl31L20J93j27k99K15J27j39J14n81P38j07j89O1J36M6l23j29L03J08n9
$$ 34 36 -295 25 218 91 -208 7 134 -5 109 -472 266 159 -30 31 167 213 -110 -239 64 172 113
4931A13j82J64kN3m28L51k72L25J66l14J75K14r6l38m3M2J9Lj01J6Q2L33l41O2
$$ 113 -69 95 93 146 -282 69 -203 122 288 -26 149 363 267 -71 -114 -72 -53 -50 -151 -135 -53 280 -61 1
4955Am9J43K32j74j29O6j69q5L65j35j20K94l97R1J79m09K80p2n2N4r3J24K73
$$ 1 -48 95 327 153 24 90 -79 -164 201 66 -54 240 -157 -66 113 -296 -16 -88 -140 -86 -179 -55 218
4978B18l61L4J75o4K35j47q2L25j74l09K08k16J57J38r2j69k4J00O2j07p6J16
$$ 218 -143 -109 66 2 237 90 8 333 159 -150 58 -158 -1 137 45 -124 -148 -48 14 -93 -169 -53
5000e3L44k70O9lK57l20k50K78Lj25k77J36L60N5l06oJ72p4l1K17k00K53J0k57
$$ -53 291 21 90 87 344 24 -226 52 55 -70 -347 -211 149 204 -102 -108 64 -10 -41 176 -24 229 239 -18
5024a8M0J28r7j57J57M2j05J15k30R5K06PJ25l31J51L5j69K74l88J37J17j71J15
$$ -18 22 150 53 -104 53 95 -10 105 -125 -30 176 183 308 -23 128 163 -6 268 -120 17 134 -37 78
5047G8L3L59m72J1o7M5J43j57P6J64j19r3k52L55L80n15J98j05j07o7J71K45k96
$$ 78 111 470 -2 9 -58 -13 130 -27 49 213 94 1 -251 104 484 -31 167 62 -45 -112 59 304 8
5070HR4j44J42o8J7J03m77M93m6R2m00K2P5j5j03q1N38L5j10k09L7K39j85l92
$$ 8 102 -42 100 32 49 152 -325 168 122 214 -186 -164 -89 -104 -207 -288 250 285 175 -34 3 242 57 -335
5094c35L60j38M61m72R7J68J97n49K37j53N7N44p05J62J77J3K8m06J68K95j68
$$ -335 25 -113 348 -124 -27 141 338 -211 26 -127 -70 474 -231 -69 108 121 149 -257 -89 206 38
5115C8k38L63m36M57l78K18j00M04m4l41OJ25j27j43K77r4Lk19Q5j7M56l03kJ39
$$ 38 -200 163 -273 184 -194 24 -76 328 284 -57 -51 74 -53 -196 81 -13 -10 -229 -144 -161 295 -8 -10 129
5139A29k16K01K0l12L54j35J0q0p5J94l32j80K68L8K14j97J35k24N00l07m6k0
$$ 129 -87 114 134 -178 176 41 51 -29 -104 90 -242 -422 -154 -116 98 -99 36 -188 312 5 -41 -61
5161f1o6K08J17k02L18k32j65R9j41j44J14L9J72j72K52k08M4P9J99k02k28O7
$$ -61 -127 81 198 -4 314 82 -83 16 -125 -269 -155 -116 56 -116 136 -72 -28 51 250 48 -180 -113
5183a13K84j50p2j52M22j54m0Q6k94K79R2k33JM4J18j84J05k20K01P5k66J35K22
$$ -113 171 21 -51 -203 219 65 25 111 -183 96 188 -45 -44 0 118 -66 39 -181 20 95 -171 -36 186
5206A86m47M22l6l8J08j30k4j84O62j34n12R5j54L67l49O0J01k0K2j12L4L01l03
$$ 186 -261 161 125 87 195 65 41 -143 519 385 -127 -32 -186 181 -168 -108 -7 -27 -5 -117 -83 218 -85
5229h5j48r9N62k09K4Ok18L18j10j94M31j91J07j44p0m6m9J14r2J28J77l5J81
$$ -85 -233 -332 230 21 45 51 -167 151 41 -153 278 87 194 50 -20 -66 -115 -1 -93 35 212 177 358
5252C58j43j41p5l11K47Rk8J06K3p6o9O5K8m3K11l35J89j03m3J08J77k46m7L90
$$ 358 215 74 -1 -312 -65 -56 -84 22 45 -31 -100 -35 -7 -50 161 -174 15 -88 -131 -23 154 -92 -139 251
5276B51p1n45J88J16J25k27r9Q4K37P2lk04J79r3M3k56q3M48l49K83k17K56k75
$$ 251 180 -365 -177 -61 64 -163 -262 -178 59 131 128 -76 103 10 53 -203 -286 162 -187 96 -121 135 -140
5299a40K24p2PJ37m11O2K62J17k78m7p6J01K75k65K33P1j66q8Q4K16j31j40k78
$$ -140 84 12 19 156 -255 -193 69 186 -92 -139 -215 -114 161 -104 129 200 34 -54 30 246 115 -25 -303
5322c03J18L03J03j33l6k24N2J26M0j69K18J14k25p9J15M2K5J01j65J14j83K23
$$ -303 -185 118 221 88 52 -172 -120 6 46 -123 95 209 -16 -95 20 62 87 188 23 137 -46 177
5344A77J61j70p3j67j24L05RJ57k74J52j25j40L31o2p8R1l29R9j05J28M06m32
$$ 177 338 168 95 -72 -196 109 118 275 1 153 28 -112 219 157 79 170 -159 -60 -165 -37 369 -63
5366f3K5J77m35R8k66O77j02k0j00j83M22k11N1l3K62k79M3J76j52j52K3J66j34
$$ -63 -38 139 -296 -198 -464 213 111 91 -9 -192 230 19 70 37 299 20 63 239 87 -65 -42 124 -10
5389a0p8L95N5o14M66L14n02J66r6j99K8j64L73o9qk52J33K2k1L1K3K47j27q3
$$ -10 -88 307 362 -252 214 528 26 192 96 -103 -75 -239 134 65 57 -195 -62 -40 -61 -30 -7 240 113 30
5413C0L3J30j32K31j62k43j8J98p6M2q6m4K6K28j20R8J6L9k20m0L56l44j2N2j0
$$ 30 63 193 61 292 130 -113 -131 67 -9 33 -53 -97 -71 157 37 135 151 190 -30 -70 286 -58 -70 -18 -28
5438b8M2j14k7K41J61l25K4o7K31l2k16QJ97j3M3o9M8N9k3m5Ok44K59l96M60O9
$$ -28 14 -100 -127 114 275 -50 -26 -93 138 106 -110 -102 95 82 125 56 104 163 140 95 101 -143 116 -280 180 249
5464B49K9n00M18K4j00P4m96Q2N88l00j5l35N49Q8k76j86M2N0J27k31J79l26J24
$$ 249 278 -222 196 220 120 194 -302 -220 368 68 53 -282 267 355 79 -107 -65 -15 112 -119 60 -266 -142
5487a42J76o0m3L18K6l15L07l50j2j67L12J22l59j10J63N17n87K66j12M4N0n8
$$ -142 34 -26 -69 249 275 -40 267 -83 -95 -262 50 172 -187 -297 -134 383 -204 62 -50 -6 44 -14
5509a4k9j78L29J32j85o9J76n0j33J31J79k46j11j37J9L53l39L29k75J36q3oj10
$$ -14 -43 -221 108 240 55 -14 162 112 -21 110 289 43 -68 -205 -186 167 -172 157 -118 18 -65 -71 -181
5532a81J24K69l03k45L84J7J50k06r2k5L00l76J21J8M35j65m57K57L6lk4k80J05
$$ -181 -57 212 -91 -336 48 65 215 9 -83 -108 192 -184 -63 -45 390 225 -232 25 61 58 34 -246 -141
5555a41J19O8j41NM26l10J1l7K1K95o24L34k0k07M29n08K93O1r9r9L8Q2Lj99q9
$$ -141 -22 46 -95 -90 336 26 37 0 21 316 -308 26 6 -201 228 -280 13 74 -25 -124 -86 -4 -1 -200 -289
5580b89M01j58J37j43m13N66M9p0j36jj5K26k35n6o1M14k29p8N3m5J22k33L34
$$ -289 112 -46 91 -52 -465 101 150 80 -56 -57 -72 154 -81 -137 -198 216 -13 -91 -38 -83 39 -194 140
5603A40j39j3M2j72j7M34m75q9K92J23qqj49Q1l4l58J85J32J41M4o33N23j05J61
$$ 140 1 -12 30 -142 -159 275 -200 -289 3 126 118 110 -39 42 8 -350 -165 -33 108 152 -481 42 -63 98
5627I8k6k01K53j44l27L88J60o4j61n1J45KK01j80k30J48QM0R0j20l0k08L96j80
$$ 98 72 -129 124 -20 -347 41 201 137 -24 -75 70 72 273 93 -137 11 19 59 149 29 -1 -209 187 7
5651Gj53L22R5k54L0M0k51JJ10J67m4k33M3J54M9k26Q1L3K81j04j45LJ31k9j94
$$ 7 -146 176 271 17 47 87 -164 -163 -53 114 70 -163 -120 34 83 -143 -62 -29 252 148 3 6 137 108 -86
5676h6k0M97j66M0l62K36j71j56L06j32L7k54L85j77Lr0M3K86j53P0J71m25k0
$$ -86 -106 391 225 265 -97 139 -32 -188 118 -14 23 -231 154 -23 -20 -110 -67 219 66 136 307 -118 -138
5699a38J89j20L69n35M93j36j66P0j28K76n3k5k6Q2n38L55j29J08J15j02M6k83
$$ -138 51 -69 300 -235 258 122 -44 26 -102 174 121 96 70 152 -386 -31 -160 -52 63 -39 7 -276
5721b76J74N4j73M00l53Q7P2q3L2P0r9J37j44K11K69o31N8J39r2M6j14L4K05m52
$$ -276 -102 -48 -221 179 -174 -87 -15 -98 -66 4 -95 42 -102 109 378 -253 -195 -56 -148 -102 -216 -182 23 -429
5745d29K59J86O4R8l98J19M58l75n7r9K19J73j65j00j35K91N2k73RJ68J08k41
$$ -429 -170 16 80 178 -220 -101 357 -18 -75 -174 45 218 53 -47 -182 109 161 -112 -103 65 173 -68
5767f8r3J75R3P9O5j82K6K21j26n52R0L22k68K87l13M25M6k84j44J95J69l55K1
$$ -68 -161 14 107 186 251 69 95 316 190 -362 -272 50 -218 69 -244 181 227 -57 -201 -6 163 -192 -171
5790a71J42J38k2j75n2O9K99k21j43r1M14l53K23j65J12j4m08K29K92p8N5j32
$$ -171 -29 109 87 -88 -140 -71 228 7 -136 -227 187 -166 57 -108 4 -10 -418 -189 103 25 80 -52
5812e2R1J3l49M09m90M39k7n1rj7M06l14o0j14J87j09j83J64J90J99m17j53L91
$$ -52 39 52 -297 112 -378 61 34 -17 -26 -43 363 49 -11 -125 62 -47 -230 -66 124 323 -94 -247 144
5835A44K9j80l0K39L5l01j05k9L69jj82k08L90j31Ll3J9K19q0q7P2M8j40J36k68
$$ 144 173 -7 -37 202 237 -64 -169 -198 171 170 -12 -220 170 39 42 9 28 247 167 80 152 200 60 196 -72
5860g2k9K42l4k38j19K34o5J34L7Q9j04q4q2R0K5Q8k02J97oO0l1l07O2kp6J02
$$ -72 -101 141 107 -131 -250 -16 -81 53 90 179 75 -9 -91 -1 24 112 -90 107 101 161 130 -177 -115 -117 -193 -91
5886i1n1K31m1J4j65J73j37J70j68RJ29J16j42j7J73n15K97j55N5J64K57m54J75
$$ -91 -142 89 48 62 -103 70 -67 103 -65 -56 73 189 47 30 203 -312 -15 -170 -115 49 306 -148 27
5909B7Q5j27Q0q1j37L88J56l52j1n2O7kO2j92J01L28m57J80j1N0k68J51Q6j19
$$ 27 112 -15 65 -16 -153 235 391 39 28 -24 43 41 103 -89 12 340 -117 63 52 102 -166 -15 71 -48
5933d8k79M22n1j44J05l44M22J27k42P9o3k44N13j55k77Q7Q1Q0l46L83j03J11
$$ -48 -327 95 44 -100 5 -339 83 210 -32 47 -16 -260 253 98 -179 -92 -11 69 -277 106 3 114
5955A14o6j83N0J80k15J99J69o00N54j60q2MJ02o0m33M70j48n8N5J78Qr3j09p7
$$ 114 48 -135 -85 95 -120 79 248 -352 202 42 -40 -36 66 6 -427 43 -105 -163 -108 70 78 -15 -124 -201
5979b01K92J20j88K08l05P7Lk03K70j43J07o0K89l14K14L9q4J9n3Q1m4J12m06
$$ -201 91 211 23 231 -74 3 6 -197 73 -70 37 -23 266 -48 166 205 121 140 87 168 124 236 -170
6002a70K04j53j50J04K71J24l08K44m38K23L1k38L83j70kJ46O3LJ37n60QL66j82
$$ -170 34 -119 -269 -165 106 230 -78 166 -272 -49 -18 -256 127 -43 -45 101 164 167 304 -256 -248 118 -64
6025f4K64k19J83k91J17L8mJ17k87Q4j37Q3J23O6k0k8k66L91J19k57K80k56k0
$$ -64 200 -19 164 -127 -10 28 24 141 -146 -62 -199 -116 7 73 53 25 -241 150 269 12 292 36 16
6048A6j66J47J95j67K4J24l93N3K36k56L13p0j55J99n4k9q4j2L02k86Km1j64L23
$$ 16 -150 -3 192 25 49 173 -220 -167 69 -187 126 56 -99 100 46 17 -67 -79 223 -63 -61 -102 -266 57
6072E7O0m70K27L32j4j24k99N1K23o5P4K81l69J84k97K27P7j80k28K50Q3n9P3
$$ 57 117 -353 -126 206 192 68 -231 -180 43 -22 52 333 -36 148 -149 78 155 -25 -253 -3 80 21 94
6095I4k70K19n0L61m94K15l5m8j0l77M38l09L69n21L39M23k30k34J45J90p6j93
$$ 94 -176 43 -7 354 -140 75 40 -8 -18 -395 43 -266 103 -418 -79 344 114 -120 25 215 139 -54
6117e4J4J36k18J87k70n9L00j43K64l08P4K92k41l6J44l43K45K40m70L91j40K02
$$ -54 -40 96 -122 65 -205 -264 36 -107 157 -151 -77 215 -26 -62 82 -261 -16 224 -246 145 5 207
6139B07j61k63J69J75j41k11L20j01p2j23j24K31J33k76L60J60o0q0j05m1N4Q2
$$ 207 46 -217 -48 127 -14 -225 95 -6 -78 -201 -325 -94 39 -237 123 283 223 143 38 -3 51 133
6161A33k67l4K46O9l10L46n8j4m49J55K60j32j34K36J43k74K90k56J99k17Q4J5
$$ 133 -134 -168 78 147 -163 183 125 111 -338 -183 77 -55 -189 47 190 -84 206 -50 149 -68 16 31
6183C1oJ69m13J56j95R4K43K70j38j31K20j08l72K21j76L13Ql54K06j25p6m8K05
$$ 31 25 194 -219 -63 -258 -164 79 349 211 80 300 192 -180 41 -135 178 186 -168 38 -87 -163 -211 -6
6206fj00K22j83L35j06j03j10J59J21k83K03o3j95n8M60l44j1K46k89p4R4J92
$$ -6 -106 116 -67 268 162 59 -51 108 229 -54 149 86 -109 -167 293 -51 -62 184 -105 -179 -85 107
6228A07j92P7j09l9L15j15L56n22N9l27K02L41k12j76K03J3K4J01J42k5k18j79
$$ 107 -85 -8 -117 -156 159 44 400 -122 -63 -390 -188 153 -59 -235 -32 -19 5 106 248 223 5 -174
6250a74l7K08J75J01l49K56j04q2J30q0k49Q8l9l1L96q9j76KN0k98J69J35p5L00
$$ -174 -211 -3 172 273 -76 180 76 -6 124 44 -205 -117 -156 -187 209 120 -56 -54 -4 -302 -133 2 -73 227
6274B27l88N0L42P7j67r1J32k61l4j19K77P5j93kM0p6k07N48m58J42K50k16K07
$$ 227 -161 -111 231 308 141 50 182 -79 -113 -232 45 120 -73 -75 -35 -111 -318 230 -228 -86 164 -52 155
6297A55r5j07R7l6j16J78L8k22J13o4K69Jl46J57P2M8k97J69J26k33J56J85k59
$$ 155 60 -47 50 14 -102 76 114 -108 5 -59 210 211 -135 22 94 142 -155 14 140 -93 63 248 -11
6320a1N1j09%n7j21j8QK33n4J89pj93L69ln01L12q0N41o35n6L02k57j30L81q1
$$ -11 40 -69 -69 -126 -247 -265 -257 -24 -78 111 104 -89 280 277 -224 88 8 549 -86 -142 160 -97 -227 154 73
6345G3j26l3l11M00J68k79L09m35J65J11j80K14J0k76K15k86M30l87P1O6K34j4
$$ 73 -53 -86 -397 3 171 -108 201 -234 -69 42 -138 76 86 -190 25 -261 169 -218 -147 -81 153 139
6367A39k63J15Q5J8K7k96M30j26N7j73k48L21j12j24KR5j12K80m0j1L3j29J30
$$ 139 -124 -9 76 94 121 -175 255 129 186 13 -235 86 -26 -150 -148 -53 -165 115 75 64 97 -32 98
6390I8j64J1J12k3j83K37j59J51j92K46j64j51K22k1L05m06k96L32J13O3j32k46
$$ 98 -66 -55 57 34 -149 88 -71 80 -112 134 -30 -181 41 20 325 -81 -377 -45 68 131 -1 -247
6412b47L19n3p6J29k03K32j90L3J10L4l3M5%j37k03J11J80K06k46q8j30J1L64
$$ -247 72 19 -57 72 -131 101 -89 -56 54 88 55 100 100 -37 -240 -129 51 257 11 -77 -207 -196 168
6435A68k19l72K38K66r2J16n5%k74R3J7K10J5o7j5k13M63k56j85K26l18M94p7
$$ 168 -51 -423 -185 81 -11 105 50 50 -224 -131 -114 96 111 44 29 -184 279 23 -162 64 -254 240 163
6458A63mk82K75l41N8k1K3QJ24k98K24m1K51k57J29O4j25O1p9m7J5J36k2p3L8
$$ 163 159 -123 152 -189 -131 -152 -129 -121 3 -295 -71 -112 139 -118 11 75 -50 11 -68 -115 -100 36 14 -59 -21
6483b1k34M99k17jK74k06Q6j44J24j63j01J04M9k78Q3k4Q2J27n9O5J4J38J95m19
$$ -21 -255 244 27 26 300 94 180 36 160 -3 -104 0 49 -229 -146 -170 -88 39 -20 45 59 197 392 -27
6507b7K0L77l70J95k47M9K15jl87Q2J16o5P5j57K75j98r7J00n0J57k7j20R5N5
$$ -27 -7 370 0 195 -52 -3 212 211 -176 -94 22 -43 32 -125 150 -48 -145 -45 -95 62 35 -85 10 65
6531F5K39n3n66L13L60n28K30k24M78m20n2K06K71n97R3K30L72j85l69J11N4N4
$$ 65 304 251 -315 -2 358 -170 60 -164 314 -106 -158 48 319 -278 -185 45 417 232 -137 -26 28 82
6553H2L5kk10J60j59M0l73N03Q0J40l77O6k21K26l64O40m25L64K10k89n1K29j26
$$ 82 117 115 -95 65 -94 -54 -427 76 156 296 -81 -15 -236 -10 -374 266 -159 205 415 126 75 304 178
6576A78j96j3J2n0j56J68L7Q2K88J5m30m7K5J90l25m3M39k99Q3J55Q8O0n16J62
$$ 178 -18 -31 -19 -69 -225 -57 -20 62 350 365 -65 -112 -87 103 -222 -265 174 -125 -42 113 201 261 -255 -93
6600i3j35K71K36n20L79j87J28j88J54o5j7J26n7k63M13Nk01P%M7k28L33k13M14
$$ -93 -228 43 279 -241 138 -49 79 -109 45 -20 -37 89 32 -231 182 187 -14 -7 -7 40 -188 145 -68 346
6624C46n66J92P0J12MJ48m33K47J53m94K84l07J93J0j58J84j05J57M0k10J92j5
$$ 346 -220 -28 42 154 158 306 -127 120 273 -221 63 -244 -51 -41 -199 -15 -120 37 77 -133 59 44
6646D4j44RM2P6J81m87K91K01m3k08J71On0p7l5j19J04J22l74Q1M41n0k42l7J69
$$ 44 -100 -91 -49 27 208 -279 12 213 170 -38 133 139 89 12 -23 -142 -38 84 -290 -209 232 182 -60 -97 72
6671G2k3j31R0j39K0N0K76n3j76O5J88j44l15J59J89j72J1j28J61K35n12M43k85
$$ 72 49 -82 8 -131 -111 -61 215 162 -14 51 239 95 -220 -61 128 -44 -33 -161 0 235 -277 166 -119
6694a19J28O9N5J8J01l01n7J39j33L86k75q6M5J87j53j2J65m21N02k69K80j95
$$ -119 9 78 133 151 252 -49 -106 33 -100 286 11 -75 -30 157 4 -8 157 -264 238 -31 249 54
6716E4q9r3K59M3m23L33k83J16K19L9l66M24j88J25Q4k49K81k14J21m98N45r0
$$ 54 -35 -128 131 174 -249 84 -199 -83 136 175 -191 233 45 170 254 5 286 72 193 -305 240 150
6738A50k48n6K50j87J27k84L28J84ml04K48l37O6Om03M53o4J68k11J02K0K27m68
$$ 150 -98 -154 96 -91 36 -248 80 264 260 -44 204 -133 -67 -61 -464 -11 -75 93 -118 -16 4 231 -237
6761b37K51J04n40L95j51M50j21k04j84J14MK21k7m7P5O0k26J84r8K17m7l71M18
$$ -237 14 118 -422 -27 -178 272 151 -53 -237 -123 -119 102 75 28 103 163 -63 121 23 240 193 -178 240
6784B40m47M23l07R2j77M87l89J41j44R9p6p4L0l1J16j52K5J11r8K99m57O21k60
$$ 240 -207 216 -91 1 -176 311 -78 63 -81 18 -58 -132 -102 -133 -17 -169 -144 -33 -131 168 -289 332 72
6807G2p2q5J90k04K81pn00K92J29K04n58K05j66L68k50j66o9N16Pm62L1K36J89
$$ 72 0 -85 105 -99 182 175 -325 -33 96 300 -258 -53 -219 149 -101 -267 -336 180 187 -275 -244 -8 181
6830A81k72L07l03L1lj55K02jk42j26M55L05o33j5J25L56q2j26l3K4K2p1p6K40
$$ 181 -91 216 -87 -56 -59 -214 -12 -13 -255 -381 74 379 -254 -269 -144 212 130 4 -29 -5 17 -54 -130 110
6854A10j94K09l88J23M4M35k17k43J21J16q1k15L58j96k4j2J11L33m62jj89JL08
$$ 110 -84 125 -263 -140 -96 339 122 -121 0 116 35 -180 178 -18 -42 -54 57 390 -72 -73 -262 -261 47
6877D7nJ22l74N5k11J62L46j32j9j00J14K95m93K80k45O1M7j78L29l42J90J3l15
$$ 47 42 164 -210 -155 -366 -204 142 10 -9 -109 5 300 -193 87 -158 -97 -50 -228 101 -241 -51 -38 -353
6900c53M68n7j48J53l1j97K67j86k92K86O4J46J22m31J62J35j05J56M5r8J5J85
$$ -353 115 58 -90 63 32 -165 102 -84 -376 -90 -26 120 242 -189 -27 108 3 159 204 106 121 306
6922C06j65j22Q9l87J95L58j97K02m42K33lK4n8P3l5j5r2k85K79J07o5J58l25
$$ 306 141 19 108 -279 -84 274 77 279 -163 70 67 91 33 106 71 56 -36 -321 -42 65 0 158 -167
6945a67n6K54o6R1k38J28j16K45p0J5j36O9j18L58k4l05q0M43L8j12k52N6L76
$$ -167 -223 31 -35 56 -182 -54 -170 75 5 20 -116 -47 -165 193 169 -136 -216 227 265 153 -99 -43 333
6968C33l65j02j08PK72J16m5l50J87J7K3N5pn6O17n75k64L49K19j90k53o8K48
$$ 333 -32 -134 -242 -235 37 153 108 -242 -55 -38 -15 40 33 -23 594 19 -245 104 323 133 -120 -188 60
6991F0J18l28J21J97j47J59k37j09K21k32J45q8J55J39m0j84K04l64n1L89k12
$$ 60 178 -150 -29 168 21 180 -57 -166 55 -177 -32 -120 35 174 134 -50 154 -210 -261 128 -84
7012h4L36j9n60L34L85n57J30p5P9RK20k00k3M7l36M55O1n03M39m03J91l4L44
$$ -84 252 233 -327 7 392 -165 -35 -110 -31 -22 198 -2 -25 22 -314 141 202 -301 138 -265 -74 -108 236
7035B36o8m37N06j90m4j30K20l0j24j73J41K06N5k71q8L48j9j80j96M2J73J93
$$ 236 168 -269 237 47 3 -127 93 63 -61 -234 -93 113 168 -103 -191 157 138 -42 -238 -196 -23 170
7057A70r8j58K67j99P2l74M60J08j66k9J34R1l16J36k38p5K54j31K8P6l0J83j06
$$ 170 72 -86 181 -18 54 -320 140 248 82 53 187 278 -38 98 -140 -215 39 -92 -64 12 -18 165 59
7080E9k99L34l04O6L8n5J4L6M06k14J58k05Q2j06N2mK3L0M3j9k15N8j28L92o1
$$ 59 -240 94 -210 -144 -106 -161 -147 -111 295 81 239 34 116 10 62 58 81 111 154 135 -80 -22 -150 242 181
7105A81j18N0k12K23J16l82Lq7J99L05l70N1j90K64j18j33K1K76J70k27J03k14
$$ 181 63 113 -99 124 240 -142 -139 -226 -27 278 -92 -41 -231 33 -85 -218 -197 79 249 22 125 -89
7127h9J29j20K79n14L01K10j08O8j14p2N2p2M3N1k04L9J05L24n07K48J6K4k32
$$ -89 40 -80 199 -315 -14 196 88 156 42 -30 22 -50 -7 44 -160 -121 -16 308 -199 49 65 89 -143
7150a43P4N4J99o5j50K33k02%J24L5l13N66m28j35L91k39l42L13k03J53N9m26
$$ -143 -69 -15 184 119 -31 202 0 0 124 159 -154 412 -16 -151 240 1 -341 -28 -231 -78 -19 -445
7172d45L86K0l0j03J26o7O4p0r%L58r0o2ro8k6p5K93k41J04k09J66l35M25l9m9
$$ -445 -59 -39 -69 -172 -46 -113 -49 -119 -128 -128 230 140 78 69 1 -25 -100 193 -48 56 -153 13 -322 103 64 15
7198A5J95l68K09l23K43j03L18m61J6K03J03K05r8r4j40J58n1L0j20L8L6kj59
$$ 15 210 -158 51 -272 -29 -132 186 -275 -259 -56 47 252 154 60 -80 78 27 57 -63 -25 11 9 -150
7221a50R7J37pJ84j71K27m00J43l61L94j69K99k86k63L77j38J25l97J86K31k32
$$ -150 -53 84 77 261 90 317 -83 60 -301 93 -76 223 -63 -326 51 -87 38 -359 -173 58 -174
7242a74J35j59K92j19j1l1j39J16m1J43Q8k1l50R8q3N85n56J04J87J9J12l11J10
$$ -174 -39 -198 94 -25 -36 -67 -206 -90 -131 12 100 79 -271 -173 -256 329 -227 -123 64 83 195 -116 -6
7265fn1J82N0r6l21K72p4J2j70K25n0K31m23l4l3J63R3J90l2k00K30p3J73j03
$$ -6 -57 125 175 79 -242 30 -44 -32 -202 23 -27 204 -219 -253 -286 -123 -30 160 128 -72 158 85 258 155
7289A55j3l26J43J80k66N4k00j39O91l98K58K4j44J57k01k43K33R4j14k23K4L23
$$ 155 142 -184 -41 139 -127 -73 -273 -412 279 -119 139 163 19 176 -25 -268 -35 59 -55 -278 -254 69
7311F9l6P3j59n9j47L51l6J4J26n09m8N37j28J05l00K69l32M11j64q6n9R4J75
$$ 69 33 106 -53 -112 -259 92 56 70 196 -313 -361 176 48 153 -147 122 -210 201 37 -49 -108 -14 161
7334A61l83L54j79K70m34k52M01n4K27j43K15j94L94m36L59j59k96k02M38K18
$$ 161 -222 132 -47 223 -211 -463 -62 -116 111 -32 183 -11 383 -53 306 147 -149 -351 87 305
7354C05k55J8k07M42l2k04J02k35O9p1J05L26m33M80p2l00j54R2J7n3J22N9k5
$$ 305 50 68 -139 303 271 67 169 -66 3 -68 37 363 -70 410 338 38 -116 -24 -7 -60 62 121 96
7377I6L0q7Ol40N06k75L0J41q2O9K10k35J16jk32O5L5L65l01q0j3K48m70J51K1
$$ 96 126 39 45 -295 211 -64 -34 107 25 94 304 69 185 184 -48 17 52 417 116 36 23 271 -199 -48 -27
7402b7R4%m00K35kJ1j84K43K81l88o6P0L15k00q5j45K30r9L03j29k77L94j82R2
$$ -27 67 67 -333 -98 -100 -89 -273 -30 251 -137 -203 -133 182 -18 -103 -248 -18 -117 186 57 -220 174 -8 84
7426H4k61l6L51l73K38K81q7j97k02J47j97K65j28J28r9%J77J4l15N63j93Pj99
$$ 84 -177 -213 138 -235 3 284 197 0 -202 -55 -252 13 -115 13 -86 -86 91 105 -210 353 160 167 -32
7449c2M02m67j9J00l9j47J74K0q5J87L3j78l7j12J43n6K1j19L15O1k66K48r0J75
$$ -32 370 -97 -116 -16 -55 -202 -28 -8 -93 94 127 -51 -88 -200 -57 -113 -92 -211 104 165 -101 147 57 232
7473B32l59k7L82j93l9j62p3K20o9j62R3l5L3Q5k32M91j55j29k24J94R4o0k3J77
$$ 232 -127 -154 228 35 -4 -166 -239 -19 -88 -250 -157 -192 -159 -74 -306 185 30 -99 -323 -129 -35 -95 -118 59
7497E9j31P3KJ05Qlj51QK34m11K45l9j21J30K9j85K45K1j67N0j15p4j41K08n6
$$ 59 -72 1 3 108 116 113 -38 -30 204 -207 38 -1 -122 8 37 -148 97 118 -49 1 -114 -188 -329 -121 -177
7522a77L12M1k59P5L1n9o4J21J03n07M07O2j63m7J52n8j97O2L2K84k77Q6N9l32
$$ -177 135 176 -83 -8 23 -36 -100 21 124 -383 24 86 -77 -124 28 -30 -227 -165 -133 151 -126 -40 19 -313
7546c13L41K47k54n1j64J70K09m39K90k44K92k93L3K23l9K97m55K02r5O08q38
$$ -313 28 275 21 -30 -194 -24 185 -254 36 -208 84 -209 -176 47 8 305 -150 52 -43 565 -273
7567b73M20k60K29j05J7J38k90L13k30J73k9m86N90j51m7K2k57J65j3K9j14O0
$$ -273 147 -113 116 11 28 166 -124 189 -41 132 103 -383 207 56 9 31 -226 -61 -74 -45 -159 -99
7589i9k89J38M19l56K44N5j85PJ1J78j70J1L7K72n10J10k8k4K86k22KL41l13O6
$$ -99 -388 -250 169 -187 57 112 -73 -66 -55 123 -47 -36 1 273 -237 -127 -155 -179 107 -115 -113 228 -85 -19
7613a9k07K23J3K04n2l52K25K46j15m80L13k0J95K21n05j26L4K80J25l99J56j41
$$ -19 -226 -3 10 214 162 -190 35 281 166 -314 -1 -21 174 395 -110 -236 -202 78 203 -196 -40 -181
7635a81J85kj44r0M14j07o7K22k14k55R9l4O0K55k76K59l92K84j67j34O91l88
$$ -181 4 2 -142 -232 182 75 8 230 16 -239 -140 -174 -114 141 -135 124 -268 16 -151 -285 406 18
7657A8j42l2L93k73QQ3j94K65n3j44N3K60k11n4o1J22j13J13LK51k54L5k32Q9
$$ 18 -124 -156 237 -36 -28 55 -139 126 73 -71 -18 242 31 -23 -84 38 -75 38 41 292 38 73 -159 -70
7681g0m2K18l29J32K04M4o3q2k07Q7L18k35Q6p5j15J83k80N1L58m46M05R9l09
$$ -70 -112 106 -223 -91 113 157 94 12 -195 -108 210 -25 61 -14 -129 54 -226 -175 183 -263 142 241 -68
7704f8k12J33K11%j13K05j0j08J03K1k5k38Q1j92K50k1l2J32j22Q5j77n0J52N
$$ -68 -280 -147 64 64 -49 156 146 38 141 162 137 -101 -20 -212 38 17 -15 117 -5 80 -97 -147 5 10
7728A0k18K48j8P2k84j02K34j20l6L49p4J15l79J93J09r0J28k86K67K02l37K05
$$ 10 -208 40 22 94 -190 -292 -58 -178 -214 135 61 176 -203 -10 99 9 137 -149 118 320 -17 188
7750A88l58M54k95J31j33l59P51l61J05N9J23l07l09L26J6lK66k82J8k05j0Q9
$$ 188 -170 284 -11 120 -13 -372 379 18 123 182 305 -2 -311 15 31 28 294 12 30 -175 -185 -96
7772i6L3m2J42rj41l8J78J54k00J48q0k93M93l57M2m6J50J51Ll63K31j32L1K1
$$ -96 -63 -105 37 28 -113 -151 27 181 -19 129 49 -244 249 -108 -66 -112 38 189 192 -171 60 -72 -41 -20
7796b0j45J89k05M25l12j20J01M25m24J74l25L43j38k84M51K37k12J08l77o2K81
$$ -20 -165 24 -181 244 -68 -188 -87 338 -86 88 -237 106 -32 -316 135 372 160 268 -109 -171 110
7817A10j43J64j94m5O4J73k51M39m12K82k73K42k07m5o6r5M05k25r8Q3J30j23
$$ 110 -33 131 -63 -108 -44 129 -122 317 -95 187 -86 156 -51 -96 -162 -257 148 -77 -175 -92 38 -85
7839h5R8q1j93R8J55K1l2k53L99r7p1J74j52J63j35J32M6m15M18j72rK0Nnk14
$$ -85 13 -68 -261 -163 -8 13 -19 -272 127 30 -41 133 -19 144 9 141 187 -228 190 18 9 29 34 29 -185
7864a85K67J22l37J61N9r0l0l43L64R0j81J38L38n12L59k08r1K22k71K80J78n10
$$ -185 82 204 -133 28 87 -3 -33 -376 -12 78 -103 35 373 -139 220 12 -79 143 -128 152 330 -180
7886a80J76j28K29j73L22k31J38j64j99N51m75L77j10k65J55n4J70O6k28K1j18
$$ -180 -4 -132 97 -76 246 15 153 -11 -210 341 -134 243 133 -132 23 -31 139 205 -23 -2 -120
7907a20k41K42L9p8Q0J81l9R8j65j73L55j23J12K8m73M03k19K5k7K43j14j19o3
$$ -120 -361 -119 -80 -158 -78 103 64 162 -3 -176 179 56 168 196 -277 126 -93 -68 -95 148 34 -85 -148
7930a48K30k42K48J6j71R4K87q6j53j2K60k18m0K00Lk58o3L87l94J34J23k53r7
$$ -148 82 -160 88 104 -67 27 314 228 75 63 323 105 65 265 268 10 -53 334 -60 74 197 -56 -153
7953a53K68j49k17K36Lj12L20l21j14L73J3j90m3j09K67j32K50j91J79j26P0J88
$$ -153 115 -34 -251 -15 -12 -124 196 -125 -239 134 147 -43 -86 -195 72 -60 190 -1 178 52 122 310
7975C10L9m49J18J4%Q5k62J83K30k00k45l4J47m3K21j78k09M08l42N8K0N5K96
$$ 310 349 -100 18 32 32 117 -145 38 268 68 -177 -211 -64 -107 114 -64 -273 135 -207 -149 -129 -74 222
7998B22j24L33q76N11k73M5j20L04L0l12J75J07K7k5K49j74o1J39o2Q8l58J43
$$ 222 98 431 -445 66 -207 -162 -282 22 52 -260 -85 22 49 24 273 99 38 177 115 203 -155 -12
8020a2l6R1L96m98K29k72L12j72K30k25r2j60L7J96mJ64j48k56M37q8j51j33L15
$$ -12 -48 43 439 -59 170 -102 210 38 268 43 -49 -209 -172 24 20 184 36 -220 217 129 -22 -155 160
8043A60K5k30P7l4mN3j97k2L83k73J77Q5j07Q0m02K68l72K41L08m52L25k77J39
$$ 160 185 -45 32 -2 -6 47 -150 -172 211 -62 115 200 93 173 -229 39 -333 -92 216 -236 89 -188 -49
8066d9kK47k79J82m50J89M0k22J32K36Ok20J51j0J49K15k80j62K0l8M4R8J13L7
$$ -49 -51 196 -83 99 -351 -162 -122 -344 -212 24 30 -190 -39 -49 100 315 35 -127 -107 -145 -101 -3 110 147
8090A47l97L28J65k06m6k45L68k82M4J2J0J91j58r1J77mO6p6r1K44q1l99M25m9
$$ 147 -250 78 243 37 -9 -254 114 -168 -124 -112 -102 89 -69 -160 17 13 79 3 -88 156 75 -324 101 52
8114E2k17J94l88K95J76NR7k12K91k51j36J97oj97L49k88K6J49n7j26L06k25j93
$$ 52 -165 29 -359 -64 112 117 214 2 293 42 -94 103 97 -100 249 -39 -13 136 79 -47 259 34 -159
8137a59J55J00k42O4o2N3M44j72j06l4N6k04K59k34J27L45m30o4N6K87p07N04
$$ -159 -4 96 -146 -82 -144 -91 353 181 75 41 97 -107 152 -82 45 390 -40 -104 -48 239 -468 36
8159C6j14P2j66k13L82p1k92K28M39q5oj75k69l6J76K31k05J47r6J99K56n29L37
$$ 36 -78 -6 -172 -385 -3 -74 -366 -138 301 216 210 35 -234 -270 -94 137 -68 79 -17 182 438 -91 246
8182B46k63J13P5q9k50N4N3k16K85
$$ 246 -17 96 171 82 -168 -114 -61 -277 8
8191H
$$ Imaginary data points
##PAGE= N=2
##DATA TABLE= (X++(I..I)), XYDATA
0@%%%%%%%Qj6J6j6J6k4L2l2M0m9N7p2Q5r7J10j27J50j73J95k21K52k85L22l63
$$ 0 0 0 0 0 0 0 0 8 -8 8 -8 8 -16 16 -16 24 -25 32 -40 45 -52 58 -69 81 -92 103 -118 134 -151 171 -192
31a92M08m56N09n70O35p05P82q68R64j067J179j305J447j604J778j976K203k464
$$ -192 216 -240 269 -301 334 -371 411 -457 507 -560 619 -686 761 -843 935 -1041 1162 -1302
49a302K770l128L561m099M780n675O909q732J1688j7269L1338j28283k51180L27723
$$ -1302 1468 -1660 1901 -2198 2582 -3093 3816 -4916 6772 -10497 20841 -107442 -358622 -30899
63c0899K37734k24504k09420K21108J73990k12569j84087K05058J86801j67302
$$ -30899 206835 -17669 -227089 -5981 168009 -44560 -228647 -23589 163212 -4090
73d090j98488J04851J37797r1147r7050J18974J03863j10819j17744R4038J38331
$$ -4090 -202578 -97727 40070 -51077 -148127 -29153 74710 -36109 -153853 -59815 78516
84G8516k4061r1967P512N1401j3977m2489J2713L9960M966l8503n2340j6482O2262
$$ 78516 54455 -37512 -30000 21401 7424 -35065 -22352 17608 22574 -15929 -68269 -84751 -22489
97b2489P8989j9221q8249Q71R5487K4652o5203R141R4418p472j17450j7284J11721
$$ -22489 56500 37279 -50970 -50099 45388 70040 4837 13978 108396 100924 -16526 -33810 77911
110G7911L0114r4738l3213O4561p673q3157K2688J16688M751j15577k4204J06397
$$ 77911 108025 13287 -19926 44635 36962 -46195 -23507 93181 97932 -17645 -41849 64548
122F4548M7010o7611k6116O8927K1281q3194n2961N8444O4110l6431p8563j9234
$$ 64548 111558 43947 17831 86758 108039 24845 -28116 30328 94438 58007 -20556 -39790
134c9790L4384J9806q710m853J0910M092j3557j0665J7490L6445J1295l4799l5199
$$ -39790 -5406 14400 5690 837 11747 15839 2282 -8383 9107 45552 56847 22048 -13151
147a3151P081J8506j3574j4509J7449j641n8541l1838O2114N8164m3964n6867
$$ -13151 -6070 12436 -1138 -15647 1802 161 -58380 -90218 -28104 30060 -13904 -70771
159g0771M2743O0844l6787m9956N9328P6788m9800r7297J6174Q4625J06o8599
$$ -70771 -28028 32816 -3971 -53927 5401 82189 32389 -64908 -48734 35891 35997 -32602
171c2602j0589L9802r868m1687J6710N7333M409l9203k235L6323J1424r353J7006
$$ -32602 -43191 -3389 -13257 -54944 -38234 19099 23508 -15695 -17930 18393 29817 20464 37470
184C7470K4851j8213m1120j017L3458J0763k3046j9929l871M61O018J2802O470
$$ 37470 62321 44108 2988 1971 35429 46192 23146 3217 -654 -193 5825 18627 25097
197B5097L6P762M617j3857k801L7450K9665l1822m7220R239L5813j1380l7153
$$ 25097 25133 32895 37512 23655 20854 58304 87969 56147 8927 18166 53979 42599 5446
210E446K538K0032k1745l4640J4194L8289j401k4448M396J8124p243q096K3550
$$ 5446 7984 28016 6271 -28369 -14175 24114 22713 -1735 2661 20785 13542 5446 28996
223B8996J7154k8125l4171Q574J9949j3457k4298J764N679j8806j6494J5047K1596
$$ 28996 46150 18025 -16146 -7572 12377 -1080 -25378 -23614 -17935 -36741 -53235 -38188 -16592
236a6592k248q553M827L795k148J2354J9608q303k7168l404J7047m663k1710J590
$$ -16592 -18840 -27393 -22566 -18771 -20919 -8565 11043 2740 -24428 -27832 -10785 -15448 -37158 -35568
250c5568J5549j1857k5468P987K8830N096j1541P186J4933l557k516K1750J5406
$$ -35568 -20019 -31876 -57344 -49357 -20527 -15431 -26972 -19786 -4853 -8410 -10926 10824 26230
263B6230j7601j7538J1743R611j7496j2756J5111P088k2428j3989K1427K1671
$$ 26230 8629 -8909 2834 12445 -5051 -17807 -2696 4392 -18036 -32025 -10598 11073
275A1073o330p553J3903J1072m788J765J5605L321j5170o998N613l733j3084p84
$$ 11073 4743 -2810 11093 22165 17377 19142 34747 38068 22898 15900 21513 17780 4696 3912
289C912N395r613j5364L796J3117J7l685Q065O114o800P48J4951L853j7098q279
$$ 3912 9307 -306 -15670 -11874 1243 1260 -2425 5640 11754 4954 5702 20653 24506 7408 -871
304h71R242l373k2348o572J3784k859k4718p418J9315Q462j3189k556J7026O891
$$ -871 8371 4998 -17350 -23922 -10138 -12997 -37715 -45133 -25818 -17356 -30545 -33101 -16075 -9184
318i184j0111l92J4563L886j3015o996M095k677j0947l770K929m691q275K286
$$ -9184 -19295 -19687 -5124 -1238 -14253 -21249 -17154 -19831 -30778 -34548 -31619 -36310 -44585 -42299
332d2299Q434K486P08Q112P128k43L390J1209M830p121k795N769r15j1638k969
$$ -42299 -33865 -31379 -30671 -22559 -15431 -15674 -12284 -1075 3755 -3366 -6161 -392 -1307 -12945 -15914
347a5914Q274j607j3233j502J5088O351n845J748J5352P631n124K647J3598L469
$$ -15914 -7640 -9247 -22480 -23982 -8894 -2543 -8388 -6640 8712 16343 11219 13866 27464 30933
361C0933r835l876M582j462r387l233K235m860p776K595O895l64j826P641P091
$$ 30933 21098 17222 21804 20342 10955 7722 9957 5097 -2679 -84 6811 6447 4621 12262 19353
376A9353j915r87Q898N974q594q424L663R73j1609j0278L029K03j2059p520P541
$$ 19353 17438 16451 25349 31323 22729 14305 17968 18941 7332 -2946 83 286 -11773 -19293 -11752
391a1752O664n244k468Q251O457k446l68O877J720o938l908P86l766p951k253
$$ -11752 -5088 -10332 -12800 -4549 1908 -538 -906 5971 7691 753 -3155 -2369 -6135 -14086 -16339
406a6339n19o559o074L949N947k557q34R335P606k647JJ1532O554o737n573O096
$$ -16339 -16858 -23417 -29491 -25542 -19595 -22152 -22986 -13651 -6045 -8692 -8691 2841 9395 2658 -2915 3181
422C181K619r249o802M564K102q633m559Q303O978j911R87R025P211O51K720O847
$$ 3181 5800 -3449 -10251 -5687 -3585 -12218 -16777 -8474 -1496 -3407 -2420 6605 13816 14467 17187 24034
438B4034L060k999o90P79l659m752n6j272o659l433M903L733l509r3Q563O747
$$ 24034 27094 24095 23405 24184 20525 15773 15717 14445 7786 4353 9256 12989 9480 9387 17950 24697
454B4697k526l45P831N379n099n928J582M38p354o647j306k328o806l057K567
$$ 24697 22171 21826 29657 35036 29937 24009 25591 26029 18675 12028 10722 8394 1588 -1469 1098
469A098Q49k419J483M961J695q54K959N099j690n351j041K78m864o637j765j603
$$ 1098 1947 -472 1011 5972 7667 6813 9772 14871 13181 7830 6789 7067 2203 -4434 -6199 -7802
485g802p393n572L497M226l941l427P796Q629j702l672P872R428l665q641M61
$$ -7802 -15195 -20767 -17270 -13044 -16985 -20412 -12616 -3987 -5689 -9361 -1489 7939 4274 -4367 -3906
500c906N669k435q566l433J334j500k458M87L157J632L070M843K966J753N396
$$ -3906 1763 -672 -9238 -12671 -11337 -12837 -15295 -14808 -11651 -10019 -6949 -2106 860 2613 8009
515H009P307M85m945j80M188p68n925l290R66l004m422J863M258p56j172N837
$$ 8009 15316 15801 10856 10676 14864 14096 8171 4881 5847 2843 -1579 284 4542 3786 2614 8451
531H451O117j139j125Q552P572m710r228J443O308l003j0790m432Q59j724m928
$$ 8451 14568 13429 12304 20856 28428 23718 14490 15933 22241 19238 8448 4016 4875 3151 -1777
546a777k052J284K079K460L06j637J435O929N365m440p528L63M219k686r042m237
$$ -1777 -3829 -2545 -466 1994 2300 663 2098 9027 14392 9952 2424 2787 7006 4320 -4722 -8959
562h959O87l051p066k886K759K668J37k08Q49J756L759N729K425l456m817J126
$$ -8959 -8272 -11323 -18389 -21275 -18516 -15848 -15711 -15919 -15070 -13314 -9555 -3826 -1401 -4857 -9674 -8548
578h548L187k396o818k741J131j389m991k270L620P034L106l586j927P009J1326
$$ -8548 -5361 -7757 -14575 -17316 -16185 -17574 -22565 -24835 -21215 -14181 -11075 -14661 -16588 -9579 1747
593A747M092n562l036M763M434m911o311J832L667l598q090k184N614O046J853
$$ 1747 5839 277 -2759 2004 6438 1527 -4784 -2952 715 -2883 -10973 -13157 -7543 -1497 356
608C56j091j560K749Q471O595o93l851J515L222l015o763p91L919j156r642o467
$$ 356 -735 -2295 454 8925 15520 14827 10976 12491 15713 12698 5935 5144 9063 7907 -1735 -8202
624h202K644N762K443j625j763K40L221N370L473j909l306J386J313o265p855
$$ -8202 -5558 204 2647 1022 -741 -501 2720 8090 11563 9654 6348 7734 9047 2782 -5073
639e073J359O469m460j4114p176Q029R466k077o868l57O346M762l15j645K865
$$ -5073 -3714 2755 -1705 -15819 -22995 -14966 -5500 -7577 -14445 -14802 -8456 -3694 -4009 -5654 -2789
654b789N188j933r876o101O230O419n718j1852l126N036K566K96K548K072O4J170
$$ -2789 2399 466 -9410 -15511 -9281 -2862 -8580 -20432 -23558 -18522 -15956 -15660 -13112 -11040 -10976 -9806
670i806M710L964O67K452M158k922r190k977Q517O488p035j2276j729Q717N870
$$ -9806 -5096 -1132 -465 1987 6145 3223 -5967 -8944 -427 6061 -974 -13250 -14979 -6262 -392
685c92k845j405N610O166o53k778L147R433N435o193r493k783O354M824l765q758
$$ -392 -3237 -4642 968 7134 6481 3703 6850 16283 21718 15525 6032 3249 9603 14427 10662 1904
701A904l540K190K268j168M49M653M475j168l833M20P213O941q74r295p756J196
$$ 1904 -1636 554 2822 1654 2103 6756 11231 10063 6230 6650 13863 20804 19930 10635 2879 4075
717D075N189p91o902n599l99J43k118p91M242N845N85n076k748M010Q327M063
$$ 4075 9264 8473 1571 -4028 -4427 -4284 -6402 -7193 -2951 2894 3479 -1597 -4345 -335 7992 12055
733A2055n623q625l763K697K996k460o995k189K541m66n340J6J0640Q625n382
$$ 12055 6432 -2193 -5956 -3259 -263 -2723 -9718 -11907 -9366 -9832 -15172 -15156 -4516 4109 -1273
748a273j0411K779J3638O213n860n812j1J579j800l477Q54J959j288n302l158
$$ -1273 -11684 -8905 4733 10946 5086 -726 -737 842 -958 -4435 -3581 -1622 -2910 -8212 -11370
763a1370L572P581N587q5k713q75L026O533N672j350o766k942K158K65l793j827
$$ -11370 -7798 -217 5370 5285 2572 1697 4723 11256 16928 15578 8812 5870 8028 8293 4500 2673
779B673L655J347q213o669O271J2352L617p133m435M708O346R91j748n17j83l103
$$ 2673 6328 7675 -538 -7207 -936 11416 15033 7900 3465 8173 14519 15510 13762 13245 13062 9959
795I959n633k639J443K837q12o247p094P14Q007O213k008m521L06L607J453q06
$$ 9959 4326 1687 3130 5967 5155 -1092 -8186 -7472 535 6748 4740 219 525 4132 5585 4779
811D779J198J631k741p039m570L87L151Q00l535o031l544L262O176M266o79k429
$$ 4779 5977 7608 4867 -2172 -6742 -6355 -3204 -2404 -5939 -11970 -15514 -12252 -6076 -1810 -2489 -4918
827d918M49K593K342l14J008K244j950p607n239K928O956K23p742n477L309N878
$$ -4918 -4469 -1876 466 152 1160 3404 1454 -6153 -11392 -8464 -1508 -1285 -9027 -14504 -11195 -5317
843e317K528N17K480K419l73j655J194N354L269k139o516m820J068L333J863k361
$$ -5317 -2789 -2272 208 2627 2254 599 1793 7147 10416 8277 1761 -3059 -1991 1342 3205 844
859H44l705j943J363L001K997K942K194l92k015J35K688L601N97l261n414m105
$$ 844 -2861 -4804 -3441 -440 2557 5499 7693 7301 5286 5421 8109 11710 12307 9046 3632 -473
875d73m95L236J562m175m628J79K189J370O02L169M143j919m747p08N497L357
$$ -473 -968 2268 3830 -345 -4973 -4794 -2605 -1235 -633 2536 6679 4760 13 -695 4802 8159
891H159k442n575m822o81N96M4j379j429q69j133j327J743N592M344j593m104
$$ 8159 5717 142 -4680 -5361 -4765 -4721 -6100 -7529 -8398 -9531 -10858 -9115 -3523 821 -772 -4876
907d876L1L588K637j036j612j415l549l465O22K575L70k846j780O17J919J681
$$ -4876 -4845 -1257 1380 344 -1268 -2683 -6232 -9697 -9075 -6500 -6130 -8976 -10756 -10139 -8220 -6539
923f539L727L944M06k686j668L824M218m56l287k907o50m02j144L5J395J096k076
$$ -6539 -2812 1132 1538 -1148 -2816 1008 5226 4770 1483 -1424 -2074 -2476 -3620 -3585 -2190 -1094 -3170
940c170k588J936O063M147q10k078Q76K202L62m45J047k43l837m476o44K362M72
$$ -3170 -5758 -3822 2241 6388 5578 3500 4376 6578 6940 6495 7542 7299 3462 -1014 -1658 704 1176
957A176j562j145o34K70J014L164K802Q28j482j204P77J629J80j514k418k236
$$ 1176 -386 -1531 -2165 -1895 -881 2283 5085 5913 4431 3227 4004 5633 5813 4299 1881 -355
973c55k636j414K49M25j33j470j178K22K384L307K061j484o78J131Q62j053o35
$$ -355 -2991 -4405 -4156 -3731 -3864 -5334 -6512 -6290 -3906 -599 1462 -22 -700 431 1293 240 -395
990c95Q27j099l968l232R85K235q88k332L39K015M21M27K881L193K31j024j31
$$ -395 432 -667 -4635 -7867 -6882 -4647 -5535 -7867 -7528 -5513 -5092 -4665 -1784 1409 1640 616 485
1007D85J236J042k29j379k007j578p16K3L1J71Q90J08m89J038L107L058J16o11
$$ 485 1721 2763 2534 1155 -852 -2430 -3146 -3123 -3092 -2921 -2031 -1923 -2412 -1374 1733 4791 4907 4296
1025D296O33J916m86j542M49K82j817l815o43J642N7j631k38J393J280l2J211
$$ 4296 4929 6845 6359 4817 5266 5548 3731 -84 -727 915 972 -659 -897 496 1776 1744 2955
1042B955K192J860n85j250n20J381M0j912k512o61m77j980j854O78J743p66j516
$$ 2955 5147 7007 6422 5172 4652 6033 6073 4161 1649 988 511 -1469 -3323 -2645 -902 -1668 -3184
1059c184O51K653J812k44k17J142L19o90j277n51K82j155k605j838j5P53o68r28
$$ -3184 -2533 120 1932 1688 1471 2613 2932 2242 965 414 696 -459 -3064 -4902 -4917 -4164 -4832 -5760
1077e760O61K188P52l12J037K350J211l75j163O37J134j154k477q13P67o41k312
$$ -5760 -5099 -2911 -2159 -2471 -1434 916 2127 1752 589 1226 2360 1206 -1271 -2084 -1317 -1958 -4270
1094d270j06J562J082p93M8K581K167j51J47J851J092l60j352n0M80j386k002
$$ -4270 -4376 -2814 -1732 -2525 -2477 104 2271 2120 2267 4118 5210 4850 3498 3448 3928 2542 540
1111E40j058N90m70p25l83J307J302O69M0P31J806J117l46p15L26K39q99k500
$$ 540 -518 72 -398 -1123 -1506 -199 1103 1772 1812 2543 4349 5466 5120 4405 4731 4970 4071 1571
1129A571j031M3K99k012j916M19J494N30p56M07J808J307k50l47O17J144p99j354
$$ 1571 540 583 882 -1130 -3046 -2627 -1133 -603 -1359 -952 856 2163 1913 1566 2183 3327 2528 1174
1147A174j277n65k96j241j232q16K89l98j69Q67J502O17n71J524J615M7q53P74
$$ 1174 -103 -668 -964 -2205 -3437 -4253 -3964 -4362 -4531 -3664 -2162 -1545 -2116 -592 1023 1070 217 991
1165I91R41j088k914p06J139L18k254k099J370J916K64o89N67K167J856p33l66
$$ 991 1932 844 -2070 -2776 -1637 -1319 -3573 -5672 -4302 -2386 -2122 -2811 -2244 -77 1779 1046 680
1182F80J040K315j69k144j411J44P46j113j957q10J249P92q56q07K117K170J65
$$ 680 1720 4035 3866 1722 311 455 1201 88 -1869 -2679 -1430 -638 -1494 -2301 -184 1986 2151
1199B151j021J164J354N53n86Q7r00j371o68l6q1j878j498J060O98j19m74L85
$$ 2151 1130 2294 3648 4201 3615 3702 2802 1431 763 727 646 -1232 -2730 -1670 -972 -1091 -1565 -1180
1217a180K303J326j061j070J535K277l44l056j804J316J024k289k633n0J659N2
$$ -1180 1123 2449 1388 318 1853 4130 3786 730 -1074 242 1266 -1023 -3656 -3706 -2047 -1995
1233a995j889p62K227K518J41k230M70K773J376j186k040J96L98n37j266o58m43
$$ -1995 -3884 -4646 -2419 99 240 -1990 -1520 1253 2629 1443 -597 -401 -3 -540 -1806 -2464 -2907
1250b907j71q6j09k95O03J894J276k63l55N58J724J540q31j918p28J047K60j643
$$ -2907 -3078 -3164 -3273 -3568 -2965 -1071 205 -58 -413 145 1869 3409 2578 660 -68 979 1239 -404
1268d04k170K79K158p16k223k06L374K515r63k416Q06L511J843j999k366N47J379
$$ -404 -2574 -2295 -137 -853 -3076 -3282 92 2607 1644 -772 34 3545 5388 3389 1023 1570 2949
1285B949m56k719j344J179J593j984k261M06K677J836j047j244L80K312J038o33
$$ 2949 2493 -226 -1570 -391 1202 -782 -3043 -2637 40 1876 829 -415 -35 2277 3315 2682
1301B682j98o34n32k15o50j101r46M68M90j496k110N38L656J648k084k147J769
$$ 2682 2484 1850 1318 1103 453 -648 -1594 -1126 -636 -2132 -4242 -3704 -48 1600 -484 -2631 -862
1318h62L612L6k126p52J317M34j617k453l76K446O10k956k684J123L430J537j704
$$ -862 2750 2786 660 -92 1225 1659 42 -2411 -2787 -341 269 -2687 -5371 -4248 -818 719 -985
1335i85j254J889K440j78j130K20J296L1k197k039K57J988K32j753j770k43J429
$$ -985 -2239 -350 2090 1912 782 1002 2298 2329 132 -1907 -1650 338 570 -1183 -2953 -3196 -1767
1352a767K066O03p51n11J227J433q1r47Q60J392m23k904k198J413K415m43k762
$$ -1767 299 902 151 -360 867 2300 2219 1272 2132 3524 3101 197 -2001 -588 1827 1384 -1378
1369a378k280J376K696J001j599j94J457J757r31k013J659L111l63m246k602J838
$$ -1378 -3658 -2282 414 1415 -184 -378 1079 2836 1905 -108 1551 4662 4299 53 -2549 -711
1385g11K466n99l109j211J129J033k12l9J291J150J49j471l06J564J675J35j625
$$ -711 1755 1156 -1953 -3164 -2035 -1002 -1214 -1253 38 1188 1337 -134 -440 1124 2799 2934 1309
1402A309k071j067O04J344p9j892j570M27J677p5K8J056J818q1j963r38K612L225
$$ 1309 -762 -1829 -1225 119 40 -1852 -3422 -2995 -1318 -1393 -1365 -309 1509 1428 -535 -1473 1139 4364
1420D364j014m103k016K189J623j149j991N22N63k39j690R68K451K169p78k630
$$ 4364 3350 -753 -2769 -580 1043 -106 -2097 -1575 -1012 -1251 -2941 -1973 478 2647 1869 -761
1436g61l08K391K315o08j733j239j05m67k27O41Q0p66q50j91l10J290K219J319
$$ -761 -1069 1322 3637 3029 1296 57 -48 -515 -742 -101 -21 -787 -1637 -1828 -2138 -848 1371 2690
1454B690j110k222R5K337J877n74k257j408J80N63p32q56P77J047j266k480M44
$$ 2690 1580 -642 -547 1790 3667 3093 836 -572 -392 171 -561 -1417 -640 407 -859 -3339 -2895
1471b895L365K790j571k560k83K160J629m61j165k97K22j675j598M31K453J44
$$ -2895 470 3260 1689 -871 -1154 1006 2635 2174 1009 712 934 -741 -2339 -1908 545 689
1487F89j952k214P36J865K028J98o04p54m26Q70O24R14j2j040j425j089l38R71
$$ 689 -1263 -3477 -2741 -876 1152 1350 746 -8 -434 436 1060 1974 1962 922 -503 -1592 -1930 -959
1505i59R69L07j541j812L68K081K572j86j448m63N76R36j99K34M74m63j720k489
$$ -959 10 317 -1224 -3036 -2668 -587 1985 1799 351 -112 464 1400 1201 1435 1909 1446 -274 -2763
1523b763M98K956J184k479k570O40J989J156q6Q21N51j073r17N05J327J005o02
$$ -2763 -2265 691 1875 -604 -3174 -2534 -545 611 525 1346 1897 824 -93 412 1739 2744 2142
1540B142j823k296K42J010Q73K30r63r40j039R71K073J501l44r80j27k11L4N78
$$ 2142 319 -1977 -1735 -725 148 378 -585 -1525 -2564 -1593 480 1981 1637 657 530 319 353 931
1558I31J214q1k505j929k4K092J186q08k140P3P79O57O49P26J183l96k050m89
$$ 931 2145 2064 -441 -2370 -2394 -302 884 76 -2064 -1991 -1212 -555 94 820 2003 1607 -443 -932
1576i32J741J801k00j890j988k21P62N50j36K79j09r66p34J242K176R16j205j078
$$ -932 809 2610 2410 520 -1468 -1689 -927 -377 -513 -234 -343 -1309 -2043 -801 1375 2291 1086 8
1594HJ63K93M12O49J54j137j622j458Q96J727L59j183o04k2N21K06J190J502J31
$$ 8 171 464 876 1525 1679 542 -1080 -2538 -1642 85 444 -739 -1343 -1365 -844 -638 552 2054 2185
1613B185k001j333J352J301O51j146j643l89k54p5O64O98j01q13j422O41K242
$$ 2185 184 -1149 203 1504 2155 1009 -634 -1023 -1277 -1352 -688 10 -91 -904 -2326 -1685 557
1630E57J537m64j058j19J66m49J15J041K58j563j917K27Q36J036j99o76n66L53
$$ 557 2094 1630 572 453 619 170 285 1326 1584 21 -1896 -1669 -833 203 4 -672 -1238 -885
1648h85N04N83O32J300m36j555r78J431R22P7j417p45l59k22J40Q06Q97n43j613
$$ -885 -381 202 834 2134 1698 143 -835 596 1518 1595 178 -567 -926 -1148 -1008 -202 695 152 -1461
1667a461j66J096J723O12r30m04P6pj78M54O07o20j454j236O96R68O8m53j66N2
$$ -1461 -1627 -531 1192 1804 874 470 546 539 361 815 1422 802 -652 -1888 -1192 -224 -156 -609 -775 -723
1687g23j50P67M00J071M10p39j526M76J055J74r45q30J63p23m56K83J142L48q68
$$ -723 -873 -106 294 1365 1775 1036 -490 -14 1041 1215 270 -560 -397 -1120 -1576 -1293 -151 197 -671
1706f71j035K78J587J125k15l87k15K03n80k62Q83K05j017j656j24J097O15m59
$$ -671 -1706 -1428 159 1284 1069 682 467 670 90 -172 711 916 -101 -1757 -1881 -784 -169 -628
1724f28R1kP2%R1J409R92o86j264q2R49M42p04n28q3m21p66j76J180O05l28j190
$$ -628 -537 -539 -467 -467 -376 1033 2025 1339 75 -7 942 1384 680 152 69 -352 -1118 -1294 -114 491 163 -1027
1746a027K13Q81R87O9m23K28N91j012n86L59N19q8j793m43N40R90l59m34%P90
$$ -1027 -814 67 1054 1123 700 928 1519 507 -79 280 799 711 -1082 -1525 -985 5 -354 -788 -788 2
1766Bk82l7O02J221j75j112n22M10P00l55o93l11L5k75o38L20O94K55l81m14L39
$$ 2 -280 -317 285 1506 1331 219 -303 107 807 452 -241 -552 -517 -792 -1430 -1110 -416 -161 -542 -956 -617
1787f17R34K31l87N01J73m34q13J21O69R4j056p33L18L31J80o33N17J065o00k73
$$ -617 317 548 161 662 835 401 -412 -291 378 472 -584 -1317 -999 -668 -488 -1121 -604 461 -139 -412
1807d12l00J571J302j175j169K76J053m46j006l00Q35J52r35q50J065L93M33n55
$$ -412 -712 859 2161 986 -183 93 1146 700 -306 -606 229 381 -554 -1404 -339 54 487 -68
1825f8n69J117M69k23k02O13m63K31r81Q8M45o39r7j76l6j81J20K05K62L10p96
$$ -68 -637 480 949 726 524 1137 674 905 -76 12 457 -182 -279 -455 -491 -672 -552 -347 -85 225 -571
1846e71N62K55Q78n22q66M13P43L8j553m80Q06P67j152r92K22J494L56r29q42
$$ -571 -9 246 1124 602 -264 149 892 930 -623 -1103 -297 470 -682 -1674 -1452 42 398 -531 -1373
1865a373J270Q29l92p18M70O76L70j441n54Q46k2l7r30J86K21L8P4J91Q4j44K05
$$ -1373 -103 726 334 -384 86 762 1132 -309 -863 -17 -39 -76 -1006 -820 -599 -561 -487 -296 -212 -356 -151
1886a51L78J93k62L71M9j19j55l34l92N34J46r73l73M57R02j20p85L3J130O19
$$ -151 227 420 158 529 578 459 304 -30 -422 112 258 -715 -1088 -631 271 151 -634 -601 529 1148
1906A148l69q52N5J504l5j174j121R09R85p98j330k11J528M97j082n23P46J118
$$ 1148 779 -73 -18 1486 1451 277 -844 65 1050 252 -1078 -1289 239 736 -346 -869 -123 995
1924I95l8r83k83Q68L71l09j93n14p1L64l00m4m36j04K11L77j79n67L74J249N7
$$ 995 957 -26 -309 559 930 621 428 -86 -157 207 -93 -137 -573 -677 -466 -89 -268 -835 -461 788 845
1945H45r33o81N26J462m35j021o92J003P00q04j287K47J335J58j140q65J136J588
$$ 845 -88 -769 -243 1219 784 -237 -929 74 774 -30 -1317 -1070 265 423 -717 -1582 -446 1142
1963A142j79j515k51J370Q76p20j160K00J494q25q33n76N09P53l00n19KN62M66
$$ 1142 963 -552 -803 567 1443 723 -437 -237 1257 432 -401 -977 -468 285 -15 -534 -532 30 496
1982D96K5k84q9r4O34m2r4j02l29L27J10o53l24J54N36N1r04n04J248J433n12
$$ 496 521 237 148 54 688 646 552 450 121 448 558 -95 -419 -265 271 322 -582 -1086 162 1595 1083
2003A083j571R9J479J36m67j371O88J224p60j161n14J516M99r01j380L99J561
$$ 1083 -488 -389 1090 1226 759 -612 76 1300 540 -621 -1135 381 880 -21 -1401 -1002 559
2020E59K90p09r69Q50M44j92j22L9J78j02k42j73l95J85K52J61l18j114P58N71
$$ 559 849 140 -829 21 465 273 151 190 368 266 24 -149 -544 -359 -107 54 -264 -1378 -620 -49
2040d9N31m80j36n55J046P87r07n02R07L85r32j205j58J774O21j020j518N88J339
$$ -49 482 2 -134 -689 357 1144 237 -265 642 1027 95 -1110 -1268 506 1127 107 -1411 -823 516
2059E16J64q35m59J219O19p18j068M43J404j21j175j040R51Q06L0r67J4k53K68
$$ 516 680 -155 -614 605 1224 506 -562 -119 1285 1164 -11 -1051 -100 706 736 -231 -217 -470 -202
2078b02K13M0L15M4j75J8j35l23N38N21j13n07j166J64J071M57j001p51Q4J056
$$ -202 11 51 366 410 235 253 118 -205 333 854 741 234 -932 -768 303 760 -241 -992 -908 148
2098A48Jm17k55R50L20p74j068O68J597J6j309j489J165J070o75m91J64M80k08
$$ 148 149 -268 -523 427 747 -27 -1095 -427 1170 1186 -123 -1612 -447 623 -52 -543 -379 101 -107
2117a07p73J08J005M18m15r74k2Q46L16J63l73k94o07K30j67Q18j89j49k39M3
$$ -107 -880 -772 233 651 236 -738 -760 86 402 565 192 -102 -709 -479 -646 172 -17 -166 -405 -362
2137c62K75j91M85P82n85q59o23Q91J086J69r38j027O10Q23j28r77N80M22k16
$$ -362 -87 -278 207 989 404 -455 -1078 -187 899 1068 130 -897 -287 536 408 -569 11 433 217
2156B17j299J43J221R69m25j408l4R93N32l43n89K49J38p28n22M60R36J27n02
$$ 217 -1082 -939 282 1251 826 -582 -616 377 909 566 -23 226 364 -364 -886 -426 510 637 135
2175A35p97N6M02M37L59r8m28n21q7P27N49m45p84j00mJ30J89K57L21j70j066
$$ 135 -662 -606 -204 233 592 494 66 -455 -542 185 734 289 -495 -595 -599 -469 -280 -23 298 128 -938
2196i38p49J477J373M8j310m12J70M44q2j24P45l15o10p99M42Q95P92r83q03J09
$$ -938 -1687 -210 1163 1211 -99 -511 -341 103 21 -103 642 327 -283 -1082 -640 255 1047 64 -739 -630
2216f30K38L19K45M41l02m70m04QJ042N33o30p17n95O19q6L37N84J90j185n04
$$ -630 -392 -73 172 613 311 -159 -563 -555 487 1020 390 -327 -922 -303 -389 -52 532 722 -463 -967
2236i67L04J114N49p94l78K33L6j59J14N62J47o70q49j51J013J062p10q16m66
$$ -967 -663 451 1000 206 -172 61 97 -62 52 614 761 91 -758 -909 104 1166 456 -360 -826
2255h26N91M78k25L56N52n61p63o65J102J251l78q78k73J2l47L17L73M09k60j181
$$ -826 -235 243 18 374 926 365 -398 -1063 39 1290 912 34 -239 -227 -574 -257 116 525 265 -916
2275i16l50J077P98M33r36m37K92j79J92J11P50k74j026o70P41Q87J30l17o44
$$ -916 -1266 -189 609 1042 106 -331 -39 -218 -26 85 835 561 -465 -1135 -394 493 623 306 -338
2294c38k42J42K47J32R29l8q50o35L28J081K59o43m95p7n3k23N10O89r1o22r43
$$ -338 -580 -438 -191 -59 870 832 -18 -653 -325 756 1015 372 -123 -200 -253 -476 34 723 632 10 -933
2315i33K39J375K57m58o07J08p1J26J16K57Q10j324o59k86J235O31l45m71m2K39
$$ -933 -694 681 938 480 -127 -19 -90 36 152 409 1219 -105 -764 -1050 185 816 471 0 -42 197
2335A97l91K55M84K97l79j111K16N13N93l95l26k2j34l29k13J139K33l13r39j94
$$ 197 -194 61 545 842 463 -648 -432 81 674 279 -47 -69 -203 -532 -745 394 627 314 -625 -819
2355h19Q42K71L98m16j85m29MR4L98P70l77r68p20P84P45J50m48j04p4n32K42
$$ -819 23 294 692 276 91 -338 -334 -240 158 928 551 -417 -1137 -353 392 542 94 -10 -84 -616 -374
2376c74K47R20q7n81p77N5R17K63n43j16j63j62L38l3P13J23p13q92L66N96L85
$$ -374 -127 793 706 125 -652 -597 320 583 40 -76 -239 -401 -63 -96 617 740 27 -865 -499 97 482
2397D82j13j62k8K43p52J39O85K17n37r39k4J003L61k92m98p3L19n50K79N53N03
$$ 482 369 207 179 422 -330 -191 494 711 174 -765 -789 214 575 283 -215 -288 31 -519 -240 313 816
2418H16o25m46m99P46K81j24j23P6k23o11M32M24N35n43q62PR19J72j86j48J69
$$ 816 191 -255 -754 -8 273 149 26 102 -121 -732 -300 124 659 116 -746 -739 180 352 166 18 187
2439A87k9n65k87O56J011o02m29m93M64K65R4m19K75R3k59m40L41P43J22q62n08
$$ 187 158 -407 -694 -38 973 371 -58 -551 -87 178 272 -147 128 221 -38 -478 -137 606 728 -134 -642
2460f42O61K23l2l86L96j53l79j83L96N17o2m27k02k6L12j49PK53o0j76l24L81
$$ -642 19 242 210 -176 220 67 -312 -495 -99 418 356 -71 -273 -299 13 -136 -129 124 64 -112 -436 -55
2482e5L87K46p83k36M63M05l64j37n8N37j73m69j61N23N88m70q18K83L16L10m42
$$ -55 332 578 -205 -441 22 427 63 -74 -132 405 232 -237 -398 125 713 243 -575 -292 24 334 -108
2503a08J07M38k94n77j1M67N81j39o24J4L9K71j65L19j63j31j13n04M21N07k44
$$ -108 -1 437 143 -434 -445 22 603 464 -160 -146 -107 164 -1 318 155 24 -89 -593 -172 335 91
2524I1j44KK40m62nK18O55k32q52n3N50N09l29l16l80O94J03n58m16N82O97o86
$$ 91 -53 -51 189 -273 -278 -60 595 363 -489 -542 8 517 188 -128 -508 186 289 -269 -685 -103 594 -92
2546i2p06M97P69j9o24j12J31N08J38p73p6O76k88m46L34JL50l1m51j46K25K76
$$ -92 -798 -301 468 449 -175 -287 -156 352 490 -283 -359 317 29 -417 -83 -82 268 237 -214 -360 -135 141
2568A41m4K03k43l78M4L46L70m48m09K53M51k00m75p1L78O08m56p45Q4J191l20
$$ 141 97 300 57 -321 -277 69 439 -9 -418 -165 286 86 -389 -460 -82 526 70 -675 -591 600 280
2589B80l49o66O23Q09q23l75L73O21o3p12k50O75M19l20m23q3N59L1n73K98j23
$$ 280 -69 -735 -112 697 -126 -501 -128 493 430 -282 -532 143 562 242 -181 -264 295 326 -247 51 -72
2610g2L41n02lN9L74K9j43n6j00L75k57K86j4j30k24J7M16J50q83j50O79L44j36
$$ -72 269 -233 -236 -177 197 226 83 27 -73 302 45 331 317 187 -37 -20 396 546 -337 -487 192 536 400
2633D00j140M81N81J32p22l63O88M77l28o89L86L71M05r57k80N01N10j43m05m11
$$ 400 -740 -259 322 454 -268 -631 57 534 206 -483 -97 274 679 -278 -558 -57 453 310 -95 -506
2653e06O67J98l60K07m32R1L12m45L34K90N3j05n06K0J38J48J37J77l22l91o0
$$ -506 161 359 -1 206 -226 -135 177 -268 66 356 409 304 -202 -182 -44 104 241 418 96 -295 -355
2674c55L69L15j67o36L99N18l34k75K18L29J33p66l81N50P41o0p94j45N72J32
$$ -355 14 329 162 -474 -75 443 109 -166 52 381 514 -252 -633 -83 658 598 -196 -341 231 363
2694C63m34m87L27P58l56k18n47M72M89m8o38k52J023nm92l28O8L09j05J47N7
$$ 363 -71 -558 -231 527 171 -47 -594 -122 367 319 -319 -571 452 447 -45 -373 -305 4 -101 46 103
2715A03O3j76J37p1m7l26L26L1K93l32m39M06L55J2p45m2N46K53l23n04K76P37
$$ 103 166 -10 127 56 9 -317 9 40 333 1 -438 -32 323 335 -410 -452 94 347 24 -480 -204 533
2737E33k84n07m57P43O49m75o03J01P88Q9o68k52O53K99p35k41N2P88l17m22K75
$$ 533 249 -258 -715 28 677 202 -401 -300 488 577 -91 -343 310 609 -126 -367 -315 473 156 -266 9
2758Irk7P7n7l7j6k59K8J59L7j42O9J93K19k10j51K23K10j10n95K06L37M91n68
$$ 9 0 -27 50 -7 -44 -60 -319 -291 -132 -95 -237 -168 25 244 34 -117 106 316 206 -389 -183 154 645 77
2782G7n46R4P85Q7o25P7M26Pj56j110O13N91J36p63j06Q3P64o12r8N13j00k48
$$ 77 -469 -375 410 497 -128 -51 375 382 226 -884 -271 320 456 -307 -413 -330 434 -178 -276 237 137 -111
2804a11k73RN08L67j14o05O0j45K12p9N14K9k95m14N15L23l51k43L4M49j46l37
$$ -111 -384 -375 133 500 386 -219 -159 -304 -92 -171 343 372 77 -337 178 501 150 -93 -59 390 244 -93
2826i3k0M71j84m4n24P8L61M71n23m31M72L46m41l23O79J39j9r36K1P15L09j58
$$ -93 -113 358 174 130 -394 -316 45 516 -7 -438 34 380 -61 -384 295 434 415 -521 -500 215 524 366
2848C66l37k65L15k42Ol3L58J23n04k23Q34q4J68m29j18J12N5j50k17O39J05n06
$$ 366 29 -236 79 -163 -157 -190 168 291 -213 -436 398 314 482 53 -65 47 102 -48 -265 374 479 -27
$$ [...]
8191A25
##END NTUPLES=NMR FID
##END=
