##TITLE=1H_Lac-B3-f4-A
 PY-d5, 8 sc, 
 18.11.2019
##JCAMPDX= 6.0         $$ Bruker NMR JCAMP-DX V2.0
##DATA TYPE= NMR FID
##DATA CLASS= NTUPLES
##ORIGIN= UXNMR, Bruker Analytische Messtechnik GmbH
##OWNER= root
$$ XWIN-NMR		Version 3.5
$$ Mon Nov 18 14:17:06 2019 Russian Standard Time (UT+4h)  she@DPX200
##.OBSERVE FREQUENCY= 200.1315
##.OBSERVE NUCLEUS= ^1H
##.DELAY= (6, 6)
##.ACQUISITION MODE= SIMULTANEOUS
##.ACQUISITION SCHEME= undefined
##.AVERAGES= 8
##.DIGITISER RES= 18
##SPECTROMETER/DATA SYSTEM= spect
##.PULSE SEQUENCE= zg30
##.SOLVENT NAME= Pyr
##.SHIFT REFERENCE= (INTERNAL, Pyr, 0, 15.7039)
##AUDIT TRAIL= $$ (NUMBER, WHEN, WHO, WHERE, WHAT)
$$ ##TITLE= Audit trail, XWIN-NMR		Version 3.5
$$ ##JCAMPDX= 5.01
$$ ##ORIGIN= Bruker BioSpin GmbH
$$ ##OWNER= she
$$ F:/spectra/data/she/nmr/H-F/1/audita.txt
$$ ##AUDIT TRAIL=  $$ (NUMBER, WHEN, WHO, WHERE, WHAT)
(   1,<2019-11-18 14:16:12.32 +0400>,<she>,<DPX200>,
      <created by zg, POWCHK disabled, PULCHK disabled
       configuration hash MD5:
       00 E9 B6 7A A2 85 ED C7 34 08 36 98 17 FE 4E 26
       data hash MD5: 16K
       58 1D 32 56 00 73 24 F4 56 F6 35 22 FF 6B D9 BB>)
$$ ##END=
$$ 
$$ hash MD5
$$ 6B BB 5D B1 08 0D 0F E1 5E E6 81 76 6E B9 8F 1A
##$RELAX= 
##$RELAX= 
##$RELAX= 
##$RELAX= 
##$RELAX= 
##$RELAX= 
$$ Bruker specific parameters
$$ --------------------------
##$DU= <F:/spectra>
##$EXPNO= 1
##$NAME= <H-F>
##$PROCNO= 1
##$TYPE= <nmr>
##$USER= <she>
##$AMP= (0..31)
100 100 100 100 100 100 100 100 100 100 100 100 100 100 100 100 100 100 
100 100 100 100 100 100 100 100 100 100 100 100 100 100 
##$AQSEQ= 0
##$AQ_mod= 1
##$AUNM= <au_zg>
##$AUTOPOS= <>
##$BF1= 200.13
##$BF2= 200.13
##$BF3= 200.13
##$BF4= 200.13
##$BF5= 200.13
##$BF6= 200.13
##$BF7= 200.13
##$BF8= 200.13
##$BYTORDA= 1
##$CFDGTYP= 0
##$CFRGTYP= 5
##$CHEMSTR= <none>
##$CNST= (0..31)
1 1 145 1 1 1 1 1 1 1 1 1 1 1 1 1 1 1 1 1 1 1 1 1 1 1 1 1 1 1 1 1 
##$CPDPRG= <>
##$CPDPRG1= <>
##$CPDPRG2= <>
##$CPDPRG3= <>
##$CPDPRG4= <mlev>
##$CPDPRG5= <mlev>
##$CPDPRG6= <mlev>
##$CPDPRG7= <mlev>
##$CPDPRG8= <mlev>
##$CPDPRGB= <>
##$CPDPRGT= <>
##$D= (0..31)
0 1.2 0 0 0 0 0 0 0 0.06 0 0.03 0 0 0 0 0.0002 0 0 0 0 0 0 0 0 0 0 0 0 
0 0 0 
##$DATE= 1574072171
##$DBL= (0..7)
120 120 120 120 120 120 120 120 
##$DBP= (0..7)
150 150 150 150 150 150 150 150 
##$DBP07= 0
##$DBPNAM0= <>
##$DBPNAM1= <>
##$DBPNAM2= <>
##$DBPNAM3= <>
##$DBPNAM4= <>
##$DBPNAM5= <>
##$DBPNAM6= <>
##$DBPNAM7= <>
##$DBPOAL= (0..7)
0.5 0.5 0.5 0.5 0.5 0.5 0.5 0.5 
##$DBPOFFS= (0..7)
0 0 0 0 0 0 0 0 
##$DE= 6
##$DECBNUC= <off>
##$DECIM= 24
##$DECNUC= <off>
##$DECSTAT= 4
##$DIGMOD= 1
##$DIGTYP= 9
##$DL= (0..7)
0 120 120 120 120 120 120 120 
##$DP= (0..7)
150 150 150 150 150 150 150 150 
##$DP07= 0
##$DPNAME0= <>
##$DPNAME1= <>
##$DPNAME2= <>
##$DPNAME3= <>
##$DPNAME4= <>
##$DPNAME5= <>
##$DPNAME6= <>
##$DPNAME7= <>
##$DPOAL= (0..7)
0.5 0.5 0.5 0.5 0.5 0.5 0.5 0.5 
##$DPOFFS= (0..7)
0 0 0 0 0 0 0 0 
##$DQDMODE= 0
##$DR= 18
##$DS= 0
##$DSLIST= <SSSSSSSSSSSSSSS>
$$ [...]
##$SUBNAM2= <"">
##$SUBNAM3= <"">
##$SUBNAM4= <"">
##$SUBNAM5= <"">
##$SUBNAM6= <"">
##$SUBNAM7= <"">
##$SUBNAM8= <"">
##$SUBNAM9= <"">
##$SW= 24.0689530833862
##$SWIBOX= (0..15)
0 0 2 0 0 0 0 0 0 0 0 0 0 0 0 0 
##$SW_h= 4816.95568400771
##$TD= 16384
##$TD0= 1
##$TE= 0
##$TE2= 300
##$TE3= 300
##$TEG= 300
##$TL= (0..7)
0 120 120 120 120 120 120 120 
##$TP= (0..7)
150 150 150 150 150 150 150 150 
##$TP07= 0
##$TPNAME0= <>
##$TPNAME1= <>
##$TPNAME2= <>
##$TPNAME3= <>
##$TPNAME4= <>
##$TPNAME5= <>
##$TPNAME6= <>
##$TPNAME7= <>
##$TPOAL= (0..7)
0.5 0.5 0.5 0.5 0.5 0.5 0.5 0.5 
##$TPOFFS= (0..7)
0 0 0 0 0 0 0 0 
##$TUNHIN= 0
##$TUNHOUT= 0
##$TUNXOUT= 0
##$USERA1= <user>
##$USERA2= <user>
##$USERA3= <user>
##$USERA4= <user>
##$USERA5= <user>
##$V9= 5
##$VALIST= <valist>
##$VCLIST= <CCCCCCCCCCCCCCC>
##$VD= 0
##$VDLIST= <DDDDDDDDDDDDDDD>
##$VPLIST= <PPPPPPPPPPPPPPP>
##$VTLIST= <TTTTTTTTTTTTTTT>
##$WBST= 1024
##$WBSW= 4
##$XGAIN= (0..3)
0 0 0 0 
##$XL= 0
##$YL= 0
##$YMAX_a= 481664
##$YMIN_a= -340221
##$ZGOPTNS= <>
##$ZL1= 120
##$ZL2= 120
##$ZL3= 120
##$ZL4= 120
##$ABSF1= 10
##$ABSF2= 0
##$ABSG= 5
##$ABSL= 3
##$ALPHA= 0
##$AQORDER= 0
##$ASSFAC= 0
##$ASSFACI= 0
##$ASSFACX= 0
##$ASSWID= 0
##$AUNMP= <proc_1d>
##$AZFE= 0.1
##$AZFW= 0.1
##$BCFW= 1
##$BC_mod= 2
##$BYTORDP= 1
##$COROFFS= 0
##$CY= 11.3945322036743
##$DATMOD= 1
##$DC= 2
##$DFILT= <>
##$DTYPP= 0
##$F1P= 16.9975609425685
##$F2P= -3.02152046262296
##$FCOR= 0.5
##$FTSIZE= 0
##$FT_mod= 4
##$GAMMA= 1
##$GB= 0.15
##$INTBC= 1
##$INTSCL= 1
##$ISEN= 128
##$LB= 0.24
##$LEV0= 0
##$LPBIN= 0
##$MAXI= 10000
##$MC2= 0
##$MEAN= 0
##$ME_mod= 0
##$MI= 1.114404
##$NCOEF= 0
##$NC_proc= 0
##$NLEV= 6
##$NOISF1= 3.799351
##$NOISF2= 2.8
##$NSP= 1
##$NTH_PI= 0
##$NZP= 0
##$OFFSET= 15.70392
##$PC= 1
##$PHC0= -9427.913
##$PHC1= 10.40087
##$PH_mod= 1
##$PKNL= yes
##$PPARMOD= 0
##$PSCAL= 0
##$PSIGN= 0
##$REVERSE= no
##$SF= 200.130013532006
##$SI= 16384
##$SIGF1= 3
##$SIGF2= 2
##$SINO= 400
##$SIOLD= 16384
##$SREGLST= <1H.CDCl3>
##$SSB= 0
##$STSI= 0
##$STSR= 0
##$SW_p= 3612.71676300578
##$SYMM= 0
##$S_DEV= 0
##$TDeff= 0
##$TDoff= 0
##$TI= <>
##$TILT= no
##$TM1= 0
##$TM2= 0
##$TOPLEV= 0
##$USERP1= <user>
##$USERP2= <user>
##$USERP3= <user>
##$USERP4= <user>
##$USERP5= <user>
##$WDW= 1
##$XDIM= 8192
##$YMAX_p= 0
##$YMIN_p= 0
$$ End of Bruker specific parameters
$$ ---------------------------------
##NTUPLES= NMR FID
##VAR_NAME=  TIME,          FID/REAL,        FID/IMAG
##SYMBOL=    X,             R,               I
##VAR_TYPE=  INDEPENDENT,   DEPENDENT,       DEPENDENT
##VAR_FORM=  AFFN,          ASDF,            ASDF
##VAR_DIM=   8192,          8192,            8192
##UNITS=     SECONDS,       ARBITRARY UNITS, ARBITRARY UNITS
##FACTOR=    0.0002076,     1,               1
##FIRST=     0,             0,               0
##LAST=      1.7004516,     0,               0
##MIN=       0,             -340221,         0
##MAX=       1.7004516,     481664,          0
$$ Real data points
##PAGE= N=1
##DATA TABLE= (X++(R..R)), XYDATA
0 0 0 0 0 0 0 8 -1 8 -8 9 -16 16 -24 32 -33 41 -49 62 -72 86 -100 117 -135 157 -181 206 -237 269 -304 344
30 344 -388 436 -489 549 -613 684 -759 845 -939 1040 -1151 1277 -1412 1562 -1731 1920
46 1920 -2132 2372 -2649 2967 -3340 3786 -4328 5004 -5878 7052 -8722 11311 -15897 26461
60 26461 -104168 80015 171629 -261463 -340221 -56922 79756 -108073 -113772 91623 158976
71 158976 8207 -16625 99351 138287 59775 40286 51398 9789 -45317 -38262 -42429 -64810
83 -64810 -30549 41812 21544 -50276 -19303 103432 135387 52980 4109 52355 88863 53348
95 53348 13545 26515 44197 18424 -16229 -9938 9476 -9778 -49438 -41905 6885 24335 -8253
108 -8253 -27108 975 33157 39927 37854 25647 -15154 -49085 -29859 1004 -21684 -64497 -58636
121 -58636 -35834 -57716 -81700 -45208 -3785 -34321 -82188 -58838 -7221 -9784 -36252 -19110
133 -19110 5573 -16672 -46578 -36840 -24168 -42778 -55379 -46430 -55010 -77888 -60402 -14548 -8210
146 -8210 -35049 -29090 2077 -1516 -20225 7235 48860 25424 -30756 -21909 39637 47841 -16117
159 -16117 -51417 -7994 34591 5995 -38668 -19292 34788 41838 13522 24695 67674 65108
171 65108 22412 22487 66787 70675 21719 1823 32594 46805 20112 508 5783 11004 15388
184 15388 24249 14780 -6234 14457 64884 63022 12744 11721 61947 55378 -12212 -21318 35414
197 35414 31342 -45729 -60092 10880 31753 -34412 -61571 -4351 27774 -16693 -46481 -8081
209 -8081 28364 10640 -13435 -5430 7140 -1069 -13911 -20552 -29521 -36261 -36944 -41752 -50135 -40051
223 -40051 -12997 -4668 -21353 -22877 5954 22559 1024 -17365 2244 26930 10732 -18847
235 -18847 -8582 23191 17232 -22729 -30561 3806 14977 -16966 -29331 8798 40359 25860
247 25860 13969 40978 62417 42836 24845 40211 48237 22495 4833 20517 28677 11502
259 11502 7752 27227 28682 8465 12608 38222 35290 10844 21257 56508 53221 22261 25340
272 25340 55237 48677 10085 -114 15606 5668 -22059 -19025 4354 2065 -15098 -4288 18033
285 18033 12733 -1697 8881 20775 2906 -13985 2510 15988 -8091 -29152 -10292 4455
297 4455 -26332 -55994 -35333 -8849 -28913 -55213 -32022 4726 -3469 -27711 -10901 23685
309 23685 15411 -20573 -25210 -901 2892 -21435 -34234 -23943 -15530 -19323 -21850 -18377 -14967 -11537
323 -11537 -6350 -5140 -4108 8532 23885 19890 5634 13390 34197 26405 -7097 -14489 13512
336 13512 19011 -17023 -32835 2782 30586 6156 -18062 9448 44581 28736 -2505 11713
348 11713 45403 37509 5603 6252 29756 25443 -3880 -13325 -25 3644 -8598 -16468 -14611 -9807
362 -9807 443 12534 9433 -3455 91 16417 13856 -5582 -6208 8404 -588 -32221 -34734 -6938
376 -6938 -2295 -34224 -50208 -27843 -13487 -29836 -36288 -12728 2333 -12775 -22819 -5406 7848
389 7848 -4480 -17079 -13154 -14586 -31173 -37459 -23911 -18002 -28956 -31237 -19580 -17536 -26260 -16777
403 -16777 7181 6668 -16873 -17015 13856 27205 6215 -7842 5536 10963 -8806 -19777 -5620
416 -5620 1204 -14641 -20970 -1715 13100 6334 3082 15640 24074 20345 19348 21228 13751 8593
430 8593 20302 27529 7301 -10626 3666 19842 463 -23514 -8197 17676 5651 -18389
442 -18389 -2268 31892 27547 117 5768 33487 27837 -9044 -18762 5506 14410 -10687 -30599
455 -30599 -21861 -7211 -6830 -11766 -11330 -11600 -13421 -11651 -5993 -587 5119 8711 729 -12280 -9171
470 -9171 6111 3239 -20951 -32130 -16935 -10250 -29533 -37939 -10999 12632 -2690 -24561 -10580
483 -10580 18025 17082 -2721 -490 16748 11182 -9951 -8446 14409 17008 -7537 -20275 -6908
496 -6908 4981 -2386 -7838 2882 12740 11470 11132 18970 24559 25971 28266 26706 14201 6333 13426
511 13426 18335 5476 -4058 9583 18444 1040 -12481 7733 29431 16702 -2801 11089 33123
524 33123 23771 5651 16481 33467 20096 -2739 -235 9538 -1446 -13648 -5142 1763 -11344
537 -11344 -17307 -1087 9161 -2415 -5337 11465 15235 -4298 -9688 10390 18041 -2721 -17887
550 -17887 -7104 -940 -16268 -27058 -15462 -4586 -13526 -24378 -17664 -3300 3422 1038 238
563 238 3240 6403 4779 -203 -2857 545 4369 -504 -12815 -16996 -6820 3719 -2859 -16044
577 -16044 -11303 8602 13628 -331 -874 23316 33830 11024 -4129 18049 36484 11466 -16053
590 -16053 -310 24202 7602 -19586 -5701 23032 15987 -9164 -4559 20550 24626 11051 8322
603 8322 15279 18634 20410 19623 8485 -1627 5255 10577 -6245 -19355 -3879 9912 -9967 -27676
617 -27676 -3749 24047 9872 -16849 -4990 21884 12925 -15291 -13257 10990 11547 -14145 -27253
630 -27253 -13871 -2172 -10843 -25368 -23818 -13372 -13124 -21136 -16975 -606 5284 -5713 -11174 -1243
644 -1243 5387 -2272 -10399 -10365 -10605 -13531 -13915 -15209 -20660 -16772 -2078 -1438 -16574 -17492 2669 10000
660 10000 -3792 -2967 16355 16908 -4135 -4639 16094 15351 -7140 -9235 5288 -731 -18553 -10670
674 -10670 9519 6742 -3988 6802 18277 6255 -1599 18725 32336 12542 -6088 4722
686 4722 18098 7075 -5229 2620 9491 -1236 -14365 -12101 -800 5758 3068 -2906 -1989 7298
700 7298 11902 4381 172 10885 15695 -2074 -19377 -12890 567 -3533 -16245 -18273 -12755 -11503
714 -11503 -14373 -15146 -10271 165 4284 -8615 -20000 -4516 17164 5164 -21405 -13973 11578
727 11578 -1137 -36757 -31089 5897 5815 -29482 -33379 -774 8061 -13586 -15593 8482 16462 -45
741 -45 -7725 342 7564 8702 6078 -3487 -9965 -1261 5811 -8121 -18585 876 19452 2153
755 2153 -19323 -1807 27740 23060 1239 6514 25428 20700 -33 -323 17042 22525 6309
768 6309 -9623 -7578 6815 11628 510 -5299 6983 17516 5035 -5735 9522 29284 20797
781 20797 1287 2342 12705 7630 -1709 1872 4569 -4874 -10631 -6314 -5917 -8983 -987 7807 -2021
796 -2021 -12173 -507 12421 2998 -6334 6685 13938 -4608 -17934 -4907 5541 -8605 -19106
809 -19106 -10536 -6758 -16850 -15575 -1425 693 -8616 -3719 8532 3180 -8344 486 15109 7435
823 7435 -10667 -8831 5012 3374 -9373 -10891 -1768 587 -6047 -9274 -1795 8004 9950 3845
837 3845 2951 12685 19112 10707 1774 8661 17408 9370 -4779 -3178 7621 7099 -2354 -3477 4597
852 4597 9745 7015 2116 2894 12205 21009 14400 1648 5791 21033 16247 -5348 -6620 15076
866 15076 14623 -14558 -22984 4790 18470 -5733 -21488 -15 20307 7356 -10020 -1070 14759
879 14759 10360 -3102 -5621 516 3032 -2462 -11044 -14125 -6930 -1888 -10401 -20262 -11961 3174
893 3174 -685 -14203 -9011 9900 10134 -8858 -13532 4537 13900 -2332 -19800 -14234 653 -1290
907 -1290 -14185 -15604 -3485 -175 -10904 -13867 1066 12447 4714 -5636 -394 9835 7360
920 7360 1009 3184 6402 819 -6256 -5017 -1381 -1421 -1167 -79 -2826 -4644 2897 10818 8108 2216
936 2216 7400 13938 8397 1393 6258 13102 5312 -5275 -2960 3849 73 -7006 -4224 1501 -111
951 -111 -3213 1165 4870 2896 2114 7139 8535 1570 -784 4378 3219 -6235 -9098 -288 1426 -11737
967 -11737 -18844 -8577 2969 -2121 -12120 -7893 3317 3123 -4610 -4242 4765 6242 -3473 -9643 -5307
982 -5307 139 -3335 -10761 -12191 -7374 -6594 -10553 -11427 -3936 3388 1184 -7723 -7505 5216 13831 5302
998 5302 -6713 -4342 7161 5160 -8297 -9163 3273 5101 -9994 -15355 490 11891 741
1011 741 -9897 1750 16707 10139 -3320 1564 16445 15308 -329 -5401 3692 9494 2558 -5932
1025 -5932 -5090 943 2936 -445 -2885 1258 8247 7426 1077 1559 10457 13322 3314 -4325 3678
1040 3678 11850 2857 -11151 -8556 4120 3185 -10076 -12238 239 5635 -3500 -7533 2098 9921
1054 9921 3826 -3766 -749 5685 3245 -3340 -4756 -2152 -3241 -6865 -8051 -6407 -5091 -4075 -3813
1069 -3813 -5509 -4975 -145 4627 3230 -806 832 5500 3968 -1564 -2244 1934 725 -6342 -8516
1084 -8516 -2865 855 -2531 -5047 -1194 2945 3103 2307 4166 6484 6071 6586 6210 3841 2843 5211
1100 5211 5677 -573 -5283 -170 5084 -404 -7132 -1089 9014 6360 -3218 478 13485 13737 805
1115 805 -2120 9080 12496 972 -6980 360 6622 82 -8333 -5741 1867 1827 -3889 -5305 572
1130 572 5223 4012 -179 -460 5317 7937 1572 -6297 -3503 4591 1506 -11217 -12877 -351 4426
1145 4426 -8494 -15532 -2731 9038 154 -12124 -3789 11107 7573 -7126 -6038 7008 7686
1158 7686 -6442 -11501 -1418 4061 -4166 -12043 -7252 1713 1864 -4710 -5350 1499 7564 5028 -1403
1173 -1403 -980 6581 8919 2154 -4422 -974 5759 2540 -6701 -6640 2952 4464 -5130 -8475 2495
1188 2495 10996 4135 -3615 2662 12844 8601 -1241 -225 7438 5764 -2631 -3874 1196 650 -3756
1203 -3756 -2723 433 -1696 -3534 -295 2939 640 614 5483 5462 -284 -1347 5267 5609 -3272 -7456
1219 -7456 -2543 180 -5719 -9184 -4469 -416 -2669 -4997 -3229 -345 1000 1034 33 -1528 -246
1234 -246 2081 418 -4061 -3183 1061 -692 -8107 -9882 -3133 815 -4350 -9599 -4027 5428 5244 -3314
1250 -3314 -4065 6218 10859 727 -7382 1036 9755 611 -11557 -4372 9482 5122 -10744 -9606
1264 -9606 5121 7947 -2166 -4968 4188 9236 4958 887 2858 7085 9190 5171 -3896 -5678
1278 -5678 4132 7731 -3949 -10358 1721 10558 -757 -11173 1478 16690 6840 -9138 -3120
1291 -3120 12239 10167 -2891 -3787 5811 6488 -3058 -7510 -2620 1598 -1150 -6419 -7007 -362 3952
1306 3952 -789 -5812 -301 8885 6133 -4362 -4837 2621 3258 -3082 -4481 -812 -689 -5458 -7643
1321 -7643 -5454 -1698 968 -1540 -6119 -5403 2108 4579 -861 -1056 6474 5671 -5588 -8207 2897
1336 2897 7506 -3045 -8937 -2631 -191 -5527 -3842 4970 4034 -3720 -2363 4016 2854 185 6220
1351 6220 9863 1532 -5579 1102 7222 1115 -4503 422 3541 -2766 -6314 -670 4492 4019 3005
1366 3005 2576 1356 1809 4829 5069 1766 2566 5942 1966 -5626 -4025 4534 4786 -3715 -6258 -1889
1382 -1889 770 -2035 -2426 1297 5801 5443 -1079 -5500 -70 9201 5342 -5986 -6045 3532 597 -12314
1398 -12314 -8563 7784 7211 -11012 -15240 838 8023 -2402 -6418 2467 6448 -977 -5363 -1228
1412 -1228 3037 3904 1108 -6315 -10640 -3766 3317 -2673 -9613 -565 8572 -1688 -13971 -2461
1426 -2461 14968 8122 -9147 -6875 8175 7839 -4699 -5013 5574 6804 -3084 -9258 -5108 1866
1440 1866 3590 -1358 -4827 -69 5916 2996 -3135 2059 11524 7858 -4675 -6031 3981 6248
1454 6248 -1300 -3242 2115 2692 -2194 -4382 -1508 1563 3459 2423 -2224 -3363 3584 7801 1708
1469 1708 -1482 5607 7887 -2831 -9173 -24 6159 -1799 -8433 -2059 2192 -3306 -4748 3002 5169
1484 5169 -1387 -2840 1940 1151 -2756 1243 6422 613 -6228 -2705 2549 -1179 -6309 -2578 1162
1499 1162 -2862 -6716 -3651 1451 2569 1872 984 -671 188 2771 1763 -1820 -1109 3099 877 -6189
1515 -6189 -5370 2392 3408 -3372 -5427 -551 2975 37 -2923 -388 5641 7332 1579 -3928 183
1530 183 7984 4763 -5657 -5373 5565 5024 -7056 -8929 4885 10051 -1730 -8691 1804 9922
1544 9922 2600 -4729 1546 8931 5737 -1861 -2482 2019 5184 3069 -3548 -5658 155 4647 -1168
1559 -1168 -6962 -167 9792 4506 -7210 -3894 9357 9410 -3664 -5545 4770 7647 -2104 -7224
1573 -7224 218 6082 411 -7242 -5828 1278 3215 -1783 -4805 372 5970 3398 -3072 -2102 4794
1588 4794 5229 -2897 -6167 -581 2989 -1432 -5516 -2657 1428 82 -3586 -4063 -484 2170 1161
1603 1161 -2371 -1575 3378 4225 -271 -2685 1577 3526 -1502 -5725 -2644 1470 -1460 -4071 -1085
1618 -1085 1883 61 -1594 1100 2781 878 102 1439 1358 -637 105 2768 1795 -1646 -1810 1097
1634 1097 365 -3447 -3707 -123 1743 -514 -1587 1043 4061 3525 1029 256 2195 2193 -524 -2449 -577
1651 -577 2340 1335 -2340 -3147 288 2480 -688 -3792 -1510 2296 2193 -1767 -1883 3287 6235 1154
1667 1154 -3806 -849 4211 1282 -6244 -5615 1725 2517 -5347 -7283 1273 6207 -193 -6608 -1497
1682 -1497 5861 2838 -4582 -4187 3071 4846 -1219 -5075 -1181 3164 -50 -6450 -5906 -259 1782
1697 1782 -2729 -6090 -1054 5973 3108 -4164 -3652 4556 5383 -3266 -6989 574 5924 -548 -8189
1712 -8189 -3339 5471 3467 -5922 -6449 2338 5165 -1413 -4614 1122 6176 2687 -2563 -637 4312
1727 4312 3968 -1086 -3982 -862 1939 585 -2241 -1841 1243 2644 -52 -2261 1027 4790 3192
1742 3192 -1420 -1661 3490 5124 804 -1574 1269 3133 -92 -3276 -1476 1893 739 -1957 -1794
1757 -1794 1269 2183 1260 1141 1490 957 792 1077 596 -304 768 1891 467 -3071 -2578 1097 1529 -2615
1775 -2615 -4418 -422 3285 570 -2653 -580 3876 2799 -1517 -2122 1214 2156 -1074 -3238 -1441
1790 -1441 1286 95 -3043 -3519 449 2427 -850 -4186 -1970 3279 3101 -1923 -2760 3371 5731 32
1806 32 -5044 -1282 4858 2050 -6105 -5293 2384 4573 -2214 -4616 2170 7038 1362 -5167 -1830 5798
1822 5798 4922 -2089 -3005 3141 5615 530 -3745 -631 4117 1383 -4676 -4780 1824 5441 1010 -3395
1838 -3395 58 5974 4354 -2280 -2238 4383 4886 -2026 -5408 -79 5169 1576 -4323 -2365 3212 2674
1854 2674 -3237 -4435 1034 4637 323 -4148 -562 5038 3998 -1805 -2834 1522 2326 -2244 -4873
1869 -4873 -1684 621 -1002 -2783 -1332 530 725 -313 -1098 -1191 141 621 -888 -2630 -378 2612
1885 2612 1100 -3241 -2409 982 92 -4049 -3399 221 321 -2259 -2100 414 752 727 1336 717 -930
1902 -930 -1224 664 471 -2054 -1426 1925 933 -3257 -2685 1836 2738 -1331 -2921 302 2461 208 -1320
1919 -1320 218 3628 3360 308 -2440 163 3413 1255 -3915 -2947 2437 2979 -2755 -3888 2252 5382
1935 5382 217 -3676 -332 3849 2205 -1757 -1098 2285 3664 73 -3660 -2631 2898 3200 -3268
1950 -3268 -5953 444 4829 -1256 -6205 386 7396 1743 -6704 -3374 5118 3893 -3641 -3626 2167
1965 2167 3135 -2345 -4850 -1325 2702 1438 -3399 -5434 -1051 3770 1522 -3731 -1499 5062 3149
1980 3149 -4732 -4929 3501 5497 -2427 -6060 -260 3460 -525 -3625 -1121 2350 1295 -2055 -3138
1995 -3138 -517 3663 3167 -1575 -2128 2368 4118 -1518 -3652 2156 5334 -1085 -5781 -992 3753
2010 3753 565 -1528 1472 3249 184 -1082 919 1782 1068 2218 2561 -778 -2174 1968 4024 -420
2026 -420 -1820 1531 1361 -3064 -2735 2101 3465 217 -288 1623 748 -158 1949 2893 -667 -2147 1078
2043 1078 863 -2843 -1445 4026 3446 -3084 -4069 927 2104 -1224 -1577 1073 1614 -450 -1561 -498
2059 -498 1492 3267 1879 -3034 -4272 275 2625 -2872 -4426 2507 4949 -3244 -6996 1016 7068
2074 7068 961 -4831 -1476 3108 389 -3258 -914 2625 2776 -125 -3135 -4200 580 4032 -230
2089 -230 -5510 -1256 5277 941 -6136 -1019 8447 4717 -5737 -5566 4139 4746 -2612 -3466 2801 3896
2105 3896 -1217 -4183 -942 2693 3545 -2 -3628 -1625 3441 3042 -2613 -1671 5271 4778 -3818 -5482
2121 -5482 2501 5579 -915 -4614 202 2883 -861 -3448 -49 3044 2263 -406 -2606 -1777 1847
2136 1847 3179 -332 -2559 964 2843 -1675 -4822 405 4586 -246 -5452 -2545 2059 520 -2309
2151 -2309 302 2140 -423 -2606 -1037 867 -320 589 1088 -1342 -3089 -392 1434 -540 -2103
2166 -2103 84 975 -2166 -2870 518 1739 -352 -475 512 -461 -1410 509 1278 -1106 -1558 1072 1160
2183 1160 -3028 -2641 2299 3096 -2038 -3019 354 1828 -1099 -1745 644 2278 1058 -723 -1422 -266
2199 -266 1973 2186 -1661 -3562 844 2978 -1661 -4374 1648 5872 -263 -5728 -583 5120 2088
2214 2088 -3802 -1765 3802 2406 -2169 -2086 1574 3402 1091 -2614 -3031 993 3395 -507 -4381 -385
2230 -385 5049 1889 -4297 -2292 5014 4515 -3546 -4754 2319 4443 -1886 -4907 -98 4247 1487
2245 1487 -3551 -3177 1403 2655 -481 -3814 -719 3861 1779 -3342 -2743 3521 4583 -1844 -4692
2260 -4692 512 3811 -366 -3948 -798 2901 1612 -2316 -2604 1221 3219 791 -1925 -1656 1486
2275 1486 2278 -1012 -2198 1066 3240 -146 -3468 -790 3087 1371 -2638 -1695 1490 1591 -854 -542
2291 -542 1412 1917 201 -283 -167 896 787 435 -121 -808 471 1361 245 -1008 261 1516 819
2308 819 -667 -622 736 1182 678 150 362 973 1182 5 -1194 -705 1174 999 -1327 -1747 1063 2228
2326 2228 -254 -1557 261 2248 1003 -1957 -1388 1592 2574 -554 -2550 -330 2606 1077 -2407
2341 -2407 -2086 1857 2630 -1890 -3468 236 3827 465 -3943 -1291 3335 2560 -2793 -3128 1638 3154
2357 3154 -861 -4244 -1172 3342 1742 -2778 -2891 1530 3130 -901 -3956 -695 3739 1591 -3421
2372 -3421 -2783 2657 3325 -2077 -4250 316 3898 649 -4045 -1698 3578 2684 -2649 -3561 1361 3785
2388 3785 -691 -3819 -434 3692 1858 -2689 -2501 2127 3059 -952 -3073 -183 2978 807 -2681
2403 -2681 -1671 2251 2569 -1265 -2580 301 2308 716 -2212 -1320 2002 1861 -918 -2112 773 2256
2419 2256 -187 -2647 -1146 1445 696 -1950 -1396 858 1697 -155 -1154 -159 1079 265 -965 -784 -36
2436 -36 503 46 -429 -301 -318 85 218 -554 -1125 230 625 -72 -1361 -198 1026 447 -775 -1023 747
2455 747 1139 -496 -1766 -762 1078 571 -1279 -1492 597 1673 -117 -1734 -676 1641 1378 -1726
2471 -1726 -1924 1173 2412 84 -2743 -603 2761 1670 -2458 -2490 1681 2875 -1226 -3298 203 3843
2487 3843 1154 -3051 -1588 3082 2487 -2026 -3044 879 3155 -55 -2856 -1008 3048 2546 -1920
2502 -1920 -2488 1307 3612 248 -3308 -1214 3249 2333 -2462 -2640 2124 3484 -977 -3639 -80 3990
2518 3990 963 -3454 -1703 2598 2612 -1606 -3097 688 3523 367 -3189 -1407 2846 2539 -2044 -2852
2534 -2852 1547 3070 -718 -3078 -455 2703 1051 -2177 -1641 1467 1400 -826 -1611 85 1571 648
2550 648 -1342 -1703 731 1926 186 -2078 -1058 2138 1471 -1907 -1398 1634 1503 -1374 -1802 769
2566 769 1809 -184 -847 334 450 -127 63 375 -398 -191 787 600 -1158 -720 973 1401 -683 -1392
2584 -1392 301 1326 157 -895 108 1281 905 -187 -792 -275 1193 1081 -1082 -1255 1187 1703
2600 1703 -1160 -2094 697 2934 257 -2559 -671 1970 1217 -1159 -1289 747 1554 -34 -2146 -1220
2616 -1220 1989 2658 -1377 -3554 187 3346 265 -3753 -1038 3950 1565 -4059 -2750 3039 3049 -2352
2632 -2352 -3051 982 2621 -508 -2513 -377 2109 1745 -963 -2990 -595 2900 1649 -2817 -2610 2298
2648 2298 2983 -2646 -4134 1772 4531 -750 -4230 -579 3345 765 -2832 -948 2305 1649 -1484
2663 -1484 -2427 -230 2464 1639 -1561 -2649 1035 2588 -519 -2724 608 3803 315 -4188 -1139
2678 -1139 3529 1782 -1943 -1240 1277 523 -1738 -690 1023 1338 390 -413 -1664 -1051 1579 2025 -1048
2695 -1048 -1788 1376 1318 -1708 -2011 1882 2501 -808 -2685 360 1217 -506 -64 1330 189 -1330 -10
2712 -10 709 -632 -656 1752 1255 -2148 -2170 1026 1961 -342 -870 973 674 -1219 -1328 60 1015 935 168
2731 168 -1242 -1795 562 2396 176 -2026 622 2364 -1327 -3901 -70 4299 1115 -3364 -1646
2746 -1646 1971 811 -1488 -500 1606 1403 -585 -2039 -1275 1245 2939 464 -3136 -1344 2856 1020
2762 1020 -3606 -1559 4420 2954 -4079 -4508 2682 3990 -1103 -2886 700 2686 -646 -2559 -300
2777 -300 2230 2213 -313 -2672 -1550 2083 2422 -1537 -2329 1584 3058 -2243 -4513 1341 5161 217
2793 217 -4398 -1096 3110 1099 -2230 -728 2225 1576 -958 -2388 -801 2025 2110 -419 -2596 55
2809 55 2162 -83 -3050 90 3851 1145 -3461 -1938 2555 2203 -1778 -967 1574 601 -1468 -1336
2825 -1336 726 738 449 82 -1186 -1382 748 1480 -585 -1276 924 1517 -1493 -2032 857 2468 -354
2842 -354 -1839 -188 813 -594 -344 1049 783 -696 -130 837 -816 -831 1317 1769 -958 -2285 539
2859 539 1381 -439 -1091 727 941 -692 -1231 -494 447 608 662 -880 -1397 223 1660 104 -1948 552
2877 552 2598 153 -3435 -1136 3029 1572 -2200 -1724 1565 1531 -1390 -1812 349 2179 561 -1747
2893 -1747 -1554 748 2389 263 -2685 -842 2685 1508 -2967 -2288 3128 2995 -2254 -3590 1155 3713
2909 3713 -570 -2800 173 3073 764 -2131 -1601 1412 2611 -19 -2381 -1213 1964 1852 -1715
2924 -1715 -2371 1492 3303 -1159 -3850 198 4124 885 -3261 -950 2926 1649 -2275 -1938 1278
2939 1278 2382 -91 -2184 -634 1677 1408 -950 -1778 311 2375 -42 -2310 -518 2289 1443 -1768
2955 -1768 -1728 1147 1982 -1075 -1916 94 1220 -28 -1451 -579 614 1166 -177 -928 -255 930 692
2972 692 -983 -732 602 1209 -379 -1077 -124 1089 141 -815 -410 396 76 -73 -223 17 418 498 292
2991 292 -651 -516 713 1057 -249 -1274 228 1315 161 -1144 -561 920 1101 -903 -1022 216 1470
3008 1470 723 -1128 -1064 1081 1442 -715 -1548 200 2057 138 -2045 -1114 1981 1473 -1011 -1976 660
3025 660 2589 141 -1911 -690 2063 1514 -1541 -1842 986 2581 -118 -2747 -257 2575 1248 -2154
3041 -2154 -2254 1748 2517 -1044 -2870 278 2770 586 -2788 -1215 2248 1652 -1908 -2264 548 2674
3057 2674 42 -2434 -1301 1986 1710 -2031 -2109 774 2280 -174 -2875 -672 2698 1128 -2463 -1678
3073 -1678 1777 1963 -958 -2674 128 2348 228 -2507 -1201 2005 1719 -950 -1765 624 2122 58
3089 58 -1509 -676 1743 1155 -1124 -1140 501 1369 5 -1532 -335 952 728 -906 -732 549 1438
3106 1438 13 -831 -58 958 488 -388 -220 540 683 -235 -377 -275 156 245 -122 -477 4 364 662
3125 662 54 -656 -27 636 288 -305 -385 330 1047 -202 -1231 -316 1002 618 -819 -936 694 1250 -332
3144 -332 -1396 -295 1456 918 -1222 -1179 974 1499 -516 -1841 -533 1901 548 -2157 -1460 1267
3160 1267 1794 -1030 -2124 362 2116 455 -1993 -989 2136 1319 -1559 -2318 967 2424 215 -2368
3176 -2368 -1051 2091 1509 -1751 -2327 1316 2621 -561 -2500 -89 2943 1298 -2440 -1521 1903 2206
3192 2206 -1139 -2436 225 2349 352 -2295 -1042 2137 2247 -1236 -2386 391 2391 403 -2358
3207 -2358 -779 2733 1559 -2087 -1595 1209 2379 -513 -2289 -161 2022 927 -1777 -1455 1067
3222 1067 1882 -295 -2026 -300 1669 831 -1610 -1339 1396 1502 -1012 -1680 93 1411 -486 -1337
3238 -1337 -512 957 377 -426 -784 -217 649 368 -652 -736 166 957 12 -914 -587 431 -78 -1002 -260
3257 -260 894 126 -681 -412 -252 83 307 401 -232 -539 57 1103 -521 -1457 556 1561 -207 -2113
3275 -2113 -651 1420 696 -1288 -550 616 981 129 -594 -23 936 838 -482 -1539 -209 2072 1052
3292 1052 -1601 -1069 1669 1155 -1973 -2145 1863 2272 -1434 -2183 -17 2262 343 -1461 -399 1517
3308 1517 1196 -1103 -1608 -16 2267 1036 -1952 -1989 1546 1842 -1359 -2694 1003 3158 -479 -3460
3324 -3460 -567 2624 1116 -1927 -1309 1103 948 -1283 -1688 105 1615 687 -1681 -2192 250 2431
3340 2431 29 -2538 -340 2607 499 -2922 -1299 3026 1791 -2081 -1910 1243 1404 -802 -1316 452
3356 452 984 -86 -993 -924 154 1548 1159 -1085 -1209 912 1312 -691 -1444 1079 2020 -628 -2234
3373 -2234 272 1862 445 -755 -166 603 -150 -434 456 773 408 626 130 -1190 -382 1218 1368 -744
3391 -744 -525 857 453 -1139 -566 983 1115 -740 -503 89 -606 30 1434 549 -784 -185 1502 -114
3409 -114 -2023 61 2405 431 -2327 -1490 1337 1082 -1227 -263 781 375 -558 -840 337 715 906
3426 906 -60 -1486 -1058 1188 1383 -1417 -1187 1601 1856 -2256 -2594 1763 2937 -590 -2561 -22 2179
3443 2179 71 -1904 -233 1526 1232 -988 -1950 -648 1454 1690 -1110 -2084 644 2048 -874 -2824
3459 -2824 615 3631 -21 -3308 -1008 2490 1348 -1735 -808 1426 911 -1178 -1398 -358 1249 1369
3475 1369 -454 -1938 -407 1804 574 -2216 -727 2845 1257 -3061 -1986 2290 2002 -1428 -1676
3490 -1676 605 1380 -908 -1333 330 1171 143 -692 -892 -59 970 1124 -440 -1234 225 848 -619
3507 -619 -1647 453 2017 -352 -1933 -646 1038 224 -794 -144 290 -343 -316 100 134 -12 637 622
3525 622 -986 -1350 277 856 -895 -855 707 425 -871 -1154 314 681 -31 -10 -444 -738 -134 1037
3543 1037 193 -1181 -317 1199 144 -2233 -779 1896 1065 -1815 -1307 731 821 -886 -847 562 1229
3560 1229 -71 -1127 -1092 647 1241 121 -1463 -853 1172 1124 -1311 -1517 1457 2073 -1170 -2692 831
3577 831 2307 274 -2146 -424 1901 879 -1237 -1302 933 1772 -188 -1807 -895 1558 1399 -1153
3593 -1153 -1919 1135 2429 -383 -2428 -177 2930 1045 -2459 -1255 2063 1385 -1279 -1616 297 1454
3609 1454 -374 -1518 -569 1304 1575 -384 -1188 216 2136 336 -1994 -500 1858 1342 -1331 -1882
3625 -1882 1040 1869 -547 -1714 107 1599 24 -1615 -441 1214 705 -416 -923 212 1084 573
3641 573 -377 -775 442 784 -447 -1151 298 1152 247 -648 -243 709 527 -287 -339 515 404 86 -289
3660 -289 -217 387 873 324 -210 -237 130 502 -38 -530 35 779 280 -435 -171 140 527 192 -220 -222 431
3681 431 1013 -202 -709 337 1244 362 -943 -663 865 1182 -560 -1316 341 1326 58 -1219 -342
3698 -342 1412 589 -871 -1232 602 1454 -103 -1377 -574 1535 988 -1411 -1547 1058 1727 -444 -1919
3715 -1919 5 2105 1082 -1540 -1217 1592 1502 -1094 -2239 218 1997 -33 -2275 -1116 1759 1311
3731 1311 -1131 -1612 575 1944 -246 -2182 -258 1609 977 -1931 -1612 1127 1939 -731 -1943 -217
3747 -217 1533 399 -2014 -1146 1158 1360 -611 -1838 -49 2139 164 -1645 -880 1095 1023 -1122
3763 -1122 -1213 260 1448 -262 -1614 -425 1192 896 -1050 -882 623 1122 -118 -955 95 925 558
3780 558 -560 -714 329 659 21 -971 -132 841 449 -368 -391 318 568 -33 -603 -222 655 197 -447 -539
3800 -539 -17 337 -173 -470 -416 -229 36 -55 -584 -327 227 411 -327 -734 -7 515 391 -772 -725 368
3820 368 557 -358 -1217 -593 664 544 -1167 -993 488 899 -797 -1549 -149 982 213 -1223 -686 882
3838 882 883 -1104 -1257 89 1276 41 -1435 -711 1253 973 -975 -1763 598 1682 197 -1511 -572
3855 -572 1724 909 -1562 -1118 1210 1593 -408 -1597 222 1609 591 -1856 -1205 1340 1703 -760
3871 -760 -1867 164 2017 617 -1756 -455 1803 1275 -1569 -1199 934 1654 -86 -1563 -102 1261
3887 1261 914 -980 -823 718 1352 -276 -1376 -368 1415 766 -1221 -1242 1103 1411 -788 -1721 456
3904 456 1637 324 -1129 -449 1104 667 -536 -422 -106 660 301 -442 -323 517 819 38 -1069 -293
3922 -293 886 737 -722 -432 749 666 -371 -329 321 610 -138 -216 102 -95 340 211 -21 -451 466 449
3942 449 -230 -703 -256 900 450 -577 -277 691 413 -136 -225 405 613 508 -343 -285 275 937 636 -581
3962 -581 -459 946 831 -712 -755 1111 1537 -108 -1736 10 1611 382 -1241 -327 660 635 -701
3979 -701 -841 19 955 789 -1174 -1406 600 1531 -415 -1771 206 1912 254 -2205 -800 2066 998
3996 998 -1778 -1532 834 1196 -908 -1340 -90 950 145 -1199 -1456 560 1662 207 -1561 -1024 1697
4013 1697 352 -1883 -1441 1934 1740 -1558 -1977 601 1540 -592 -1554 -27 930 -74 -797 -446 272
4030 272 913 280 -978 -1064 990 1585 -569 -1372 554 1582 -582 -2315 194 2130 319 -1369 -416
4047 -416 844 287 -795 -23 574 221 -144 -266 -820 46 1062 675 -655 -1070 717 655 -860 -556
4065 -556 1148 1029 -707 -997 437 576 -427 41 272 -556 -707 156 241 -1001 4 788 -37 -1367
4083 -1367 -764 799 647 -870 -519 479 365 -734 -298 184 527 165 43 -925 -763 644 936 -667
4101 -667 -1105 939 982 -1211 -1576 898 1942 -528 -1939 46 1321 -144 -989 -181 1188 407 -482
4118 -482 -954 -479 1063 780 -245 -1330 179 1598 122 -1834 -129 2376 615 -2302 -1407 1952
4134 1952 1438 -1406 -1219 1107 715 -696 -1311 246 1159 524 -750 -1283 -217 1458 890 -1332 -962
4151 -962 1604 1210 -1693 -1467 1810 2112 -1032 -2209 508 1747 -29 -1381 -39 1300 233 -906
4167 -906 -634 15 965 817 -585 -1160 193 1328 -188 -1128 408 1870 -51 -1519 -200 1470 470
4184 470 -924 -594 741 227 -532 165 361 546 354 148 -672 -460 858 728 -458 -757 707 445
4202 445 -461 -484 1093 1115 -343 -357 267 37 224 237 606 -105 -360 431 205 -520 68 1427 641 -1117
4222 -1117 -1018 959 674 -383 -766 341 318 -325 -460 2 452 449 34 -360 -564 853 982 -684 -722 735
4242 735 1390 -460 -1606 562 2235 169 -1443 -391 1239 642 -1131 -640 767 1125 191 -1085
4258 -1085 -565 933 954 -711 -1514 518 1343 177 -1591 -630 1994 1075 -1785 -1353 1268 1722 -660
4275 -660 -1342 809 1348 -33 -1731 -639 1011 758 -502 -1094 281 1199 523 -1094 -900 1283 999
4292 999 -1045 -1581 590 1466 -447 -1727 -267 1275 408 -1118 -540 782 949 -398 -791 178 915
4309 915 322 -789 -1060 495 657 -486 -1184 25 960 167 -1197 -715 741 652 -714 -760 189 576
4327 576 12 -569 -253 100 311 -28 -516 -255 526 438 -348 -593 174 403 -192 -445 -237 574 16 -445
4347 -445 198 151 274 155 -190 -533 -69 232 -366 -633 -392 535 449 -602 -728 276 949 -248 -892 -102
4367 -102 768 401 -597 -398 287 944 70 -1205 -68 910 614 -696 -847 490 1225 24 -1274 -185
4385 -185 1272 675 -1305 -564 888 1235 -373 -1234 231 1287 245 -1396 -966 1065 849 -832 -1327
4402 -1327 212 1483 11 -1879 -228 1368 771 -1162 -1369 665 1641 -528 -1636 57 1092 418
4418 418 -965 -927 544 1210 -796 -1369 226 1482 491 -1214 -541 986 1066 -810 -1171 311 1515
4435 1515 85 -1055 -288 1134 641 -566 -976 611 1382 -70 -1223 -538 997 734 -690 -726 490
4452 490 737 -190 -827 36 800 341 -794 -422 441 745 -452 -667 -363 870 327 -482 -324 264 489
4471 489 -97 -537 -45 472 44 -211 60 229 305 151 -239 -132 121 285 158 -278 -33 197 456 49
4491 49 -420 163 378 526 -401 -130 464 688 -315 -625 13 836 86 -775 -418 991 914 -251 -749 458
4511 458 1068 -97 -710 -550 794 735 -397 -789 457 1143 88 -1146 -161 1057 921 -850 -978 696
4529 696 1296 -359 -958 73 996 448 -1080 -746 708 1098 -415 -1300 -55 1872 550 -1377 -692
4546 -692 1019 959 -787 -1522 688 1538 -287 -1275 -179 1147 664 -913 -756 446 868 -505 -1130
4563 -1130 -319 853 462 -859 -1262 674 1219 -172 -1180 55 1550 238 -1351 -926 971 697
4579 697 -928 -942 106 863 183 -812 -555 660 663 -340 -677 163 1025 244 -769 -538 521 294 -549
4598 -549 -513 303 78 -68 -495 26 267 -36 -312 -153 -170 -129 214 -207 -701 108 665 373 -621 -244 372
4619 372 216 -611 -60 295 266 -273 -57 -167 -75 165 304 -497 -525 450 300 -593 -983 420 919 -797
4639 -797 -952 164 1133 -52 -948 -420 523 5 -506 -184 605 429 285 -600 -644 160 842 14 -1522
4658 -1522 -296 1227 473 -1658 -542 1395 1007 -1156 -948 1013 920 -127 -849 81 612 364 -839
4675 -839 -870 223 1276 209 -1447 -904 1035 1199 -989 -897 1051 1301 -865 -1522 609 1558 201
4692 201 -1370 -606 877 322 -807 -586 342 582 192 -725 -628 395 1060 -292 -1362 -124 1221 47
4710 47 -1580 -239 1464 588 -1387 -863 656 430 -399 -198 359 218 -341 -648 -169 74 924 306 -545
4729 -545 -489 594 398 -626 -570 704 549 -873 -958 493 731 61 -348 209 172 -192 77 387 -171 101
4749 101 556 6 -868 -458 860 596 -902 -501 454 192 -504 -205 684 310 -402 -127 48 -160 33
4768 33 622 -167 -455 179 1123 -229 -1158 765 1240 -339 -1829 -202 1041 426 -945 -295 601 388
4786 388 -686 -250 90 468 349 -268 -844 112 1089 128 -969 -146 1172 279 -1137 -1126 1641 1315 -570
4805 -570 -1063 394 1000 -312 -903 169 685 405 -681 -924 104 861 251 -1259 -624 737 1009 -633
4823 -633 -1055 811 1521 -710 -1596 -24 1573 430 -1264 -77 626 509 -526 -625 127 792 221 -355
4841 -355 -813 171 1082 130 -1132 -57 1448 241 -1509 -483 1424 735 -1109 -828 468 497 -564
4858 -564 -159 380 370 -79 -285 -570 -75 469 347 -385 -281 697 393 -623 -591 376 747 -431 -1153 117
4878 117 696 0 -211 151 237 -91 -14 -64 -7 27 494 366 -569 -674 348 615 -318 -358 305 587 -463
4899 -463 -406 53 352 54 -281 -396 -171 271 474 -82 -574 402 802 -121 -678 -45 1262 406 -1063 -396
4919 -396 1168 637 -381 -534 558 556 -366 -395 -184 504 726 -624 -665 51 956 368 -891 -235 1144
4938 1144 615 -841 -788 651 1339 -450 -979 -31 1218 -25 -958 -320 442 522 -581 -1262 -75 1031
4956 1031 277 -1239 -715 827 834 -457 -1018 391 1105 -83 -1401 -508 1060 624 -724 -527 455 656
4974 656 -275 -653 -6 524 489 -263 -712 187 871 -162 -992 -26 1019 446 -774 -732 781 598 -484
4993 -484 -756 219 468 -73 -544 -319 459 239 -62 -376 105 360 258 -238 -321 186 643 -97 -596 -63
5013 -63 546 118 -464 -213 330 87 177 -248 -11 41 56 -80 -121 303 298 1 -407 -271 280 334 -164 -577 -73
5036 -73 317 -295 -457 101 374 706 -93 -598 -398 440 551 -278 -330 253 747 -213 -618 -432 1084 388
5056 388 -709 -502 558 730 -369 -652 -99 1021 194 -567 -495 1104 794 -477 -685 62 885 147
5074 147 -906 -297 603 706 -450 -345 564 1013 -99 -1021 -191 906 479 -701 -746 140 977 -189
5092 -189 -1299 -138 1289 571 -936 -739 884 975 -231 -903 -40 990 30 -944 -564 1055 480 -551
5110 -551 -842 299 1091 149 -912 -541 861 945 -374 -480 335 1153 164 -947 25 940 310 -752
5128 -752 -372 429 666 -70 -838 36 696 60 -761 -468 378 512 -215 -336 115 342 -109 -430 -346 -214
5148 -214 333 -121 -159 -384 514 -10 -183 -132 267 703 -68 -272 -76 153 301 -251 -286 39 533 53 -203
5169 -203 -341 -136 127 -206 -481 77 452 498 9 -469 324 342 81 -341 -87 691 512 -288 -377 89 460
5190 460 288 -646 -184 831 593 -752 -942 432 688 -255 -901 -46 661 339 -632 -498 467 480 -188
5209 -188 -1012 0 676 289 -816 -797 693 766 -186 -1010 164 1131 321 -886 -328 851 417 -452 -795
5228 -795 132 626 -340 -915 -490 1024 467 -443 -943 574 866 -100 -832 -253 1045 420 -732 -651 741
5247 741 532 -309 -516 147 730 -19 -684 -401 508 559 -149 -846 179 665 458 -597 -538 561 471 -350
5267 -350 -799 502 629 -360 -680 -38 658 359 -51 -65 6 135 -137 -52 -2 8 473 134 -694 145 654
5288 654 145 -526 -1 372 234 -317 -394 181 68 207 23 -41 14 329 107 -358 -240 184 206 -341 -291 -29
5310 -29 713 -67 -777 98 335 365 -294 -254 168 484 -19 -476 -253 -32 306 117 -738 -16 817 511 -820
5331 -820 -534 756 992 -508 -988 486 907 -356 -817 -261 678 24 -494 -648 163 525 55 -696 -378
5350 -378 819 809 -499 -959 639 1197 -207 -1004 287 1587 323 -1054 -561 1099 473 -498 -373
5367 -373 198 386 142 -552 -472 387 689 -248 -566 -97 1149 235 -989 -371 1287 568 -981 -747 505
5386 505 539 -430 -610 -8 367 -176 -119 -305 85 621 269 -715 -539 456 899 -249 -731 306 145 -607
5406 -607 -1017 -46 911 38 -884 -73 372 196 -199 189 4 114 61 -87 -334 -486 715 478 -516 -573
5426 -573 701 255 -325 -305 546 343 -290 -380 254 484 -239 102 227 -160 55 279 254 -389 -66 551 -152
5447 -152 -1205 -287 1031 252 -482 -371 911 111 -494 -233 -93 308 -52 -152 -380 169 378 370 -618 -269
5467 -269 894 712 -683 -728 823 1029 -559 -1139 51 677 -106 -829 -309 656 19 -430 -563 99 612
5486 612 355 -476 -526 244 1043 -574 -652 300 1141 -284 -1497 -441 971 541 -681 -199 263 383 -620
5505 -620 -239 36 187 123 -282 -281 293 449 97 -1016 -186 910 106 -952 -505 773 735 -815 -818 444
5525 444 449 -139 -574 233 659 -209 -276 -58 200 509 197 -513 -403 222 544 -317 -696 20 523 -128 -647
5546 -647 11 856 160 -493 75 189 57 -218 -80 51 -53 -19 214 -311 -158 548 471 -451 -414 403 306
5567 306 -518 -152 614 529 -276 -384 86 15 282 -12 -189 -252 -86 137 -132 -690 287 547 240 -743 -361
5588 -361 872 443 -430 -502 213 196 -55 -459 -96 299 660 -271 -299 -36 353 292 -612 -324 454 521 -549
5609 -549 -818 306 753 -262 -797 -78 652 163 -624 -180 670 485 -208 -664 -29 665 292 -342 -423 570
5629 570 860 -97 -877 -42 929 84 -996 -228 1006 623 -799 -857 330 648 -74 -611 -35 734 83
5648 83 -416 -277 226 619 66 -680 -62 776 208 -585 -660 486 611 -580 -708 160 839 -30 -634 -69
5668 -69 760 179 -35 -586 329 303 182 -94 -382 413 213 -121 -669 143 469 136 -413 -80 440 82 -444
5689 -444 -352 -5 502 -20 -144 -87 202 282 -87 -119 -22 89 428 -33 -473 144 109 -191 -26 -63 446 427 -147
5712 -147 -95 -72 426 188 -120 -320 122 429 -379 -355 52 567 73 -491 -386 22 393 -422 -466 -137 312
5733 312 168 -534 -325 337 358 -361 -908 -250 607 165 -741 -391 609 402 -538 -641 379 705 83 -676
5753 -676 -357 350 430 -650 -644 366 711 123 -593 -118 863 402 -337 -454 317 734 -217 -658 156 583
5773 583 -12 -962 -392 922 617 -381 -708 98 997 -154 -583 -354 760 601 -411 -648 49 861 -120
5792 -120 -528 -127 838 402 -528 -456 258 708 30 -770 28 709 451 -531 -412 313 451 -396 -734 -41
5812 -41 431 80 -679 41 511 346 -93 -323 56 201 75 -354 -388 109 426 -160 -514 -58 233 85 -218
5833 -218 -199 0 372 57 -297 -62 395 275 -204 -271 205 251 139 -365 -292 194 378 10 -271 -357 290 334
5855 334 -74 -431 74 -34 241 -349 -8 293 359 -310 -471 275 331 -40 -331 -28 645 269 -558 -216 219
5876 219 226 -63 -495 -18 664 250 -387 -440 603 719 -466 -652 65 617 21 -775 -235 594 357 -540
5896 -540 -710 -79 380 110 -359 -168 417 466 -37 -819 113 781 151 -856 -420 819 190 -739 -672 399
5916 399 1085 -64 -500 144 628 281 -596 -122 367 439 -67 -521 -79 528 240 -614 -211 365 509 -23
5936 -23 -631 0 612 -250 -1087 -139 571 335 -526 -214 220 376 -162 -203 -291 454 367 -356 -145 -131 375 75
5958 75 -286 -211 353 187 -456 -171 292 379 -112 -295 74 179 1 -62 170 -214 162 275 67 -274 274
5979 274 550 -139 -458 -7 445 68 -226 -271 90 -45 125 -179 152 137 318 230 -651 107 485 288 -296
6000 -296 -392 300 514 -367 -687 551 998 34 -859 190 455 319 -312 -299 246 396 62 -406 -126 294
6020 294 584 -91 -797 89 823 -152 -1006 -47 641 261 -741 -636 835 540 -111 -608 -35 366 68
6039 68 -218 -348 360 631 102 -764 -302 473 525 -868 -323 649 593 -728 -596 649 922 -180 -758 65
6059 65 339 53 -233 -303 213 347 -139 -553 -361 282 392 -393 -545 266 637 -197 -621 245 894 -71 -835
6080 -835 -108 425 501 -455 -146 265 36 -97 67 -122 10 57 0 -369 -124 148 402 -115 -216 361 334
6101 334 -546 -428 160 510 314 -215 169 71 108 -61 60 -128 96 362 -342 -435 -325 458 146 -326 -100
6122 -100 560 243 -299 -226 -16 323 -127 -41 230 -366 266 149 -144 -362 318 506 -239 -438 368 645 -281
6143 -281 -727 189 871 26 -663 -14 289 27 -384 -167 -52 249 388 -594 -294 -45 690 25 -684 -34
6163 -34 671 167 -988 -312 916 351 -643 -533 458 379 -115 -240 227 348 -21 -521 -236 319 535 367
6183 367 -591 -463 736 729 -731 -660 541 739 -575 -801 60 793 135 -655 -5 597 76 -408 -88 475
6203 475 232 232 -463 -469 355 408 -223 -414 -245 689 -40 -829 -368 597 613 -471 -126 361 341 -155 -123 74
6225 74 437 -52 -31 -101 107 150 -18 -233 -451 182 605 -236 -407 283 196 -344 -441 -134 154 129 -348 -75
6247 -75 86 -290 271 53 -257 -2 -6 146 -567 -77 453 554 -90 -452 284 314 1 -167 -78 139 100 -204
6269 -204 -278 155 234 41 -496 -448 199 413 -192 -531 270 362 -74 -470 31 357 108 -695 -243 164 91 -262
6291 -262 -478 215 132 302 -84 -325 621 622 77 -396 -32 581 292 -627 -348 778 426 -471 -512 187 340
6312 340 42 -354 -195 476 425 -263 -636 203 754 28 -434 -273 497 270 -409 -1066 99 635 -432 -362
6332 -362 9 487 315 -359 -438 275 129 -110 -354 -357 328 -103 -381 -405 394 258 -205 -634 171 443 234
6353 234 -454 34 433 248 -312 -472 105 229 -14 -599 -70 188 217 -121 -265 77 84 -268 -55 -551 134
6374 134 305 -306 -365 271 262 9 -143 -194 330 -31 -200 157 -82 -50 240 -2 -154 144 360 123 -382 -40
6396 -40 226 328 -109 -672 266 264 -131 -235 -188 282 357 -245 -114 -68 260 -28 28 -121 167 414 -286 -521
6418 -521 143 612 22 -422 -83 342 429 -417 -402 405 625 359 -924 -81 471 82 -357 -279 305 658 -30
6439 -30 -693 -32 546 431 -475 -490 296 752 -280 -571 152 668 371 -367 -595 398 373 -56 -463 -19 509
6460 509 128 -324 -113 453 169 -286 -684 42 231 -100 -546 -196 595 300 -471 -523 -93 613 -117 -507
6480 -507 -301 176 334 -133 -246 390 359 -225 -658 51 701 54 -267 -233 14 590 -9 -394 220 416 363
6501 363 -136 -52 208 566 4 -260 -203 141 111 -345 -212 -184 209 76 -314 -92 214 657 -202 -166 350 508
6523 508 -243 91 -98 56 356 -91 -51 -29 425 -105 -238 97 201 252 -229 -347 87 282 155 -524 -588
6544 -588 7 235 23 -124 -442 465 274 -146 -308 26 493 -105 -99 112 505 202 -318 -211 495 506 -233
6565 -233 -351 -265 395 178 -390 -444 301 515 -422 -483 -217 883 -32 -509 -420 394 457 -211 -485 374 483
6586 483 -143 -445 -279 391 124 -28 -206 293 384 65 -426 170 579 337 -184 -355 351 568 -543 -570
6606 -570 48 506 223 -423 -556 409 408 -529 -308 101 202 347 -347 -212 295 248 -264 -586 -63 303 241
6627 241 -504 -393 494 303 -251 -411 437 616 -48 -232 -182 169 -264 -277 -127 -385 103 32 -262 -121 -162
6648 -162 427 -133 -198 176 152 76 -273 -253 254 186 -67 -327 40 39 -229 -201 -317 -157 233 188 -91 -151 324
6671 324 356 -367 -454 22 332 -286 -407 -43 308 201 -57 -148 37 10 54 -178 -67 405 306 -238 -522 -85
6693 -85 612 239 -555 -216 405 454 -496 10 293 479 -121 -607 -32 139 58 -339 -128 31 259 -22 -738
6714 -738 -84 502 331 -303 -409 231 542 -138 -509 493 601 153 -672 -175 570 135 -329 -43 186 67
6734 67 71 -319 -86 187 296 82 -356 -154 522 96 -564 -130 299 380 -691 -350 707 366 -55 22 347
6755 347 252 -211 -79 -365 -106 211 -75 -342 -299 360 589 -337 -110 307 496 -170 -452 375 450 103 -624
6776 -624 174 125 21 122 117 -148 30 287 230 -353 98 356 51 -283 -418 352 245 -239 -222 340 438 -194
6798 -194 -224 212 248 82 64 -323 -46 -68 317 73 -44 100 192 -11 -431 28 554 240 -331 -37 485 -65
6820 -65 -397 -174 170 -5 171 -188 -376 173 394 8 -339 -6 334 77 -487 -186 492 375 -508 -712
6840 -712 202 693 -120 -712 192 326 83 -130 -222 114 353 262 -512 -315 635 526 -349 -570 149 566 -130
6861 -130 -730 -153 534 32 -334 -294 196 196 -215 -192 8 17 158 -410 -520 -72 527 170 -530 -60 525 120
6883 120 -374 -413 708 533 -531 -508 330 658 84 -512 -20 263 130 -232 -107 -284 135 263 -165 -558
6903 -558 101 617 -420 -464 262 385 195 -315 -102 453 50 -44 -11 159 26 -191 -166 -49 152 -60 63
6924 63 -242 240 343 289 -68 -260 151 219 -136 21 141 396 200 -405 -176 142 92 37 -210 -62 -340 279
6946 279 -329 -324 31 442 -190 -395 -294 232 449 -140 -327 51 71 30 -82 81 434 -123 40 -237 -42
6967 -42 355 57 -422 -193 238 289 -429 -278 373 587 -143 -695 98 434 120 -456 -224 443 247 -125 -170
6988 -170 252 711 7 -266 -324 495 327 -291 -681 132 666 169 -671 -178 260 208 -213 -171 341 151 -257
7009 -257 -496 236 451 68 -194 -288 94 628 -245 -599 -81 463 194 -247 -194 235 369 -329 -127 89 370
7030 370 -104 -701 -308 550 175 -378 -371 -191 578 -116 -401 -44 241 366 202 -212 -8 399 123 -119 -51
7051 -51 41 99 -57 -106 -108 337 -31 -117 -138 -182 342 -183 -78 -125 -80 -3 183 3 12 209 72 -360 -321 109 -29
7076 -29 -487 -237 106 380 44 -67 -58 -72 201 -168 -353 -210 193 -128 -296 -275 94 262 -128 -262 81 333
7098 333 -140 -366 13 409 192 -198 -495 311 457 -36 -216 -38 487 -70 -65 -449 63 184 73 -436 -116
7119 -116 679 258 -82 -221 201 293 -282 -204 133 391 61 -344 -396 411 217 -45 -315 2 474 129 -585
7140 -585 -494 468 172 -166 -344 218 601 8 -377 -71 36 357 -492 -411 58 379 148 -452 -6 354 220
7161 220 -394 -422 308 568 160 -416 -100 356 328 -267 -124 284 300 -116 -268 233 296 187 -121 112 326
7182 326 200 52 -106 -44 343 -31 -247 -301 -38 130 10 -96 240 183 185 -91 -54 248 27 338 -156 28
7204 28 -5 305 -9 -134 126 79 310 -109 -92 99 -79 -126 -201 -248 292 13 5 -210 -93 359 367 -384 -53 237
7228 237 100 -399 -305 145 144 28 -418 -66 102 -63 -310 -119 277 135 -330 -297 -304 215 -259 -471 -329 276
7250 276 485 -328 -550 227 482 -74 -506 41 328 106 -330 -420 222 197 148 -416 -63 24 83 -273 -375 38
7272 38 152 67 -585 -375 369 97 -422 -201 517 341 -103 -377 -60 320 189 -283 -156 240 214 107 -216
7293 -216 -70 -36 18 -379 -131 200 342 -198 -374 212 376 29 -122 -215 634 6 -361 -187 100 134 1
7314 1 -42 -273 176 282 -49 -219 -237 350 -194 -234 -42 324 -176 -220 -328 -115 333 223 -243 199 9 -212
7336 -212 129 -328 -263 192 96 -378 -375 -145 598 22 -429 -492 261 194 -103 64 430 129 -115 -115 -3 331 213
7359 213 -291 49 71 512 272 -212 -188 166 508 -104 -467 269 595 4 -305 -76 276 -230 -260 -87 61
7380 61 367 226 -154 -159 332 426 -100 -500 -195 647 193 -644 104 662 -262 -384 -156 193 237 -183 -312 174
7402 174 265 85 -48 -129 316 69 -253 -197 -18 549 193 -442 -351 412 571 -543 -468 406 361 -325 -261 55
7424 55 10 -193 21 -137 88 414 -160 -402 -154 374 378 -144 -370 142 241 75 -374 246 550 264 -241 6
7446 6 560 336 -58 -45 -36 -227 -56 -114 -10 36 259 259 -437 -284 532 346 -184 -208 48 -19 -261 -203 164 -111
7470 -111 -237 -310 -192 -43 -1 404 -13 -141 64 141 -107 -492 120 325 -32 -395 -32 203 40 -477 -113
7491 -113 164 328 108 25 101 187 152 -72 -121 -276 59 144 -129 -170 271 258 -529 -208 201 431 70 -585 -33
7514 -33 348 6 -95 -40 112 -145 130 -144 -11 6 343 220 -324 136 273 -272 -417 -73 563 72 -421
7535 -421 -215 359 366 -157 -496 77 116 73 -180 -72 61 34 57 -429 -6 323 412 -459 -268 199 208 -214 -192
7558 -192 178 511 -359 -456 26 307 233 -145 -142 268 125 144 -82 29 -160 165 -134 -429 -5 588 104 -348
7580 -348 -251 331 300 -372 -302 172 226 -34 -107 -47 265 122 -79 -32 123 319 -90 -353 -48 204 451 -177
7602 -177 -564 59 450 -239 -471 101 -2 124 -42 -72 29 -255 -137 236 -49 -128 63 -44 -562 82 296
7623 296 124 -403 -103 189 123 142 -569 125 208 26 -251 -124 -147 207 -57 -107 -30 244 150 -422 -522 221
7645 221 257 -145 -344 -232 204 205 -307 -152 359 246 -353 70 193 396 88 -178 -369 187 145 -156 -308
7666 -308 -112 125 -264 -565 -197 330 148 -404 -263 445 359 -259 -338 -39 123 39 -444 -491 316 456 3
7687 3 -390 -275 356 164 -390 -349 -5 436 82 -240 -51 338 60 -195 -538 32 169 41 -82 113 320
7708 320 30 -528 -229 17 399 -350 -477 12 443 103 -153 -186 126 87 -205 -108 97 380 9 -102 -322
7729 -322 32 -113 -65 -162 233 56 -21 -43 -20 255 281 -132 -87 -102 53 10 -63 -12 7 -55 -196 -256 -116 302 252
7754 252 -203 68 109 472 42 -80 -214 150 -101 -197 -218 -76 324 168 -184 151 286 443 -67 -145 -59 -118
7776 -118 69 -258 15 290 -17 -87 -405 -11 504 130 -136 -60 578 84 -363 -85 390 161 -197 -188 -149 253
7798 253 -73 -164 -420 126 237 67 -153 -100 1 -98 -53 -235 -14 302 -206 -284 140 195 -72 -430 -57 237
7820 237 180 -165 -1 45 386 225 -214 -262 197 214 -133 -408 48 142 -226 -424 91 359 42 -390 -99 76
7842 76 328 -142 -504 -154 229 87 -269 -460 -109 152 100 -344 -283 183 331 -206 -176 171 182 19 -227 -69
7864 -69 86 72 117 -138 -72 152 6 -143 -4 397 47 -94 -69 -5 44 3 -188 -257 409 -74 -210 86 270
7887 270 140 -220 -153 -9 128 247 -82 149 187 224 -178 -581 -414 296 413 -91 -212 135 458 58 235
7908 235 6 189 -8 155 97 211 505 20 -307 -240 239 286 -127 -100 -263 409 20 -529 -302 376 314 -225
7930 -225 -383 47 174 91 -371 49 279 349 -252 -286 216 203 152 -343 -56 419 415 -508 -45 317 258 -45 -217
7953 -217 87 278 -217 -258 -87 141 149 -379 -382 133 348 170 -314 -122 383 500 132 -168 -121 71 190 -526
7975 -526 -53 417 88 -59 -257 269 218 -2 -126 -218 425 222 141 -251 91 297 262 -123 -175 218 184 -69
7997 -69 -369 206 502 -135 -237 -212 69 323 76 -200 -15 49 38 -54 -335 36 -2 -239 -599 211 143 -23
8019 -23 -171 -108 454 145 -184 -84 185 -163 220 -60 -193 157 292 225 -174 -236 56 105 -398 -152 274 334
8041 334 -112 -125 227 324 -125 -129 1 161 85 10 -47 -177 293 383 -334 -156 81 303 129 -232 113 486 365
8064 365 -678 -227 646 217 -195 -375 192 266 -150 -227 -129 240 49 74 -691 -56 182 221 -452 -414 368 392
8086 392 -139 -277 353 471 -226 -399 -54 324 -155 -72 -7 79 233 47 -325 -184 173 307 -261 -70 168
8107 168 546 69 -495 137 17 357 -474 -236 320 357 -124 -105 119 -43 -191 -243 3 -44 0 97 -254 -215
8129 -215 124 87 -182 -279 210 267 -204 -269 157 458 -310 -114 -2 -292 180 -149 70 -176 18 22 37 -51 50
8152 50 345 245 -510 -203 411 139 -168 -116 507 -70 -208 99 74 79 86 80 -234 8 -77 301 -436 -198 280
8175 280 312 -49 -541 2 134 -201 -243 48 298 -18 -318 -3 60 110 9 -348
8191c48
$$ Imaginary data points
##PAGE= N=2
##DATA TABLE= (X++(I..I)), XYDATA
0 0 0 0 0 -8 8 -8 8 -15 16 -16 24 -32 40 -48 56 -72 82 -98 117 -137 162 -187 217 -249 288 -330 376 -426
28 -426 483 -546 614 -690 772 -865 964 -1075 1195 -1326 1471 -1630 1807 -1999 2212 -2451
44 -2451 2715 -3012 3349 -3733 4174 -4687 5292 -6025 6923 -8064 9562 -11626 14669 -19612
58 -19612 29017 -53333 246072 481664 -90362 -188053 73795 175131 -103618 -165543 16239
69 16239 81125 -82139 -80984 82710 160790 85724 79828 122958 112450 64363 78264 80716
81 80716 47711 39547 63395 8189 -78694 -61649 36751 37142 -61091 -95550 -15140 44039 20199
94 20199 -6368 25301 55656 33600 -1173 2217 12911 -16164 -61267 -60585 -25899 -28343 -74284
107 -74284 -92970 -57622 -22732 -25088 -36109 -41126 -54246 -54667 -13462 26864 9288 -30459 -22572
120 -22572 3028 -17955 -49303 -28279 -4079 -45681 -93311 -63301 -5860 -9171 -37627 -18210
132 -18210 16841 6332 -11923 11707 38822 26290 12309 22361 19247 -1440 6479 35547
144 35547 22919 -20626 -25222 4005 2719 -14947 9405 47174 29036 -10962 13725 79508
156 79508 80933 15206 -11527 35902 66837 21612 -32373 -17381 25879 15415 -29217 -30052 4455
169 4455 -216 -38187 -29860 21669 30079 -11931 -21337 19471 33872 -1396 -27837 -22521 -20410
182 -20410 -30443 -37666 -51971 -70386 -55561 -18448 -27726 -74832 -69704 -13549 -8709 -60887 -56402
195 -56402 9478 13111 -54578 -62157 7020 17234 -59801 -92906 -36955 -11347 -64397 -93904
207 -93904 -47150 -6530 -25777 -47254 -25824 1568 1449 -5387 -1702 1295 375 1726 -480 -8314
221 -8314 -4355 8865 2991 -22461 -28991 -4837 8101 -10998 -20368 9584 41387 33106 13937
234 13937 32344 65123 54956 14794 7281 37198 39658 -402 -17509 14862 35351 8877
246 8877 -12278 10357 30187 10753 -3596 19033 37485 21033 10896 32730 44045 23371
258 23371 10385 19972 12186 -17177 -23252 -6379 -13927 -39519 -29677 4046 3057 -24235 -15412 20467
272 20467 18981 -13888 -16121 9383 7179 -18068 -16168 3982 -4932 -31274 -30170 -14593 -24754
285 -24754 -43314 -33315 -14838 -22469 -28380 -2227 21473 7672 -5428 17599 34343 5936 -20808
298 -20808 395 23561 -1262 -30654 -10862 20823 6482 -21470 -5028 29304 22404 -6580
310 -6580 2691 40109 50631 30026 23545 40555 48938 37637 25718 22277 18602 13319 10850 8507
324 8507 7490 16176 27289 24185 14698 26496 48643 44610 18875 20055 50025 52671 16369 268
338 268 29970 44871 7773 -24552 -3093 23218 594 -31305 -13302 23807 18346 -9431 -932
351 -932 29566 28160 797 -4589 12469 14122 -5556 -17403 -16469 -14530 -13669 -12815 -21694 -34174 -28924
366 -28924 -9723 -7352 -19551 -13176 8993 8427 -12178 -7422 21248 21638 -13728 -30500 -8499
379 -8499 2317 -19736 -31814 -12575 -1100 -17690 -25944 -4192 13877 5379 -2538 9211 18717
392 18717 11142 10016 24581 27908 11811 2095 7498 5126 -8207 -6676 8071 3680 -17280 -11284
406 -11284 22014 35084 13552 3141 22357 33252 16918 7285 21235 26253 5982 -6042
418 -6042 6846 12646 -4520 -17524 -9860 -4165 -10931 -13054 -6616 -4642 -2755 11364 19272 3695
432 3695 -10287 3608 16433 -6209 -32304 -21170 -1553 -19249 -46894 -33794 -4591 -13335
444 -13335 -41878 -33991 -2832 -4409 -32764 -30577 3535 14412 -10876 -27714 -13328 869 -7402
457 -7402 -22556 -28367 -30420 -33114 -31185 -24676 -18798 -14111 -10404 -12482 -15020 -4008 14219 13100
471 13100 -6792 -12104 5841 12910 -6478 -16397 3418 16158 -8445 -33471 -18902 9219 5282
484 5282 -14899 -9409 14224 15706 1884 9836 33710 33437 6837 -4934 9758 18431 3859
497 3859 -8844 -3751 1430 -5748 -10515 -4356 1569 1908 3238 4620 335 -26 12009 19858 8952
512 8952 -812 7883 12315 -8155 -24101 -9832 4190 -14696 -37316 -23283 -258 -8362 -24181
525 -24181 -10128 11158 1854 -16318 -7326 9352 2173 -10984 -4118 1538 -13496 -23853 -12165
538 -12165 -6005 -20970 -27262 -12256 -6308 -20440 -19388 6365 17983 1173 -7724 9307 20324
551 20324 6321 -3446 7298 14744 832 -12728 -7264 4617 4837 -2722 -4403 972 6994 9187
565 9187 10375 14851 22989 28370 24239 15218 14369 23631 27502 14408 -1387 721 15136 13912 -3114
580 -3114 -4862 16012 24044 2975 -5955 20128 39477 17677 -4605 15622 40464 21652 -7540
593 -7540 3164 26478 11425 -20315 -17074 6281 5233 -13299 -14968 -1496 5452 6226 6935 2220
607 2220 -1279 7801 14749 975 -10885 1811 11261 -10082 -28797 -9275 11897 -8453 -36910
620 -36910 -22204 7121 348 -22995 -13014 17619 19575 -4363 -10779 8891 20025 6182 -10182
633 -10182 -8830 516 -2251 -12486 -10557 2358 4211 -7416 -10040 4217 14308 9148 4839 11113
647 11113 16962 16374 15836 15478 10788 10623 16676 10759 -7030 -10905 6828 11621 -3719 -4719 14851
662 14851 18081 701 4077 27444 28279 6140 3778 20040 15538 -3711 270 16306 7450 -11507
676 -11507 -7761 1708 -10086 -18452 380 13152 -4940 -19186 -757 17805 8089 -4596 2711
689 2711 9244 -4207 -17991 -14606 -5056 -5956 -15430 -23425 -22300 -13774 -10121 -15695 -16924 -5134 1348
704 1348 -10672 -19677 -6051 10988 5357 -9883 -12291 -6378 -7536 -13785 -16999 -14234 -9648 -9976
718 -9976 -20395 -25019 -6334 14686 4936 -16752 -4932 22754 13812 -16735 -8140 27357 22280
731 22280 -17607 -21925 10031 15168 -12906 -18218 5353 11118 -7277 -11793 4309 15905 15395
744 15395 12212 7447 5014 13388 19000 5282 -6185 7622 18803 -3421 -25743 -8529 17516
757 17516 7193 -17671 -11149 10877 8246 -8344 -3504 17510 20090 2084 -10762 -4156 8923
770 8923 7355 -8541 -17607 -9095 -3302 -16427 -26471 -10597 6753 -3869 -21435 -14789 2912
783 2912 2487 -5690 -1232 4378 -4143 -10782 -5935 -5144 -10847 -9262 -6078 -16321 -25802 -14190 -217
798 -217 -7443 -15433 -1578 9245 -3850 -12227 5748 18400 4716 -7272 1728 6847 -4181
811 -4181 -7051 3398 2581 -9751 -8546 3492 353 -8470 2529 18871 12996 -1299 5208 22566
825 22566 20947 6862 5159 13911 12965 2019 -2792 2458 8181 4919 -3271 -3355 6248 12230 5083
840 5083 18 9611 19941 13186 1498 5755 16790 13714 1164 -2481 3599 3565 -3978 -10740 -9050
855 -9050 -1166 3568 -2906 -11503 -3746 11933 9683 -7795 -5656 15675 14951 -12367 -18343 7840
869 7840 16378 -12101 -28913 -7870 9780 -7521 -25476 -13119 5625 1554 -9970 -7114 4994
882 4994 9299 4171 -1806 -1388 5158 7525 -2709 -12739 -5601 5476 -1370 -15636 -10176 7716
896 7716 6891 -9923 -9439 12200 21648 5431 -6915 4926 21296 16990 1329 -1077 9173 9332
910 9332 -3957 -7944 4306 11932 672 -9426 -1139 11967 10834 4708 8731 14410 10263 4835
924 4835 7967 12154 9142 4694 2718 -1386 -4842 -889 3415 -1682 -8676 -3692 3827 1110 -3732
939 -3732 3092 11168 5252 -3033 1161 8944 4249 -5643 -4445 -469 -5102 -11646 -9519 -5787 -9188
954 -9188 -10246 -5079 -2324 -6567 -6477 1390 3623 -2743 -3559 5441 6246 -6639 -12768 -2551 5139 -4600
970 -4600 -16704 -12766 -1624 -2885 -10784 -8494 2200 4671 -2917 -4737 4306 10967 7675 83
984 83 229 4417 3728 -2337 -4525 -220 2906 -2469 -10775 -7841 4938 11304 2345 -6510 571 14164
1000 14164 13373 1558 1370 13156 12847 -2894 -8558 5655 12453 -3122 -14903 -4343 8860
1013 8860 930 -11834 -4355 11745 9762 -4255 -5573 7893 13494 4266 -4103 -2317 3051 1711
1027 1711 -4991 -9028 -6315 -2767 -5326 -11807 -10176 -726 2323 -6001 -9420 1226 10196 1809 -9345
1042 -9345 -4248 8219 4279 -10366 -12651 -1454 1028 -10557 -15479 -5842 1299 -5427 -11762 -5102
1056 -5102 4333 3159 -1657 -195 4574 4658 1096 -344 966 1079 -839 -3493 -5704 -5723 -2140 1200
1072 1200 -1237 -4327 -1316 5248 5495 1956 3847 8912 9129 2946 1495 6624 8210 1864 -3022
1087 -3022 -1132 1448 -918 -3353 -1781 197 549 1507 3437 3410 3948 7252 8352 3270 202 4594
1103 4594 7411 627 -6989 -2678 4070 -1149 -11690 -8199 3865 2555 -8958 -8642 4455 9349
1117 9349 -945 -6265 3277 9594 2038 -6745 -3863 3026 9 -8683 -10034 -5081 -1744 -4458 -8009
1132 -8009 -6451 -96 3207 -1092 -5122 329 9156 6184 -4688 -4837 7269 9031 -5316 -12756
1146 -12756 -865 7818 -3313 -15270 -5667 9021 4902 -8415 -4117 11230 12228 -752 -3004
1159 -3004 8695 13509 3511 -4658 767 8048 4467 -4091 -5583 1001 4879 271 -4696 -2128 6079
1174 6079 9278 3348 -530 5108 11787 8024 -1234 -591 7095 6635 -4481 -8130 917 6609 -2649
1189 -2649 -10639 -3670 6464 2559 -6772 -2683 6917 6428 -1230 -967 5378 4543 -1546 -2185 107 -2990
1205 -2990 -6736 -5018 -2568 -5191 -6174 -1948 -832 -4553 -3600 3610 5202 -1905 -4143 2817 6205
1220 6205 -275 -4385 -89 2072 -2434 -6617 -5020 -2687 -2302 -3013 -3328 -2626 456 3605 3460 1227
1236 1227 3188 7256 5735 -1217 -1555 4693 6281 -1134 -6336 -1531 5441 2931 -6274 -5888 4622
1251 4622 8843 -442 -5674 5077 13919 5530 -4742 3057 15492 7891 -8766 -6859 7191 7077
1265 7077 -5927 -9123 25 4701 -976 -4274 -302 4597 5888 2046 -3539 -2072 7304 9071 -2002
1280 -2002 -8641 1769 8445 -4453 -15400 -3495 8751 -2770 -17454 -9301 8093 5452 -7742
1293 -7742 -5884 6155 6934 -2861 -5810 362 4267 -610 -6584 -6502 -1187 608 -5455 -9957 -3908
1308 -3908 3523 -2 -8803 -6556 3540 6107 124 -1002 4233 4275 -631 -2463 209 2226 1506
1323 1506 -2723 -7468 -5539 1484 3089 -2443 -2949 4092 4835 -3577 -3262 8926 12955 914 -4560
1338 -4560 2669 6524 -38 -1158 4839 2218 -6552 -5972 1553 1377 -2009 2671 6533 -755 -5245
1353 -5245 3578 10594 4181 -2559 2487 5466 -1270 -5323 -106 3782 -95 -4070 -4654 -4662 -3507 -153
1369 -153 977 -1504 -345 3675 1479 -4155 -1113 6948 5225 -4498 -7363 -1728 201 -3732 -5534
1384 -5534 -2266 370 -1622 -7134 -8360 -1004 7159 3841 -6535 -4603 6214 5005 -5996 -3045
1398 -3045 10701 7166 -12134 -14976 2526 8288 -4382 -10211 86 4662 -2597 -5440 1800 6990
1412 6990 5698 2042 -2283 -3178 3622 9289 2379 -5088 976 7652 -2501 -13262 -1673 13709
1426 13709 4522 -12544 -7279 10906 10542 -2305 -1522 9410 9781 -1055 -5971 749 6985 5171
1440 5171 -1862 -5319 -906 3368 260 -5690 -741 7414 3232 -7214 -5435 6834 9455 799
1454 799 -1481 3730 4242 -1636 -3949 -814 1313 -121 -2783 -6711 -6069 659 4416 -1341 -4710 2371
1470 2371 5732 -3104 -7260 2789 9773 340 -7267 -838 4017 -2134 -5780 354 1724 -5926 -7287
1485 -7287 -877 650 -2544 978 6234 1418 -4314 622 6871 2816 -3107 69 3714 -980 -5308
1500 -5308 -1814 2508 1458 -1132 -1883 -2418 -831 2496 2354 -27 1579 5684 4475 -1490 -6 6739
1516 6739 6235 -2064 -4865 631 3077 -1073 -4488 -1300 3963 3774 -1532 -4462 1144 8215 4777
1531 4777 -3687 -2040 8322 7441 -4736 -6246 6367 9196 -4674 -11557 -451 7027 -1576 -8391
1545 -8391 -1255 6993 2934 -4169 -2698 4041 6193 2425 -3181 -4022 1966 4767 -1419 -7650 -1703
1560 -1703 5862 -964 -12103 -7070 6475 5355 -7523 -7985 4488 7879 -2236 -6336 2364 7375
1574 7375 -5 -7599 -4371 2153 2382 -3889 -6814 -1644 2682 -715 -6507 -3448 3901 3707 -3127
1589 -3127 -4127 2516 6302 1168 -2786 -60 3150 618 -4228 -4245 -853 1059 -1202 -3616 -2205
1604 -2205 2362 3296 -382 -2295 2165 5021 639 -3065 1030 5003 1854 -2271 -435 2441 -445
1619 -445 -3398 -1321 532 -1114 -2475 70 1305 475 1256 3963 3223 -94 -118 2321 1518 -2199 -2715
1636 -2715 934 1556 -1891 -3271 -886 1578 95 -2507 -2468 119 1332 -321 -955 1746 3973 2515
1652 2515 -1030 -1620 1231 1670 -2422 -5023 -3211 339 -276 -3996 -3400 1813 4285 -930 -4808 -673
1668 -673 4772 2165 -4491 -2847 4699 4672 -3745 -5285 1651 5272 -2749 -8947 -2718 4493 1097 -5780
1684 -5780 -3458 4942 5881 -563 -3173 1976 5675 1707 -3942 -3050 2844 3491 -1901 -4876 11 4979
1700 4979 1348 -5407 -3986 4634 5409 -2538 -4507 3617 9048 1982 -4680 680 8236 4428 -5647
1715 -5647 -5148 3450 5198 -2385 -5358 986 5415 1443 -3787 -254 5309 4440 -527 -2119 2186
1730 2186 4866 2330 -785 -497 2057 1483 -2055 -3709 -612 2411 -54 -3944 -2588 2798 4356
1745 4356 379 -1794 1457 3456 596 -2230 179 2862 937 -2824 -2605 -95 346 -1408 -2195 -1381
1761 -1381 -1229 -952 -136 144 255 953 2073 896 -1934 -1560 2260 1572 -2696 -4165 -498 2120 -1027
1778 -1027 -3993 -1483 2442 903 -2748 -2177 1801 3151 306 -1513 1381 3717 1786 -1605 -1837
1793 -1837 1232 2154 -1656 -4669 -1667 3074 2173 -2960 -2420 3354 5438 -491 -4304 846 6572 3192
1809 3192 -4139 -2657 4794 5490 -2158 -5181 1021 4872 -1434 -6931 -2056 5219 3677 -3219 -2936
1824 -2936 3738 6099 103 -3525 903 4302 880 -4875 -3771 2491 4009 -1791 -5496 -1499 3540
1839 3540 780 -4738 -3803 2829 3600 -2981 -4682 1731 6233 1660 -4764 -2684 2553 1337 -5005
1854 -5005 -5944 -51 2522 -2185 -5969 -1581 3884 2144 -4093 -3578 1451 2468 -1815 -3349 662
1869 662 2711 366 -2334 -1534 224 -301 -2245 -2821 -1968 -550 28 -656 -1428 1032 3671 1765 -1886
1886 -1886 -751 2426 1480 -2179 -1843 2089 1955 -1621 -1873 740 1319 -454 42 -26 -1326 -835 2322
1903 2322 2345 336 1039 3633 2306 -1428 -1576 2648 2354 -2294 -3497 16 2013 -85 -1765 -255
1919 -255 2705 1907 -895 -2664 503 3926 1953 -2471 -1677 3683 3037 -2980 -4065 1801 3871 -2567
1935 -2567 -5798 -1316 3478 549 -2857 -1729 2413 3015 -604 -3498 -1071 3579 3406 -3262 -5100
1950 -5100 875 4564 -1894 -6600 -313 5967 -278 -8136 -3443 5684 3859 -3676 -3166 3508 4131
1965 4131 -1406 -3057 1267 4346 1379 -3446 -4277 507 4280 991 -4451 -1372 4397 2716 -4791
1980 -4791 -3095 5504 6161 -1894 -4262 2378 5569 1153 -2645 488 3411 985 -2747 -2802 1074 4123
1996 4123 2509 -1877 -2297 3094 4490 -450 -2440 3337 6089 -613 -4551 1099 5667 1323 -2319
2011 -2319 0 1996 -1175 -2682 53 1292 198 685 1184 -964 -1439 2858 4230 -306 -2725 462
2027 462 1661 -2675 -2335 2356 2527 -2043 -2722 -166 -262 -1742 416 1537 -1474 -2409 829 1675 -1635
2044 -1635 -626 3877 2489 -4241 -4850 1031 2305 -1875 -2827 259 657 -1685 -2139 -40 1779 2427
2060 2427 487 -3085 -3068 1901 3877 -1267 -3508 2732 4466 -3322 -6854 1627 6824 -15 -6435
2075 -6435 -1716 3697 1075 -2304 650 3981 2804 -792 -2902 -1504 2289 4242 -399 -4845 -941
2090 -941 4894 621 -5825 -1098 7307 2521 -7651 -4962 4871 5473 -2710 -3093 3359 4131 -1871 -3644
2106 -3644 -279 3270 2026 -1911 -4307 -1715 2853 1964 -3416 -2325 3839 2778 -4966 -5150 3514
2121 3514 5960 -1603 -4739 224 3069 -828 -3535 -407 2245 249 -3044 -3570 -1461 1587 2057
2136 2057 -1229 -3220 523 2322 -1176 -3570 1143 4785 -556 -5654 -1837 3123 849 -3058 -646
2151 -646 1881 -1261 -3538 -582 1377 457 255 458 -695 -1679 973 2853 259 -1884 85 1269
2167 1269 -1495 -2306 1182 2133 -329 -1483 -154 -201 -958 750 2099 -262 -1150 1923 2019 -1583 -1230
2184 -1230 3311 2804 -2175 -3081 842 2326 -739 -2068 1042 2323 364 -1301 -768 455 2462 1779
2200 1779 -1332 -2445 1550 3490 -1216 -3456 1944 4984 -1241 -6105 -927 5263 1239 -4762 -1964
2215 -1964 4076 2479 -2612 -1892 2446 3289 -2 -2811 -2113 1493 2798 -747 -4000 -329 4445 1126
2231 1126 -5152 -2613 4690 3142 -4595 -4504 3176 4950 -1752 -4109 1395 4925 1091 -3903 -2433
2246 -2433 2102 2625 -1661 -3747 -421 3873 1271 -3771 -2036 3756 4313 -2097 -4440 1372 4394
2261 4394 109 -3260 298 3588 1157 -2952 -1845 2011 2683 -269 -2955 -1572 2238 2308 -737 -1356
2277 -1356 1576 3449 -19 -3285 261 3317 1320 -2716 -1395 2214 1577 -1003 -1057 1288 1238 -731
2293 -731 -1381 289 781 1172 424 -4 -95 778 1567 -114 -1070 -384 875 163 -1362 -1108 563 937 74
2312 74 -786 -261 539 771 -513 -1155 -126 1024 622 -1503 -1382 780 1633 -603 -2251 -196 1582
2329 1582 324 -2418 -1138 1264 1887 -1091 -2842 259 2803 514 -2953 -1830 1877 2128 -2156
2344 -2156 -3638 866 3397 -85 -4324 -1698 2887 1788 -2565 -3039 2264 3048 -746 -3724 84
2359 84 3720 1100 -3466 -2473 2020 2925 -1289 -4111 -242 3990 1119 -3912 -2334 2913 3174 -2191
2375 -2191 -3685 1351 4319 152 -4385 -1033 3823 2442 -3157 -3378 1984 3409 -1181 -3974 -217
2390 -217 3879 1477 -3177 -2036 2333 3068 -1524 -3340 279 3065 635 -2735 -1198 2426 2171 -1625
2406 -1625 -2903 99 2340 193 -2636 -1422 2147 1705 -1539 -2127 911 2399 -241 -2702 -952
2421 -952 1718 858 -1618 -1768 738 1227 -469 -1559 -133 754 -356 -1288 -607 671 686 -68 -644 -161
2439 -161 202 504 229 -947 -808 208 457 -703 -1285 -108 1546 696 -1075 -550 889 1179 -370
2456 -370 -1324 -37 1744 1144 -883 -779 1101 1318 -123 -1850 -471 1943 1193 -1641 -1719 1414 2610
2473 2610 -347 -2256 205 2993 1086 -2593 -1952 2145 2882 -1284 -3104 892 3681 674 -3382
2488 -3382 -1477 3496 2317 -2361 -2788 1518 3157 -238 -3078 -441 3193 1608 -2428 -2376 1540 3278
2504 3278 -836 -3544 -469 3384 1609 -3090 -2649 2583 3076 -1659 -3766 522 4068 275 -3575
2519 -3575 -1490 3086 2322 -1927 -2879 1320 3389 -493 -3661 -1019 3031 1994 -2513 -2692 1930 2765
2535 2765 -999 -3122 26 2838 399 -2822 -1329 2166 1493 -1164 -1811 620 1952 596 -1318
2550 -1318 -1314 996 1935 57 -2022 -464 2309 1593 -1815 -1055 1670 1794 -1290 -1818 1463 1841 -254
2567 -254 -1095 230 786 177 -174 619 150 -346 402 910 -700 -425 911 998 -765 -1449 705 1251 -198
2586 -198 -1355 -31 1202 566 -778 -836 -39 1109 466 -1384 -1104 854 1489 -1307 -1746 730 2322
2603 2322 -677 -2963 -635 2331 1073 -1825 -1346 993 1079 -368 -1868 -687 1986 1691 -1496 -3395
2619 -3395 497 3503 417 -3665 -733 3824 1281 -4410 -2356 3566 3018 -2842 -3373 1394 2955
2634 2955 -874 -2755 185 2148 1031 -1886 -2297 513 3064 1064 -2788 -1986 2567 2697 -2499 -3162
2650 -3162 2096 4109 -1341 -4680 -14 3695 548 -3147 -550 2614 1234 -2052 -2074 648 2435
2665 2435 895 -2129 -2277 1194 3066 -300 -2584 501 3647 -480 -4047 -535 4031 1725 -2931
2680 -2931 -1613 1555 872 -1521 -622 1492 635 -503 -709 -1323 -95 1841 1675 -1258 -1878 1049 1648
2697 1648 -1158 -1537 2524 2403 -1825 -2566 655 2215 13 -494 568 248 -1767 -322 892 11
2713 11 -538 1323 975 -2069 -1621 1791 2104 -951 -1275 795 587 -936 -840 1103 1278 90 -726 -1589
2731 -1589 -1275 733 2346 -278 -2281 322 2420 -1222 -3180 1108 4279 192 -3986 -1508 2509
2746 2509 1508 -1683 -756 1689 967 -1381 -1958 -383 1712 2580 -143 -3045 -698 3231 1252 -3070
2762 -3070 -1124 4171 1971 -4351 -4073 3448 4358 -1631 -3701 1122 2728 -689 -2454 304 2550
2777 2550 1349 -1271 -2469 -477 2590 2198 -1736 -2594 1402 2951 -2228 -3903 1933 4782 -680
2792 -680 -5106 -756 3804 787 -2617 -809 2393 1112 -1622 -2042 266 2315 1702 -1073 -2336 -70
2808 -70 2608 10 -2406 12 3435 509 -3882 -1683 3365 2393 -2026 -1239 1376 970 -1453 -890
2824 -890 1272 934 145 -694 -1161 -887 575 1596 -318 -1481 242 1024 -1027 -1724 1393 2478 -725
2841 -725 -2377 216 1266 -95 -182 975 407 -1304 -624 652 -276 -676 1065 1214 -1120 -2008 656
2858 656 2109 -184 -1104 888 888 -618 -1496 30 1104 687 -228 -999 -1237 78 1645 -156 -1676
2875 -1676 117 2200 -93 -2568 -260 3514 1311 -2571 -2122 1770 1491 -1435 -1641 1090 1775 -203
2891 -203 -2160 -946 1437 2667 -153 -2630 -349 2449 801 -2948 -1509 3359 2664 -2922 -3443 1740
2907 1740 3295 -1163 -3262 161 3009 586 -2712 -1316 2197 2192 -434 -2421 -507 2518 1216 -2020
2923 -2020 -2203 1802 2530 -1668 -4108 378 3903 572 -3382 -1179 2907 1406 -2293 -1792 1657 2340
2939 2340 -668 -2496 -214 1980 1027 -1634 -2078 712 1854 -431 -2171 -178 2331 1065 -2162
2954 -2162 -1570 1594 1914 -603 -1805 493 1489 -171 -1583 -424 627 508 -482 -1196 -401 608 965
2971 965 -629 -939 707 1042 -273 -1245 271 1160 269 -901 -162 184 59 -85 1 114 109 -9 -86 -690
2991 -690 -378 706 1110 -278 -1104 114 1225 677 -756 -327 1116 596 -918 -1590 373 1299 244
3008 244 -1299 -691 1101 1436 -707 -1584 482 1760 -61 -1769 -873 1831 1543 -1425 -1780 971 2051
3025 2051 -450 -2317 -273 2216 892 -1833 -1872 1572 2411 -627 -2614 -136 2562 828 -2855 -2010
3041 -2010 2006 2361 -1590 -3240 905 2857 -174 -2805 -819 2677 1436 -2008 -1949 1260 2360 -220
3057 -220 -2643 -329 2323 1364 -1858 -1994 1384 2164 -684 -2890 -307 2783 1213 -2075 -1560 2083
3073 2083 2373 -1106 -2052 847 2845 127 -2335 -779 2146 1296 -1536 -1543 896 1779 -267 -1944 -245
3090 -245 1564 1025 -1251 -886 893 1348 -67 -1248 -498 1106 970 -966 -788 822 1072 -150 -1177
3107 -1177 -238 950 150 -604 -488 767 709 27 -311 155 607 423 -49 -521 12 289 200 -571 -481 311
3127 311 521 384 -685 -562 719 1019 -231 -1000 176 1145 366 -925 -747 774 1267 -478 -1338 -84
3145 -84 1244 397 -1533 -1018 1104 1451 -619 -1502 64 2036 343 -1811 -1011 1984 1713 -1299 -1926
3162 -1926 386 2006 124 -2226 -344 2163 1338 -1485 -1682 1475 2244 43 -2256 -325 2386 1329
3178 1329 -1937 -1781 1694 2645 -993 -2819 402 2771 349 -2693 -1153 2199 1970 -1366 -1949 868
3194 868 2371 155 -2176 -567 2029 1779 -1570 -2376 812 2620 -383 -2777 -631 2531 1210 -2562
3210 -2562 -1649 1567 2102 -820 -2353 458 2239 322 -1964 -901 1160 1068 -877 -2025 -405 1520
3226 1520 381 -1725 -871 1453 1266 -1066 -1623 602 1595 -374 -1615 -370 746 393 -387 -572 421
3243 421 468 -106 -521 -636 441 1155 -3 -1158 -49 1000 286 -1011 157 720 2 -560 -509 227
3261 227 167 396 395 -262 -714 461 1300 -76 -1186 499 1391 -122 -1867 30 1874 720 -1293 -903
3279 -903 1254 723 -699 -879 172 1142 228 -907 -1220 134 1709 696 -1557 -1044 1587 890 -2223
3296 -2223 -1914 1871 2325 -1575 -2584 451 2392 -82 -2150 -592 1579 617 -1166 -1568 642 2182
3312 2182 450 -1996 -1666 1217 1767 -1409 -2466 1119 2647 -1083 -3279 -134 2981 940 -2531
3327 -2531 -1244 1559 1373 -1073 -1448 706 1739 296 -1800 -1451 853 2166 -78 -2063 -14 2418
3343 2418 393 -2576 -514 3110 1899 -2374 -1974 1686 2040 -837 -1050 330 1067 -249 -1097 -445
3359 -445 764 1184 292 -1363 -1320 1264 1545 -764 -1106 1308 2018 -994 -2313 888 2174 136 -1787
3376 -1787 -126 581 -334 -786 402 468 -78 74 -174 -908 -521 1258 1587 -1155 -1008 984 677 -987
3394 -987 -353 1379 479 -1077 -877 -2 -188 258 1004 180 -1195 -719 1396 216 -1330 308 2220
3411 2220 114 -2805 -754 2137 1006 -1088 -462 1086 424 -894 -831 671 968 857 -144 -1448
3427 -1448 -511 1774 1541 -1366 -1174 1373 1549 -2266 -2358 1878 3003 -983 -3107 175 2106 -186
3443 -186 -1290 -267 1524 492 -1247 -1113 440 2206 1271 -1409 -2222 1020 1909 -978 -2325 888
3459 888 3237 -191 -3251 -945 3126 1421 -1982 -761 1515 933 -1441 -1088 561 1275 630 -959
3475 -959 -2062 146 1887 325 -1839 -698 2372 944 -2449 -1401 2868 2577 -1814 -2413 746 1796
3491 1796 -890 -1207 744 1239 -477 -954 -567 5 1039 612 -590 -1400 462 1029 -291 -1232 809
3508 809 1685 -550 -2118 -366 1453 -27 -1290 -169 347 -370 -729 59 360 11 67 273 -689 -517
3526 -517 592 1099 -543 -1093 533 592 -850 -734 648 626 -232 -694 -829 -676 -18 1163 398 -1008
3544 -1008 -52 991 92 -1503 -215 2237 812 -1874 -1417 1565 1376 -876 -1077 814 972 -497
3560 -497 -1121 -232 787 942 -2 -1357 -382 1416 1198 -1299 -1221 1261 1489 -1607 -2559 994 2495 -76
3578 -76 -2417 -318 2377 431 -1705 -1147 1335 1562 -536 -1498 -85 1433 1012 -1163 -1800 1160 1626
3595 1626 -661 -2563 156 2555 276 -2559 -1093 2054 1266 -1708 -1396 1060 1549 -414 -1848 -464
3611 -464 1769 742 -918 -1889 224 1802 46 -2106 -454 1966 1124 -1932 -1590 1474 2116 -1006
3627 -1006 -2034 322 1551 -142 -1565 -486 1165 609 -486 -1008 130 1157 328 -816 -226 602
3643 602 1016 -336 -789 474 1375 319 -893 -152 672 594 -585 -462 70 441 234 -127 -198 275 643
3662 643 230 -345 -222 607 363 106 -373 134 671 -57 -358 -51 380 740 -19 -338 -130 658 1028 36
3682 36 -625 -69 1431 203 -1198 -436 1332 1088 -793 -1390 779 1442 -145 -1275 197 1368 566
3699 566 -1150 -1006 813 1221 -29 -1460 -231 1760 641 -1348 -1426 755 1721 -1000 -2199 -13
3715 -13 1967 236 -2047 -1087 1713 1427 -1247 -1727 932 1627 -295 -2194 -225 1674 898 -1346 -1725
3732 -1725 828 2089 -508 -1899 -151 1984 791 -1717 -949 1501 1763 -736 -1657 141 1805 279
3748 279 -1526 -741 1856 1377 -921 -1733 719 1832 162 -1392 -378 1592 1162 -1510 -1022 1066
3764 1066 1706 -272 -1325 -359 1338 689 -1010 -602 684 1163 -401 -973 182 888 73 -941 -434
3781 -434 545 605 -370 -919 -50 523 244 -611 -649 317 247 -429 -797 -169 555 143 -353 -421 208 317 261 -365
3803 -365 -238 35 -22 -146 -400 -241 103 177 -545 -569 4 428 -164 -711 -714 232 556 -627 -1029 -43 895
3824 895 217 -1118 -644 910 493 -851 -1096 394 1379 -128 -1467 -351 1066 1120 -725 -1175 578
3841 578 1349 -84 -1054 -263 1106 854 -1194 -1481 848 1585 -351 -1778 -272 1786 578 -1366 -1072
3858 -1072 1333 1639 -653 -1682 220 1614 391 -1661 -1094 1319 1387 -1149 -1824 481 1619 -193
3874 -193 -1742 -508 1541 1195 -1713 -1645 1311 1500 -736 -2244 -325 1304 503 -1511 -1166 914 788
3891 788 -447 -1792 -123 1263 457 -1322 -1282 921 1401 -989 -1386 640 1383 -226 -1785 -304 1160
3908 1160 467 -813 -412 815 445 100 -474 32 509 598 -284 -952 -134 1002 492 -1057 -389 1156
3926 1156 288 -621 -775 472 828 -288 -407 172 -99 -45 491 178 -305 40 448 159 -663 102 872
3945 872 107 -767 -521 549 343 -597 -465 379 614 64 -377 -550 189 1038 283 -873 -497 858 970
3964 970 -1087 -785 1019 1118 -839 -1438 254 1782 76 -1336 -228 952 149 -703 -1008 238 888
3981 888 335 -1135 -911 944 1374 -316 -1823 402 2106 -104 -2101 -148 2269 923 -1979 -1174
3997 -1174 1428 1288 -635 -832 390 964 219 -863 -873 698 1833 32 -1653 -123 1701 900 -1567
4014 -1567 -718 2299 1706 -1557 -2003 1002 1984 -306 -1345 304 1309 143 -1059 -388 694 1089
4030 1089 148 -950 -963 938 1635 -401 -1358 427 1498 -723 -1712 119 2169 520 -1519 -595 1000
4047 1000 220 -527 -69 932 119 -185 -131 -274 173 755 197 -1114 -776 691 509 -697 -881 1094
4065 1094 580 -922 -769 421 459 -424 -200 34 -452 -393 434 266 -508 -42 556 90 -1357 -591 1396
4084 1396 612 -1070 -1019 334 488 -616 -265 475 496 81 -359 -702 -492 864 852 -902 -790 716 1100
4103 1100 -1240 -1222 881 1697 -885 -1923 100 1776 284 -984 -396 931 495 -711 -786 48 1091
4120 1091 864 -769 -1498 316 1574 -187 -1732 -174 1956 -109 -2540 -622 2457 1540 -1952 -1302
4136 -1302 1184 1258 -766 -1065 387 833 135 -876 -1001 182 1452 647 -1088 -879 1324 1023 -1952
4153 -1952 -1759 1565 1972 -1495 -2007 396 1774 -429 -1369 -272 1186 73 -939 -784 443 969
4169 969 556 -882 -886 471 1158 -222 -1325 202 1226 -287 -1953 -481 1565 471 -1175 -418 823
4186 823 76 -805 -210 779 334 -1 -62 -510 -343 803 620 -575 -472 468 568 -710 -724 582 929
4205 929 -515 -1064 51 520 -52 -51 192 -444 -151 588 279 -398 -260 761 613 -1196 -550 1148 997
4224 997 -612 -733 919 522 -192 -707 85 731 600 -180 -613 67 731 854 -635 -848 913 1066 -938
4243 -938 -1490 478 1944 -183 -1819 -185 1505 644 -1025 -529 781 891 -648 -1006 -124 835 848
4260 848 -757 -1141 135 1299 -5 -1784 82 2106 781 -1669 -1340 1777 1495 -772 -1268 625
4276 625 1401 -501 -1304 -67 1585 613 -982 -1182 556 1479 188 -1221 -689 1286 1050 -897 -1410
4293 -1410 709 1532 -681 -1890 85 1399 151 -1345 -412 1155 972 -520 -1087 178 956 302
4309 302 -784 -298 890 814 -282 -1183 144 963 -151 -942 -335 843 573 -944 -385 307 861 -209
4327 -209 -288 128 380 87 -4 -81 -247 545 -178 -268 -367 377 507 -363 -570 258 539 256 -282 -436 320 134
4349 134 -409 -12 -197 -61 411 127 -735 -262 511 415 -490 -871 392 641 -247 -1015 56 943 252 -583
4369 -583 -674 388 1038 -451 -855 -60 797 225 -722 -779 722 1050 -302 -1045 121 1188 113 -1261
4387 -1261 -685 1155 951 -696 -1233 488 1151 131 -1434 -528 1196 800 -1407 -1104 510 1458 -65
4404 -65 -1420 -385 1412 465 -1161 -881 837 1429 -655 -1602 -1 1208 211 -1423 -728 967 917
4421 917 -889 -1247 428 1155 -134 -1676 -802 1102 827 -755 -1109 291 1302 -124 -1582 -625 1177
4438 1177 274 -892 -958 557 1055 -371 -1059 -97 1219 182 -1021 -543 701 459 -135 -735 228 597
4456 597 201 -594 -450 497 740 -168 -720 -157 586 72 -536 -286 293 544 -173 -506 -377 680 168 -573
4476 -573 -530 242 414 -138 -56 -3 270 224 -133 -278 291 233 307 -552 -288 -59 200 66 -551 -199 729 345
4498 345 -313 -593 125 704 -97 -707 -276 858 399 -540 -933 327 977 -326 -889 -377 771 625 -706
4517 -706 -963 303 1221 -244 -967 -61 1388 606 -1164 -1000 850 1165 -347 -1177 -37 1043 655
4534 655 -926 -678 944 1399 -762 -1067 140 1520 62 -1473 -648 1211 1182 -637 -1408 870 1454
4551 1454 -602 -1269 -319 1202 566 -975 -622 599 796 -103 -1171 117 1259 645 -918 -813 672
4568 672 1081 -231 -1099 78 1530 476 -1408 -410 954 839 -733 -684 600 614 -38 -758 -155 794
4586 794 551 -323 -803 115 901 128 -1068 -70 562 383 -578 -556 659 793 -121 -598 189 443 -14 -180
4606 -180 -95 -92 313 299 -209 -346 234 524 -204 -482 -85 786 18 -436 -49 511 -29 -358 -190 -128 264 143
4628 143 -118 -579 -102 349 602 -328 -632 262 1221 -461 -1079 317 1089 33 -964 -60 777 388 -625
4647 -625 -662 375 674 35 -547 -514 472 975 -204 -976 -86 1071 348 -1432 -408 1460 663 -1189
4665 -1189 -862 788 931 -788 -874 62 845 415 -553 -801 599 665 20 -1109 -486 1181 758 -888
4683 -888 -766 1045 1073 -818 -1377 615 1681 -62 -1486 -260 1070 -35 -1034 -414 699 715 -155
4700 -155 -1044 -664 600 1259 -470 -1227 70 1167 -14 -1497 -295 1332 659 -1503 -715 1200 756
4717 756 -836 -644 341 645 -234 -438 -174 324 488 79 -942 -605 718 513 -545 -329 614 641 -608
4736 -608 -961 409 936 -202 -464 208 422 -408 174 306 -64 -157 583 17 -854 -410 1297 501 -748
4755 -748 -141 434 306 -569 -325 743 202 -741 -555 290 -131 253 423 -158 -798 -48 847 147 -489 375
4775 375 1131 -282 -1711 -59 1186 465 -1054 -217 595 239 -438 -68 602 661 127 -559 -689 288 950
4794 950 235 -878 -381 1191 469 -1125 -722 1226 1013 -950 -1146 380 1474 -128 -1119 -8 733
4811 733 207 -682 -548 387 1317 276 -1039 -768 1058 1011 -1031 -1200 756 1296 -709 -1769 481 1937
4829 1937 231 -1282 -377 1075 495 -1026 -291 819 600 -25 -703 -789 545 1173 37 -1105 42
4846 42 1138 -9 -1360 -176 1628 799 -1109 -905 616 732 -549 -531 415 544 -354 -258 -119 229
4864 229 473 292 -579 -629 348 604 -528 -751 379 898 -427 -1033 258 935 92 -320 152 86 226
4883 226 -267 94 -65 -375 199 20 -593 -552 588 814 -443 -651 438 216 -314 -440 280 578 172
4902 172 -344 -90 285 36 143 118 -598 93 846 -301 -823 193 1032 -56 -1032 -217 958 499 -739
4921 -739 -248 654 752 -651 -556 24 1114 415 -486 -633 177 864 196 -992 49 1051 475 -1066 -902
4940 -902 687 1350 -603 -1061 213 868 -15 -850 -124 850 466 -464 -845 13 990 183 -1075 -715 730
4959 730 916 -718 -1285 785 1614 -535 -1261 -420 1303 690 -1111 -366 985 609 -430 -775 -94 683
4977 683 344 -481 -761 178 699 22 -956 -40 945 290 -932 -602 827 561 -397 -631 162 727 -266
4996 -266 -692 -28 556 240 -288 -338 244 350 -58 -219 -83 242 341 -288 -425 219 596 125 -334 -233 444
5017 444 150 -220 -218 129 315 21 -183 -175 241 250 29 -409 -225 379 395 -323 -507 134 459 -63 -385 -195
5039 -195 9 410 -118 -460 84 281 462 -525 -375 304 529 136 -655 1 725 97 -847 -520 463 637
5059 637 -338 -405 -9 961 -115 -622 -492 581 534 -455 -961 304 1046 232 -707 -99 895 508 -679
5078 -679 -861 455 1229 -268 -1078 -194 1056 384 -859 -476 647 959 -360 -975 -106 1343 469 -612
5096 -612 -628 849 1026 -424 -1136 425 850 -49 -930 -384 993 888 -539 -670 397 886 -71 -977
5114 -977 227 676 443 -584 -1013 381 660 -158 -810 266 776 390 -665 -595 479 689 -486 -835
5132 -835 58 505 -62 -802 -339 604 636 -447 -228 129 346 132 -366 -135 333 492 -51 -479 -35 292
5152 292 332 -272 -284 124 176 -16 -318 102 381 163 0 239 119 342 148 -187 -272 337 180 -221 -303 -174
5174 -174 605 123 -263 -219 257 354 -297 -470 -130 430 263 -257 -467 453 637 -103 -667 -484 550 514 -373
5195 -373 -548 658 577 -85 -846 -5 805 120 -711 -213 621 513 -144 -644 168 731 398 -804 -588 757
5215 757 900 -725 -827 499 697 64 -721 -77 813 407 -1013 -752 430 1157 -353 -1063 -310 831
5233 831 504 -523 -704 517 848 -189 -961 -34 1201 435 -1154 -528 789 616 -567 -1004 179
5250 179 648 46 -692 -265 608 557 -346 -824 285 750 6 -684 -85 935 537 -390 -794 559 842
5269 842 -377 -605 129 1009 215 -337 -174 166 528 -113 -237 -100 155 378 -121 46 1 818 47 -553
5289 -553 -166 344 237 -312 -327 400 165 -269 -349 -323 46 165 235 -118 -2 243 206 -276 -637 192 666 -240
5311 -240 -473 50 605 11 -452 -185 414 230 -105 -336 -219 434 541 -32 -661 -199 642 119 -716 -643
5331 -643 587 700 -778 -822 635 1034 -260 -1119 125 839 -151 -392 -294 277 494 -289 -601 -435 933
5350 933 711 -697 -962 273 906 -401 -968 275 1264 -230 -1135 -290 703 275 -347 -291 321 641 -396
5369 -396 -281 -130 375 569 -589 -768 23 807 -109 -779 -494 898 485 -973 -976 700 712 -204 -986 448
5389 448 552 -755 -388 -252 351 115 -394 -769 -445 305 821 -498 -518 587 785 -403 -771 235 918
5408 918 -268 -656 -3 363 -109 -478 268 240 -66 128 73 -194 277 523 159 -308 -568 623 678 -515
5428 -515 -254 735 223 -360 -383 136 438 -8 -111 -132 50 193 417 1 -383 72 785 -82 -516 -83 807
5449 807 351 -575 -347 836 85 -481 -485 637 179 10 -259 -397 530 458 132 -489 -173 467 377 -769
5469 -769 -359 845 722 -556 -1010 474 770 -174 -621 234 629 153 -711 -607 287 499 360 -868 -431
5488 -431 352 857 -189 -730 343 933 90 -1424 -46 1564 440 -998 -328 627 491 -692 -433
5505 -433 472 712 -30 -504 -155 25 674 98 -731 -161 867 302 -811 -671 1136 799 -950 -848 771
5524 771 836 -269 -907 322 447 -168 -539 -247 230 352 129 -452 -232 544 618 -96 -389 397 606 -148
5544 -148 -983 -15 669 96 -512 -501 234 -121 -104 -200 210 204 328 -324 75 -235 338 284 -288 -453 166 427
5566 427 -220 -461 445 418 -88 -573 -72 206 66 -375 -177 -443 -351 220 -187 -116 100 743 136 -397 -18
5587 -18 860 527 -655 -517 365 549 -283 -545 521 358 -132 -130 -287 161 458 182 -637 -698 762 346
5607 346 -579 -683 917 917 -295 -853 50 816 -65 -540 -193 878 639 -465 -662 -152 428 16 -669
5626 -669 -722 729 531 -308 -807 -1 966 73 -1075 -39 872 598 -887 -368 696 681 -479 -618 76
5645 76 686 227 -601 -543 290 780 -76 -665 -289 1032 351 -616 -505 552 841 -543 -802 315 846
5664 846 -58 -568 -193 735 444 -96 -304 362 490 33 -405 -202 378 111 -401 -494 111 634 -55 -520
5684 -520 -311 267 101 -163 -323 335 82 -215 -190 31 283 216 -302 -163 -507 58 256 -297 -386 92 376
5705 376 -238 -147 47 255 70 119 -90 239 157 142 -237 -88 182 238 61 -573 -53 318 -15 -588 -341 501
5727 501 84 -530 -573 353 457 170 -451 16 338 469 -445 -655 -110 500 217 -516 -530 636 447 -728
5747 -728 -772 146 840 -101 -541 59 859 430 -646 -149 114 487 -176 -736 -125 495 187 -578 -611 405
5767 405 625 -589 -862 24 930 292 -705 -251 673 618 -470 -789 316 866 5 -727 -22 704 408
5786 408 -450 -389 448 488 -59 -676 108 620 290 -542 -717 597 559 -280 -763 274 594 138 -512 -409
5806 -409 391 592 -409 -505 172 282 -3 -664 -114 343 438 -130 -492 -91 249 -6 -222 -92 272 147
5826 147 -108 -144 414 391 84 -119 -340 190 314 -128 -176 -16 426 175 -171 -545 32 396 30 -213 -118
5847 -118 287 225 118 -174 146 233 168 -363 -214 335 287 138 -424 -212 234 171 -138 -521 315 335 -170 -551
5869 -551 32 526 212 -446 -315 263 353 -408 -602 64 576 119 -668 -181 356 549 -264 -611 28 786
5889 786 -85 -975 -187 705 635 -468 -578 270 367 -254 -637 -249 406 226 -456 -499 271 567 -84 -765 -321
5910 -321 821 225 -371 -512 557 762 -451 -522 171 461 92 -666 -250 821 350 -124 -494 -175 948
5929 948 181 -543 -576 604 428 -132 -510 270 1016 -20 -766 -154 393 269 -485 -208 351 180 80 -516
5949 -516 119 -14 122 -374 -299 108 601 90 -285 -270 371 492 -548 -220 229 126 -39 -175 13 261
5969 261 -124 -236 -26 130 360 54 -326 -224 49 478 -204 -437 -17 512 18 -421 -118 462 116 -149
5989 -149 -516 -30 113 392 78 -314 -35 384 323 -365 -178 327 292 -240 -538 379 895 -23 -441 -323 365
6010 365 249 -206 -195 428 77 149 -307 12 561 420 -534 -498 295 643 56 -678 20 1122 9 -729
6030 -729 -254 616 539 -367 -444 111 661 -39 -276 -130 245 396 -474 -714 -157 914 175 -654 -580 753
6050 753 345 -563 -674 420 708 -360 -589 186 800 -16 -172 86 137 233 -66 -324 -232 444 226 -355
6070 -355 -554 490 608 100 -492 42 1058 -54 -669 -250 775 385 -236 -93 210 182 72 70 -36 521
6090 521 211 246 -435 -331 750 148 -608 -222 702 203 -441 -300 25 433 -301 -245 37 -53 -64 99 388
6111 388 -295 -44 506 -256 -543 37 514 341 -814 -248 401 175 -69 -90 15 140 -142 -53 132 113 222
6132 222 244 -323 -620 305 382 -381 -361 468 521 -253 -648 265 857 47 -723 -153 353 150 -538 -97 199
6153 199 -16 2 -491 -429 205 783 -231 -696 -39 659 251 -773 -75 607 399 -693 -379 558 591 -599
6173 -599 -84 -46 491 -302 -417 -169 -53 467 49 -308 -106 569 604 -662 -426 410 801 -449 -1032 439
6193 439 720 -192 -407 361 432 148 -423 93 231 298 38 -450 -49 228 656 184 -590 389 616 -242 -831
6214 -831 -9 770 183 -735 -273 518 254 -394 -206 209 -90 156 -255 -13 -33 179 291 -459 -430 330 288
6235 288 -140 -172 251 486 -98 -222 -106 525 -282 -135 155 130 166 28 61 42 35 129 -359 -318 13 723 280
6258 280 -301 105 304 394 -254 -400 490 180 -71 -367 -247 -8 536 -92 -196 -295 314 410 -445 -414 210
6279 210 516 -259 -611 -74 692 240 -168 30 583 351 -276 -789 -130 379 286 -358 -271 483 426 -73 -651
6300 -651 28 758 549 -434 -137 655 600 -228 -598 253 580 -72 -614 -111 355 305 -464 -309 41 319 -60
6321 -60 -422 -245 645 451 -469 -300 400 697 -500 -914 40 644 -166 -449 52 568 387 -347 -414 106
6341 106 466 -48 -310 -282 616 363 188 -349 40 483 119 -567 17 470 495 -364 -310 191 471 115 -329
6362 -329 236 268 188 -176 -94 -179 286 34 -234 -272 417 273 -254 -187 306 129 -129 -139 -125 389 179 -228 -202
6385 -202 262 580 230 116 -517 42 249 82 -525 -84 267 156 -151 -543 57 62 21 66 -59 324 165
6406 165 -484 -166 -11 442 -120 -217 -457 247 413 -120 -465 -131 398 40 -409 -318 444 120 -544 -371 339
6427 339 601 -77 -806 -103 514 334 -658 -607 248 517 -364 -416 8 416 94 -614 -333 508 464 -326 -401
6448 -401 12 448 460 -455 -620 596 228 -238 -471 90 375 10 -557 -336 390 596 -335 -544 2 571
6468 571 -247 -679 30 743 357 -605 -486 139 270 36 -356 -192 347 146 -263 -325 320 179 -193 -468
6488 -468 111 117 -63 -254 -929 358 373 -388 -512 -16 253 -69 -183 -180 64 64 -272 -232 -103 202 -38 -314
6510 -314 -176 -160 393 -297 -225 71 219 122 -162 -207 151 231 76 -580 122 211 158 72 -335 -94 82 27 44
6533 44 -205 340 358 -193 -514 85 309 64 -142 -544 206 263 -234 -137 260 598 298 -276 49 222 259 -221
6555 -221 -218 26 382 78 -411 -93 283 549 -433 -461 46 331 70 -242 -266 329 43 -246 -275 185 636 -42
6577 -42 -283 -145 533 287 -349 -389 304 739 -172 -581 39 387 390 -337 -282 293 478 -388 -759 -206 544 19
6599 19 -558 -370 216 699 -207 -390 212 520 195 -664 -128 650 361 -400 -245 290 463 67 -171 188
6619 188 -42 110 -22 -372 49 395 112 -649 -146 224 120 -671 -450 201 290 -174 -716 133 129 -58 -218
6640 -218 -442 60 72 -146 -134 -60 545 140 -54 -78 -159 490 118 -78 36 331 -21 -17 -246 8 11 90 -341
6663 -341 -180 -174 163 111 -268 -206 104 383 -351 -210 276 253 -110 -341 -104 251 58 51 -94 171 203 -165 -62
6686 -62 -93 370 225 -179 -559 139 423 -127 -562 74 406 89 -372 -354 361 602 -385 -313 217 410 -196
6707 -196 -212 -244 506 503 -225 -454 111 499 452 -508 -444 591 560 -329 -691 365 838 49 -603 -47 670 292
6729 292 -214 -113 227 350 -139 -472 -101 281 208 -72 -505 -73 306 213 -860 -197 460 353 -693 -277
6749 -277 473 405 -440 -299 -29 -10 206 153 -130 153 292 -383 -138 -39 192 268 -392 -602 459 271 -548
6770 -548 -345 545 454 -135 -250 327 280 310 30 5 -89 -162 11 -192 -173 -146 369 -32 -368 -163 307 -229 -352
6793 -352 -292 330 321 -388 -11 317 403 26 -364 -51 -241 -19 38 3 -274 15 397 -376 -473 69 782 68
6815 68 -489 -336 549 44 -199 -123 -19 439 -134 -403 -329 -89 348 -45 -271 169 334 -164 -598 -308 542
6836 542 197 -556 -482 412 560 -147 -424 239 281 -105 15 -111 155 200 25 -444 -11 86 269 -691 -160
6857 -160 202 404 -138 -864 -24 812 -75 -907 88 191 201 -433 -325 341 172 -38 -34 -199 338 311 -28
6878 -28 -510 -254 132 210 -511 -81 515 179 -661 -475 301 520 -181 42 78 309 -52 -293 78 274 286
6899 286 27 -444 -438 335 247 -184 -291 331 376 210 -543 126 389 103 -490 -201 109 102 46 -147 -211 -182 -127
6922 -127 -313 -188 -49 15 258 -397 -115 238 347 -317 -26 382 158 -167 -298 114 105 185 -52 -312 -100
6943 -100 188 304 -340 -91 -9 289 -31 -310 75 631 134 -376 -34 507 109 -304 -271 -97 329 105 -254
6964 -254 54 -67 137 -65 -332 -162 581 162 -430 63 378 116 -671 -890 358 506 -125 -481 -273 308
6984 308 120 -494 -149 215 361 94 -556 -133 333 562 -72 -506 327 520 49 -511 -384 799 245 -316
7004 -316 -88 317 101 -242 -834 220 338 256 -522 -182 167 392 -58 -327 149 248 -83 -317 -355 197 214
7025 214 -269 -232 42 676 4 -323 91 186 -17 -234 -202 333 433 -129 -184 -237 188 207 -210 -104 111 487
7047 487 -14 -379 -184 407 90 -171 -28 266 209 -151 -196 -151 127 134 33 -463 -2 123 263 -300 -406 -13
7069 -13 298 -151 -355 -55 276 48 -263 -34 150 -3 -60 -148 115 137 227 -39 -298 68 509 -96 -399 39
7091 39 161 62 -239 -131 230 283 55 -340 205 356 193 -262 -303 109 178 166 -307 170 307 -18 -419 -315
7113 -315 327 284 -397 -412 -204 569 65 -171 -381 557 486 -35 -236 30 474 445 -351 -161 394 381 -291 -506
7135 -506 -94 173 -106 -332 -185 307 34 -470 -61 241 66 -148 -304 -86 483 311 -57 253 253 506 -183
7156 -183 -346 11 467 -47 -326 -400 145 511 15 43 9 399 287 -162 -384 99 166 -108 -33 -171 296 -92
7178 -92 -250 -183 137 442 66 21 -180 311 369 -32 -58 50 197 94 -66 -4 154 -35 -211 -72 -355 190
7200 190 -144 -24 -193 119 190 -150 -125 265 129 254 -192 -121 157 -111 -24 -507 70 555 0 -51 -67 115
7222 115 -12 -52 -327 -41 363 199 -321 -119 506 435 -304 -192 133 313 25 127 -270 379 285 -340 33
7243 33 114 616 64 -363 -124 244 76 -394 -522 195 500 -122 -486 -93 277 134 -340 -76 256 343 44
7264 44 -416 191 159 326 -254 -254 336 393 39 -546 171 352 110 -541 -257 541 496 -318 -234 69 146 76 -170
7287 -170 -177 383 227 -151 -354 100 363 137 -464 -137 197 278 -144 -244 129 479 210 -303 -175 361 -152
7308 -152 -548 -25 308 312 -47 -494 -2 348 50 -175 -373 108 282 -349 -259 142 -58 168 -257 -132 129
7329 129 321 -370 -103 42 94 -71 -33 -370 86 247 -162 106 -69 128 387 -19 -431 13 303 -14 -298
7350 -298 -169 377 70 -36 -294 10 270 -15 -99 -11 205 438 186 -217 -145 403 210 -180 -38 411 569
7371 569 -268 -4 54 319 102 -351 -223 237 122 -177 -86 64 246 379 -355 -663 355 473 -30 -577
7391 -577 110 334 56 -627 -268 223 132 -246 -34 -18 416 94 -484 -107 243 145 -436 -217 -94 445 230
7412 230 -684 -314 455 272 -186 -489 171 320 -281 -138 57 305 -241 -343 -161 40 241 24 54 109 268
7433 268 -28 -129 -524 50 197 -205 -570 75 569 -131 -397 -27 322 91 -34 -71 -67 221 236 -202 -398
7454 -398 -251 314 99 -376 -338 322 -73 -377 27 156 299 -331 -274 422 282 115 -70 70 -145 93 198
7475 198 4 -201 93 237 -54 -249 -27 53 169 -329 -158 232 20 -276 -154 64 157 -46 -32 -407 169
7496 169 279 -38 -167 -127 470 88 -277 -230 360 495 -300 -512 -65 340 -50 -311 -56 364 146 -388 100
7517 100 155 -235 -39 -486 -42 207 339 -224 -12 -12 272 13 -346 86 435 194 -684 -193 658 473 -354
7538 -354 -303 390 483 -78 -359 -257 412 224 110 -153 -36 170 -2 -334 -167 446 476 -313 -511 145 591
7559 591 -90 -520 37 396 91 -253 -117 53 4 -416 -290 240 251 603 -354 -283 72 298 10 -431 45
7580 45 142 207 -595 10 180 119 -221 -319 -134 121 29 -341 -129 -97 390 133 -174 -291 296 164 -126 -284
7602 -284 -85 313 -435 -68 -97 133 -211 -162 -241 15 362 6 -11 -188 281 173 -100 -278 -59 418 294
7623 294 -246 -120 418 223 -101 -471 230 269 -174 -177 -45 32 290 -125 -30 -86 151 -39 -184 -674 433 534
7645 534 -214 -423 -4 342 87 -409 5 435 -32 -513 -322 59 -128 -314 -474 -339 427 128 -128 -304
7665 -304 -60 483 -104 -563 82 432 338 -583 -321 164 272 38 -253 25 349 186 -160 -647 128 107 -14
7686 -14 -265 -286 280 393 -263 -330 342 27 -45 -258 12 132 -163 -342 -184 232 11 -205 -357 357 196
7707 196 102 34 85 365 165 12 -162 133 273 -79 -363 -268 223 29 49 -156 143 127 208 -72 53 28 109
7730 109 -160 -34 -30 296 19 173 -212 -98 79 -344 -63 -135 375 153 -205 98 91 138 -114 -441 -35 204
7752 204 -95 -255 -142 160 -234 172 -78 -83 353 -62 -233 -231 150 332 -383 -302 -82 383 54 -119 -53 -83
7774 -83 -141 -5 -222 43 423 57 -146 -382 339 361 39 -397 44 662 2 -309 -197 382 104 -118 -244
7795 -244 100 322 34 -241 16 165 362 203 -81 243 727 156 -227 -284 469 193 -159 -341 168 58
7815 58 -17 -270 17 504 -39 36 -180 85 272 -193 -295 -2 394 136 -409 -155 157 390 -207 -516 153
7836 153 280 411 -239 -266 310 89 14 -375 269 239 -60 -11 -544 -120 307 -76 -369 49 268 -5 -333
7857 -333 -147 307 213 -109 -125 25 289 38 -100 16 204 175 37 -352 -76 193 228 -279 -369 105 -31 199
7879 199 -76 -36 348 84 -26 -256 375 220 -130 -179 138 195 309 -268 28 174 372 -220 -178 -230 171 330
7901 330 54 -268 -94 364 114 -285 -181 241 -88 116 -357 291 140 109 -97 129 1 176 -77 -194
7921 -194 -49 14 -244 -452 -69 276 264 -376 -163 63 329 -73 -280 -116 32 197 -293 -7 -4 499 425 -161
7943 -161 169 171 -14 -279 -336 -130 -83 -275 -280 -216 429 -86 -431 -297 276 333 -199 -377 184 553 189 -158 -139
7966 -139 87 471 -167 -415 324 582 162 -418 -60 377 159 -206 -95 266 176 -51 -221 61 287 291 28
7987 28 147 -45 273 214 -303 -19 309 249 -387 -423 -31 98 -231 -269 184 124 -25 -162 29 3 -276 -136
8009 -136 120 -83 163 77 -67 -53 -104 288 -3 -360 -115 322 153 -233 -127 -130 228 -205 -170 -17 -165 43
8031 43 217 -25 -190 -208 -283 -438 -247 30 49 -334 -374 -35 173 189 -374 49 140 215 7 -58 131 100 287
8054 287 -208 -123 68 413 223 -265 444 414 -169 -205 18 136 -81 -45 21 170 74 -38 -64 251 30 19 -381
8077 -381 -407 27 134 -32 -318 -447 368 225 -332 -330 462 423 -271 -322 -47 -13 -118 -364 103 248 285 -177
8099 -177 -358 168 -1 152 -115 -353 100 642 -126 -162 -269 301 87 -875 -89 338 163 6 -86 29 137
8120 137 29 115 223 115 73 -177 -185 -322 167 -120 -255 -203 235 328 -230 -44 350 323 -213 -687 189 189 87
8143 87 -197 -150 -245 -4 4 -20 -181 35 290 -84 -432 -312 351 53 -311 -431 328 9 -271 -164 23 159
8165 159 94 -131 61 305 44 385 -197 -132 16 336 -123 -346 207 209 -248 -481 57 133 131 -155 -183 428 -100
8188 -100 -19 -141 -31
8191c1
##END NTUPLES=NMR FID
##END=
