##TITLE=1H_Lac-B1
 PY-d5, 8 sc, 
 18.11.2019
##JCAMPDX= 6.0         $$ Bruker NMR JCAMP-DX V2.0
##DATA TYPE= NMR FID
##DATA CLASS= NTUPLES
##ORIGIN= UXNMR, Bruker Analytische Messtechnik GmbH
##OWNER= root
$$ XWIN-NMR		Version 3.5
$$ Mon Nov 18 14:28:18 2019 Russian Standard Time (UT+4h)  she@DPX200
##.OBSERVE FREQUENCY= 200.1315
##.OBSERVE NUCLEUS= ^1H
##.DELAY= (6, 6)
##.ACQUISITION MODE= SIMULTANEOUS
##.ACQUISITION SCHEME= undefined
##.AVERAGES= 8
##.DIGITISER RES= 18
##SPECTROMETER/DATA SYSTEM= spect
##.PULSE SEQUENCE= zg30
##.SOLVENT NAME= Pyr
##.SHIFT REFERENCE= (INTERNAL, Pyr, 0, 15.7039)
##AUDIT TRAIL= $$ (NUMBER, WHEN, WHO, WHERE, WHAT)
$$ ##TITLE= Audit trail, XWIN-NMR		Version 3.5
$$ ##JCAMPDX= 5.01
$$ ##ORIGIN= Bruker BioSpin GmbH
$$ ##OWNER= she
$$ F:/spectra/data/she/nmr/H-F/1/audita.txt
$$ ##AUDIT TRAIL=  $$ (NUMBER, WHEN, WHO, WHERE, WHAT)
(   1,<2019-11-18 14:27:16.25 +0400>,<she>,<DPX200>,
      <created by zg, POWCHK disabled, PULCHK disabled
       configuration hash MD5:
       00 E9 B6 7A A2 85 ED C7 34 08 36 98 17 FE 4E 26
       data hash MD5: 16K
       B4 A4 D0 1A 27 58 25 71 05 74 3D 35 94 27 A2 A1>)
$$ ##END=
$$ 
$$ hash MD5
$$ 95 F2 60 69 BA F9 7E AB 0A E7 1A 59 05 CC 6E B3
##$RELAX= 
##$RELAX= 
##$RELAX= 
##$RELAX= 
##$RELAX= 
##$RELAX= 
$$ Bruker specific parameters
$$ --------------------------
##$DU= <F:/spectra>
##$EXPNO= 1
##$NAME= <H-F>
##$PROCNO= 1
##$TYPE= <nmr>
##$USER= <she>
##$AMP= (0..31)
100 100 100 100 100 100 100 100 100 100 100 100 100 100 100 100 100 100 
100 100 100 100 100 100 100 100 100 100 100 100 100 100 
##$AQSEQ= 0
##$AQ_mod= 1
##$AUNM= <au_zg>
##$AUTOPOS= <>
##$BF1= 200.13
##$BF2= 200.13
##$BF3= 200.13
##$BF4= 200.13
##$BF5= 200.13
##$BF6= 200.13
##$BF7= 200.13
##$BF8= 200.13
##$BYTORDA= 1
##$CFDGTYP= 0
##$CFRGTYP= 5
##$CHEMSTR= <none>
##$CNST= (0..31)
1 1 145 1 1 1 1 1 1 1 1 1 1 1 1 1 1 1 1 1 1 1 1 1 1 1 1 1 1 1 1 1 
##$CPDPRG= <>
##$CPDPRG1= <>
##$CPDPRG2= <>
##$CPDPRG3= <>
##$CPDPRG4= <mlev>
##$CPDPRG5= <mlev>
##$CPDPRG6= <mlev>
##$CPDPRG7= <mlev>
##$CPDPRG8= <mlev>
##$CPDPRGB= <>
##$CPDPRGT= <>
##$D= (0..31)
0 1.2 0 0 0 0 0 0 0 0.06 0 0.03 0 0 0 0 0.0002 0 0 0 0 0 0 0 0 0 0 0 0 
0 0 0 
##$DATE= 1574072835
##$DBL= (0..7)
120 120 120 120 120 120 120 120 
##$DBP= (0..7)
150 150 150 150 150 150 150 150 
##$DBP07= 0
##$DBPNAM0= <>
##$DBPNAM1= <>
##$DBPNAM2= <>
##$DBPNAM3= <>
##$DBPNAM4= <>
##$DBPNAM5= <>
##$DBPNAM6= <>
##$DBPNAM7= <>
##$DBPOAL= (0..7)
0.5 0.5 0.5 0.5 0.5 0.5 0.5 0.5 
##$DBPOFFS= (0..7)
0 0 0 0 0 0 0 0 
##$DE= 6
##$DECBNUC= <off>
##$DECIM= 24
##$DECNUC= <off>
##$DECSTAT= 4
##$DIGMOD= 1
##$DIGTYP= 9
##$DL= (0..7)
0 120 120 120 120 120 120 120 
##$DP= (0..7)
150 150 150 150 150 150 150 150 
##$DP07= 0
##$DPNAME0= <>
##$DPNAME1= <>
##$DPNAME2= <>
##$DPNAME3= <>
##$DPNAME4= <>
##$DPNAME5= <>
##$DPNAME6= <>
##$DPNAME7= <>
##$DPOAL= (0..7)
0.5 0.5 0.5 0.5 0.5 0.5 0.5 0.5 
##$DPOFFS= (0..7)
0 0 0 0 0 0 0 0 
##$DQDMODE= 0
##$DR= 18
##$DS= 0
##$DSLIST= <SSSSSSSSSSSSSSS>
##$DSPFIRM= 0
$$ [...]
##$SUBNAM2= <"">
##$SUBNAM3= <"">
##$SUBNAM4= <"">
##$SUBNAM5= <"">
##$SUBNAM6= <"">
##$SUBNAM7= <"">
##$SUBNAM8= <"">
##$SUBNAM9= <"">
##$SW= 24.0689530833862
##$SWIBOX= (0..15)
0 0 2 0 0 0 0 0 0 0 0 0 0 0 0 0 
##$SW_h= 4816.95568400771
##$TD= 16384
##$TD0= 1
##$TE= 0
##$TE2= 300
##$TE3= 300
##$TEG= 300
##$TL= (0..7)
0 120 120 120 120 120 120 120 
##$TP= (0..7)
150 150 150 150 150 150 150 150 
##$TP07= 0
##$TPNAME0= <>
##$TPNAME1= <>
##$TPNAME2= <>
##$TPNAME3= <>
##$TPNAME4= <>
##$TPNAME5= <>
##$TPNAME6= <>
##$TPNAME7= <>
##$TPOAL= (0..7)
0.5 0.5 0.5 0.5 0.5 0.5 0.5 0.5 
##$TPOFFS= (0..7)
0 0 0 0 0 0 0 0 
##$TUNHIN= 0
##$TUNHOUT= 0
##$TUNXOUT= 0
##$USERA1= <user>
##$USERA2= <user>
##$USERA3= <user>
##$USERA4= <user>
##$USERA5= <user>
##$V9= 5
##$VALIST= <valist>
##$VCLIST= <CCCCCCCCCCCCCCC>
##$VD= 0
##$VDLIST= <DDDDDDDDDDDDDDD>
##$VPLIST= <PPPPPPPPPPPPPPP>
##$VTLIST= <TTTTTTTTTTTTTTT>
##$WBST= 1024
##$WBSW= 4
##$XGAIN= (0..3)
0 0 0 0 
##$XL= 0
##$YL= 0
##$YMAX_a= 249779
##$YMIN_a= -143826
##$ZGOPTNS= <>
##$ZL1= 120
##$ZL2= 120
##$ZL3= 120
##$ZL4= 120
##$ABSF1= 10
##$ABSF2= 0
##$ABSG= 5
##$ABSL= 3
##$ALPHA= 0
##$AQORDER= 0
##$ASSFAC= 0
##$ASSFACI= 0
##$ASSFACX= 0
##$ASSWID= 0
##$AUNMP= <proc_1d>
##$AZFE= 0.1
##$AZFW= 0.1
##$BCFW= 1
##$BC_mod= 2
##$BYTORDP= 1
##$COROFFS= 0
##$CY= 11.3945322036743
##$DATMOD= 1
##$DC= 2
##$DFILT= <>
##$DTYPP= 0
##$F1P= 16.9975609425685
##$F2P= -3.02152046262296
##$FCOR= 0.5
##$FTSIZE= 0
##$FT_mod= 4
##$GAMMA= 1
##$GB= 0.15
##$INTBC= 1
##$INTSCL= 1
##$ISEN= 128
##$LB= 0.24
##$LEV0= 0
##$LPBIN= 0
##$MAXI= 10000
##$MC2= 0
##$MEAN= 0
##$ME_mod= 0
##$MI= 1.114404
##$NCOEF= 0
##$NC_proc= 0
##$NLEV= 6
##$NOISF1= 3.799351
##$NOISF2= 2.8
##$NSP= 1
##$NTH_PI= 0
##$NZP= 0
##$OFFSET= 15.70392
##$PC= 1
##$PHC0= -9442.354
##$PHC1= 34.00087
##$PH_mod= 1
##$PKNL= yes
##$PPARMOD= 0
##$PSCAL= 0
##$PSIGN= 0
##$REVERSE= no
##$SF= 200.130013532006
##$SI= 16384
##$SIGF1= 3
##$SIGF2= 2
##$SINO= 400
##$SIOLD= 16384
##$SREGLST= <1H.CDCl3>
##$SSB= 0
##$STSI= 0
##$STSR= 0
##$SW_p= 3612.71676300578
##$SYMM= 0
##$S_DEV= 0
##$TDeff= 0
##$TDoff= 0
##$TI= <>
##$TILT= no
##$TM1= 0
##$TM2= 0
##$TOPLEV= 0
##$USERP1= <user>
##$USERP2= <user>
##$USERP3= <user>
##$USERP4= <user>
##$USERP5= <user>
##$WDW= 1
##$XDIM= 8192
##$YMAX_p= 0
##$YMIN_p= 0
$$ End of Bruker specific parameters
$$ ---------------------------------
##NTUPLES= NMR FID
##VAR_NAME=  TIME,          FID/REAL,        FID/IMAG
##SYMBOL=    X,             R,               I
##VAR_TYPE=  INDEPENDENT,   DEPENDENT,       DEPENDENT
##VAR_FORM=  AFFN,          ASDF,            ASDF
##VAR_DIM=   8192,          8192,            8192
##UNITS=     SECONDS,       ARBITRARY UNITS, ARBITRARY UNITS
##FACTOR=    0.0002076,     1,               1
##FIRST=     0,             0,               0
##LAST=      1.7004516,     0,               0
##MIN=       0,             -143826,         0
##MAX=       1.7004516,     249779,          0
$$ Real data points
##PAGE= N=1
##DATA TABLE= (X++(R..R)), XYDATA
$$ [...]
2072b96O43r94o31J649N44j867m3J541L04j582p44J327j78r44M00Q28R7j418L91
2091i73J539K38j075l5N18l13k56K00N15m86r25O67J023j20q89n99M18K78l5l23
2111f33O20M53o05j56J194N74j334p10O32P86j116o31R33L04j462J87J811j02
2129G45j195o41J825O61j860n14J757k28j583P03J466m39j596K09J825r53j506
2146a324M51J277p65q19J419J222j226r45J277J145j473j458J206R07j433j41
2162f80J233%j319J68J237L87j102m83O15q0m53Q87J048o69r56K88P00r0l73k9
2182C29k79j05P6L02k29L6K19J39K38N8J72l91l68P01j59k33o65O19L64o06K12
2203D30l7Lp75j30J200L21j320J39P28M20p78L70O24n90r88R3J223m21j230P60
$$ plain form
2072 -296 347 -647 -1278 371 915 -952 -995 546 850 -732 -1476 -149 -327 -1271 -871 -43 54 -1364 -973
2091 -973 566 804 -271 -306 212 -101 -357 -157 358 -128 -1053 -386 637 517 -372 -971 -553 -275 -310 -633
2111 -633 -13 440 -165 -321 873 1447 113 -597 35 821 -295 -926 7 311 -1151 -964 847 745
2129 745 -450 -1091 734 1395 -465 -979 778 550 -1033 -330 1136 697 -899 -690 1135 182 -1324
2146 -1324 -873 404 -361 -1180 239 1461 235 -710 567 1712 239 -1219 -13 894 -539 -680
2162 -680 553 553 -766 -598 639 1026 -76 -559 56 -24 -477 410 1458 789 -167 121 821 731 358 329
2182 329 50 -55 21 323 94 130 349 488 726 784 956 565 197 898 739 506 -159 460 824 218 430
2203 430 393 396 -379 -509 691 1012 -308 -169 559 979 201 571 1195 605 -383 -290 933 512 -718 42
2223D2J17m1n67Q14O07o44q71O70O49o43m73L04P58n10p7k62M08p6o80O37K93
2244D55o56o88J70R83M69n27n88J141r7j157P01R43n48j420L06J239m49j040O54
2263a09J142p10j352J068R73j004j134J429P71j064r91J571J116j480r49J532
2279H09M20k031o67J829P84j978n79J835N76j645Q4J685j98j702l19J897r6j505
2297h01oJ698o72j088M47J271r76j523J358J149r94j323P96J163l61j024J016
2314A30P12r68j114J212N13q08q88O74P07m89n34R13K84q08l62Q45L60q15l84
2333h20N01L23o20K89M78J02p32j41M35J11m70k34O51m8k7j13M73M0q7k66J59
2354Dr7l59L79J56m45j84K45L60k88R4J08j19r0l9K04p1k23M42j75l0j40J39K34
$$ plain form
2223 42 159 118 -449 365 972 328 -543 127 776 133 -340 -36 722 212 135 -127 281 205 -475 162 455
2244 455 -201 -889 -719 264 733 206 -382 759 662 -495 206 1149 601 -819 -513 726 277 -763 -109
2263 -109 1033 323 -1029 39 1012 8 -1126 303 1074 10 -981 590 1706 226 -723 809
2279 809 1229 -802 -1469 360 1144 -834 -1413 422 998 -647 -563 1122 924 -778 -1097 800 704 -801
2297 -801 -807 891 219 -869 -422 849 -127 -1650 -292 857 -137 -1460 -664 499 138 -886 130
2314 130 842 -126 -1240 -28 485 -323 -1211 -537 170 -319 -853 60 344 -464 -826 19 379 -436 -820
2333 -820 -319 4 -616 -327 151 253 -479 -620 -185 -74 -544 -778 -127 -175 -202 -315 158 198 111 -155 4
2354 4 -93 -452 -73 83 -362 -546 -301 59 -229 -135 -27 -146 -236 -275 -71 -142 -365 77 -98 -128 -268 -129 105
2377A05o37J54N90k74l33N5M36j78o66P76M05n76n58N33O48m77m71K74L90m98
2397c02m40Q53L60o37m74N88L61p68k01R16K52j197L2R64M49j293j46J496J6j629
2417h00J83J292j51j443P09J017j08j391M01Q25l8j071K91J459o66j734Q76J528
2435A179q36j098O56J049j020j144J084J332j356o37P95J166j204q13J275Q26
2451A254j337p80J438L15j531k03J438L90j525O1J191L25j396l67J569j05j287
2468e50J47J092j69p27K93J063p15j104L26J395m60r92L2J422j206o34Q07Q81
2486I01n63p99O12P21o25r95Q25R80p99n88N37M43p00j14J41N69o00m06Q53k37
2506A56m23L40N11R7q22q1O47n8n26J76K97l09j00K63M5P0k67L29R1p14L70r9
$$ plain form
2377 105 -532 -378 212 -62 -395 -340 96 -82 -748 28 433 -143 -701 -168 480 3 -468 -194 196 -302
2397 -302 -742 111 471 -166 -640 -52 309 -459 -660 256 508 -689 -657 307 756 -537 -683 813 829 -800
2417 -800 -617 675 524 -919 -210 807 699 -692 -291 534 496 -575 -284 1175 509 -1225 -349 1179
2435 1179 343 -755 -99 950 -70 -1214 -130 1202 -154 -791 4 1170 -34 -847 428 1254
2451 1254 -83 -863 575 890 -641 -844 594 984 -541 -480 711 1036 -360 -727 842 737 -550
2468 -550 -403 689 520 -207 86 1149 434 -670 -344 1051 591 -401 -369 1053 -153 -787 20 901
2486 901 338 -461 151 872 247 -748 77 1057 258 -330 207 650 -50 -164 -23 546 -54 -460 393 156
2506 156 -267 73 584 681 -141 -222 425 367 -159 17 314 5 -95 168 213 283 16 345 436 -278 92 -7
2528gK28j61j09M09j81o73M55K36rj95j60M20l37k22M15R9m81k8Q40j64j115L47
2550c93P67m6o06K82N47n75n69N91O57o86m34P00N0k94o11Q90K84n39p76J113
2570C52P14j094p17J058Q9p56l90Q81K85j092l4J012L42j144K11R51l86p87n0
2589e55J169l08j188K55J269m09p88J87J009l05j297O76O92l20l88q8R96o08r08
2608i09N27J357p06q97L36Q39q36k15K87O90n92l29J38Q02m48o73M50P09m75q02
2628g47Q26M05p84m16J039L32p87n97R12K93p28j24N30K07j118p1J429o0r27k4
2648d10R13l93m43m9O44m6q02K95P77k19o92M53L19m01n40L22P49o41m74L23P91
2669D76n63l53M93J93l98J33N5jm23P0M00ol62n0N01J13l98L60k85o2l8K86l2
$$ plain form
2528 -7 221 60 -49 360 179 -494 -39 197 188 -7 -167 253 -84 -306 109 208 -273 -301 539 375 -740 -393
2550 -393 374 328 -278 4 551 -24 -593 -2 655 -31 -465 235 285 -9 -620 270 554 15 -761 352
2570 352 1066 -28 -745 313 402 -354 -744 137 422 -670 -704 308 650 -494 -283 668 282 -505 -555
2589 -555 614 306 -882 -627 642 233 -555 -368 641 336 -961 -285 407 87 -301 -389 607 -1 -909
2608 -909 -382 975 269 -628 -292 547 -289 -504 -217 473 -119 -448 -310 492 44 -629 -179 530 55 -747
2628 -747 79 484 -300 -716 323 655 -132 -729 183 476 -252 -376 154 361 -757 -828 601 541 -386 -410
2648 -410 503 110 -333 -382 262 216 -586 -291 486 267 -425 28 347 -54 -594 -272 477 -164 -638 -315 476
2669 476 -87 -440 53 246 -152 -19 36 35 -388 -318 82 76 -286 -336 165 278 -120 240 -45 -107 -145 141 109
2692A09q6l4J56k52J2M30M4o40k28P01K77p78K26L26k28o41O74L79n41m24J95
2713c23P97k61p45O98L04p84M4Q39L20q96o90O91J96k53j78N60k13o28O81K68
2733D27M5m49o77Q23K00m07J65j90K22k82K22L20j43k36l72M67j61L65n71J24
2753a08J55r0n8K16J88k85j84L15J96m82q8J32P53m82m31M00M93j128j8J011J94
2774F99q55j85P21J49o89J76M17m38k80j28Q37j4j005J10Q46n7p88L19R73q65
2794e7n49Q09O95r84l19K94M52r1m81L06L23r49P5J127M0j073P2L27L67m99J02
2815a3L54k11m05N08L20l50j57k43J79K06L7j05k24j41L06j21M31j41k79J4k25
2836b60L55M68o86l25K88M87p86J94M30k24l99L56M92l7r41J25J038l92n94N09
$$ plain form
2692 109 23 -11 145 -107 -95 335 379 -261 -489 212 489 -289 -63 263 35 -606 68 447 -94 -518 -323
2713 -323 474 213 -532 166 470 -314 -270 569 889 -7 -697 -6 190 -63 -241 319 106 -522 159 427
2733 427 472 23 -654 169 369 -38 127 -63 159 -123 99 419 276 40 -332 135 -26 339 -232 -108
2753 -108 47 -43 -101 115 303 18 -166 149 345 -137 -225 -93 660 178 -253 147 640 -488 -506 505 699
2774 699 -156 -341 380 529 -160 16 433 -5 -285 -413 424 410 -595 -485 361 304 -484 -165 808 -57
2794 -57 -606 203 898 -86 -405 -111 341 250 -231 75 398 -551 -476 651 691 -382 -310 17 384 -115 -13
2815 -13 341 130 -275 233 553 203 46 -197 -18 188 225 120 -104 -245 61 -60 371 230 -49 -35 -260
2836 -260 95 563 -123 -448 -160 327 -459 -265 165 -59 -458 -102 390 353 -588 -463 575 183 -411 98
2856I8P24r60n16N52J091j256q31J033K87m11l29P46J04p94K67R77l36q45k33
2875f32J200l3p91J69R6Q4q36P45O45q66o48O52K96K15p18M46K4j38P1J88K00
2896C69l98l45L53J87M7k72k08N6N3J99k79J73r6M41m04L94k93J44l36J27L91
2917C03l50q7K23j26l86O6M53J54m46J38J76m2J65k30K54j68k39N9N29k68m33
2938b55k9L41L08n78K19j29J31k24L53K15m23j54K57J05J7j9k63L4M6r1J53J0
2960B4k24L47m49J72N4J34M5m69P02J0l39q9L93k58m93O21J9j35m40Q5R14o45
2982b1k80Q0L09L4m56K39Q71p85m13P97J53p32k33M45K77q44j12J237P5j026j12
3003d97P87K66j129J72P98j65q77P69P00p95r90N95Q95n19p95M73Q10p44l64R11
$$ plain form
2856 98 822 -138 -654 -102 989 -267 -1098 -65 222 -189 -518 228 332 -462 -195 782 446 -399 -632
2875 -632 568 535 -256 -87 9 93 -743 2 647 -219 -867 -215 81 296 -422 24 48 -90 -19 169 369
2896 369 -29 -374 -21 166 213 -59 -267 -211 -158 41 -238 -65 -161 280 -124 270 -23 121 -215 -88 303
2917 303 -47 -134 89 -37 -423 -357 96 250 -196 -58 118 76 241 11 265 97 -142 -83 446 178 -255
2938 -255 -284 57 365 -213 6 -123 8 -216 137 352 -71 -225 32 137 154 135 -128 -94 -48 -139 14 24
2960 24 -200 147 -302 -130 -76 58 103 -366 336 346 7 -82 311 53 -440 181 200 65 -375 -290 624 -21
2982 -21 -301 -221 88 122 -334 -95 776 -9 -422 375 528 -204 -437 8 285 -559 -671 566 641 -385 -497
3003 -497 290 556 -573 -401 397 232 -645 124 824 29 -961 -366 529 10 -785 -312 498 -246 -610 301
3023C01L60n11o57M30R22p99m62P33K18o82j59K35N06p80k76Q02R1q42m8Q30K35
3044D47n95k58J074j12p07j39J094p20l60M5L23L57p69J70L49k76l74L13J68L03
3064C33o53K66N10l03p57L34L80m6n21M29N37m77l97L55L44m80k80R41k19m68
3084a72k30N25j25j32k09Q69j56n07K04j26J30l87N29K2m78p6M24J99l87JK57
3105A75J65m27J72J02R2m88j6K40K22m42l5M99qn87J71M31k01k44M88J44l95k85
3127b27M61J18m78JK01K03m00m74P82K34j010L78M21j37l49J6M99j44o42M46P43
3148F42j10j078M50L75j69o25O50M67p33l10M55M48p79j52N83O87j046j32Q36
3167D59K29p35l61P35J73o34n67R66K58j030J05R32j93p96J83R69J50r78K8N15
$$ plain form
3023 301 661 150 -507 -77 845 46 -416 317 535 -147 -306 -71 435 -345 -621 181 272 -570 -618 212 447
3044 447 -148 -406 668 556 -151 -290 804 84 -276 -231 92 449 -320 -150 199 -77 -451 -138 30 333
3064 333 -320 -54 456 153 -604 -270 110 64 -457 -28 509 32 -365 -10 334 -146 -426 515 296 -172
3084 -172 -402 123 -2 -134 -343 526 370 -137 67 -59 71 -316 213 235 -243 -319 105 304 -83 -82 175
3105 175 340 -87 85 187 279 -209 -225 15 237 -205 -240 259 251 -336 -165 266 65 -179 309 453 58 -227
3127 -227 234 352 -126 -125 76 279 -121 -595 187 421 -589 -211 210 73 -276 -260 239 95 -547 -101 642
3148 642 532 -546 -96 279 110 -515 135 602 -131 -441 14 462 -317 -469 114 801 -245 -377 459
3167 459 688 -47 -408 327 500 -134 -701 265 523 -507 -402 530 337 -459 -276 693 843 -135 -107 408
3187D08j93m88O4R23j76p52J00P57n60n60N15K89k90p35N98Q46o51p55J016O07
3207I63j184k98Q12M34p68n18P94K46r27J17N01J20l33k80N26L33j091K49O96
3226C92j82m69L46K30R3p90q3O25l14k72K10L87m79R9K52M81n29j58L13M32n74
3247A0l09M90L06p07l42N35P3j79j41N42p1o35K51J44J16L8L4p2K15k80p5N30
3269D73o12j44N23j12j74l91N74J25m09o5O84l29l29k9K69L80p40L48L49n29l68
3290e06L31L61n12L37J34j48j88k53P45r6l91l36N77K64o36K44M38k75l81q5L71
3311ej33k34p1M25Ml71J93K82k41k70K12K48k08k31J28N78j9p49L73L06k82p58
3333h23Q48J38m04m7J37L03k34n46O06Q33p29m22N01J58n44m30R07M43j041k44
$$ plain form
3187 408 215 -273 -209 714 538 -214 -114 643 83 -477 38 327 37 -698 -100 746 95 -660 356 963
3207 963 -221 -519 293 727 -41 -559 235 481 -446 -329 172 292 -41 -321 205 538 -553 -304 392
3226 392 210 -259 87 317 410 -380 -463 162 -152 -424 -214 173 -306 -207 45 526 -3 -161 152 584 10
3247 10 -299 191 497 -210 -552 -17 56 -123 -264 278 207 -428 -177 -33 83 121 155 83 298 18 -57 473
3269 473 -139 -283 240 128 -46 -437 137 262 -147 -212 472 143 -186 -215 54 434 -306 42 391 -138 -506
3290 -506 -175 186 -326 11 145 -3 -191 -444 301 205 -186 -522 55 319 -317 -73 365 90 -291 -376 -5
3311 -5 -138 -372 -443 -18 -14 -385 -192 90 -151 -421 -209 39 -169 -400 -272 306 287 -462 -89 217 -65 -823
3333 -823 25 163 -241 -288 -151 152 -82 -628 -22 811 82 -340 161 319 -225 -655 252 695 -346 -590
3353e90J080l1p42j14O68J27j016J37J123k78q77M38R75p50p10L71P15m37n27
3372d38L85L45o32l40J152N6n22n86R02K90p55l71R79k72l66r2Q36l29m90l73
3392f21O11Lm62M40L54m46l51N93K30j96m14M87nk78j26L84M03o38j80J56O04
3413E48m76j44J03k80M98j4k8l86J51k59L56J88n5j03j07M4J07L13m60k6O1J05
3435A36j7l8K59n05J43K48K55N9n88L04J76l85M00j68j19k42j06M39K92m36L2
3456A39J3j07K95p8J16n91K94p4N3J73O0k87k73O0L52J05m49J11K76n63K93J05
3478B3N19q00p3O64k7k12n36Q06Pl06m76P38j56p16J24Q47r2m60j52K23J97l87
3500b45N23J54n33m71L82R16r41L2N34K3o72r2N83K27p07R8P38j0q59M14L44R
$$ plain form
3353 -590 490 459 -283 -397 271 398 -618 -481 642 364 -513 -75 900 150 -560 -189 526 89 -438
3372 -438 -53 292 -340 -680 472 528 6 -580 322 612 -143 -514 465 193 -173 -265 571 242 -248 -621
3392 -621 -10 -7 -469 -29 325 -121 -472 121 351 155 -259 228 223 -55 -181 203 606 -32 -212 -56 548
3413 548 72 -72 31 -249 249 235 207 -179 -28 -287 69 257 202 99 -8 36 143 456 -4 -30 31 136
3435 136 119 81 340 -165 -22 226 481 540 -48 256 432 47 447 279 160 -82 -188 251 543 107 139
3456 139 152 45 340 262 378 -213 81 7 60 233 293 6 -267 -207 145 250 -199 -88 188 -375 -82 23
3478 23 542 -258 -331 333 306 94 -442 364 371 65 -411 327 171 -545 -421 426 334 -126 -278 -55 142 -245
3500 -245 278 432 -101 -572 -190 726 -215 -183 351 374 -298 -390 193 420 -287 -189 549 539 -320 94 438 447
3522D47o33L23K14j30n86K96M59k35n40K99K84o4l46M21k70kj04N27L9o11L6j8
3544a94J92k87K36n04K14j01M36r1Q3j79K5j56m4L89n2j64J7J30J13k35J13qn41
3567f08kJ82K43j91M0J9k4l1L21J73j2m25q6M58p6j46ro8K6q4J63K19l33j34L54
3592c1K9k22O7J83jk56N8N04m48K0r9K42J25k37j8L97j64j04K2J22o44L12K44
3615A01P9P2m71L45l08j1J57J04l35K9K46J02l42L96m52l4l8K32K18k19j68J86
3637a11K49k9j27RR5n05J25J34P1l82J1P98l50k54r3M31k58q4M44r3j54m2K79
3660A64J46l06k13K36P4l45J70R3J49l20k21L12K52j34j69L00K9l79L30p7j51
3681f0L15j91r2J09K33p2n9J12L0k7k51k4J22K5k46L24O4j40k60K42j16j52p9
$$ plain form
3522 447 -186 137 351 221 -365 -69 390 155 -385 -86 198 134 -212 209 -61 -63 -167 360 399 -212 -176 -194
3544 -194 -2 -289 -53 -557 -343 -444 -8 -99 -16 -195 -170 -326 -370 19 -33 -197 -180 -50 63 -172 -59 -67 -608
3567 -608 -610 -428 -185 -376 -336 -317 -341 -372 -51 122 110 -315 -401 57 -19 -165 -174 -242 -216 -300 -137 82 -251 -385 -31
3592 -31 -2 -224 -157 26 25 -231 -173 331 -117 -97 -196 46 171 -66 -84 313 149 45 67 189 -455 -143 101
3615 101 180 252 -219 126 -182 -193 -36 68 -267 -238 8 110 -232 164 -288 -322 -360 -128 90 -129 -297 -111
3637 -111 138 109 -18 -9 86 -419 -294 -160 -89 -471 -460 338 -12 -266 -359 72 -186 -270 174 81 -73 -115 164
3660 164 310 4 -209 27 101 -244 -74 19 168 -152 -373 -61 191 57 -112 188 217 -162 168 91 -60
3681 -60 255 64 -28 81 314 242 183 295 325 298 47 23 145 170 -76 248 312 172 -88 154 38 -114 -193
3704a93M99k60P1k73N15l1r8k91L36Q9l54L2l7L93m51M8K35j55l00K43K17k62
3726b7j43J40M35j49j06j82J70km25N12K27l07j08m8J95K0l48K36K94p0j30k7
3748A57N14p87m4K64K69k63n0K20N12p56J6M78n3l42j42M77j03k48n26Q26l59
3769F0k07m0O99J39p80J47M48p3m59OK22o2n19L54K85j35j94J33L10k27m21M25
3791A11K52m55P6m6L06m03M7J03K36m03q2N79m96J06k24K13O3j21K2O2J1k77J92
3814a28K86k05j14J44K10k18L8k39n6L45n36L72O9J80m78K86L63l27l52N43O7
3835B50m34q3K98n7k08r9N37l4l61j37M00N5m55N62r3L4k83J86l2q3o3Q6M28n56
3859a42o1K66p8k08K78M28o50Q1r7L72m52L2J23M48n85r8M84m01J62l46L37L35
$$ plain form
3704 -193 306 46 117 -156 359 328 230 -61 275 364 10 42 5 398 -53 -5 230 75 -225 18 235 -27
3726 -27 -170 -30 405 256 150 -32 138 136 -289 223 450 143 35 -13 182 202 -146 90 384 314 184 157
3748 157 671 -116 -160 104 373 110 60 280 792 36 52 530 477 135 -7 470 367 119 -407 419 60
3769 60 -147 -187 512 651 -129 18 466 393 -66 -60 162 100 -419 -65 220 85 -109 24 334 107 -314 111
3791 111 363 -92 -16 -62 244 -159 -112 -9 227 -176 -258 321 -175 -69 -293 -80 -17 -138 -116 -54 -43 -320 -128
3814 -128 158 -47 -161 -17 193 -25 13 -226 -282 63 -473 -101 -32 148 -330 -44 319 -8 -360 183 250
3835 250 -184 -267 31 -26 -234 -333 204 170 -191 -328 72 127 -328 234 141 175 -108 78 46 -37 -100 -14 414 -142
3859 -142 -203 63 -15 -223 55 483 -167 -86 -183 189 -263 -231 -108 340 -245 -343 141 -260 -98 -444 -107 228
3881B28k91k17P4L41l03k48O26j80l43J11Q6L27l28k62M76j39l90J56L55p6m91
3902d88J36M84j03l77N5K99J07l82J34N14l32l39K34N54n99j67J69M59n47j01
3922b90L54J23m76q7M86L66m39m91P35Mo81J52N14R9n27k45O83o4n75pM59l4l54
3945b95J27N43n79k29M53L10k19n71M33L36k80l67K04O10q65K9L63K36n65j26
3965d52M41L89n52k66Q52l0n45m4N19j51o13L78O89r28n7M78J9p2l77J08O78p80
3987c16J64J50J90j30k21J59K5J8N5K06k94N2j30K57k53P7J97J9K15o14M39R6
4009C61j21j75m5L58l28k5R0j82K35k09k03N80j74N2p4L61m03k26L55K7k41K33
4031B46j55N5k5J72J23m4n28k9M19l0k30K21R6k53j92J33M14k66L8l32J61J49
$$ plain form
3881 228 -63 -280 -206 135 -168 -416 210 30 -313 -202 -116 211 -117 -379 97 -42 -432 -276 79 3 -488
3902 -488 -352 132 29 -348 -293 6 113 -269 -135 379 47 -292 -58 496 -103 -270 -101 358 -189 -290
3922 -290 64 187 -289 -376 110 476 37 -454 281 285 -396 -244 270 369 -158 -403 280 216 -359 -366 93 59 -295
3945 -295 -168 375 -204 -433 20 330 111 -460 -27 309 29 -338 -134 476 -389 -360 3 239 -326 -452
3965 -452 -11 378 -174 -440 412 382 -163 -207 312 161 -452 -74 615 -313 -370 108 127 55 -322 -214 464 -316
3987 -316 -152 -2 188 58 -163 -4 21 39 94 300 6 58 -72 185 -68 9 206 225 440 -174 265 361
4009 361 240 65 20 378 50 25 115 -67 168 -41 -244 336 162 214 140 501 98 -128 227 254 13 246
4031 246 91 146 121 293 416 372 -156 -185 234 204 -26 195 291 38 -154 -21 393 127 165 -167 -6 143
4053A43n01Q03k42j88l50M04J65k21n6K18K27m09k90L53L06n18J6M46K96r76L24
4074e0N95k36o46N26M07k79q30L28Q01o19l04J30N77l73j76K84K14k17l74L99
4094A57N45j099q0M92J74m62q1M58k22J02o1N26j09m95k49P34j44l87j1L22q8
4115B2j53K19K39m08j41K57K03m13J57K25q4l68r0K24O3o1j12K28L1j10N3ok85
4138c10O7J57j4j12Nj24L82N7j14j9k44K9j38O04l29j3j18QL21n5j7P7j22n1j54
4163b27J91k9M5k68M19r1j89k23K80J30r6k84M01K48o49N5L73KP0m79L07O9l7
4186A8m5J52k39m28P90O7j65l61N2L25Q7o07P94m19k92j62P71J76o82m8M93j70
4208A07m43L12P4k10m80K91M23J40n26J74K97J8n35M23J44l31kK84L40q82RJ48
$$ plain form
4053 143 -358 445 203 15 -335 69 234 13 -43 175 402 -7 -297 56 362 -156 -140 306 602 -374 -50
4074 -50 545 309 -337 189 596 317 -513 -185 616 -3 -307 -177 400 27 -149 135 349 132 -242 157
4094 157 702 -397 -477 15 189 -273 -354 104 -118 -16 -77 449 340 -155 -404 330 186 -201 -212 110 22
4115 22 -131 88 327 -81 -222 35 238 -175 -18 207 123 -245 -335 -111 -48 -109 -221 7 38 -72 -19 -25 -310
4138 -310 -243 -86 -100 -212 -207 -331 51 108 -6 -25 -269 -240 -378 226 -103 -116 -234 -226 95 40 23 100 -22 -73 -227
4163 -227 -36 -65 -20 -288 131 40 -149 -372 -92 38 -58 -342 59 307 -342 -287 86 88 158 -321 -14 55 18
4186 18 -27 125 -114 -542 248 315 150 -211 -159 166 253 -354 440 21 -271 -433 338 514 -168 -216 277 107
4208 107 -336 -24 50 -160 -640 -349 74 214 -312 -138 159 177 -358 65 209 -122 -124 160 500 -382 -373 -225
4230b25L52n38M46j74J34j10q0K88J42l13k29M08M9j28K1Lj69j90L26J99n6j52
4252DO1k15Q2J37kl5l59M00R4n7j9k66J31K58k73j71j03L00mj92Q1L03Kl09L26
4277A74j24m2J14k23P7K0k29M08L9l30R6J49M17m12k07K01J8k90Q3L09m76K01
4299b7k67M85R9l58L4m7p8P4J3K64m14J03o0N04n23K62K36k27J32m79M23k30R
4322g2j5K22j44J23p8R6j66J70j90K51k62O4K51j83P8J22k03J17j95J63o8P8L0
4345A89k52J29p5J81l43J20m6J50J3j44OQ1O2k4k31K31rJ30n98P91k46N5J60m12
4369h2M5j1l5o5K00k83J81K80l49J78l80M25NL2o6J22j41l22J80K24j27J01j2
4392A00J82m60J57Q0J66j42ol0K51k47J98K9k50P5l11J92K35l46o7K10Rj8J53
$$ plain form
4230 -225 127 -411 35 -139 -5 -115 -195 93 235 -78 -307 101 150 22 43 46 -123 -313 13 212 156 4
4252 4 65 -150 -68 69 67 32 -327 73 167 110 91 -175 -44 214 -59 -230 -333 -33 -37 -229 -148 155 157 -152 174
4277 174 50 8 122 -101 -24 -4 -233 175 214 -116 -20 129 546 134 -73 128 146 -144 -61 248 -228 -27
4299 -27 -294 191 290 -68 -34 -81 -159 -85 -72 192 -222 -119 -179 325 -198 64 300 73 205 -274 149 -81 -72
4322 -72 -87 135 -9 114 36 132 -34 136 -54 197 -65 -1 250 67 145 267 64 181 -14 149 81 159 189
4345 189 -63 66 -9 172 -171 -51 -97 53 66 -78 -72 9 71 47 -184 47 38 168 -430 361 115 170 330 -82
4369 -82 -37 -48 -83 -148 52 -231 -50 230 -119 59 -321 104 109 141 75 197 56 -266 -86 138 11 112 100
4392 100 282 -178 -21 59 225 83 77 47 298 51 249 278 28 103 -208 -16 219 -127 -194 16 25 7 160
4415A60k59M8J89n00N75O4O5m44j59J66J73j92J14K54p9m41J14l5M93l30O6j7
4437B5J91l36l4J59M3k85K8K52j58P0p9L98n97K36J90j59J36j01j34l0J31J21
4459F7M5L04l03o8M0j65j11K15j30J87J34l76K25j52n6K5Q0K21k53R8k17J32N6
4482bk89K16K05j48m7l00K55K57l33J75J0R6k30M53j07k60J6l3M75m58j80J07
4504a22L37oj94k27M55l99l14L00K98j99l60M48J61j65n39N04Ok20%J69L4j02
4526a35k5N18l84l14N9N09k14k95O3L97o15L44J16p6j90l3K95L7l40k1M25k17
4548i6N1r6K89o5n9K7j94OJ29rJ79k0k90O6J68M9j55Q1J58m34K55j99Q7K9J34
4573I1M7l80L03k90K50l6j42r5N4L17Oj55K44k99j83J19NL25l97K9L37p9m49m1
$$ plain form
4415 160 -99 -51 138 -362 213 277 342 -102 -261 -95 78 -114 0 254 175 -266 -152 -187 306 -24 42 25
4437 25 216 -120 -154 5 48 -237 -209 43 -115 -45 -124 274 -323 -87 103 -56 80 -21 -155 -185 -54 67
4459 67 112 416 113 45 85 -80 -191 24 -106 81 215 -161 64 -88 -144 -119 -39 182 -71 27 -190 -58 -2
4482 -2 -291 -75 130 -18 -65 -365 -110 147 -186 -11 -1 95 -135 318 211 -49 -33 -66 409 -49 -229 -122
4504 -122 215 209 15 -212 243 -156 -470 -170 128 -71 -431 17 178 13 -526 -22 -16 -236 -236 -67 -33 -135
4526 -135 -160 358 -26 -340 -281 228 14 -281 -218 179 -436 -92 24 -52 -242 -275 20 57 -283 -304 121 -96
4548 -96 -45 -141 148 83 24 51 -143 -137 -8 -17 162 142 -148 -82 86 135 -20 61 219 -215 40 -159 -72 -43 91
4573 91 138 -242 61 -229 21 -15 -157 -252 -198 119 125 -30 214 -85 -268 -149 -144 181 -216 -187 150 71 -378 -419
4597d19O22m12R8J98K0L6j24j12J25j81k47O67l28L9%J16J24l62q0M71j44k82
4619a75J53mK81l37k52M80J90l63J26J66j50j46j56L50K13p01m7N11J88l33K21
4640B15J59n12J77k62N18l94j29M84%l31l02M43J51m73q1L69n3k5j30K75Q9l85
4662a97r9M88k4k91K08L58l46m43J98K97l50J43J2L57m53j25L15J04l58j88L45
4683d9R1l34kK99J43m83k06M97Q4K33j77k4j73J33p8K18k78M3M7Q5Lk03P8M24
4707C71J2o96M23K21k74N5j26Q2J17k49pQ3k71J62N5NM3l94M18ok37J69J34j3
4731G7q4J19K04j60o3m3J95k13j92k26O00k65lJ40R2p8n05O43M2j93k45j8L29
4754A53k28j22J84K19r1o14O45n2K2m28N28j72j68O4J68J29n84N8M14l7k99K09
$$ plain form
4597 -419 203 -209 -111 87 107 143 19 -93 32 -149 -396 271 -57 -18 -18 98 222 -140 -220 251 107 -175
4619 -175 -22 -26 255 -82 -334 146 336 -27 99 265 115 -31 -187 163 376 -325 -372 139 327 -6 215
4640 215 374 -138 39 -223 295 -99 -228 256 256 -75 -377 66 217 -256 -337 32 -21 -46 -176 99 188 -197
4662 -197 -296 192 168 -123 85 443 97 -346 -148 149 -201 -58 -46 311 -142 -267 48 152 -206 -394 -49
4683 -49 42 -292 -294 5 148 -335 -541 -44 40 273 96 72 -101 32 -46 172 -106 -63 -16 69 72 -131 -53 371
4707 371 383 -313 110 331 57 112 -14 68 185 -64 -71 12 -259 -97 -42 -37 6 -388 30 24 -213 -44 90 77
4731 77 -7 112 316 156 93 50 245 32 -160 -386 214 -51 -54 86 178 100 -405 238 280 87 -158 -176 153
4754 153 -75 -197 -13 206 115 -499 146 94 116 -312 216 44 -124 -60 108 237 -347 -289 125 88 -211 -2
4776bK99l10o5J44K22p3m33M5J11r0k0L91k0k96J1L62j10k46k34M52N8k92P9K2
4800Ej72j47M90Q6k30k84R7N92m98j88Q2N38p08M4O67k69k10J2K07k00k81L19
4822d8L2m4k88J64K05K57k80j2J18l6j84l9P5Qj13J39L80n25m0j93M91o7j39J06
4846c3L65o99K71n0N84m81j58L22O3j37m29Q2K12p8k22L55N5j20k04M03j08j8
4868b5k30L99K5n15K58L61j64k77j7M02o2l32L8K39J84m84J2L97k3n10M14K16
4890C06m0m4m20N41k85k82O06k56l00j49O08K9n51K7O22l29k7j98J82J19n00K86
4912e5J44o9r5J66j7j35k7J31L50l32l57L97K24k01m39L98J9m69K90L63l62j01
4934a77J86j57K83m56L16J9j27J04J71j09q8J07n7J16l04j41N00k55R0k14M27
$$ plain form
4776 -2 297 -13 -78 66 288 215 -218 -173 -62 -152 -172 219 199 -97 -86 276 166 -80 -314 138 196 -96 -17 5
4800 5 -167 -314 176 262 32 -252 -155 437 -61 -249 -167 371 -337 -293 374 105 -105 -93 114 -86 -367 -48
4822 -48 -16 -60 -348 -184 21 278 -2 -14 104 68 -116 -155 -80 -72 -185 -46 334 -191 -231 -424 67 0 -139 -33
4846 -33 332 -367 -96 -146 438 -43 -201 121 184 47 -382 -300 -88 -166 -388 -33 22 -98 -302 101 -7 -25
4868 -25 -255 144 169 -346 -88 273 109 -168 -185 217 155 -177 -139 100 284 -200 -188 209 186 -324 90 306
4890 306 266 222 -198 343 58 -224 382 126 -174 -323 285 314 -237 -210 412 83 56 -142 40 159 -341 -55
4912 -55 89 20 -75 91 74 -61 -88 43 393 61 -296 101 325 124 -315 83 102 -367 -77 286 -76 -177
4934 -177 9 -148 135 -321 -5 14 -113 -9 162 53 -35 72 15 131 -173 -314 186 -69 21 -193 234
4955B34Rk30j84M13j23j42L72l68L19J34p73N17j00K21l20n0L28q5l48rK08j4
4977Ik6J35R6k10O2L43k53M1j86l9K10k27J33M2J39l91q3N40l13p0o9J65n9l18
5001c29L26Q0k61K04l4O6j0j36L54k55nj22L60j91j28N5M6m7j38r1O82l23l20
5024b17J85q8O5J7J74j07m08L68j48K13r3J10J64j12j32k17N21k47j95O7L1L7
5046a2p3p7J79J8k28L7K05p2k8mL2J45Lj91Q4j70L09o0J01o39K80Q3n3O1J70L6
5072A36J11r1j64j92J27j32M17n2j16j31k5JJ78l53Q7M26o5p9k65J61J27J96l18
5095a6j70J61K11j42O3J7j17K39o49O16k19j11j84L48J60k63o3j09K01Q1M9pn56
5118d60J18L43n4J64j11L05m54L00l4k2r4j13J97J16l46O3K69k93J2K60m6mq8
$$ plain form
4955 234 243 13 -171 242 119 -23 349 -19 300 434 -339 178 78 299 -21 -71 257 172 -176 -185 23 9
4977 9 -17 118 214 4 66 409 156 197 11 -28 182 -45 88 130 269 -122 -205 335 22 -48 -117 48 -11 -329
5001 -329 -3 77 -184 20 -14 52 42 -94 260 5 0 -122 238 47 -81 -26 20 -27 -165 -256 426 103 -217
5024 -217 -32 -120 -55 -38 136 29 -379 -11 -159 54 -39 71 235 123 -9 -226 295 48 -147 -80 -49 -12
5046 -12 -85 -162 17 35 -193 -156 49 -23 -51 -55 -23 122 125 -66 18 -152 157 97 198 -441 -161 -78 -131 -70 100 136
5072 136 247 156 -8 -200 -73 -205 212 160 44 -87 -112 -111 67 -286 -199 227 162 83 -182 -21 106 302 -16
5095 -16 -186 -25 186 44 107 124 7 246 -403 213 -6 -117 -301 47 207 -56 -119 -228 -27 54 103 96 -460
5118 -460 -342 1 -53 111 0 305 -149 151 117 95 1 -112 85 201 -145 -82 187 -106 -94 166 120 116 28
5141B8K49L0k02j46K02q0M0k36K51j72K71k28N3J0N6k39L95k40k86N9J59j13R3
5164d6m7q6J48m4L03m65K93Q0j44J14O6k24K07J26l75J25n8L9j04J1J56m7m9j59
5188a80J14O4qJ72k48k7O3m35M56l06J10K72k47L28l10K17J40j75M18n42J65o3
5210b2l19L56k0l6M34J3p15L98J77k75J14l1L70l32j78J6P6K18k94k61M90m34
5232b55L40j31O8M9k41O6J68k74K00O0j35O8J21l02J32J01k6j52R3K7L13r8k00
5255hj5j4K20%r9r4r2L67m77J61k0r3L40k59j62O7L85L2L7m01K05K06k95J39k27
5280i7K30l62J60K52k87J11pO7l1j61J17M0lk23O7L37k98L58j89j46j46M17k4
5303A82K63m38j58j32K48NJ35J28m96L43n3J10L6k94q7L12n6j27k09K11K19j8
$$ plain form
5141 28 277 307 105 -41 161 81 121 -115 136 -36 235 7 60 70 126 -113 282 42 -244 -185 -26 -139 -46
5164 -46 -93 -179 -31 -75 228 -237 56 136 -8 106 172 -52 155 281 -94 31 -27 12 -92 -81 75 28 -21 -180
5188 -180 -66 -2 -10 162 -86 -113 -50 -485 -29 -335 -225 47 -200 128 -182 35 175 0 418 -124 41 -22
5210 -22 -341 15 -5 -41 393 406 -309 89 266 -9 105 74 444 112 -66 -50 26 244 -50 -311 179 -255
5232 -255 85 -46 22 71 -170 -104 64 -210 -10 50 -85 -17 104 -198 -66 35 9 -143 -50 -23 290 192 -8
5255 -8 -23 -37 183 183 84 -10 -102 265 -212 -51 -71 -164 176 -83 -245 -178 207 239 276 -125 80 286 -9 130 -97
5280 -97 133 -229 -69 183 -104 7 0 67 36 -125 -8 32 29 -194 -127 210 -88 270 81 -65 -211 206 182
5303 182 445 7 -151 -283 -35 -30 105 233 -263 80 27 137 173 -121 -208 104 48 -79 -288 -77 142 124
5325A24j69J40k31K69k14K41L6J81q7k64J45j36j84J21K13k36JM1l45J45k16N46
5347A21j57n1jQ2k25L31k76R9N3k66M06J63m88L40o9o7o5k7J22K6j31j4J76N5
5371A37r0j25M80k13j85J89j6l83K78J18j88j20rJ03J79j83q4M58J01n50m2M30
5393B85m79M4K90m9j46K24r0Pj04J3J05j1l01K31J66J58m14ok7J93r2j0L13l75
5417g5p2JK98q8o1j76J99m8k9J79j90O2k21o8M42J55n15K90j53P3j39K5K20k36
5441a27j30K42P8k16L4j13K62R4j74j91M01j86j53M42J9l55J7P9J86l02k72N88
5463B23J43l69j9J06J06m74M21J13l45M0q1K59l17q7M69J21l02k15K08J0k08l2
5485b30K69q3k09K76L40k37l72J65L54j67l49L21M2l31J63J52m2k45P3J46L0j84
$$ plain form
5325 124 -45 95 -136 133 -81 160 196 377 290 26 171 35 -149 -28 185 -51 -50 -9 -354 -209 -425 121
5347 121 -36 -87 -88 -6 -231 100 -176 -77 -24 -290 116 279 -209 131 62 -5 -70 -97 25 51 -80 -94 82 137
5371 137 47 -78 402 189 4 193 177 -206 72 190 2 -118 -127 -24 155 -28 -112 346 447 -103 -145 285
5393 285 -194 -150 140 91 -55 169 79 86 -18 -5 100 89 -212 19 185 343 -71 -77 -104 89 -3 -13 300 -75
5417 -75 -147 -146 152 64 3 -173 26 -22 -51 128 -62 0 -221 -289 153 308 -207 83 -70 3 -136 -111 109 -127
5441 -127 -257 -15 63 -153 -119 -232 30 124 -50 -241 160 -26 -179 263 282 -73 -56 23 209 -93 -365 223
5463 223 366 -3 -22 84 190 -284 137 250 -95 -55 -136 123 -194 -281 188 309 7 -208 0 10 -198 -230
5485 -230 39 -44 -253 23 363 126 -246 -81 273 106 -243 78 120 -211 -48 104 62 -183 -110 36 66 -118
5507a18p8K78j56j9K80j47L66m41J88j41j7kL33j80N7k40NK0J8j59J57L79k63
5530A20j5k85L5K05j12J67Ok77J73K2Lm08O50p9j02k38K29Q6j31j96j38M96qk56
5554e3L47l27J60j27Nq0K58n96K04L36O2j48J1J69j75j71k0N35k92l06P0M99l98
5577c7l05N55r2k93j83M57Qm43j5L93J96j83n2J07J93n1k77K79j57l16J56L1j06
5600a35k10K71K27l9n54M43J54m42m2L84J88l80j12M29J92m05j09M19k92N1o1
5621b3L7ko9j61J55R1k2mK78o0k53J31l33J90l2p7K97j25k42N0N5l33K52J88k33
5646b45o0J40Q3J07j32J77j3L5k44J14p7P5J15r2k83L25k62L43l92L04k95K99
5668B2J02K8k74M3R9j16L41k69J19l55M0nJ74J03j29j56K37j21R4K9J40P6l66
$$ plain form
5507 -118 -196 82 -74 -93 187 40 406 -35 153 12 -5 -7 326 146 203 -37 -32 -12 6 -153 4 383 120
5530 120 105 -180 -145 60 -52 115 121 -156 17 39 42 -366 284 205 103 -135 94 180 49 -147 -285 211 203 -53
5554 -53 294 -33 127 0 5 -75 183 -413 -209 127 189 41 52 221 46 -125 -145 390 98 -208 -138 361 -37
5577 -37 -342 213 121 -172 -355 102 110 -333 -348 45 241 58 6 113 306 255 -22 257 100 -216 -60 -29 -135
5600 -135 -345 -74 153 114 -440 3 157 -285 -327 57 245 -135 -247 182 374 -31 -140 279 -13 38 -23
5621 -23 14 12 -57 -218 -63 28 6 2 280 220 -33 98 -235 -45 -77 -154 143 18 -224 -174 -119 -452 -200 -12 -245
5646 -245 -305 -165 -82 25 -107 70 57 92 -152 -38 -115 -40 75 -17 -300 25 -237 106 -286 18 -277 22
5668 22 124 152 -122 -79 20 -96 245 -24 95 -260 -220 -225 -51 52 -77 -233 4 -117 -23 6 146 222 -144
5691a44K09n4k44M08o8j37o6j03Q2K38k43j72M73k06J39j80J50J85l62J56N4j42
5713b7N2J10j93qn6M39m50J71p6J85J76n18J83lK16l91j52L89K54m22l9J39J72
5736A51j97J70J37o63M69O3J9k59K68j05l3M7j77J49J09j28j76J71R0n6j95K88
5758A42j11K8j86K20k43j80j77N44K60o27J22M03k39J32k10j21M85k89k52J62
5778a37K29k52J13J72n2l02K94k00Q7j53J73l3jqJ10p3r4J52mJ3Q6j11k1q0q5
5803a77P0J25J57k25m3K52j78j2K09j51o9n0J67j14j79M3L18p5j25l17N09r8l15
5826b78K44j10k9J07k30O43k81j44J41k77K56j3J37L91o46J1j6K80j88l9q7N06
5848C78n51K29k05j22K23m2j25K64K43n33J07K4K07j56r2Q3J44n1P5l38L23k72
$$ plain form
5691 -144 65 11 -233 175 107 -30 -96 -199 -117 121 -122 -294 179 -27 112 -68 82 267 -95 61 115 -27
5713 -27 25 135 -58 -66 -122 317 -133 38 -38 147 323 -195 -12 -15 201 -190 -342 47 301 -121 -160 -21 151
5736 151 -46 124 261 -402 67 130 149 -110 158 53 20 67 -110 39 148 20 -156 15 105 49 -146 142
5758 142 31 59 -127 93 -150 -330 -507 37 297 -330 -208 195 -44 88 -122 -243 242 -47 -299 -137
5778 -137 92 -160 -47 125 73 -229 65 -135 -48 -201 -28 -61 -62 -70 40 -33 -127 25 21 34 120 9 -12 -92 -177
5803 -177 -107 18 175 -50 -93 159 -19 -31 178 27 -42 -92 75 -39 -218 -175 143 68 -57 -374 135 37 -278
5826 -278 -34 -144 -173 -66 -296 347 66 -78 63 -214 42 29 166 557 -89 -78 -94 186 -2 -41 -128 378
5848 378 -173 56 -149 -271 -48 -90 -215 49 292 -241 -134 -110 97 -59 -151 -68 76 25 100 -238 85 -187
5870a87K23o9m2K55k67R9J87l05J59pN4p8p3J52Kp7J18J12j44j59K68k00j54j28
5894b61L87j77j23L85j00L7k78J39J93m06K54Rj91q0K58P3k58r6K17K01k65j50
5916b32K66k51J58j09J16Q1j76K64N5j25k06M04j60l03J27rm4K77j87j48J78j08
5938a32k0K11N4k10K86pj23K0m32L43qo0J29k19J52j54M96m63j28NK77l12L26
5961C1J31j27J32K3k84N0k05K32L38k66o7J46K1m40M43m33K05p9J29j03K93m28
5983b58L54p8j05j17OJ84r0J37N9j40l40M14J20j15k49J91K33j73j92J49J73n9
6005A04k72J02Q0Q8j77k65L72K52m30O2p1RL41j33j62O7rk1r8J31R7n01M73j06
6029f7K27l07Q9Lj21pL96Jn57K78j08J17K70l34K55k21j49Q3J15Nj05k02K70J37
$$ plain form
5870 -187 36 -33 -75 180 -87 12 199 -106 53 46 100 22 -51 101 103 26 144 256 112 -47 221 21 -133 -261
5894 -261 126 -51 -174 211 111 148 -130 9 202 -204 50 59 -132 -212 46 119 -139 -235 -18 183 -82 -232
5916 -232 34 -217 -59 -168 -52 29 -147 117 172 47 -159 245 85 -218 -91 -100 -144 133 -54 -202 -24 -132
5938 -132 -152 59 113 -97 189 182 59 79 -353 -10 -18 -78 51 -168 -16 -170 326 -137 -265 -260 17 -295 31
5961 31 162 35 167 190 -94 -44 -249 -17 321 55 -12 134 155 -285 158 -275 -70 -149 -20 -123 170 -258
5983 -258 96 18 -87 -204 -198 -14 -104 33 92 -48 -388 26 146 31 -218 -27 206 33 -159 -10 163 104
6005 104 -168 -66 14 102 -75 -340 32 284 -146 -84 -155 -146 195 62 -100 -33 -42 -63 -161 -30 67 -434 39 -67
6029 -67 160 -147 -58 -55 -176 -183 213 214 -343 -65 -173 -56 214 -120 135 -86 -235 -152 -37 -32 -137 -339 -69 68
6053F8j19M6j03JM03j87K8l41K25M68l59k24k7L40j75J49k15J38K5k90J98P6k27
6076a02nK76K82n75J07j36J9q7L11O2k56K2M0J94m32J87m1J81p8j27K75om4m0
6100B7j4l6Q3l67J04L05l4M3j13k39L24j92J7K22j89k09R5L68j51m9L7K81j62
6123A51j14J48k47R6k08J90N0J73k00m7LJ19j10J6Q1m8k10K00k28J65k28L36j6
6146G2j61J77m0N5j41J16P1p3k71m0L63q5k5o5M05j68j91K17K46l65l14J23R7
6169CJ69l64K02j95L71k72J01q1p0L47k05K5j17J00o8K63l77K67J42m66P6J65
6191A6J67l2k13j07M68k44n09N00J86j27j72J64Q8k06j55J07k08Q6J56O6l5k64
6213b68K92m7M5j46J66J17j12j72M20k09o3j58K18k26J05Q9L51o51j97L85Or5
$$ plain form
6053 68 -51 -5 -108 -107 296 109 137 -204 21 489 130 -94 -121 219 44 193 -22 116 141 -149 49 125 -102
6076 -102 -107 169 451 -124 -17 -153 -134 -221 90 152 -104 -82 -42 152 -280 -93 -134 47 -31 -158 117 111 67 27
6100 27 13 -23 60 -307 -203 102 68 111 -2 -241 83 -109 -92 130 -59 -268 -173 195 44 -5 32 313 151
6123 151 37 185 -62 34 -174 16 66 239 39 -8 -5 114 4 20 101 53 -157 43 -185 -20 -248 88 72
6146 72 -89 88 48 103 -38 78 149 76 -195 -235 128 43 18 -47 358 190 -1 216 462 97 -217 -94 3
6169 3 172 -192 10 -185 186 -86 15 -66 -136 211 6 31 -86 14 -54 209 -168 99 241 -225 -149 16
6191 16 183 151 -62 -169 299 55 -454 46 232 105 -67 97 185 -21 -176 -69 -277 -191 -35 31 -4 -268
6213 -268 24 -23 22 -124 42 159 47 -125 295 86 23 -135 83 -143 -38 51 402 -249 -446 -61 -55 -150
6235a50j87L23J36j29J21j77O3o3Q8p1p4J53J17m06K19J6r1k66M88j02O3j3j1
6258D7o8%J20j58J08j07r8J21j15j22K53R7k88j85N25j43j5j37l2M63k66L9R5
6281A34k00L0Q3R7j89j3K19l06O4j72K79M43n19j25K36N9jj29J42k94R1j69L15
6304G5J1l63L69q7K2k7j27J53q4n9J62m4M8j43J87j50J66l30J91J04j32K74m29
6327b13P28o60L1J2L40m02P6K33j77J06m09L97k05J08m7K01m20Q0L63o7n2j11
6349h8Q8k15L35k31l3L22p6l11m8J98K05kJ19J27k75O8nJ4p9r1l9N5n0p4J44K6
6375H4r8K62k76K36l75K3k69N41n1J50l9k63j49P8J19K78l48l72N25O6k26L11
6397B07j29L04l81k24L42k40L5p2M18m39r4P6L15j29j37Q6j04J80k44L18M9m0
$$ plain form
6235 -150 -337 -14 122 -7 114 -63 0 -63 25 -46 -120 33 150 -256 -37 -21 -112 -378 110 8 71 58 47
6258 47 -21 -21 99 -59 49 -58 -156 -35 -150 -272 -19 78 -210 -395 130 -13 -28 -165 -197 266 0 39 134
6281 134 -66 -36 47 144 -45 -58 161 -145 -81 -253 26 469 -50 -175 61 120 119 -10 132 -162 -71 -240 75
6304 75 86 -277 92 5 27 0 -127 26 -58 -117 45 1 49 -94 93 -57 109 -221 -30 74 -58 216 -213
6327 -213 515 -145 -114 -102 238 -164 -88 145 -32 74 -335 62 -143 -35 -82 119 -301 -221 142 75 23 -88
6349 -88 0 -215 120 -111 -144 178 102 -209 -257 -59 146 144 263 390 115 183 178 192 113 22 -17 38 -12 -86 58 84
6375 84 -14 248 -28 208 -167 -144 -413 128 77 227 188 -75 -224 -146 -27 251 -97 -469 56 122 -104 207
6397 207 78 382 1 -223 119 -121 -86 -158 260 -179 -273 -197 118 -11 -148 -62 -166 14 -230 88 137 97
6419I7j60J23J68J32n48M48l52m31M92L0K11j70R6P8k80L2O2p5k7r1K03L9l03
6442b26L07L4l35J98m4L75j20k54L00j43k99J36Q7j45L13n37M10Q3j03l3QK01
6464B13j63o4r6K79l00R0k83M22m58L83Q5pj3k94M58R1n01k09M50q7j0j63M01
6487B24k09p6r2J57k21N42m61N10m14n4J15j64J49o1n3K63j86J74k77L06jj87
6509a6p0K48j28M2J02m55K43p4L13k18K05k25KJ95n31K42M18j86O0k39J98j98
6531g2J8j5K73k64NJ54j00j27K04j9k6J03k73K26R3j61N1J05J3r3j93J07K03k19
6555gj04m9R8m5J5K22j71L57m52J73Lk72L02k39K50l11K24j08K85l36J87J22j85
6578d1J60j03J64m76K50J92o3j25m6J6J22j99L42j19j61K7k04O6K69k20j28K43
$$ plain form
6419 97 -63 60 228 360 -188 260 -92 -523 -31 -1 210 40 136 214 -66 -34 28 -47 -74 -165 38 77 -226
6442 -226 81 115 -220 -22 -66 309 189 -65 235 92 -207 -71 16 -129 184 -353 57 140 37 4 12 213
6464 213 50 -14 -110 169 -131 -41 -324 98 -360 23 108 101 88 -206 252 343 -158 -367 83 -4 -14 -177 224
6487 224 15 -61 -153 4 -217 325 -136 374 -40 -94 21 -143 6 -55 -108 155 -31 143 -134 172 171 -16
6509 -16 -86 162 34 76 178 -277 -34 -108 205 -13 192 -33 -31 164 -367 -125 293 107 167 -72 126 -72
6531 -72 -54 -69 204 -60 -55 99 -1 -128 76 57 31 134 -139 87 180 19 70 175 188 95 -98 9 212 -7
6555 -7 -111 -160 -62 -107 -92 130 -41 316 -136 37 40 -232 70 -169 81 -230 -6 -114 171 -165 22 144 -41
6578 -41 119 16 180 -296 -46 146 83 -42 -88 -72 50 -149 193 74 -87 -60 -264 -198 71 -149 -277 -34
6600c4j32O0L12o6J12k56n3K54l10m7J78j08P2J70m0J0J27j28j5n8R6o5j62J21
6624C8K7j23J40k24J05%J61j50N9O2p4k29J17L36m15j05J37L95n56L93k40J99
6646E3j25p2M8K57k39k79L39M08P9l75j81K39R7l46M00l42l6K02j96J93r5KL6
6669F7M6k06P4l41M64l53J43K36k54K56r9l79L96o9J07l7n5J33p1l9J35k17J00
6692C7j55M2l1M5J45l53K07m1J47j34L35k63j41K35R6q9m37M53K9j8J52k64l4
6715c7P3k03K49J2k60K59l50K77J09j56N3Q1r1j26J02q0p7j21K10q5L25m29K31
6738c4J2q9K52k68J20j66J36L39l36k7k29M17j22k67K31j04P0j51J60J6J38k03
6760a05l2M17o3l63J50J11l20M20k18M1J46m00M48j97n5J59j37j71J44QK31k84
$$ plain form
6600 -34 -166 -106 206 140 252 -4 -57 197 -113 -160 18 -90 -18 152 112 122 249 121 106 48 144 79 -83 38
6624 38 65 -58 82 -142 -37 -37 124 -26 33 95 21 -208 -91 245 -170 -275 -138 257 -299 94 -146 53
6646 53 -72 -144 -96 161 -78 -357 -18 390 469 94 -87 152 249 -97 303 -39 -75 127 -69 124 29 31 67
6669 67 113 -93 -19 -360 104 -249 -106 130 -124 132 33 -346 50 -19 88 51 -4 129 58 19 154 -63 37
6692 37 -118 -76 -107 -62 83 -270 -63 -104 43 -91 244 -19 -160 75 171 82 -355 98 127 109 261 -3 -37
6715 -37 36 -167 82 94 -166 93 -257 20 129 -27 26 107 16 -110 -8 -88 -165 -286 -76 -161 164 -265 -34
6738 -34 -22 -111 141 -127 -7 -173 -37 302 -34 -61 -290 127 5 -262 -31 -135 -65 -216 -56 -40 98 -105
6760 -105 -137 280 217 -146 4 115 -205 215 -3 38 184 -216 232 35 -20 139 2 -169 -25 -17 214 -70
6782g0R6j05P2K39j86J50j94o3K82m01J28L2J45j35K6q7J01p5j78K70l06L67l6
6805G2q1m2J81j05J38k31K27k48K33j18j79O2K04m4r5J55j8J06m82N92m52l7J39
6828b3M3L75m24R8M6l35L26k9j66Q9K12j93o8M3j14q3K43L1J10j26j24L09j82
6851E8R9k49nJ46P8k87N9L22k26J08n07K87J16l80L13p8kj54K90P0j15K46m1J76
6875C24l32j14K97Ol60Q4M25m32L26k02Pj81J63L71l48o8j27J49j46l8J32j19
6897a83J02l6K9k85L94m69M63J26L4l37L89j58r2j85J38K10m5l72M76p3l46N16
6919B96j12j55j70l8O6J21O1J55j53r4p7j9r5K0J20L8J06k07L31j65j6j72J3K02
6943E6k74J80N9j36N0K3J6k1j6J12k41J10mK90k40n3O1pk4j00K33j13k64J67L02
$$ plain form
6782 -70 26 -79 -7 232 46 196 2 -61 221 -180 -52 -20 125 -10 16 -71 30 -45 -223 47 -259 108 72
6805 72 -9 -51 130 25 163 -68 159 -89 144 26 -153 -91 113 69 -26 129 111 217 -265 327 -125 -162 -23
6828 -23 20 395 -29 69 115 -220 106 77 -89 0 212 19 -49 -6 -120 -203 40 71 181 55 -69 240 58
6851 58 157 -92 -97 49 127 -160 -101 221 -5 103 -404 -117 -1 -381 -68 -146 -148 -302 -12 58 -57 189 148 324
6875 324 -8 -122 175 181 -179 -95 330 -102 224 22 29 -152 11 382 34 -34 -161 -12 -158 -196 -64 -183
6897 -183 -81 -117 -88 -373 21 -448 15 141 175 -162 227 69 -23 -208 -70 140 95 -277 199 126 -220 296
6919 296 184 29 -141 -179 -113 8 69 224 71 -23 -100 -119 -214 -194 -74 -36 70 -137 194 29 13 -159 -146 56
6943 56 -218 -38 21 -115 -65 -42 -26 -47 -63 49 -192 -82 -86 204 -36 -89 -28 -35 -59 -159 74 -39 -303 -136 166
6968A66o9Q1o0k21O2j01M41k16L3l42K28m1mj08N7K42l18K01J35j30j4J9j6K68
6992B93l29j80K33J53j99M5M47k85l38J73K1M8j91J93o4J5j51j09L03l75K47L60
7014C10m16l3K1L13l70K39K12k00o4l8%j61K87o5p3r5J51q4m5R9j49J2J46k49
7038b52M50k81M11n78k7L97l70j7L81m73L94j39q9L01Q6r9j89P7r0K36k62L41
7060B08N3m36K75n3K0j00Q3kK25n09L23q2m5j04K42L1p5l9P4Q0j64N4n30L95J75
7085I9j35j38J73j63k1J18K34j53r1P8J79P2j20l45L49j76k66K21J24P4N4k23
7107e6j28K07m8K47qj0k48K90o9k6j52R3J50n03J74J97l59J11K39p7L3k19J01
7130f1K21j93n9l4J71q5j71K75K3o3M5j7n9Q3k28K82j0l93K07J35J18l44J33N
$$ plain form
6968 166 97 178 118 -103 -41 -142 299 83 116 -226 2 -39 -43 -151 -94 148 -170 31 166 36 22 41 25 293
6992 293 -36 -216 17 170 -29 16 463 178 -160 13 34 82 -109 84 20 35 -116 -225 78 -297 -50 310
7014 310 -106 -139 -118 195 -175 64 276 76 12 -26 -26 -187 100 35 -38 -133 18 -66 -111 -12 -161 -149 -3 -252
7038 -252 198 -83 328 -250 -277 120 -250 -267 114 -359 35 -104 -193 108 194 95 -94 -17 -107 129 -133 208
7060 208 261 -175 100 47 67 -33 50 48 273 -236 87 5 -40 -144 98 129 54 15 89 169 5 59 -471 -76 99
7085 99 -36 -174 -1 -164 -185 -67 167 14 -77 1 180 252 132 -213 136 -40 -306 -85 39 113 167 -56
7107 -56 -184 23 -25 222 214 204 -44 246 177 151 -1 92 242 -261 -87 110 -249 -138 101 24 57 -162 -61
7130 -61 160 -33 -92 -126 45 -40 -211 64 87 24 69 52 -7 76 -152 130 120 -273 -66 69 187 -157 -24 -19
7154a9n4J8j93K21N8j88K03o0j0P8m31N33k64n3J94j36Kj28L06j62p7L38k75K38
7178A39k99J54m0O1j8p3K61J15k47j52R1o0J8J25N7l2j53J62j00OJ7p3k1j53Q7
7203a28P0Q8J9k72K43l35J05J43kJ84l01K69N5l95n8L14J12Pk66L8K9PQ5J45M
7228A60k67Q0j4m2K09n36M75M4o3k7K6j17j39k6K69J1J47k37P9k52KM66k24L6
7252F0k09K17m8N0l59M14j16j23k9L06j5j7l53K76n9J4j15jro4M0N4K49k57k5
7277a19K89k31p9J01J01j21JJ55J77K27n30L43m45qK1K09j39l06L14oK11j93M7
7300A9K0O1j44o4J60p1K6q7J52r2l68M41l0m7l4l98L40n9J55Pn9K57k23o6L2m9
7326a21n6K29R7k40j93K37j16mM04J03m07p1J68J35k15J91j08J45n54M23j5OK2
$$ plain form
7154 -19 -73 -55 -248 -27 31 -157 46 -14 -24 54 -377 156 -108 -161 33 -103 -101 -229 77 -85 -162 176 -99 139
7178 139 -160 -6 -46 15 -3 -76 185 300 53 -99 -8 -68 -50 75 132 100 -53 109 9 15 32 -41 -62 -215 -128
7203 -128 -58 30 49 -223 20 -315 -210 -67 -69 115 -186 83 138 -257 -315 -1 111 118 -148 -110 -81 -74 11 156 160
7228 160 -107 -27 -41 -83 126 -410 65 109 46 19 45 -72 -211 -237 32 43 190 -47 32 -220 -218 248 24 60
7252 60 -149 68 20 70 -289 125 9 -114 -143 163 148 131 -222 54 -5 9 -106 -107 -116 -180 -140 -86 163 -94 -119
7277 -119 170 -61 -140 -39 62 -59 -58 97 274 501 -29 314 -131 -139 -118 91 -48 -354 -40 -46 165 -28 19
7300 19 39 100 -44 -108 52 -19 7 -80 72 -20 -388 53 23 -24 -58 -456 -116 -175 -20 -13 -72 185 -38 -104 -72 -121
7326 -121 -177 52 149 -91 -284 -47 -163 -167 237 340 -67 -138 30 165 -50 141 33 178 -376 47 32 38 60
7349F0J53l85K80k87pM58k85R6j61L38m29M08k08n9N3p0J58l59N41j64p0kl1l04
7373b76J77J9M5Ll1k7J83l26J46K32r2Q8j89j36M51l58k03l5K20NNL87j79q9P5
7398I5j56K34l95Q8L68l56J39p0Q8j7p6R9o5P7n6J33k05K41j64L8J52k29J20k79
7422a96J47J85k12QP6O8j31P4k33M16j44j66o4K19N8k51Q9N1j94k52N85k68L68
7445B33R2k51k50K07k71L82j20k61K66m5N3j78K25j8l1k37K15J47j40l13K08J8
7467f9Q3j10j75J69J33j12J96l51K22J24j10J08k38M04k65Q6mj65N0K8M32n72
7489a36pJ9J06r4Q8j41J21J48j04J63m21K77o8J14L3j72j70M9K23k23%N8K37l7
7513F3m60O91q4k37j35K77j50L48k47r6P1n8K23q7j4k28r9J26L1n0K91k92p4K39
$$ plain form
7349 60 213 -172 108 -179 -186 272 -13 83 -78 260 -169 239 31 -28 25 -45 113 -246 295 131 61 59 28 -276
7373 -276 -99 -80 -35 -32 -63 -90 93 -233 -87 145 53 141 -48 -184 267 -91 -294 -329 -109 -104 -99 288 109 20 95
7398 95 -61 173 -222 -134 234 -122 17 -53 35 18 -58 41 -24 53 -3 130 -75 166 2 40 192 -37 83 -196
7422 -196 -49 136 -76 -68 8 76 -55 19 -214 202 58 -108 -172 47 105 -146 -57 -6 -200 -452 133 -135 233
7445 233 325 74 -176 31 -240 142 22 -239 27 -18 35 -143 82 64 33 -204 11 158 18 -295 -87 -69
7467 -69 14 -96 -271 -102 31 -81 115 -236 -14 110 0 108 -130 274 9 95 91 -74 -24 4 436 -136
7489 -136 -143 -124 -18 -112 -24 -165 -44 104 0 163 -258 19 -49 65 98 -74 -244 -195 28 -195 -195 -137 100 63
7513 63 -397 294 210 -27 -162 115 -35 313 66 -30 41 -17 206 119 105 -123 -222 -96 -65 -115 176 -116 -190 49
7537D9k41L23Jj49Q2j29K56r7k36M30j81j13Q6k82K98j27l3j00L36j09J10j15
7559E9j04J37q2j15J1R1k97K55K48n19L20m0Q1O3J41k28o5j21M9J51r5j90K46
7582dK6R9m1k38mL75j97m5j46K58o7m6j59M24j93L3j94j14O6J33L12k74r8R6j49
7607a47J41m3m1L07l95J42J66j13j19l4K64l87M53l23J53J1n8J20j12r0M49k96
7629D8k9R4O1l18K50j29Q8q7R7l31L05m1K9j10Q6L6O2k26j08Q9K17M8p5P5k51
7654a20L80j44q8J96k94J77j60j09r8J52K59l37K27q9J25N1Q1j78n9N1m16N32
7676A39k52J47j43n3K07k47q6M31O4k92J00L12j60j12j59J62J49m77K93j2K90
7697C01l50j49J74K77l42P5L07k02K5j69L6l36K73J03nl65J61K87l16K80j13q6
$$ plain form
7537 49 -192 131 132 -17 65 -64 192 95 -141 289 108 -5 81 -201 97 -30 -63 -163 173 64 174 59
7559 59 -45 92 10 -105 -94 -3 -300 -45 203 -316 4 -36 45 108 249 21 -44 -165 -116 35 -60 -250 -4
7582 -4 22 121 80 -158 -162 213 16 -29 -175 83 16 -30 -189 235 42 75 -119 -233 -167 -34 278 4 -94 2 -147
7607 -147 -6 -49 -90 217 -178 -36 130 17 -102 -136 128 -259 194 -129 24 35 -23 97 -15 -105 344 48
7629 48 19 113 174 -144 106 -23 65 -22 75 -256 49 8 37 -73 13 49 111 -115 -223 -134 83 131 56 131 -120
7654 -120 260 116 28 224 -70 107 -53 -162 -260 -108 151 -186 41 -48 77 128 209 31 -28 23 -393 139
7676 139 -113 34 -109 -162 45 -202 -288 143 207 -85 15 327 167 55 -104 58 207 -270 23 11 301
7697 301 -49 -198 -24 253 -89 -14 293 91 116 -53 -17 -353 -80 23 18 -347 -186 101 -215 65 -48 -134
7719a34N8j1k96N04k00L80m17K87l05L08o8l61M79J28l34J52k96K15M1J6k78L33
7741B01m9k27K06n59N71r8j10J06J98k51N5j74L84k11j77J9L98j39nl03J73Q6
7763I4m4l11M36j7l82L52m30L99j48N4J56j18k29K02L33l16O7k37Q9n2J04k25
7785b23J15K77k62R9j03L3P9j01K27k44j58L75M3l51K15K49k65o1K48j09j93Q1
7807b9L0P6k08K55p3K77k26l21J37K14J72j47o8J17k45j80J2L54r1k13J93j55
7829a19O1K20l22L83k21J28m0k75P2k22K81rJ9J38l8j2j36l7L26n24K77J35Jk8
7853E8k88K89J32j4j92J07l6m08L28N00l54k45Q4K11m3l88K8N24k41j92j1j01
7875b52O25m35j59K64K72o68J4N98l57k7Q9P2j08l7K31p8j84j91L23J03j02j32
$$ plain form
7719 -134 -76 -87 -383 121 -79 301 -116 171 -134 174 106 -255 224 352 18 170 -126 89 130 146 -132 201
7741 201 152 -75 131 -428 143 45 -65 41 239 -12 43 -131 253 42 -135 -116 282 143 138 -165 8 94
7763 94 50 -261 175 158 -224 128 -302 97 -51 3 159 41 -188 14 347 31 98 -139 -50 -102 2 -223
7785 -223 -108 169 -93 6 -97 -64 15 -86 141 -103 -261 114 157 -194 21 270 5 -56 192 83 -110 -29
7807 -29 1 77 -131 124 51 328 102 -219 -82 132 304 157 89 206 -39 -219 -207 147 56 -157 36 -119
7829 -119 -58 162 -160 223 2 130 90 -185 -113 -335 -54 -63 -44 94 56 44 -92 -129 197 -327 -50 85 86 58
7853 58 -230 59 191 177 -15 92 56 -352 -24 476 122 -123 -39 172 129 -259 -231 293 52 -140 -151 -252
7875 -252 373 -62 -221 43 315 -353 -339 259 -98 -125 -36 36 -72 -109 122 44 -140 -331 -8 95 -7 -139
7897a39J94M02n75K8p8J62k04J91p5l9M08k61l9j13J7L09l3j99L1p4j14n9J30
7920a30M78k81L28l43Nj33o4K88j20J1p3k17K57Kk1j14j41L39n6n7P7j27j04K07
7944A1K30j93j27P6K49m30l4J71m8L6J66j61J9j47M8J69n3kk82M62k57o8J27J73
7968A35q1k14L27l7K5l45M53l52Nk42N28j07M9r3l87K06J59m5Q2j68Q5J02q2K6
7992B9l30K50L7K13l6r2r5j7k52L11j13n3m3J69j80J08k14N99l36l2q9J49j24
8015a41K24k1r2lJ70O1j03m0J24l06J72L90m65j92J58p0R1k71M33q8R0k6j90K50
8039A55j2k05J27j34j61K6J78J37j02n7j50M6J64J42j35l30M83k21o2K03N0k68
8061a26K09n5m24N62k06j06j1M55mk80k2L0K02m87oL17L9k01J11Q3k10K64j74
$$ plain form
7897 -139 55 457 -118 -90 -168 -6 -210 -19 -94 -133 275 14 -25 -138 -121 188 155 -44 -13 -87 -201 -260 -130
7920 -130 348 67 395 52 57 -76 -140 148 28 39 -34 -251 6 8 -13 -127 -268 71 15 -42 35 -92 -196 11
7944 11 241 48 -79 -3 246 -184 -218 -47 -95 -59 107 -54 -35 -182 -134 35 -18 -20 -302 160 -97 -165 -38 135
7968 135 54 -160 167 130 155 -190 263 -89 -84 -326 202 95 144 51 -336 -130 29 -16 66 -102 -17 85 3 29
7992 29 -301 -51 -14 199 163 71 -24 -41 -293 18 -95 -148 -191 -22 -202 -94 -308 291 -45 -77 -166 -17 -141
8015 -141 83 62 -30 -33 137 198 95 55 179 -127 45 435 -30 -222 -64 -134 -43 -314 119 31 121 95 -95 155
8039 155 143 -62 65 -69 -230 -204 -26 111 9 -48 -198 -152 12 154 19 -311 172 -49 -111 92 142 -126
8061 -126 83 28 -396 166 -40 -146 -157 298 294 14 -8 22 224 -263 -269 48 87 -114 -3 80 -130 134 -40
8084d0N0k01L5N58o95M29j85Q6L9n5N58n67L02k49k41J11P8M1K9K05j15j00k71
8107a98L40j36J83m16K03J73n2o1J1k25K96m12J73L34m43L88K88l12l10K68J36
8128B28l46l1L32n1j2k24K17j43J07M1l7k50J30L0N3j91K63P7M4l40K24k52K30
8151I9L46n47N6J59K47l24q4j35J48M0j04J35p8L09l4k28J37j93j22K42j29J26
8173F6j45J47j13j0J38j13pJ65k42R7K2L3l0j04O9J09N1j64
$$ plain form
8084 -40 10 -191 -156 402 -293 136 -49 37 76 21 579 12 314 65 -176 -65 13 54 83 288 173 73 -198
8107 -198 142 6 189 -227 -24 149 97 36 47 -178 118 -294 -121 213 -230 158 446 134 -176 92 228
8128 228 -118 -149 183 132 120 -104 113 -30 77 118 81 -169 -39 -9 44 -147 116 193 237 -103 121 -131 99
8151 99 445 -102 -46 113 360 36 -48 -183 -35 5 -99 36 -42 267 233 5 142 -51 -173 69 -60 66
8173 66 -79 68 -45 -55 83 -30 -37 128 -114 -17 5 38 8 -96 -27 82 133 -31
8191c1
$$ Imaginary data points
##PAGE= N=2
##DATA TABLE= (X++(I..I)), XYDATA
0@%%%%%%Pj5J6j6J8k6L2m0M9n7P2q8J04j21J42j66J93k24K58k95L35l82M35m91
30b60N54o22O96p82Q75r75J084j205J338j484J643j818K014k229K469k740L044
47A602l386L780m236M769n408O187p158Q412j0106J2532j6323K3134l9182J45181
61A19798J29981k07420l4434P9907M6370q8223k3022M4852Q056o4360P227O5480
73H4212K4166m4474q774K3736K0k7538P170J4375j7556l0298L949N185k3093j9985
87h905J6920J0001k7518k7703J7062L1012M480j1882J81Q151N442Q153L893k3095
101F192l2993k430K2930n889l9669j7743K4853J8424j3807m907K4526J1405k1073
114c0181o613L4958K4338k1164k3543J3326J7793j2834j2849J2492J555l1741
$$ plain form
0 0 0 0 0 0 0 0 7 -8 8 -8 10 -16 16 -24 25 -32 40 -48 56 -65 77 -89 104 -120 138 -157 178 -204 231 -260
30 -260 294 -328 368 -414 461 -514 570 -635 703 -781 862 -956 1058 -1171 1298 -1442 1602
47 1602 -1784 1996 -2240 2529 -2879 3308 -3850 4562 -5544 6988 -9335 13799 -25383 119798
61 119798 249779 42359 7925 87832 134202 45979 22957 67809 75865 11505 18732 84212
73 84212 108378 63904 55130 78866 78886 51348 58518 72893 55337 25039 28988 34173 11080 -8905
87 -8905 8015 18016 -9502 -37205 -20143 10869 15349 3467 3648 11799 17241 25394 29287 6192
101 6192 -26801 -29231 -6301 -12190 -51859 -69602 -44749 -26325 -40132 -45039 -20513 -9108 -30181
114 -30181 -36794 -1836 22502 1338 -22205 -8879 8914 -3920 -16769 -4277 -2722 -34463
126c4463k1138K3260K7146r256j5443J6828K2183k193J941K9369J9787k1593k8602
139G826M090J8089j886j2981p162p239j1730L473J8108O935j1021l445Q945M69
153A2471m187J6455K6517m267l1780r233K6912J4808k7984l3577k586R540r826
166a6737j5706L958J1755m694n938J5431J9746o566j6909N975J6095o957j9936
179b0483l256L678j1888j1848Q530L691k2932j5644K0289J8211j8721j6740K3560
192d3553K9370q144j5075J5745J7999r835j1038J0109l413l0125j1464K6338J1791
205b1295k6629j5380K4164K1899o152J532K1056L198j9190N451L2145N528k7676
218a349q266K1999N274k2082p450J4335j976k1212m64K0520L118j2282J0899K8304
$$ plain form
126 -34463 -55601 -32341 -5195 -14451 -29894 -13066 9117 6924 8865 38234 58021 36428 7826
139 7826 11916 30005 28119 15138 7976 737 -10993 -7520 10588 17523 6502 3057 12002 12471
153 12471 8284 24739 51256 46989 15209 5976 32888 47696 19712 -13865 -16451 -6911 -16737
166 -16737 -32443 -28485 -16730 -21424 -27362 -11931 7815 1249 -15660 -9685 6410 -547 -20483
179 -20483 -23739 -20061 -31949 -43797 -35267 -31576 -54508 -70152 -49863 -31652 -50373 -67113 -43553
192 -43553 -14183 -22327 -37402 -21657 -3658 -13493 -24531 -14422 -17835 -47960 -59424 -33086 -21295
205 -21295 -47924 -63304 -39140 -17241 -23393 -21861 -805 2393 -16797 -11346 20799 26327 -1349
218 -1349 -9615 12384 17658 -4424 -11874 2461 485 -20727 -21191 -671 2447 -9835 1064 29368
232B9368L334j8120L732K3869K20k4340r557P888o555j7991J673J3130q667j9493
246b1509N742K2096j048j8276K213J9437J386j3335M932J6403n268j9047J477
259d797J1615j2742k6978k778J3318m984j7549K716J8417L553o468J0548J6892
272G63m434j3210P418J4690q187j8731Q08J0781n373j1828L570P502r391r394
286c5016J2814J5837n703q262J4310K0370P81n519Q455J0836p324j1241L467M105
300A7910j2369j2566O571J0957m743p098R378J6070J793m715P120R916k880n617
314B9727P485P996r282j3650L979J0076q532j8401k951Q586j546r730K124J0098
328A5979J374k503J0404J2627n203j1939K503P574q853j5625k235J802j1694j0400
$$ plain form
232 29368 32702 14582 18314 42183 42403 18063 8506 16394 9839 -8152 -6479 6651 -2016 -21509
246 -21509 -15767 6329 5281 -12995 -10782 8655 10041 -3294 1638 18041 12773 -6274 -4797
259 -4797 6818 -5924 -32902 -35680 -22362 -27346 -44895 -42179 -23762 -20209 -26677 -16129 763
272 763 -3671 -16881 -9463 5227 -2960 -21691 -20883 -10102 -15475 -27303 -23733 -16231 -25622 -35016
286 -35016 -22202 -6365 -12068 -20330 -6020 14350 15131 9612 18067 28903 21579 10338 13805 17910
300 17910 5541 -7025 -454 10503 5760 -1338 8040 24110 25903 21188 28308 38224 35344 29727
314 29727 37212 45208 35926 22276 26255 36331 27799 9398 6447 15033 13487 3757 5881 15979
328 15979 17353 14850 25254 37881 32678 20739 23242 30816 21963 6338 4103 5905 -5789 -16189
342a6189Q904R674j1021j2493J0308J5902n934j0018J0693J3866p352j2256P958
355B042J2712p876j4418Q85K999j3103j1328J0418J1196r938r857J3044J6879
368C655l23k049J2642Q270j1440q694J2066J0091j1032j3154L391M631p249k471
382a666J0391K600j2502j796J6248R265p552N5J7362O522j2066l618J3850L080
396D0173j7890j1100Q366L83j7181p103J4601Q391j2263n715J4812J0530p199
409A8805m391R357L064j2543m376J0198l07j7431q547J0874K758j7003j3105O764
423a5883P037m789k206O623K462m224N500J3231J419j2537n837L937k895j0626
437a8788r33M287p705j2443M458J4308m54r722N167J5233j162j2879M257K0519
$$ plain form
342 -16189 -7285 2389 -8632 -21125 -10817 5085 -849 -10867 -174 13692 6340 -5916 2042
355 2042 14754 6878 -7540 -6655 -3656 -16759 -28087 -17669 -6473 -16411 -26268 -13224 3655
368 3655 3332 1283 13925 22195 10755 2061 14127 24218 13186 32 3423 8054 805 -1666
382 -1666 8725 11325 -1177 -2973 13275 22540 14988 15043 32405 38927 26861 23243 37093 40173
396 40173 22283 11183 19549 19932 2751 -4352 10249 18640 6377 662 15474 26004 18805
409 18805 14414 23771 26835 14292 9916 20114 19807 2376 -6171 4703 7461 -9542 -22647 -15883
423 -15883 -8846 -13635 -15841 -9218 -6756 -10980 -5480 7751 9170 -3367 -9204 -5267 -8162 -18788
437 -18788 -19721 -15434 -23139 -35582 -31124 -16816 -17270 -26992 -21825 -6592 -7754 -20633 -16376 4143
451D143N046j3717n657P407J212p383Q52N654r119j7064K784J9058O666j0048
465a0166k12J4372O629m788L309J2119j30j3578m774Q093N22r560k957N802j180
480C501r706q83Q374J708m161K419P039j701l035R186R358p345j2315L844P770
495A4053j0180j7448L39Q634o157j2458L567R934k552n897Q866J2496n483j1299
509a3585M276R692m467r540K673M969j0039j2754M516R813n347j1502M73O631
523b4191p02n61J0488J0790l575p539M590J0353K66n677k343k183q352l403P770
538a4269O066o655o028O702Q317j331q18J0672Q473o185o807Q140J1334k678q029
553F904J806K574q551p607O959O417r254j0274P519J2951j73m854O576R256k604
$$ plain form
451 4143 9189 -4528 -10185 -2778 -1566 -8949 -8097 -2443 -11562 -28626 -25842 -6784 -118 -10166
465 -10166 -10378 3994 10623 5835 9144 21263 21133 7555 2781 10874 11396 1836 -1121 4681 3501
480 3501 -6205 -7088 1286 2994 -1167 1252 8291 6590 3555 12741 22099 14754 2439 6283 14053
495 14053 3873 -13575 -13236 -4602 -10759 -23217 -19650 -9716 -12268 -18165 -9299 3197 -2286 -13585
509 -13585 -9309 383 -4084 -13624 -10951 -5982 -16021 -28775 -24259 -14446 -19793 -31295 -30822 -24191
523 -24191 -24893 -25454 -14966 -4176 -7751 -15290 -10700 -347 -81 -5758 -8101 -10284 -18636 -22039 -14269
538 -14269 -8203 -14858 -20886 -14184 -5867 -7198 -8016 2656 11129 4944 -1863 6277 17611 14933 6904
553 6904 8710 11284 2733 -4874 2085 8502 -752 -11026 -3507 9444 9271 4417 10993 20249 17645
568A7645n016N011L820q628q567L987M362q462j0427K517N554l145m572L038L326
583D43l502q38P904N066m813k462N497K027q776n706M341J715j0669r186K466
598a6493M111m204p83Q771M810p338l186J3624J0610o963r552M470N832o347n815
613h453P538L857j2141q843Q854Q438p238n246R793P264o814j244J5004J0078
627B0847q791o150Q787L934r876m222P920j040j4083k127J3113M137j1347p32
641C70J3456L700q192K348J1413q42r201K664J0276m202j3165Q30Q838n537j2620
656A36m54P425m021p412N550R953k563o451O066R810l438q935J718N116m960r278
672a738o91L148m278o450J256M217k509n035L283P267q28l810L524O619j405m470
$$ plain form
568 17645 12629 17640 21460 12832 4265 8252 12614 4152 -6275 -3758 1796 -1349 -5921 -2883 443
583 443 -3059 -3897 4007 9073 4260 1798 7295 9322 546 -5160 -819 896 -9773 -18959 -16493
598 -16493 -12382 -16586 -17369 -8598 -3788 -11126 -14312 -688 9922 2959 -6593 -2123 3709 -2638 -8453
613 -8453 -915 2942 -9199 -18042 -9188 -750 -7988 -13234 -3441 3823 -2991 -4235 10769 20847
627 20847 12056 5906 14693 18627 8751 4529 12449 11409 -2674 -4801 8312 12449 1102 370
641 370 13826 17526 9334 11682 23095 22253 13052 15716 25992 21790 8625 9455 18293 12756 136
656 136 -318 7107 3086 -4326 1224 11177 8614 2163 8229 18039 14601 5666 7384 12500 7540 -1738
672 -1738 -2429 719 -3559 -10009 -8753 -4536 -7045 -12080 -8797 -1530 -2358 -6168 -2644 3975 2570 -1900
688a900K243N090m041q890q81M316k469p616P09N844r03l911N876R353L00m696
704a576L137P635p23l945J235K955n081m301L093L096n450m842L724L734l242
719e51j690O703M681j765k17O433L695m120k573L720J112o910o691J169K131l249
735A878m829J439L748j101k090L368N987k18n154j44O140K139n420m235J484j481
751A511n819j226L359l364r240j185Q444K497m834R86O875n79n107M970R667m089
767B866j1963j242Q206j493r912k56N267l452o744M513P511k689m056P469O086
782A11m532k711R493M878q521m680Q970L320j2269o508R455M767j0526n494R996
797d251P118o272k752R349O839l897l173N537K829n922j981M879n07p675l440
$$ plain form
688 -1900 343 5433 1392 -7498 -8379 -4063 -6532 -14148 -13439 -7595 -8498 -12409 -6533 2820 3120 -1576
704 -1576 1561 9196 8473 4528 5763 8718 3637 -664 2429 5525 75 -4767 -1043 2691 -551
719 -551 -2241 4462 9143 7378 7161 13594 17289 13169 10596 14316 15428 8518 1827 2996 5127 1878
735 1878 -2951 -1512 2236 1135 -955 2413 8400 8182 3028 2884 9024 11163 5743 1508 2992 1511
751 1511 -4308 -5534 -2175 -5539 -14779 -15964 -7520 -5023 -9857 -8871 -1996 -2575 -7682 -2712 6955 2866
767 2866 -9097 -10339 -2133 -3626 -13538 -13794 -8527 -11979 -18723 -14210 -6699 -9388 -13444 -5975 111
782 111 -4421 -7132 2361 7239 -1282 -5962 3008 6328 -5941 -12449 -2994 1773 -8753 -14247 -4251
797 -4251 2867 -3405 -6157 3192 10031 6134 2961 8498 11327 5405 3424 8303 7796 121 -3319
812c319M120J317m953p48M525P76n038P43Q625M254m302k643L434J415l691q39
828C676K049m154q783j445N352j15o189j43N360j163m588M757J0343j428r908
843f379j52Q786J430o749j477K766m041p213K183O113k697p611J209O522j11j804
859i225M647O137j731m602M115O011k159o289n55L516j205m743j913K005J565
874d426M17M28J8J326K373L371J565K15J646J661%k332j578J107M09k101l592
891E07j722J146o2j680J610N014K408m421k337O329O760k186n273J44R24l290
907C871k293L173K52p736m563M304K729l640n09N270R79n461P74Q784K307n939
923B302k682L949m82n585j377M017k301p766n53N163O1l653L061N123k472l439
$$ plain form
812 -3319 801 2118 -2835 -3583 942 1718 -3320 -2577 6048 10302 6000 3357 6791 8206 4515 3676
828 3676 5725 1571 -7212 -8657 -3305 -3420 -9609 -9752 -4392 -5555 -10143 -5386 4957 3529 -6379
843 -6379 -6531 2255 3685 -3064 -4541 -1775 -5816 -13029 -10846 -4733 -7430 -15041 -13832 -7310 -7421 -9225
859 -9225 -4578 1559 -172 -4774 -659 5352 3193 -3096 -3651 -135 -1340 -6083 -7996 -5991 -4426
874 -4426 -4009 -3581 -3563 -2237 136 3507 5072 5287 6933 8594 8594 6262 4684 5791 6200 4099 507
891 507 -1215 -69 -131 -1811 -201 4813 7221 2800 463 6792 13552 11366 6093 6237 7161 3871
907 3871 1578 4751 5003 -2733 -7296 -2992 -263 -3903 -4412 858 1837 -3624 -2850 5934 8241 2302
923 2302 -380 3569 3087 -2498 -3875 142 -2159 -9925 -10478 -5315 -5254 -8907 -5846 -723 -3195 -6634
939f634M954P592j957o527K069N726k917o521R32N149l881o745K378O081k382
954b683m789M664P321j609m150M071O956k141m955L224N104n299p445K494N510
969F273m131n778K227M965k963k967M859N200j995k113M300K635m389j235N222
984A0110J075p664m842L999J730n411k331M450j8n935q52Q381M018m810k890M960
1000C970K382l823q62L739j357o995j548L598j86n454j466M393K06l971L91N289
1016a694K551k307j1L132O06k483J79K457r27m883j722K083L54k661q11J549J75
1033d413o22K382L496O79j705J528L924N00k429j159J767j44k581j984N77j90
1049c74k234M1K832R72j681j92L813K650j068j049K571J468k419k065J725K62
$$ plain form
939 -6634 -1680 5912 3955 -2572 -503 5223 2306 -4215 -3283 1866 -2015 -8760 -6382 -301 -2683
954 -2683 -7472 -2808 4513 2904 -1246 2825 9781 7640 2685 5909 11013 5714 -1731 763 6273
969 6273 2142 -3636 -1409 3556 593 -2374 2485 7685 5690 3577 7877 10512 6123 4888 10110
984 10110 11185 3521 -1321 2678 4408 -1003 -3334 1116 1098 -4837 -5689 2692 6710 1900 -990 3970
1000 3970 6352 2529 1667 5406 4049 -2946 -4494 -896 -1082 -6536 -8002 -3609 -3403 -7374 -6983 -1694
1016 -1694 857 -1450 -1461 1671 2277 -206 -27 2430 1503 -3380 -5102 -3019 -2665 -5326 -6137 -4588 -4413
1033 -4413 -5035 -2653 843 1522 -183 1345 5269 5769 3340 2181 3948 3804 1223 -761 -184 -374
1049 -374 -2608 -2567 265 1237 -444 -636 3177 5827 4759 3710 6281 7749 5330 3265 4990 5252
1065E252l599k454J390J65l746r42L469K231k450j644L674K974j432r89K977j50
1081D726m181j441L362P27o013l219K300J186l402q50L941J202l349n02N822K060
1097B369l696q83M733P96m903j781L738j84n177j443K764j52l970J039N026M50
1113a274l932J782N461Q74l365J046L884j656m543J784L500k491n750Q87M775
1128I82j738m523J343N296p47k668K851M738j393k883K683L817k747m839J420
1143A592L063l135m832J456K878k657k997L235L906k279k612L023M604j494l104
1158F47J042K717k070k532R86L81l138k374K063R87l342j589L079K237j779j146
1174c831L838K598j926k008K923J435l622k884J614J698l116k973J514K062j545
$$ plain form
1065 5252 1653 -801 589 754 -2992 -3934 -465 1766 -684 -2328 1346 4320 2888 1899 4876 4726
1081 4726 545 -896 2466 3193 -2820 -6039 -3739 -2553 -5955 -6805 -2864 -1662 -5011 -5513 309 2369
1097 2369 -1327 -2210 2523 3319 -1584 -3365 373 189 -4988 -6431 -3667 -3819 -7789 -6750 -1724 -1274
1113 -1274 -5206 -3424 2037 2911 -454 592 4476 2820 -1723 61 3561 1070 -4680 -3793 982
1128 982 -756 -5279 -3936 1360 613 -2055 796 5534 4141 1258 3941 7758 5011 172 1592
1143 1592 4655 1520 -3312 -1856 1022 -1635 -4632 -1397 2509 230 -2382 641 5245 3751 647
1158 647 1689 4406 2336 -196 790 1171 -1967 -4341 -2278 -1291 -4633 -6222 -3143 -906 -2685 -3831
1174 -3831 7 2605 679 -1329 1594 3029 -593 -3477 -1863 -165 -3281 -6254 -4740 -2678 -4223
1189d223j480K336K360j681m54L716K305k735j586L656K316l312l802J792K148
1204A356k691l108J323J907j879j111L228K818r71r48K504J855j400l1J608k41
1220D219m196p62K971K50l782j579K806R40l295o44M082K121k276j394K823K019
1236D303p61o98J749j045l759p76K226O6m178j216J989P91j815R7L734J184l024
1253a133q62L998K364k777k913K003J798k185k279Q30M67k536q28K250r2k560
1269d455M81L742R44k281J111L713N26l596J42K858p28l913j230K850l42l089
1285c267L88K730K14k272Q84K900j04j319K084K691k118k785J951L941j327m309
1301B82j331J747l83j754P37J471r96k137J181L707J821q45q47n0L57l14K09N82
$$ plain form
1189 -4223 -5703 -3367 -1007 -2688 -3142 574 2879 144 -1442 2214 4530 1218 -2584 -792 1356
1204 1356 -1335 -4443 -3120 -1213 -3092 -4203 -975 1843 872 -76 2428 4283 2883 2852 4460 4219
1220 4219 23 -739 2232 2482 -1300 -2879 -73 867 -2428 -3072 1010 3131 855 -539 2284 4303
1236 4303 3542 2844 4593 3548 -211 -987 1239 1305 -2873 -4089 -2100 -1309 -3124 -3027 707 1891 -1133
1253 -1133 -1995 2003 4367 1590 -1323 680 2478 293 -1986 -1156 -689 -3225 -4053 -1803 -1895 -4455
1269 -4455 -3974 -232 712 -1569 -458 3255 3781 185 327 3185 2457 -1456 -2686 164 -178 -3267
1285 -3267 -2879 -149 65 -2207 -1323 1577 1473 154 2238 4929 2811 26 1977 5918 4591 282
1301 282 -1049 698 315 -1439 -702 769 -227 -2364 -1183 2524 4345 3500 2653 2603 2960 2646 2855 3437
1319C437j140k838l92J164J24j520l91R82J92j879N53L489J193k367m44J994J488
1336C645k497l08J738j348l293p68K820j010l381O55L878k17l036J254M382n22
1352A992l476K114L921k121m385J174L886j668l757R19J855k164k305K415K357
1367G57k303j664L575K493j721j570L454K370k906k511J311L88j660j219J117
1382h9N17l118o93L024K170q61j471O20J309m48P25K031J84l295j982L014K282
1399C919k324l656L37J251j621j368K388K022j971j669K923K854j457j728K014
1414A914R56k187j975J445O64l051r23K905J97l391q80L430P54k436M01K798L02
1431I23k001N84L076l49l087j77K100q29l198M79J417j596j199J189K365n21r42
$$ plain form
1319 3437 2297 -541 -933 231 355 -1165 -1556 -574 -382 -2261 -1708 1781 2974 607 163 2157 3645
1336 3645 1148 840 2578 1230 -2063 -2831 -11 -1021 -4402 -3747 131 -86 -3122 -1868 2514 1992
1352 1992 -1484 630 4551 2430 -1955 -781 3105 1437 -2320 -1401 454 -1710 -4015 -1600 757
1367 757 -1546 -3210 365 2858 1137 -433 3021 5391 2485 -26 1285 1673 13 -1206 -89
1382 -89 428 -2690 -3383 -359 1811 950 -521 99 1408 960 1685 3716 3900 605 -1377 1637 3919
1399 3919 1595 -2061 -1724 -473 -2094 -3462 -1074 948 -1023 -2692 231 3085 1628 -100 1914
1414 1914 2870 683 -1292 153 817 -2234 -3157 -252 -55 -3446 -4326 -896 -142 -2578 -2177 621 923
1431 923 -1078 -494 2582 2233 -854 -1031 1069 240 -2958 -2479 -1062 -2658 -3857 -2668 -303 -824 -1766
1448a766J538J713q81m55J58O17J71n17m08n89n17J64k07n64L59L11j738l51J755
1467a207J565j80J39J354j8j191P54K000p93l909p10J921r4k367J045J596j496
1484a591j862K474L296j668k516J728K310j693j120K100J061k653j219K458J66
1499A271l424j721K777J091l201m17L259J294k152J049K709l4l117j93L262l72
1515B081l505n19K379j49k534K32K572j021k699P26L509k1k568M70L343L30k521
1532A05K35K899j305l144M07K669j442l975O12L171ok497J089K745K59k895J543
1549D70L520j274l546O46K873n72l125J213K055k272k712K126K640k056l091K370
1565g35K657j510j942L599J915k207j992K716J355l650j743K697M32l469o90L131
$$ plain form
1448 -1766 -228 1485 604 149 307 924 1095 578 170 -419 -936 -772 -979 -1543 -1184 -873 -2611 -2962 -1207
1467 -1207 358 178 317 1671 1653 462 1216 3216 2423 -1486 -2196 -275 -369 -2736 -1691 -95 -1591
1484 -1591 -3453 -979 2317 649 -1867 -139 2171 478 -642 1458 2519 -134 -1353 1105 1271
1499 1271 -2153 -3874 -1097 -6 -3207 -3624 -365 929 -1223 -174 2535 2501 -616 -809 2453 2081
1515 2081 -1424 -1943 436 287 -2247 -2015 557 -464 -3163 -2437 1072 1051 -1517 -1047 2296 2626 105
1532 105 340 3239 1934 -1210 -803 1866 424 -3551 -2939 232 226 -2271 -1182 1563 1822 -1073 470
1549 470 3990 2716 -830 -184 2689 2117 -1008 205 2260 -12 -2724 -598 2042 -14 -3105 -735
1565 -735 1922 412 -1530 2069 3984 1777 -215 2501 3856 206 -1537 1160 1592 -1877 -2567 564
1581E64O80k435l71L231N52k287K01K159j06k086N11K253p28k294K47J339j053
1598C77j754M07J183p47j054O44J389K54M88P65K97q75l95K85M70m61j039k96
1616f2l88j1K00p1k13K15j58P9M44N66%j26L67J190m16r81K70K70j14j320k06
1637d65N84j159j493Q37J957p5o75L84J970Mj271L71J039p23j764N07J314q58
1655D84j587N76J229p36j760N18J583q67j239J192K206k50j617J406J431j144
1671A425j892O22J309j982j949J249J323j489j452K707J931k317j442K566J489
1686B098k210j539K795J082k461j558K883J198l216j327K442J19l013o66L239
1701a34Q46k368k84L140N67l024M47L155l68l614l57K678o55k602M70K858j417
$$ plain form
1581 564 1244 -1191 -1562 1669 2221 -66 135 2294 2188 102 613 2866 2138 -156 91 1430 377
1598 377 -1377 -970 213 -534 -1588 -944 445 699 1187 1952 2249 1374 979 1264 1734 1273 234 -62
1616 -62 -450 -461 -261 -332 -545 -330 -488 -409 35 601 601 475 842 2032 1616 635 905 1175 1061 -259 -465
1637 -465 119 -1040 -2533 -1696 261 186 -489 -105 1865 1869 598 969 2008 1285 -479 28 1342 484
1655 484 -1103 -527 702 -34 -1794 -1276 307 -560 -1799 -607 1599 1349 -268 1138 2569 1425
1671 1425 -467 155 1464 -518 -2467 -1218 105 -1384 -2836 -129 1802 -515 -1957 609 2098
1686 2098 -112 -1651 1144 2226 -235 -1793 1090 2288 -928 -2255 187 306 -2707 -3373 -134
1701 -134 712 -1656 -1940 1200 1767 -1257 -810 2345 1977 -1637 -1994 684 29 -2573 -2103 755 -662
1718f62k659J278K670q31j976J160K310j884j733K112K383j431k060R58J626j829
1734e68k275J712J026j587j835K267J791j127j102J836J537j659q50J360Q74j735
1750c35j250J550P98j585q57J513M79j550n47J444M07j476K83J299P41o40o6J179
1768A387M7r95j95N08j060p72o17J254N6o95j09N22O08k54O22L74J3m78q06O80
1788I0N39k22l44q7k02k49k16m7O37n60q92j51J202L64K00L31N22K25j138J17
1808A19P39J63j486o51O96r3m19L51Q45j05j022J3J568K0j511P26J286l73j167
1827c01K44K071m93j621J76J428j127k008O69J848j083q31R03J970r09j143J564
1844A357J557j511j798Q64J488j705j095J935M85j801j061J497J639j797j440
$$ plain form
1718 -662 -3321 -2043 627 -204 -2180 -1020 1290 -594 -2327 -215 2168 737 -1323 -365 1261 -568
1734 -568 -2843 -1131 -105 -1692 -3527 -1260 531 -596 -1698 138 1675 16 -834 526 1400 -335
1750 -335 -1585 -35 763 -822 -1679 -166 313 -1237 -1784 -340 67 -1409 -1126 173 914 274 208 1387
1768 1387 1434 439 244 752 -308 -1080 -1697 -443 -387 -1082 -1191 -669 -61 -315 307 681 694 216 -590 90
1788 90 629 407 63 -24 -226 -475 -691 -738 -101 -661 -1553 -1704 -502 -138 62 393 915 1140 2 119
1808 119 858 1021 -465 -1116 -420 -513 -932 -581 264 159 -863 -850 718 738 -773 -47 1239 866 -301
1827 -301 -57 2014 1521 -100 76 1504 377 -1631 -962 886 -197 -1028 -125 1845 936 -207 1357
1844 1357 2914 1403 -395 469 1957 252 -843 1092 1577 -224 -1285 212 1851 54 -1386
1859a386J665J215j651r34K743J293k145q30J717L68k058o51K019n75k377J4K078
1876E05L27j359j55K116j17j957M48J938k04k175J77J972n81j317N31R97o36j674
1894a164J46J476l49j574P16J446K13j228P25J319k04j294J2P70m97j153J78J002
1912E40p0j314M83J189k49j247J002P97o21j167Q94J162m52p00M80J058j106j096
1930d17J28R43q96q88K68J258r03n52R90J364l20p58J18L50k59l73K26J53r82
1949e50o09J140N49o76l93N3J72l78j00N17M06n51k63O26O21L37m83o35J61J1
1969d5n77m42O3J34j60j31O64M55q26J50R99J11q13p96J616N4j194L2J253j76
1989C71j591K8J458m42j433N83J119m90r79R72J222o44j169J215J413j292j451
$$ plain form
1859 -1386 279 1494 -157 -1091 1652 2945 800 -30 1687 2055 -3 -654 1365 790 -1587 -1573 505
1876 505 832 -527 -682 1434 1317 -640 -192 1746 1542 -633 -456 1516 935 -382 149 1146 510 -1164
1894 -1164 -1018 458 109 -1465 -749 697 910 -318 407 1726 1522 228 240 1010 513 -640 -462 540
1912 540 470 -844 -361 828 579 -668 334 1131 510 -657 237 1399 947 247 727 1785 679 -417
1930 -417 -289 654 -242 -1130 -862 396 -507 -1059 -69 1295 975 217 335 685 426 53 279 432 -550
1949 -550 -1159 -19 530 -146 -539 -486 -314 -692 -792 -275 131 -420 -683 -57 564 901 418 -217 -56 -45
1969 -45 -622 -1064 -1001 -867 -1027 -1158 -494 -39 -865 -715 284 395 -418 -1214 402 456 -738 -706 547 371
1989 371 -1220 -1192 266 -176 -1609 -1026 93 -397 -1376 -404 818 174 -995 220 1633 341 -1110
2006a110J116N15j318p62J163N71r02n61J212P28j126m91P75J37m24K04N88j22
2024A93r08M12P94J01j107l44P8Q5l03k21M55L44k59j13O64R17n19q37N8N62o5
2045a3m62j81J52J56o36L91J177r10r31K71J683q27j343J199J019p44j115J514
2063D00R01j122j374J046J173j322j349J217P80j017m52J508N87j369m82J842
2079I67N81j733p21J472L41j032jJ008m12j297M66J365m02j121q9M32K24k60O75
2098D63K46j59p21P50Q70n89p50o22N53M46m61n82N73N30l81m30Q82J63j049n77
2118h45J042P63p38q19R58M77r12l18J315n6j864k85J883N26j885k48J776j2j538
2137g80O59J609l22k091P90J779p97j511K55J437p83j505J360J338j485r58J246
$$ plain form
2006 -1110 6 521 -797 -1559 -396 175 -727 -1288 -76 652 -474 -965 -190 -53 -477 -273 315 193
2024 193 -715 -303 491 592 -515 -859 -781 -696 -999 -1220 -765 -421 -680 -793 -129 788 269 -568 -510 52 -13
2045 -13 -475 -656 -504 -348 -984 -593 584 -326 -1257 -986 697 -130 -1473 -274 745 1 -1114 400
2063 400 1301 179 -1195 -149 1024 -298 -1647 -430 350 -667 -1119 389 976 -393 -875 967
2079 967 1548 -185 -906 566 907 -125 -126 882 470 -827 -361 1004 602 -519 -608 -176 48 -212 463
2098 463 709 550 -171 579 1449 860 110 -512 41 487 26 -556 17 547 166 -264 618 781 -268 -845
2118 -845 197 960 222 -597 361 838 -74 -392 923 867 -997 -1282 601 1127 -758 -1006 770 758 -780
2137 -780 -121 1488 1166 -925 -135 1644 847 -664 -409 1028 245 -1260 100 1438 -47 -1005 241
2154B41J371j697j018J517R21p10n95J120M6j232j15R29L91j573j85Q00j27k85
2172b01N91R55p45q48L61P71n0p21K67m19L21K06K84o26k29M51k20K0j38J82k14
2193bl11L51Q07n39p08Q76K72n24k67J32N9r86J52J165J23j427J09R34J55p46
2213c75K21O17m55q09M66J016k94j148M53P17l50n57K37N47q50l06O53L39o98
2232e76l18P34P62k62l34j73N22p1n79L33K62p65k96JJ095J83r46J78M01k90m92
2253f31J83J180l36j777R95J224l39r02M70Q24p54j268Q53R86q18j489J153J159
2271G13r56j051J448J259j487j260J575O25j632o86K069L94j793n32J499O33j630
2288h12m67J530L9j412p9J964k34j634K70J701j86j648L75J193o89j358R05J076
$$ plain form
2154 241 1612 -85 -1103 414 1335 625 30 1150 1196 -36 -151 778 1169 -404 -589 211 84 -201
2172 -201 390 1345 600 -248 113 884 834 113 380 -39 282 488 772 146 -83 368 148 168 30 212 -2
2193 -2 -313 38 845 306 -402 474 746 222 -45 87 146 -840 -688 477 600 -827 -718 216 371 -375
2213 -375 -154 463 8 -801 -335 681 387 -761 -308 409 59 -498 -261 286 -564 -870 -217 122 -576
2232 -576 -894 -160 602 340 6 -167 355 284 -295 38 300 -465 -761 -760 335 518 -428 -250 151 -139 -631
2253 -631 -448 732 396 -1381 -386 838 499 -403 67 891 137 -1131 -278 708 -110 -1599 -446 713
2271 713 -243 -1294 154 1413 -74 -1334 241 866 -766 -1452 617 1011 -782 -1314 185 818 -812
2288 -812 -1279 251 290 -1122 -1201 763 529 -1105 -835 866 680 -968 -593 600 -89 -1447 -542 534
2306E34o91j479J097J612q91j460Q59R89o55j039J053P83j009n51Q32N94m86o42
2324e50Q77k63q71k19R62K36q88M71J61Q17m23o52R65n00k26k17L82O7m30q7N99
2345B11n1o1q1K33J52n93j83L92J5J96k96K91J01o37K70J32K21l53j5Q1k71m2
2367b88J42K06j50J29K04k41j18K37r2j61J81K75l0p64J43P33j36n95M38J43o15
2388c59l58O62O87n46p11P34O83n02p53R35M26o01q90M91R29j019n43J057M19
2407G41q05k35J112N1j251n2J202j01j525M04J315o7j422K38J266k88j373R5J535
2426H40m93j003J95J341o14j002O43J406m82j400Q23Q48r16r25Q62J046j162r45
2444i38J360O83r37q33R22J037j351j099J469O12j520l6J282M82j411o21J790
$$ plain form
2306 534 -157 -1636 -539 1073 182 -1278 -419 570 -85 -1124 -71 712 -297 -848 -16 578 92 -550
2324 -550 327 64 -807 -1026 -64 172 -716 -245 -84 733 310 -342 623 123 -103 -320 62 129 -301 -388 211
2345 211 160 99 18 251 403 -190 -373 19 34 230 -66 225 326 -311 -41 91 312 -41 -56 25 -246 -288
2367 -288 -146 60 -90 39 243 2 -116 121 29 -132 49 324 294 -470 -327 406 270 -325 113 256 -359
2388 -359 -717 -55 632 86 -625 109 792 290 -463 472 898 297 -593 -102 827 -192 -735 322 741
2407 741 -64 -299 813 864 -387 -439 763 662 -863 -459 856 789 -633 -395 871 583 -790 -695 840
2426 840 347 -656 -461 880 266 -736 -93 1313 831 -569 254 1102 186 -739 123 1169 7 -938
2444 -938 422 1105 168 -665 257 1294 -57 -1156 313 925 -595 -631 651 1133 -278 -899 891
2461H91j4j371m34J465J36j150m6J243j59j072K41J011n5j278K26J220l70j136
2479f52L76P97o00p08O47R26m99j067N75Q96r48o92Q20O06j24o23N28k0p22q8
2499e72Q00L74j161N0O87J15l94O5N21r9n08l72N50j68k18L52K34j65l59L26J93
2520B51l17p0n1K81o36J94L46L7k65J86K67k74j05K50k22j64j33J15N38l09m56
2541e37P47P9o44j3M37J57p50j17Q51p0m57j83M62P1n63M60P94p34p52M43R93
2562F74q74m50R38M28r52n38J039M80p82n88P78L20j018l28J125L96j342k10R78
2581G4P14r30j92O55P8j204P17M72k40p89%J156m98o33K62J016l87j097L21Q09
2601C04k43m87l28J536q44o25N09P88m56q70Q40J33Q5j150Q45O08n40n85O98N15
$$ plain form
2461 891 877 -494 -928 537 673 -477 -523 720 561 -511 -270 741 686 -592 -366 854 484 -652
2479 -652 -276 521 -79 -787 -140 786 287 -780 -205 691 -257 -949 -129 477 353 -270 258 238 -484 -572
2499 -572 228 602 -559 -509 178 293 -101 -36 485 386 -122 -494 56 -112 -330 22 256 91 -268 58 251
2520 251 -66 -136 -187 94 -542 -348 -2 35 -230 -44 223 -51 -156 94 -128 -292 -425 -310 228 -81 -537
2541 -537 210 289 -355 -368 69 226 -524 -641 210 140 -317 -500 -38 33 -530 -70 724 -10 -762 -319 674
2562 674 -200 -650 288 716 -236 -774 265 745 -37 -625 153 473 -545 -873 252 648 -694 -904 74
2581 74 788 -142 -334 321 399 -805 -88 384 144 -645 -645 511 13 -620 -358 658 271 -826 -505 304
2601 304 61 -426 -754 782 -62 -687 -178 610 154 -716 124 257 342 -808 37 645 105 -480 218 733
2621G33n77o35M50N50o81m46Q38L11k82j071J225M29q95q63R79N20o50n62J037
2640D10L24j053k11R72N14j012n89O84N59q49n7M38k8o08K36P70j19q53K97O56
2660D81m13m19L63O68m26p35N47M05o49j28P49N1m95p0P4J24k02J17K66j16m4
2681A48k56L42j37j76N9j42M9j96N16k09p4Q6N9m3p4L78j78n99J2J096j23q14
2703b76K07N62l01n28K78N02m34p07M06P35l34m37K68M05k58l77N52L65r27m95
2723g94R91N12p75k3L35n0o07J02Q29j39q42j0O97J76m82J07K34j41l10Q8L36
2744B34J1n57P2K88K70m62L74k02j65J99J54j6J41k86l29M10N17q35k45N14K41
2765C28l95k16K48K62n84m43J271j53m13m62Q34L93p84j7L46L35p67n5P79qj366
$$ plain form
2621 733 156 -479 -29 521 -160 -606 232 543 261 -810 415 844 -51 -914 65 585 -65 -627 410
2640 410 734 -319 -530 442 956 -56 -645 39 598 -251 -308 130 102 -506 -270 500 381 -472 -175 481
2660 481 68 -351 12 680 254 -481 66 471 -178 -306 443 494 -1 -71 3 127 -75 42 308 192 148
2681 148 -108 234 97 -79 -20 -162 -113 -309 207 -2 -76 10 69 26 -48 330 152 -447 -435 661 538 -276
2703 -276 -69 493 192 -336 -58 444 10 -697 -291 444 110 -327 -59 346 88 -289 263 628 -299 -794
2723 -794 197 709 -66 -89 246 196 -411 -309 520 381 -461 -471 226 402 -80 27 261 120 -190 -102 234
2744 234 245 -312 -240 48 318 -144 230 28 -137 62 216 200 341 55 -274 136 653 -182 -427 87 328
2765 328 -67 -283 -35 227 -357 -800 471 318 -95 -557 277 670 -114 -131 215 550 -217 -272 507 499 -867
2786h67K31J199k07p61J07P43o98l51J035J77n49o68K50J246q21n91M90L19o86
2805d02J92O23Q2r36k31Q79J01l00k06Q4j8l06L82O70m36n83K25K26J20q7o7k72
2827b60j09M47J73k74J44Q6j47j45J75Q0m71j39N07K85m33l37O92k18n63L45O39
2848D77n50o39N00O47k48o81L67O42k68p06O93L51o80o27P80N17o69q36J108J32
2868C10o88o1R25j43j046L81Q96L2n96j15N73n66p9L99R8l9j175P35N63l59l25
2889b80J01R0J3j7L20L33p96k27M80n2K14m22L0K48l40L48P2k15L1r0J34Q9L44
2912D08j57k86j67L74k34O6J3P1O2m02J08J53l31l0L77K32j90j43L79k53l07M33
2934A76K49k4o14K02K87rn22K47J77q1r8Lj23M4j76K2M15q4j81k6o2K9L74k16
$$ plain form
2786 -867 -636 563 356 -405 -298 445 -253 -604 431 608 59 -609 -359 887 66 -525 -35 284 -402
2805 -402 -210 413 495 -441 -672 207 308 8 -198 -114 -132 -438 -56 614 178 -405 -180 46 166 79 12 -260
2827 -260 -369 78 251 -23 121 207 60 -85 90 170 -301 -440 67 352 -81 -418 274 56 -507 -162 477
2848 477 -73 -712 -212 435 187 -494 -127 515 247 -459 234 585 -95 -722 58 575 -94 -930 178 310
2868 310 -378 -439 486 343 -703 -322 574 606 10 -105 468 -98 -177 222 320 281 -894 -159 404 45 -280
2889 -280 -179 -89 -76 -93 227 560 -236 -463 17 -35 179 -243 -213 35 -305 43 115 -100 -69 -159 -25 64 408
2912 408 251 -35 -202 172 -62 4 17 88 150 -252 -144 9 -322 -352 25 257 67 -76 303 50 -257 176
2934 176 425 401 -213 -11 276 267 -255 -8 169 88 -10 -7 -130 -86 -262 -240 175 91 -90 -116 -178 -149 225 9
2958Io2J98k41M1k22nK93n69K67K62J90l08k01L77L1j78J28l4R9o06N43M38j97
2981B53o94J3O35j58m99O79j8k48n75R65J49p67k12P95K19j161M70N59O3j135
3001f67M38N63K85q51k1P84n17n81L58Q13n47n62M52O65l59r89N77P57m36o33
3021d71O31L01p33k56L04O47n17p55Q45L65n47l67N41O19n03o61N80M06n62k30
3041c63N45K17m74k06N53K75o20m13P30l3n66%O67o7l72k29P13m21l85L86N34
3062D71n10m44L01M07M3n06L18L02l94j41J61N88n23k83R9K36k65j61N75O2l89
3083e3m57M08M95l63j87M78J22o40n3O92l0l63j02M74m09k3m9N06m71J14Q1j10
3105F0n3o4L55K44m18N8M7J97o11n2O04o1o06J30L85k66lK9J9n9m83O31L91m93
$$ plain form
2958 9 -53 145 -96 -55 -277 -282 11 -558 -291 -29 161 -147 -348 29 60 -118 10 -24 75 -531 12 450 253
2981 253 -441 -428 207 49 -450 229 211 -37 -612 353 502 -265 -477 318 537 -624 -154 405 468 -667
3001 -667 -229 334 619 -232 -253 531 14 -567 -209 604 57 -505 -53 612 253 -736 -159 598 162 -471
3021 -471 160 461 -272 -528 -224 423 -94 -849 -4 361 -186 -553 -12 607 104 -557 23 429 -133 -363
3041 -363 182 399 -75 -281 272 547 -73 -486 244 211 -355 -355 312 245 -127 -356 357 -64 -449 -63 471
3062 471 -39 -483 -182 225 268 -238 80 382 -12 -153 8 596 73 -210 -111 125 -140 -301 274 336 -53
3083 -53 -510 -102 393 30 -157 321 443 -197 -250 442 412 49 -53 421 12 -11 -60 446 -25 89 170 60
3105 60 7 -57 298 542 124 182 229 426 -185 -237 367 306 -300 -170 215 -51 -54 -25 -6 -65 -548 83 474 -19
3129a9j85P1L00k15q3M82K46p03l73Q20j97m10j26O58n8n42O7Q73m78n26J91N68
3151C61j13o31M94P99q29m55J80O68k74j049R70P59j060m82J090P4o95OL88P54
3171I55r54m11Q67j21m83R4N48l34o20j13J125k24p90j31J219n54m25O1R05l28
3191B86p48M63M13m06m45K90N48m99m98L33N15N0p09M58N69p06o70O93N52m43
3211D6o72R82K03o76m48Q03J94p24j77O42O0n67j38O31L24p54R6O78m12m17J79
3232a47Q13m76m38k50M89M1n04N01M45o29k64M27K77m94l24P02K29n28j89J48
3252a71N10p28L61M93k13n16M6M15l14l0PL26j43J26r1M24m60j47J23L58l88J53
3274A41k45N3k93J34K48p5m04j13R32o63K11r7K50k97m0M19J44j68m73L80J39
$$ plain form
3129 -19 -204 -133 167 -48 -131 351 597 -106 -479 341 144 -266 -392 266 208 -334 -267 606 128 -398 -207 361
3151 361 248 -383 111 910 81 -374 -194 474 200 -849 121 880 -180 -662 428 502 -193 -187 201 955
3171 955 1 -410 457 336 -147 -53 495 161 -459 -572 553 329 -461 -592 627 73 -352 -291 614 286
3191 286 -462 1 414 8 -437 -147 401 -98 -596 -263 252 302 -407 51 620 -86 -756 -63 489 46
3211 46 -626 356 559 -117 -565 238 432 -292 -469 173 233 -334 -472 159 483 -271 -175 503 91 -326 -147
3232 -147 666 190 -248 -498 -9 32 -472 29 474 -155 -419 8 285 -209 -533 169 398 -130 -319 -171
3252 -171 339 -389 -28 465 252 -264 -218 197 -117 -147 -140 186 43 169 78 502 42 -105 18 376 -12 141
3274 141 -104 -51 -344 -210 38 -37 -441 -554 378 -285 -74 -171 79 -218 -258 161 305 137 -336 44 183
3295A83l84j12J32K49m15j08N52j17j89M8N42j08m58j70M28J40l73j14M96l25
3315a03k53K38M5K24p22N60K19o2l84L17K71n0p12J42Q73j69r38M22N85r0o79
3336b66K33O62o33l42N18O26j070L8K26N60n53o15J030K23p87n42O57O63q43k48
3356d63P21n9p05K51P05l01p47K84J201o23o87r8J116m72o61K40N23l01p97J063
3376A90L18o47o80R02R4m65j62P89K63j030N07K42J35r16mN49N8l09L0O14l94
3397H4m85J66N17n2m51L00L10n77J09N9K33l85mJ60M47j32k73J0k51L14K72k90
3419H1n7p8J25j9j89N00M2n94J27L86j18k25J81l80L21k23K22J65l55k65L70J8
3441C5p6k38L33j55L16k06M7j40m62N63L34m44J35j87k14K84L71m36J00l27Q2
$$ plain form
3295 183 -201 -313 -181 68 -347 -455 97 -20 -209 -161 381 273 -185 -355 73 213 -160 -274 222 -103
3315 -103 -356 -118 -73 151 -571 -11 208 146 -238 79 350 300 -412 -270 603 434 -504 -82 503 413 -266
3336 -266 -33 629 -4 -346 172 798 -272 -234 -8 552 -1 -616 414 637 -150 -692 -35 628 -215 -463
3356 -463 258 199 -506 -255 450 149 -598 -314 887 264 -423 -521 595 123 -538 -298 225 -76 -873 190
3376 190 508 -139 -819 83 177 -288 -450 339 602 -428 79 321 456 -460 -464 85 143 -166 -136 478 84
3397 84 -401 -235 282 230 -221 79 389 -188 -79 -20 213 -172 -176 -16 431 299 26 36 -215 99 371 81
3419 81 24 -54 71 52 -137 363 405 -189 -62 324 206 -19 162 -218 103 -120 102 267 -88 -353 17 35
3441 35 -41 -279 54 -101 215 9 56 -84 -546 17 351 -93 42 -145 -359 -75 296 -140 -40 -367 -285
3462b85J72J67m4j35L11o01K88K84k1n22Q7M19m16M7L87J51m47l87O20k38J65
3483Bl4k25N33k49j37N62k65o06R9P72l98k48k2O84k27p7O7L01l58l21M12J42
3505D07k89o48M50M53m60k26P49l6o98oM32M81r47k43P57J02m27n2N03k97m19
3526d14K41L99r6p4p1kO7n13M00m6j02p5M05J73m82O5kN6J16j63M44n60J13J97
3550G6j14k86J01J26M5J26n3M7n3k52M06J59n66L9M45l08q9N63M0l27l41K94o8
3573A0r9Q0j50K13n42N08M48j25m31K11Q2lk63L74L6m44j46L48K48l65j25N7K72
3596A94k64j2M17J03m45m4L64Nm09j9OK09j95j74L42l42K83k21J32J45k63j0Q4
3619a14K26r9J06l02K52K3j30J5j40J40K6k93M84l55r5P5J76M9j36K48k79K85
$$ plain form
3462 -285 -113 54 10 -125 186 -415 -127 157 136 -386 -299 120 -296 -249 138 289 -158 -545 75 -163 2
3483 2 -32 -257 276 27 -110 452 187 -419 -320 452 54 -194 -216 468 241 164 231 532 174 -147 265 407
3505 407 118 -530 -80 373 -87 -313 436 400 -298 -304 128 609 -338 -581 176 278 -149 -201 302 5 -414
3526 -414 -173 226 130 56 -15 -17 50 -463 -63 -109 -211 -286 119 292 -190 -125 -127 -71 45 -118 326 -234 -121 76
3550 76 -38 -324 -223 -97 -52 74 21 68 15 -237 169 328 -238 -199 246 -62 -151 412 452 125 -216 78 10
3573 10 -89 -9 -159 54 -488 20 468 343 -88 123 205 202 -61 313 349 -95 -241 107 355 -10 -135 -78 194
3596 194 -70 -82 335 438 -7 -51 313 318 -91 -110 -104 105 -90 -264 78 -264 19 -202 -70 75 -188 -198 -114
3619 -114 112 13 119 -183 69 92 -38 -23 -163 -23 3 -290 194 -161 -256 -181 -5 44 -92 156 -123 162
3641A62l20K62J29k61l87M98O9j35k93M99l29o0P6j31M62m70r2M98J30l83J75
3662I9m0K71k92J85J03m25p4K88j66j46J09K80K14m27j01J36J89k58j77M28j62
3683C4j21K11j94Q3k0K17j52k10oj51k6O1K77J80m84j26K72L60k43l6J92j94k97
3706c73L46j0K09m73j90P70j38l30P8K11j76J96o69O44k1l59N16o6k83j51M0K68
3728C9o2L0k88M85j64l44L47J03p0j9k6L99n01J1k10P12k98l13M12K24l25l21
3750a79L89L52p75P7M9M92n29J17Q6J50j67n4M67l03m98Q3M67j45k56L3L18k48
3772g4l23K14K54r4j91m9L53M68p65j06M36J97n93K85j02n6k01P0M23k37k54L17
3794b8Jj16j83K17M70m51j06K26k99L44k05M2J07j98j41K45j41J12k55O22j80
$$ plain form
3641 162 -158 104 233 -28 -415 83 152 17 -276 223 -106 -166 -90 -221 241 -229 -321 177 307 -76 99
3662 99 59 330 38 223 326 -99 -173 115 -51 -197 -88 192 406 -21 -122 14 203 -55 -232 196 34
3683 34 -87 124 -70 13 -7 210 58 -152 -158 -309 -335 -274 3 183 -301 -427 -155 205 -38 -74 118 -76 -373
3706 -373 -27 -37 172 -301 -491 279 141 -189 -111 100 -76 120 -549 95 74 -285 231 165 -118 -269 -229 39
3728 39 -23 7 -281 204 40 -304 43 146 76 57 31 430 -71 -60 -270 442 144 -169 243 467 142 -179
3750 -179 210 562 -213 -136 -87 405 -124 -7 79 229 62 8 475 172 -326 -243 224 79 -177 -144 174 -74
3772 -74 -397 -183 71 -23 -214 -263 90 558 -207 -313 123 320 -273 12 -90 -146 -347 -277 146 -91 -345 -28
3794 -28 -27 -143 -326 -109 361 -90 -196 30 -269 75 -130 -88 19 -179 -320 -75 -216 -104 -359 263 83
3815H3l62R2L41l0j81J75O1k37p9P4N30k31J01k09O8k55L1m6L40k47J3J52k54
3838g0L42l21L38r9n00K14M76k95m83M68J45j1j88K47j43Q7l32L12J08k07l02
3859b14L98K19n43J20J04K88o98L59L19m23l43L18M96m42P8k8K19j61M3k45R7
3880c9J59r4J39k5l33k14L89M55m83j04L62k53p2J07J26J71k95K1L15j43k96k98
3902d05O51j99m35M53N19l18o27K49N63k34o16N69J72j79l46M77Om35j51K96P10
3923G20r82j3M32K58m18q0J73O4l15k14N00K46r19K07N66l11j70Q5M88j59n10
3944c52J96O79m29n95J60M48N6o24K17O94o77p5J53M68n46k26O05J42n12j41L09
3965e0K19n49o0N67K2j95j86L92n5k91j9K41J00n58L52L26p2o97M38M95n49p0
$$ plain form
3815 83 -279 -187 154 124 -57 118 179 -58 -137 -63 467 236 337 128 196 -59 -28 -74 266 19 32 184 -70
3838 -70 272 -49 289 190 -310 -96 380 85 -398 70 215 204 16 263 120 207 -125 187 295 88 -214
3859 -214 184 403 -140 -20 84 372 -326 33 352 -71 -414 -96 400 -42 36 8 227 66 109 -136 -39
3880 -39 120 26 165 140 -193 -407 -18 437 -46 -150 212 -41 -113 -6 120 291 -4 17 332 189 -107 -405
3902 -405 246 47 -388 65 584 266 -361 -112 451 217 -399 170 342 163 -183 294 300 -135 -286 10 720
3923 720 -262 -275 157 415 -3 -83 90 154 -161 -375 125 371 -548 -341 225 -86 -256 -171 317 158 -352
3944 -352 -156 523 94 -501 -341 107 163 -461 -244 450 -227 -302 -149 319 -227 -453 152 294 -218 -359 -50
3965 -50 169 -380 -440 127 149 -46 -232 160 105 -186 -205 36 136 -422 -70 256 184 -513 -75 420 -129 -199
3987a99Q3L50k93k14K83j72K89k07J70J12k86j83K57L05n71kJ50K17m10M2L04
4008B5l0J63m61j3K64k49L36n2J30m18J23K00l81k9N8L77J45m56J36L87m92J54
4030h3j01j8J63N8Jn0n8k1J52Qo1j41K3J97k95N3L70k27j81J4L20j14j76M11J64
4055D08l00l28K2N92l93n35P75k1o83J14J90P56p58k82O58r1m87j68Q77j35m64
4076b53mO66n63k44J74O45m28k37qR30o31j19J87K75m89O3L17P5k49n99O75k2
4098A61k55k95O66k7l71J13N62l95l00q9N71j3m88j23N85m64l25N39O05o76l7
4119e6K87J2p2l17O1N34o78K86J16n9m89K19K65J74m6k67N4P0M5P2j25K45m94
4142a63k6K57K17Jl33J20l17J84R7L1L1l31K49J82mk21O3K40j31N3J3r2M3k36
$$ plain form
3987 -199 -116 234 -59 -273 10 -162 127 -80 90 202 -84 -267 -10 295 -276 -278 -128 89 -321 -279 25
4008 25 -5 158 -303 -316 -52 -301 35 -17 113 -305 -182 18 -363 -392 -334 43 188 -268 -132 255 -237 -83
4030 -83 -184 -202 -39 19 20 -30 -88 -109 43 51 -10 -151 -128 69 -226 -173 197 -30 -211 -197 123 9 -167 244 408
4055 408 108 -220 -198 394 1 -534 241 220 -463 -349 -159 597 -161 -443 215 124 -363 -531 346 211 -253
4076 -253 -257 409 -154 -398 -224 421 -7 -244 -252 678 47 -72 115 390 -99 -36 281 356 107 -492 183 161
4098 161 -94 -389 277 250 -121 -8 554 159 -141 -230 341 328 -160 -283 302 -162 -487 52 657 -19 -56
4119 -56 231 243 171 -146 -85 449 -229 57 173 114 -375 -156 109 283 237 -30 24 94 139 211 86 331 -163
4142 -163 -189 68 285 286 -47 73 -244 -60 37 68 99 -232 17 199 195 -26 37 277 146 199 212 120 163 -73
4166g3K40j1J38k71O1J3J08r7k7K28l86j06K33K77o94L22Q3j6Q4m8J08J93p25
4189c66K30N28n7m02O1L10L7r47Q20J8l31j18M11J78m70K0rM71k93k56M72j96
4211A11k04J70K76j1n89K01L73l24k04J21P5j21k74O97rk31j23J23J64j65m00
4232c44N22j96l64J40M56n72J70j64L37M1n25N19K68j41k70M34j82q3l73J4L10
4253cJ76l60m9K41m21N54k21J70k94K70j15J83o5k39J17R8J07Oj39o7J15n1K15
4276B28k11j71N3j74L19j22k77L47R8k56j34J39J56k91j71K36J89k76P1L39j83
4297i1J5k98N46n8l43R6O3J06k24J2L70o37J19M25q7j22m7K15Q1m06L78p1n1j96
4321b05j68L82K88k34q8L46n95r8K99K16j95k68L54j20k4q5nQ5j67R4J26O6j89
$$ plain form
4166 -73 167 156 294 23 84 97 205 108 81 309 -77 -183 50 327 -367 -45 38 22 106 58 166 359 -366
4189 -366 -136 392 335 -67 -6 304 341 -606 214 232 -99 -217 194 372 -98 -78 -87 384 91 -165 307 111
4211 111 -93 77 353 342 -247 -46 327 3 -201 -80 -5 -126 -400 297 288 57 -66 57 221 56 -344
4232 -344 178 -18 -382 -242 214 -358 -188 -352 -15 26 -499 20 288 147 -123 311 129 46 -327 -313 -3
4253 -3 173 -187 -236 5 -416 138 -83 87 -207 63 -52 131 66 -173 -56 42 149 155 16 -51 64 13 228
4276 228 17 -154 -101 -275 44 -78 -355 -8 90 -166 -300 -161 -5 -296 -467 -231 -42 -318 -247 92 -91
4297 -91 -76 -374 172 114 -229 -133 -70 36 -188 -176 194 -443 -324 101 14 -108 -155 60 141 -265 113 42 -9 -205
4321 -205 -373 9 297 63 -25 321 -274 -372 -73 143 -52 -320 34 -86 -110 -195 -200 -115 -282 -188 -62 4 -185
4344a85j84L89K31l79r5L18n7k87K00n7J59k5r4J48k14L7J69j02k84J65M9L03
4366B05o69O39kl38j8J42J35k72K94o0j2j60O5K00l13kL91R5j67L4n9J7k17m2
4390a14J4K15k22Q1n3K80k50j72L64O3l01J25M1p7N8mn1K34k68J09J54l76m2K46
4414E4J75l77L72k13k0L5K23k30k3K62k40L8j88J56K83j96n1K84r1j84k73Q9L74
4437B59l43L4j09N31o23K04K13o1k32K22J4j9l9j53j08M84l61J85Q6k48K08r5
4459D9%R6l41K54j60K25J40j83j56N31k09j20L25j58k51k48K28Q1j89R9m5J3M4
4482B5NJ50rK8k58L38j19n5Q2J7j12l55J88L42k43M1j5pj36J01J5K35n15J39K59
4507A41k01J19l78K53j8L50l62R3J64k35lL35j78j89P9OJ6r4p4K91k47j63K50
$$ plain form
4344 -185 -369 20 251 -128 -223 95 38 -249 -49 -106 53 28 -66 82 -132 -95 74 -28 -312 -147 -98 205
4366 205 -464 175 173 -165 -183 -41 94 -178 116 56 44 -116 -51 149 -164 -166 225 320 153 187 128 145 -72 -114
4390 -114 -100 115 -107 -26 -79 201 -49 -221 143 206 -95 30 71 -6 52 48 -3 231 -37 72 226 -150 -192 54
4414 54 229 -148 224 11 -9 26 249 19 -4 258 18 56 -132 24 307 111 60 344 253 69 -204 -115 259
4437 259 -84 -50 -159 372 -251 -47 166 105 -127 95 109 90 51 -102 -210 274 -87 98 184 -64 144 49
4459 49 49 145 -196 58 -102 123 263 80 -76 455 246 126 451 293 42 -206 22 103 -86 13 -32 -19 25
4482 25 30 180 171 199 -59 279 160 105 187 204 92 -263 -75 267 24 65 50 43 -93 8 23 258 -257 -118 141
4507 141 -60 59 -319 -66 -84 266 -96 -3 161 -74 -77 258 80 -109 -30 -24 -8 -102 -176 115 -132 -295 -45
4530d5J68j19K0l4K51j64j26j45L41l09J40j17K23k51Q2K31k36L13n10p9M80j82
4552f8k04L46n9J25l66J42n3L38m96R1L29k57R7j9R0OJ61k68J34l59L77L5n3j25
4576e6J15j25j34R6L6J66j76j58J87J65m17J18O1P8l17J28M55k94J81r5J60o8
4598A06Q0l33L17k63r7J25J16l82K56M6L07l63k8K95k60P9k16K77J22j42p4O5
4620C3M7k04J05K34j42k62J79r1J72k84k75M79o8J06kj31L73l43K89m5m00J35
4642i5L16K1l02j74L35J12l51r5L37J45m47m1J75K2k14J43K60j53l70M5N19j9
4664A69k93J15M84m73L30k84J44n4k93J28K06p5k74J90J7m1OO6L66n34J52N6P8
4687A86k00j66M96k26r1k29M65Q0l02j82R7P3j84K62J73J4l34J73O9nl54L99J51
$$ plain form
4530 -45 123 4 24 -10 241 77 -49 -194 147 -162 -22 -139 84 -167 -85 146 -90 223 -287 -366 114 -68
4552 -68 -272 74 15 140 -226 -84 -137 201 -295 -204 125 -132 -35 -54 36 42 203 -65 69 -290 87 122 69 -56
4576 -56 59 -66 -200 -104 -68 98 -78 -236 -49 116 -301 -183 -122 -44 -361 -233 222 -72 109 14 174 106
4598 106 186 -147 170 -93 -190 -65 51 -331 -75 -29 278 -85 -113 182 -78 1 -215 62 184 42 -32 33
4620 33 80 -124 -19 215 73 -189 -10 -101 71 -213 -488 -9 -77 29 27 -104 269 -74 215 170 -230 -95
4642 -95 221 242 -60 -234 101 213 -138 -233 104 249 -198 -239 -64 -42 -256 -113 147 -6 -376 -331 188 169
4664 169 -124 -9 475 2 332 48 192 138 -155 -27 179 104 -170 20 37 -4 2 68 434 -100 52 108 186
4687 186 -14 -180 316 90 -1 -230 235 315 13 -169 -72 1 -183 79 252 266 -68 105 174 169 -185 214 365
4710C65k62L0j6P3Q7m01NM03k45Q3n6p3K0q3k1L13j16m28K49L92l36p0J48K89
4734C50k32k69K67k45l5o3L72Pk63pL01L3o32L9O62j60m92M01k0J02l84J33N13
4757C78l91j39M44m10J77m00J08N78m49j24K92K31k66j47L22j79l0k47M95n74
4777c31P6L57J97l09P8J00O5j25l11M59l60n8L05M01m53q9oM97m21l01J07L23
4799B01N5l48L04Qk68j92J70Q2J4j40J12K9j54j03L23lk59J30l3J71j36MJ86j20
4823C3k98J72K92j03j90L0M04m79J27l18L72Q8k33j9K52j84k17K03K87j47J29
4844B01j21k11J92l66L59K65k53k99K57p5J48j82l1K18On17M18L75Qo79L39K44
4866B96l29k70K35q2N09n30K07L68m70j54O03k98k04j05K28J1n01N92J78k33j78
$$ plain form
4710 365 103 133 117 190 277 -124 -119 284 39 122 66 -7 13 -70 -91 222 106 -322 -73 319 -17 -87 61 350
4734 350 118 -151 116 -129 -164 -227 145 152 -111 -118 183 216 -416 -377 285 125 -367 34 14 116 -268 -135 378
4757 378 -13 -152 292 -118 59 -341 -233 345 -104 -228 64 295 29 -118 204 25 -5 -252 243 -331
4777 -331 -255 102 299 -10 68 168 233 108 -203 256 -104 -162 143 544 91 2 -4 493 72 -229 -122 201
4799 201 256 -92 212 220 -48 -240 -70 12 26 -114 -2 27 -127 -230 93 90 -169 -39 -72 99 -37 -33 153 33
4823 33 -265 -93 199 96 -94 -64 340 -139 -12 -330 42 130 -103 -122 130 -54 -271 -68 219 72 201
4844 201 80 -131 61 -305 54 319 66 -233 24 -51 97 -85 -116 102 108 -409 9 384 392 -287 52 296
4866 296 -33 -303 -68 -150 359 -171 36 404 -66 -220 383 85 -119 -224 4 15 -486 106 284 51 -127
4887a27K7K95p8k77J29m6m6j74M05J39l26m3J14J58r8m51O84n75L93j2M4j40l80
4910c85N59L36n93j44K17L4l58n1J83J12j69P0L51J09m35q0M12m16K33q1O5r8
4932a29j40J74J97q8l01K29L39L4k46J61N1pl64P9R4J58m43M28k68k65J41K4J36
4955fj68K1K21K17l17J18j93Q4K3J34N3j82P8j57q6J74q8J72J95l52k7j49J67
4978f8K3j94K77Q6n6m13NO62j62l06K8J88J83k35q9L93k82l7j10j8K09j78k0K27
5002A13k41L7L17P9l90l08L71P2P5k87J34J95k95j2N1J72l89L92J36q6m1l21L78
5025A52m0J68j52l2J62m47J87M27n58R2L99j19l20j92L89m6oq5Q3j42J1l0J14
5048A5J44l84K06R0r6k35R8L86K1m94l6J64q4K76n3j11L02k71K81k78J83k03Q9
$$ plain form
4887 -127 -100 195 117 -160 -31 -77 -123 -297 108 247 -79 -122 -8 150 52 -399 285 -290 103 91 135 -5 -385
4910 -385 174 510 -83 -227 -10 24 -334 -385 -202 -90 -259 -189 162 271 -164 -244 168 -248 -15 -96 -31 -129
4932 -129 -269 -95 102 14 -287 -58 281 315 69 230 281 274 -90 -11 83 241 -202 226 -42 -307 -166 -142 -6
4955 -6 -174 -153 68 285 -32 86 -107 -23 0 134 187 5 83 -74 -160 14 -74 98 293 -59 -86 -235 -68
4978 -68 -45 -239 38 124 68 -345 -340 322 160 -146 -118 70 253 18 -71 322 40 3 -107 -125 84 -94 -114 113
5002 113 -128 -91 226 305 -85 -393 -22 50 125 -162 -28 167 -128 -140 -89 83 -306 86 222 136 95 -226 152
5025 152 112 280 128 96 258 -189 -2 425 -133 -41 358 239 -81 -273 116 70 64 -21 62 -80 -69 -99 15
5048 15 159 -225 -19 71 -25 -260 -162 224 245 -249 -285 -121 -205 71 18 -93 209 -62 219 -59 124 -79 10
5071A0n7J01j09L31o22J24L79l8O9k65N7K43l80K38r5j36K52R9M2k50j40j4K06
5094D5q2j19K37m7q7R9O2N7k86K14l87K75J59k27p3K19R5j13K28j09l07k0j9L70
5118A84N5j01k15M0l1M10j05k37J37k61K97J1k63K05j44J75k94L67k00J96k47
5139b1R8j27q6j0M9M40l68Q2j44N8K7l30K98J20j53o1R7L84o48QM76J60k77n3
5163A9j31k0K72j02j77P4j16J64K26n4m70J63l3N21l70p7K10P4M8k46R9k52M71
5186B93j13j71L3L07l26J87J09k24j32J66l8l7j09K02Q3l33q9J64L62n23J7K94
5208A22k05O8k76K80L90o21K31j1qJ78j10O0l86M35j32K55l44J61n29L46J88Q9
5230A81n5j42J92m60MM26J83m26K64R3k56P6p6r3K94j91l02K63M1l3K39r8k80
$$ plain form
5071 10 -47 54 -55 276 -346 -222 157 119 188 -77 -20 223 -157 81 -14 -150 102 201 243 -7 -147 -161 45
5094 45 -37 -156 81 34 -53 46 108 165 -121 93 -294 -19 140 -87 -160 59 154 41 269 160 -147 -167 -186 184
5118 184 239 138 -77 -37 -68 342 237 0 137 -124 173 184 -79 126 -18 157 -137 230 30 226 -21
5139 -21 77 -50 -136 -146 -97 343 -25 57 -87 -29 -2 -332 -34 86 -67 -128 -31 353 -295 -287 189 349 72 19
5163 19 -112 -132 140 38 -139 -65 -181 -17 209 155 -315 -152 -185 336 -34 -111 99 173 221 -25 74 -178 293
5186 293 180 9 42 349 23 210 319 95 -37 129 91 54 -55 147 230 -103 -192 -28 334 -189 -172 122
5208 122 -83 -15 -291 -11 379 -242 -11 -22 -30 148 38 98 -288 147 15 270 -74 87 -442 -96 92 181
5230 181 126 -16 176 -284 -280 146 329 -97 167 260 4 80 4 -89 205 14 -288 -25 16 -17 222 124 -156
5253a56P9p4K06p4o6N3p0K64n30L12L7K0k27K14J14m19L84l69K74K88m28K81j85
5276g2J54k73J85P7k53M4J62j33P5L3j91K57l50J74K63m51L43L9%j9k53oR9L10
5300B14j04k50R7m7J81j12K26j88o7P9k05J11m53P39n26K33K02j57P7O3l58L10
5322F5K2l27j18K81K80l27O3M8j05K18j14J48j4j44R2j09k50K90J36k55L6j45
5344b29K54J08k00j86K00K44k65K37J02k64q5n2K26n7k31M6L46k43N6J59J63o25
5366b96L62O0Q7j58k38K74j14LQ4l6K23o43L83L10p7k47l27N11r9k78m1P3L49
5389A65k36L68m3j10n4J21k51L0j27J32K20K1o5n1j16j51J94m7K4p4M9L7O9j33
5413b8Q6LP1j54m1P0J44m6j47Np1jJ93l0K03k49k76N15p2j31k75L67M4p47O82
$$ plain form
5253 -156 -77 -151 55 -19 -85 -32 -102 162 -368 -56 -19 1 -226 -12 102 -317 67 -302 -28 260 -168 113 -72
5276 -72 82 -191 -6 71 -182 -138 24 -109 -34 -1 -192 65 -285 -111 152 -299 44 83 83 64 -189 -195 -96 214
5300 214 110 -140 -43 -90 91 -21 205 17 -50 29 -176 -65 -518 221 -305 -72 130 -27 50 113 -245 65
5322 65 87 -240 -358 -77 203 -124 -61 -13 -118 100 -14 134 120 -24 68 -41 -291 -1 135 -120 -84 -229
5344 -229 25 133 -67 -253 -53 191 -74 163 265 1 -84 -136 90 33 -198 -152 194 -49 7 166 329 -296
5366 -296 66 126 213 55 -183 91 -23 -20 64 28 251 -392 -9 301 224 -23 -350 161 62 -216 -257 -184 165
5389 165 -71 297 254 144 90 211 -40 -10 -137 -5 215 236 171 120 4 -147 47 0 24 -50 -1 36 105 -28
5413 -28 58 61 132 -22 -63 7 151 105 -42 -37 -108 -109 84 54 257 8 -268 247 175 44 -231 136 180 -567 115
5438A15M1l8O2k63L15k04j70L67o0k99j63M39l15J14J49q5P8j40p6J86l59K9K34
$$ plain form
5438 115 156 118 180 -83 232 28 -142 225 165 -134 -297 142 -173 -59 90 5 83 -57 -133 53 -306 -277 -43
$$ [...]
8191D59
##END NTUPLES=NMR FID
##END=
