##TITLE=1H_SL71-DAU(DMSO)
 DMSO-d6
 8 sc, 
 17.10.2022
##JCAMPDX= 6.0         $$ Bruker NMR JCAMP-DX V2.0
##DATA TYPE= NMR FID
##DATA CLASS= NTUPLES
##ORIGIN= UXNMR, Bruker Analytische Messtechnik GmbH
##OWNER= root
$$ XWIN-NMR		Version 3.5
$$ Mon Oct 17 13:58:15 2022 Russian Standard Time (UT+4h)  she@DPX200
##.OBSERVE FREQUENCY= 200.1313499994
##.OBSERVE NUCLEUS= ^1H
##.DELAY= (6, 6)
##.ACQUISITION MODE= SIMULTANEOUS
##.ACQUISITION SCHEME= undefined
##.AVERAGES= 8
##.DIGITISER RES= 18
##SPECTROMETER/DATA SYSTEM= spect
##.PULSE SEQUENCE= zg30
##.SOLVENT NAME= CDCl3
##.SHIFT REFERENCE= (INTERNAL, CDCl3, 0, 15.7039)
##AUDIT TRAIL= $$ (NUMBER, WHEN, WHO, WHERE, WHAT)
$$ ##TITLE= Audit trail, XWIN-NMR		Version 3.5
$$ ##JCAMPDX= 5.01
$$ ##ORIGIN= Bruker BioSpin GmbH
$$ ##OWNER= she
$$ F:/spectra/data/she/nmr/H-F/1/audita.txt
$$ ##AUDIT TRAIL=  $$ (NUMBER, WHEN, WHO, WHERE, WHAT)
(   1,<2022-10-17 13:57:14.00 +0400>,<she>,<DPX200>,
      <created by zg, POWCHK disabled, PULCHK disabled
       configuration hash MD5:
       00 E9 B6 7A A2 85 ED C7 34 08 36 98 17 FE 4E 26
       data hash MD5: 16K
       9D 09 5D CB F8 8B B5 6B B8 3C 92 48 44 D0 55 25>)
$$ ##END=
$$ 
$$ hash MD5
$$ 7A D7 15 55 CE 48 B3 A6 79 CB E0 AD 49 2D 17 F9
##$RELAX= 
##$RELAX= 
##$RELAX= 
##$RELAX= 
##$RELAX= 
##$RELAX= 
$$ Bruker specific parameters
$$ --------------------------
##$DU= <F:/spectra>
##$EXPNO= 1
##$NAME= <H-F>
##$PROCNO= 1
##$TYPE= <nmr>
##$USER= <she>
##$AMP= (0..31)
100 100 100 100 100 100 100 100 100 100 100 100 100 100 100 100 100 100 
100 100 100 100 100 100 100 100 100 100 100 100 100 100 
##$AQSEQ= 0
##$AQ_mod= 1
##$AUNM= <au_zg>
##$AUTOPOS= <>
##$BF1= 200.13
##$BF2= 200.13
##$BF3= 200.13
##$BF4= 200.13
##$BF5= 200.13
##$BF6= 200.13
##$BF7= 200.13
##$BF8= 200.13
##$BYTORDA= 1
##$CFDGTYP= 0
##$CFRGTYP= 5
##$CHEMSTR= <none>
##$CNST= (0..31)
1 1 145 1 1 1 1 1 1 1 1 1 1 1 1 1 1 1 1 1 1 1 1 1 1 1 1 1 1 1 1 1 
##$CPDPRG= <>
##$CPDPRG1= <>
##$CPDPRG2= <>
##$CPDPRG3= <>
##$CPDPRG4= <mlev>
##$CPDPRG5= <mlev>
##$CPDPRG6= <mlev>
##$CPDPRG7= <mlev>
##$CPDPRG8= <mlev>
##$CPDPRGB= <>
##$CPDPRGT= <>
##$D= (0..31)
0 1.2 0 0 0 0 0 0 0 0.06 0 0.03 0 0 0 0 0.0002 0 0 0 0 0 0 0 0 0 0 0 0 
0 0 0 
##$DATE= 1666000633
##$DBL= (0..7)
120 120 120 120 120 120 120 120 
##$DBP= (0..7)
150 150 150 150 150 150 150 150 
##$DBP07= 0
##$DBPNAM0= <>
##$DBPNAM1= <>
##$DBPNAM2= <>
##$DBPNAM3= <>
##$DBPNAM4= <>
##$DBPNAM5= <>
##$DBPNAM6= <>
##$DBPNAM7= <>
##$DBPOAL= (0..7)
0.5 0.5 0.5 0.5 0.5 0.5 0.5 0.5 
##$DBPOFFS= (0..7)
0 0 0 0 0 0 0 0 
##$DE= 6
##$DECBNUC= <off>
##$DECIM= 32
##$DECNUC= <off>
##$DECSTAT= 4
##$DIGMOD= 1
##$DIGTYP= 9
##$DL= (0..7)
0 120 120 120 120 120 120 120 
##$DP= (0..7)
150 150 150 150 150 150 150 150 
##$DP07= 0
##$DPNAME0= <>
##$DPNAME1= <>
##$DPNAME2= <>
##$DPNAME3= <>
##$DPNAME4= <>
##$DPNAME5= <>
##$DPNAME6= <>
##$DPNAME7= <>
##$DPOAL= (0..7)
0.5 0.5 0.5 0.5 0.5 0.5 0.5 0.5 
##$DPOFFS= (0..7)
0 0 0 0 0 0 0 0 
##$DQDMODE= 0
##$DR= 18
##$DS= 0
$$ [...]
##$SUBNAM2= <"">
##$SUBNAM3= <"">
##$SUBNAM4= <"">
##$SUBNAM5= <"">
##$SUBNAM6= <"">
##$SUBNAM7= <"">
##$SUBNAM8= <"">
##$SUBNAM9= <"">
##$SW= 18.0517283424941
##$SWIBOX= (0..15)
0 0 2 0 0 0 0 0 0 0 0 0 0 0 0 0 
##$SW_h= 3612.71676300578
##$TD= 16384
##$TD0= 1
##$TE= 0
##$TE2= 300
##$TE3= 300
##$TEG= 300
##$TL= (0..7)
0 120 120 120 120 120 120 120 
##$TP= (0..7)
150 150 150 150 150 150 150 150 
##$TP07= 0
##$TPNAME0= <>
##$TPNAME1= <>
##$TPNAME2= <>
##$TPNAME3= <>
##$TPNAME4= <>
##$TPNAME5= <>
##$TPNAME6= <>
##$TPNAME7= <>
##$TPOAL= (0..7)
0.5 0.5 0.5 0.5 0.5 0.5 0.5 0.5 
##$TPOFFS= (0..7)
0 0 0 0 0 0 0 0 
##$TUNHIN= 0
##$TUNHOUT= 0
##$TUNXOUT= 0
##$USERA1= <user>
##$USERA2= <user>
##$USERA3= <user>
##$USERA4= <user>
##$USERA5= <user>
##$V9= 5
##$VALIST= <valist>
##$VCLIST= <CCCCCCCCCCCCCCC>
##$VD= 0
##$VDLIST= <DDDDDDDDDDDDDDD>
##$VPLIST= <PPPPPPPPPPPPPPP>
##$VTLIST= <TTTTTTTTTTTTTTT>
##$WBST= 1024
##$WBSW= 4
##$XGAIN= (0..3)
0 0 0 0 
##$XL= 0
##$YL= 0
##$YMAX_a= 99261
##$YMIN_a= -178150
##$ZGOPTNS= <>
##$ZL1= 120
##$ZL2= 120
##$ZL3= 120
##$ZL4= 120
##$ABSF1= 10
##$ABSF2= 0
##$ABSG= 5
##$ABSL= 3
##$ALPHA= 0
##$AQORDER= 0
##$ASSFAC= 0
##$ASSFACI= 0
##$ASSFACX= 0
##$ASSWID= 0
##$AUNMP= <proc_1d>
##$AZFE= 0.1
##$AZFW= 0.1
##$BCFW= 1
##$BC_mod= 2
##$BYTORDP= 1
##$COROFFS= 0
##$CY= 11.3945322036743
##$DATMOD= 1
##$DC= 2
##$DFILT= <>
##$DTYPP= 0
##$F1P= 2.36226072786647
##$F2P= -0.459571619588291
##$FCOR= 0.5
##$FTSIZE= 0
##$FT_mod= 4
##$GAMMA= 1
##$GB= 0.15
##$INTBC= 1
##$INTSCL= 1
##$ISEN= 128
##$LB= 0.24
##$LEV0= 0
##$LPBIN= 0
##$MAXI= 10000
##$MC2= 0
##$MEAN= 0
##$ME_mod= 0
##$MI= 1.114404
##$NCOEF= 0
##$NC_proc= 0
##$NLEV= 6
##$NOISF1= 3.799351
##$NOISF2= 2.8
##$NSP= 1
##$NTH_PI= 0
##$NZP= 0
##$OFFSET= 15.70392
##$PC= 1
##$PHC0= -18045.79
##$PHC1= 22.80069
##$PH_mod= 1
##$PKNL= yes
##$PPARMOD= 0
##$PSCAL= 0
##$PSIGN= 0
##$REVERSE= no
##$SF= 200.130013532006
##$SI= 16384
##$SIGF1= 3
##$SIGF2= 2
##$SINO= 400
##$SIOLD= 16384
##$SREGLST= <1H.CDCl3>
##$SSB= 0
##$STSI= 0
##$STSR= 0
##$SW_p= 3612.71676300578
##$SYMM= 0
##$S_DEV= 0
##$TDeff= 0
##$TDoff= 0
##$TI= <>
##$TILT= no
##$TM1= 0
##$TM2= 0
##$TOPLEV= 0
##$USERP1= <user>
##$USERP2= <user>
##$USERP3= <user>
##$USERP4= <user>
##$USERP5= <user>
##$WDW= 1
##$XDIM= 8192
##$YMAX_p= 0
##$YMIN_p= 0
$$ End of Bruker specific parameters
$$ ---------------------------------
##NTUPLES= NMR FID
##VAR_NAME=  TIME,          FID/REAL,        FID/IMAG
##SYMBOL=    X,             R,               I
##VAR_TYPE=  INDEPENDENT,   DEPENDENT,       DEPENDENT
##VAR_FORM=  AFFN,          ASDF,            ASDF
##VAR_DIM=   8192,          8192,            8192
##UNITS=     SECONDS,       ARBITRARY UNITS, ARBITRARY UNITS
##FACTOR=    0.0002768,     1,               1
##FIRST=     0,             0,               0
##LAST=      2.2672688,     0,               0
##MIN=       0,             -178150,         0
##MAX=       2.2672688,     99261,           0
$$ Real data points
##PAGE= N=1
##DATA TABLE= (X++(R..R)), XYDATA
$$ [...]
1842B33l05k91K72R49l00j227O9J364j38j396J17J326Rj580L28J349j8j414N1
1861f02J023N4p63l23N61N81n19j59k62J78N19q8o69K46P13Jr80k33J389J60j437
1882f10m59J772J20j536k26J568K61j342n47J252N55p83m69J72O08j35k84m40
1900e23M83Q64q39p80N08J201n11j109j0J539J71j930J83J605R5j805l7J620l9
1919F86j452K2J457k34q86m8N39L42k55o00K32L10Jr0n61M01P33l24q23K7J184
1940F61j0j496K15J463l02j218p4J622m10p84l36J099M23j047m76O91L71k84l60
1959b52j39L79M77j47j015N17P41k18j248K25J842n65j665M63J665m92j254m1
1977g27J395k8j302k50J739K7j179l29R48K84m64o13K61L80J74l72n86O56M80
$$ y = [233, -72, -363, -91, 858, 558, -669, -600, 764, 626, -770, -653, 673, 682, -898, -570, 779, 761, -653, -602, 421, 475, -288, -611, -50, 531, 12, -147, -409, -231, 288, 200, -469, -223, 490, 491, -489, -722, 667, 827, -610, -1069, 703, 823, -713, -939, 629, 890, -452, -999, 253, 808, 25, -444, -272, 336, 201, -83, -523, -40, 824, -15, -795, -287, 914, 403, -706, -716, 823, 994, -936, -753, 852, 947, -858, -895, 725, 686, -766, -744, 713, 479, -407, -455, 84, 426, 171, -429, -197, 113, 114, 24, -537, -136, 597, 273, -550, -523, 661, 651, -845, -630, 833, 531, -687, -761, 861, 451, -333, -669, 430, 853, -194, -670, 21, 392, 108, -252, -391, -12, 465, 318, -697, -180, 561, 343, -905, -680, 1162, 597, -1068, -605, 1060, 568, -686, -727, 668, 640, -662, -912, 827, 854, -325, -654, 294, 578, 114, -499, -238, 142, 316, -56, -642, 14, 494]
1996D94j73j150L49J362o75r77J40J570l37j430J00J129M62j537J46R19N5p90
2014c43RO09O5q4k79r3J54J38j72n75K36Q88j87r52m4J194K56j346k6J171K16
2035H35j482QJ304J73j466q3J137P4q46j89O60M90o98m79K57M02M07m77o68L40
2055c01Q77l71r51N04Q29nj531P49J054j44j567J77J400pj491J83J286m15o35
2074c59N9N22K03n42k78M59J22Oj64j87J04L45q4r65M56P31j5j304M98R10j43
2095C74j056J48J106j0r62R1P55J92q28j83L92M24l51k55n5M33K88n87k94J37
2115b41J051o15r36M90J067l53j329O02J066j16j633L52J269l61r78p2J196O9
2133E28j043j3Q44L39p52o0RK22J23m49L4J50L20r0o78L46Q62p09n18J20J057
$$ y = [494, 321, -829, -480, 882, 207, -770, -630, 940, 603, -827, -727, 402, 864, -673, -527, 392, 447, -343, -334, 275, 340, 256, -23, -116, 38, 176, 4, -571, -335, 553, 366, -586, -630, 564, 820, -526, -552, 619, 835, -647, -639, 665, 838, -628, -711, 426, 500, -346, -535, 125, 615, -83, -562, -305, 97, 504, 27, -641, -301, 576, 205, -746, -242, 587, 582, -949, -200, 854, 710, -857, -680, 720, 713, -778, -595, 691, 276, -359, -300, 222, 425, -117, -395, 64, 186, 192, 28, -159, -55, 290, 206, -759, -303, 428, 413, -891, -393, 517, 374, -682, -534, 572, 562, -400, -309, 446, 638, -190, -373, 19, 443, 92, -163, -218, 215, 503, -84, -378, -241, 810, 195, -741, -251, 816, 463, -866, -264, 802, 686, -947, -595, 674, 313, -665, -737, 459, 528, -515, -528, 316, 655, -97, -157, -148, 74, 197, -252, -218, -68, 252, 162, -516, -170, 692, -17, -535, -415, 642]
2154F42l4j342K80J219m66o31J68N95j32n09M1L71P8k59l73N51l00L5O5l05L23
2175A7M12Q7j325M18R61j43q14J18J098l98j027J01J154k88p32o0J046m39n08
2194c22J96L73l9m46P9J20L62j20k39j82K14N44n28k21%P42l59p75M80O99l04
2215B74p87N06O66n57o31M31P14k83q28K82M79r8m35J49J64P7J2j51NJ79KJ16
2237B86p76M01N21l3p12L8N05J14q79J50Q94l63p12K25Q60l31l29k15M45J12j87
2258A4k38K69L7J73l62k71L8P09l01l34pP07m52o21M93N89k45p45L19Q19l89n23
2280c21P6P89m26o38L22O04k06l60j55J99K31k55K05k5n0J43j74l34N4M18L14
2301D11q05K17O91n40l30L14N30l37m59J39L94n7l30r4L19j01n14O63R3n16L99
$$ y = [642, 608, -734, -454, 765, 299, -332, -164, 431, 299, -210, -169, 202, 280, 21, -352, 199, -101, -66, -1, -306, 17, 429, 516, -809, -391, 570, 427, -387, -269, 829, 431, -596, -495, 659, 371, -361, -421, 625, 186, -322, -126, 247, 208, -238, -159, -39, 323, 203, -36, -218, -4, 540, 12, -209, -209, 533, 174, -601, -121, 578, 274, -513, -7, 659, 102, -529, -98, 616, 333, -495, -213, 266, 168, -267, -118, 46, 123, 135, -16, -11, 168, 170, 286, -490, -89, 432, 399, -313, -275, 230, 344, -535, -385, 509, 146, -566, -341, 519, 188, -141, -356, 89, 201, 14, -224, 45, 82, 255, -107, -378, -340, 369, 68, -266, -273, 434, -18, -639, -146, 443, 198, -547, -228, 591, 202, -321, -245, 544, 118, -520, -198, 406, 200, -160, -315, -116, 115, -140, 65, 40, -10, 133, -41, -375, -321, 97, 411, -394, -177, 514, -26, -356, -42, 488, 151, -308, -169, 225, 168, -162, -256, 63, -38, -552, 111, 204, -312, 87]
2322H7L5k99J12K83j49l06P6L25j03k36n2O32L0j201R29L83k65p81M43L33k58
2343A8o27Q42J65l03k32J25K27O6k46j64K28j93L70k60Q3j2K20k07n51M70M15
2364D34m66r3o5M05k33k97N21J06j25m25L00L65m92l87N47J19k52o3M63m85K6
2385i7L19j2n46K10L02L38q92L55N42k98n44pP43k99m03J49M91j98k12K18K80
2406D39o12J99K2J16m83J81O9O7j76J77L31n32O7N11j08m80M4O23l84p29L82N12
2428B36l30m31M07M26o02MM94J8k62l11J83J18k29P8M94l37j46J58K79k96k27
2449b76M82o6k85j13O02j44n48L98K76k26l01J8O75n60j62K26J77j30n5k6l3j28
2471a99j05M97j63j73L44R0n64L58K21j81k56n2M13p1l23j44P48k54o60M46L56
$$ y = [87, 122, -177, -65, 218, 69, -237, -161, 164, 61, -175, -227, 405, 435, -766, 163, 546, 281, -500, -57, 276, 18, -609, 233, 398, 95, -137, -12, 215, 281, 35, -129, 99, -94, 276, 16, 99, 87, 307, 100, -451, 19, 434, -32, -125, -190, 215, -18, -315, 206, 312, 187, -238, 62, 427, -65, -452, 95, 214, -38, -101, 362, -123, -97, 222, 210, -336, -126, 176, 514, -378, -23, 519, 221, -323, -330, 413, 114, -289, -140, 351, 153, -59, 159, 439, -173, 26, 48, 164, -319, -138, -69, -2, -178, -1, 330, -202, -135, 376, 268, -212, -168, 455, 71, -658, -276, 236, -94, -525, -118, 308, -294, -290, 204, 222, -40, -351, -168, -50, -279, -201, 293, -44, -190, -32, 247, -49, -276, 206, 140, -145, -258, 344, 200, -348, 50, 326, 100, -201, -183, 492, -68, -230, -4, 173, 43, -12, -38, -71, -199, -304, 193, 30, -143, 201, 291, -273, 85, 306, 125, -131, -183, 230, 159, -164, -308, 440, 186, -474, -28, 328]
2492C28k60m15M54n1k6r0L42l5j59j21M01l40l60K81J69l52J13J63j06j29PN02
2514C16k34j72J8L96l85l6Q4K92l97n9K17J27l54J03J75o0k32Q9K70q9l52M31
2536A48J9k48q3K8K28l34L08K78j98l9j67K19j96k48N68J7k68j32Q5K78l61j33
2558b31N05l68O5j79L89m1j20K16l4k06j40L93po54L60M27l79k67K31J95j90o3
2580i8K37m6r2j13K74q0l95J0L66N4l81K05M43m30j44L11n4N6m87K81K13k60j
2603a31P8L95o11L60J22ll36J97q7P3j46J93qj20K02l4K24p71M45M0o3k23L52
2626A48N0l68L6J25K2k18K45J95J3p30K06P23l87l42K32L16k60k64M63p2m29r
2648c05N67j89k07J61Q4M5j55o3K17m7l77K97K97o14N3N12m4n60L44j9Ql68K24
$$ y = [328, 68, -347, 107, 56, 30, -60, 282, 247, 88, -33, 368, 28, -332, -51, 118, -234, -121, 42, -64, -193, -186, 316, 82, -90, -72, 324, -61, -97, -13, 279, -118, -177, 40, 167, -187, -84, 91, 31, -201, -112, 158, 69, -283, 148, 167, -81, -164, -136, 92, -242, 66, 344, 146, 107, -60, 159, -37, -285, 283, 300, 32, -100, -15, 263, -98, -231, 274, -94, -29, -208, 181, 140, 20, 236, 202, -4, -144, 249, 242, -412, -52, 375, -4, -271, -40, 155, -35, -98, 139, 93, 1, -112, 162, 82, -313, -303, 63, 117, -264, -59, 384, -46, -190, 121, 67, 123, -364, -83, 130, -130, -131, -53, 342, -269, 91, 213, 210, -126, 71, -16, 57, -89, 104, 96, -24, 178, 144, 368, -403, 42, 82, 19, -204, 148, 198, -170, -134, -9, 13, -205, 40, 235, 248, -482, -276, 447, 60, -282, -50, 266, 6, -258, 205, 133, -296, -305, 262, 73, -134, 27, 111, 156, 1, -62, 155, 108, -269, 28, 325, -289, -236, 276, 232, -328, 16, -3, 5, -363, -139]
2671a39L33l95J39N4j03J13j31L96j84j67J23K70l28l40N79k4l26j93N32J8l97
2692a70K46r6J3k30j58M91L5n05J99N08m35k48L69J03r4k48L93j15q7P2o7j01
2714a25l9J7M16n80mL10q6l5j86L82J12j24O3P7q3m43K84L10j74n00M99pj80q8
2738a84L97%m29J26K69l17p7L50K85m32j77K40K96k19l48M46k72n5p2L42j61k3
2760a5M8l5n8p8K10j30j75L67r1K44k21J6J74m93J49K69o8l91J54M71k17j00j40
2783a10K43k57R9J52R1k48j33O6L82l90j06J92N5j43k8J00J9j29R3K63l05J32
2805C8m5J78l24J6M00n5j81k46K51l18J71k1J67J37j52k15L0J30n0J82n8L0J8
2828H3j37p5j07M37j79k23J9O8J50k10L8L55j73k26K22J43Q4l25PK80k30k32L96
$$ y = [-139, 194, -201, -62, -8, -111, 2, -129, 267, 83, -84, 39, 309, -19, -359, 220, 196, -130, -323, 209, 227, -170, 76, -20, -7, -237, -395, 96, 131, -374, -175, 333, -102, -350, 19, 122, 28, -220, 173, 58, -29, 43, -24, -125, -164, -147, 269, -311, -315, -5, -91, -126, -312, 70, 182, 58, 121, 198, 115, -328, -44, 266, 92, -408, 91, 84, -96, -184, 213, 213, -216, -90, 179, -138, -215, 135, 420, -12, -189, 51, 347, 128, -220, 226, -46, -101, -173, 169, 8, -15, 33, -2, -60, -138, 72, -58, -233, 134, 43, 287, 66, 82, 256, -237, -88, 181, 113, -278, -124, 347, 130, 30, -110, 133, -124, -25, 127, 218, -30, -163, -97, 285, -105, -211, -19, 36, -107, -135, -35, -16, -145, -52, 211, -94, 38, -7, 171, -153, -137, 263, 208, 27, -219, 32, -286, -115, -136, 31, 168, 16, -199, -169, -39, -89, 93, 35, 65, 83, -54, -129, -236, 201, 22, -201, -182, -114, 36, -174, -136, 219, 46, -180, 42, 185, 269, -56, -49, 231, 1, -231, 165]
2851A65p5j35k52L54j04j37J08J52j23k72L27J46L2m02J85J15m89K95J44m1J16
2872A09p7j58Q8J05o6m2J98q4K54k78M7k20J40M2m14M21R9M6l85q5L11j81oK0
2896a16J89n2m85O07k59Q1j62J96J50k12K16J17l44k08L40L11l96j48L46m06L68
2917A33j3Q8q7k59P6l1J39p6o8K85k43q4J22K12m56K94J55j59l36M12J10k34l8
2940e8P6Q9%l41K91lj09j00K66J35n47K18N24n41l6J6J78m7k25L77N2q0l96J11
2964a50L13k13R8o1j15M9J49j2p0l26M65Ml63M19j27kk18R9L57m02P2K91k54j69
2988a66J36R4O0l74J84O4q3k13L06N45m32l49L14J77l44n6j1K14p5o3K72k72O6
3011fo2J76n6k86L72r5P1j74J13M5k99J06K86k97l31O68J00j82k40k6J95O1l22
$$ y = [165, 90, -45, -297, 57, -47, -184, -76, 76, -47, -319, 8, 154, 186, -216, -31, 84, -405, -110, 34, -7, 109, 32, -126, -38, 67, 1, -41, 157, 73, 327, 49, 96, -124, 16, 58, -356, 65, 164, 210, -175, -260, 51, -130, -136, -116, 73, 21, -464, 143, -116, -35, -197, -1, 149, -63, 153, 270, -74, -282, 58, 369, -27, -175, 171, -235, 133, 120, 208, 121, -138, -62, -93, 46, -30, -98, 187, -56, -140, -18, 194, -262, 32, 187, 28, -308, 104, 214, -20, -58, 18, 107, 107, -234, 57, 54, -55, -155, 111, 246, -301, -83, 441, -100, -136, -120, 58, 11, -214, 163, 215, 135, -261, -150, 163, -50, 48, -13, -128, -79, 70, 58, -12, -338, 127, 131, -232, 187, 60, 58, -160, -61, 296, -106, -34, 257, 3, -166, -30, 64, 124, -250, -66, -2, -85, -298, 8, 553, 121, -228, 86, 263, -81, -137, -148, 66, -9, -72, 200, -72, -6, -68, 108, 52, -234, 138, 43, 114, -60, 53, 98, -201, -95, 191, -106, -437, 231, 331, 149, -91, -117, 78, 139, -183]
3034a83Q8J82l14K31K1K4l47L52R2k07O7O8n7kJ02J26m7m68j00Q08j13n30n7J92
3058g2J27m83P03l33J85k10J09o9j20m1K89k7j38J61J06n5k14L9l9j22J34L18
3080B48o8r2j67L74m67R2P3L14m10j9L38j85J05j69J71k62j76K48J84M4k70P3
3102b1Q8m69L04n1J64l46J50R9J70j8j09J88n69M25q5J06Mr1k2J11P9j88K50p7
3126I2j0j56q4K27O2J28l14M0p8R0J35k24J28J09J0j94l9L7J00k46J92M17k62
3149A60k63K50Q9l88M7K97k15j53L01O6l53Q9J4L06k46p2l7L37j00k30l0J81p
3172D3j76j77L67l8q6K15P5l08P8J97k84O2J76j23mM9k5j64j12K51J59r8m17K22
3196a18L03j91j89J41r4L1Q4K98k35p0K24O5m14N8K11J4j49K52N3k29j84J60K50
$$ y = [-183, -95, 87, -227, 4, 25, 49, -298, 54, 146, -61, 6, 74, 17, 15, 117, 243, 196, -272, -372, 436, 323, -207, -264, -72, 55, -428, 275, -58, 127, -83, 26, -43, -163, -204, 85, 58, -80, 81, 187, 132, -82, -43, -82, -204, -70, 248, 180, 88, -79, 295, -172, -80, -7, 307, -103, -122, 216, 31, 136, -33, 138, -124, -300, -52, 132, 176, -94, -21, 67, -402, -98, -149, 15, -331, -181, -82, 88, 70, -39, 149, -420, 5, -80, 26, 30, -61, -83, 28, 107, -81, 169, 92, 82, -74, -158, 69, 131, 259, -55, -15, -93, -3, 132, -92, 36, 145, 155, -39, -78, -41, 59, -187, 5, 422, 160, -103, 147, 236, -152, -105, 192, -23, -176, 125, 191, -162, -73, -59, 247, 1, -71, -108, 229, 129, -101, -131, 50, 43, -133, -310, 57, 19, -67, 148, 223, -85, -7, 190, -94, -32, 144, 21, 17, 66, 41, -123, -235, 16, 175, 77, -340, -118, 185, -6, -195, -54, -148, -117, -33, 265, 30, -40, 184, 249, -165, -107, 104, 118, -31, 221, 274, 45, -139, 21, 271]
3219B71n7m62K24J86n9k08J00J37k85L7L50j58l51k6L97q6O4j06m0K06m82L97
3241D9K6l3l7K38K5m42l7K59j16R0j09K49j58j08J21L02m35k48N51m51L16j91
3263a39J64j60J25l17M68l14J16K40j2On39L04K06j33j12J00J70j58K20l0n0k12
3285e7K6j83Q7O6K06l4Pk15K32Ql57O1L39j05n2K12l21J24k16K57q8q4k2J31p
3310A5k32J63J44M0o5o6J71l7j61L28n81M21J2l3K5j60P3J87L7o10N41j83p6J99
3334A52l60K50l06K71L2R5l96J90L75j69k57M0J43l25OM02l25Q0J61l2k42R8j37
3357b54K19L65m48J03K06K6m84L51j75J44L0j27L55n01Q7K25P6j92J76k49j91
3378b58K24P8rl26K16J56j78K43j17J13j96L8J76J53l14j63M79m46J87j51L25
$$ y = [271, 214, -248, -24, 162, 103, -105, -5, 132, -153, -116, 234, 76, -275, -301, 96, 10, 74, -32, -72, 134, -348, 49, 75, 42, 5, 243, 268, -174, -211, 48, -68, 22, -87, 162, 4, -104, 17, 319, -116, -364, 187, -264, 52, -139, 25, -135, -10, -327, 141, -173, -57, 183, 171, 177, -362, -58, 148, 15, -97, 3, 173, 15, 235, 205, 155, -57, -31, -214, -127, -61, 145, 111, 118, -97, 135, 143, -214, -153, 186, 81, 29, 241, -80, 44, -172, 85, -3, -87, -109, 22, 15, -217, -54, 90, 130, 65, -1, 170, 133, -28, 300, -281, 140, 152, 119, 144, -16, 57, 244, 281, -329, 212, 29, -47, 152, -208, 42, -264, 7, 39, 134, -262, -72, 303, 134, -123, -83, 60, -265, -259, 143, -182, -102, 59, 27, -215, -117, -254, -35, 330, -118, -15, 191, 217, -267, 84, -91, 53, 83, -44, 311, -190, -103, 122, 198, 6, 182, -67, -258, -34, 44, 35, -291, -75, 81, -97, 146, 29, 142, -54, -16, 160, 313, -1, -164, 315, -131, 56, -95, 230]
3399B30j59r0O3o6m7j43K44Q6j99J24l7M2k93L69oj95K34j59J12j14k4J37P5l14
3423a30KK09k9k78J63K61L2l92K16J91k17Rj17J31k84K75Q4J41j84k10M5k26K48
3446f0n6J69m54M60j17J28n0K79j98j96R5k54N06l38J53o1J24j35j38L5J10q7
3468h5J41j25m1J51j32J18k37J54j68K30l2OK17j81j74K20O9L7l85K13J78j91
3490a7J62j42K02k95p5M18j03l24O7N7l1P0j40J64j18PM91n30l8K95j05jm47M80
3514D7J2J27k26Q2J53k54O9m0L73l37k62J92J2j21K73k85L48k89K7M2j60K17m9
3537d9l7K18l10p7K27n5J02J36j70j27J27K18r5j55RQ0l5k46Q0M94l58l7m2J08
3561Fj20j44J80R7j71J75J4n9q5J59r3k6R1nm7j77J14K51K4k24j00K52j44r0N58
$$ y = [230, 71, -19, 44, -22, -69, -212, 32, 118, -81, 43, 6, 48, -245, 124, 118, -77, 157, -2, 110, -4, -28, 109, 184, -130, -128, 81, 52, -226, -63, 198, 230, -162, 54, 245, 28, 37, -80, 51, -233, 42, 126, 267, 83, -127, -82, -308, -60, -116, 53, -401, 59, -58, 70, 20, 299, 101, -95, 0, -254, 252, -86, 67, 6, 130, -5, -143, -108, 2, -85, 56, -69, -110, 41, -91, 27, -210, -56, -224, 6, -26, -20, 197, 16, -158, 62, 131, 168, -217, -4, 174, -17, 145, 3, 205, -90, -165, 253, 150, -174, -107, -50, -81, -11, -151, 13, -105, -98, 393, -137, -175, 120, 15, 14, -433, 47, 59, 186, -40, 42, 195, -59, 10, -30, 343, 6, -256, -64, -52, -173, 100, -185, 163, -126, -99, -57, -217, 0, -49, -86, 132, -178, -255, -28, -83, 19, 155, -15, -142, -15, 203, 108, -47, -38, 42, 7, -239, -159, 335, -23, -60, -102, 6, -114, -258, -78, 19, -152, 23, 37, -22, -107, 52, -41, -67, 24, 19, -28, -205, -91, 160, 184, -40, -140, 112, -32, -122, 436]
3586D36n35m3j2M9j04mlK31j67j25K14J7m9O8L04m46K43j33L20l87j44L78l30
3609b22K43O0J12k62L17n66L19O7p1J84j83j2J63j36K20n28M63k17O3J69L1n28
3631c14M00k9j98K26j24K8n5n3K73%r1J08j30J5l2J63K6m65K58pJ21k6Ml40R6
3656a46K44j14q8m5J49j71J24o5K45N0j04l4J42k10K17l1k09Lo6q3L22Nj94N4
3680eL3J0n4l6J24k8r6K5j43J06K64R1p3n32L91j72j09R3J87J0l9O5J6k85j25
3705b82J94K66p3j37Q4O7j25L35j48m34p0K95J00p1km2lr3OK39j34k99K53K1M2
3730a1j80R0K48j80k85M18j05M4J70k28J62j11k9J06N3l02K07N2l63J47J11L5
3752D9n1j29J76l01K70l8K46j44j50M2p7J17J01l37L25l18J88r5M48m38r3Q1O7
$$ y = [436, -99, -142, -154, -105, -209, -213, -216, 15, -152, -277, -63, -46, -95, -27, 277, -169, 74, -59, 261, -126, -270, 108, -222, 21, 81, 193, -69, 248, -318, 1, 68, -3, 181, -2, -14, 149, 13, 233, -295, 168, -49, 14, 183, 214, -314, 86, 57, -141, 85, -39, -11, -66, -119, 154, 154, 63, 171, 41, 56, 24, 187, 213, -252, 6, -1, 120, 94, 98, -242, -146, 98, -16, -104, -149, 0, -171, -47, -112, 133, 183, 79, 45, 187, -23, 194, 163, -46, -43, -109, -192, 130, 135, -59, -5, 28, 38, -16, -52, 72, 44, -52, -27, -170, -64, 200, 291, 218, -314, 77, -95, -204, -111, 76, 86, 47, 112, 128, -157, -282, -88, 178, 105, -32, 52, 119, -6, 329, 181, -253, -323, -28, 72, 1, -1, -43, -46, -139, -133, 106, -28, -327, -74, -53, -11, -191, -101, 147, -33, -318, 100, -5, 39, 209, -19, 143, 32, 3, 109, 162, -140, 67, 119, -244, -97, 14, 49, -2, -131, 45, -256, 14, -24, 222, 78, -72, -30, -107, 10, 111, -226, 99, -219, -31, -126, 322, -116, -209, -128, -61]
3775f1J80J9k77J17k3NJ51l87L35Q8l17R8J68j43J20J07j57K2j10j10L84k20n7
3798f8J25l15K15P8J07m13L83K0l5%j12NK25k82j9l6K12m3m08M81J1j95J04J60
3822B00j32j29R6k59L68p4j41M0L38l38k7k60O6J45J32l9r6J94k22K09NN4k5r8
3846Gk58Q7L50k27k59M67j69k2j19J51L12j94o3J9j91J84j83j08k1J18J66j54
3868a07K57p6m0r0J31j43K31K4l12K22j8J32m58K13J14k39J29j32L82j63k32K95
3890A20j94R6j34J61p0J5J2k1RJ01j39K7j80M6K40k2q0K9J96r1k00J50j38J31
3914F4j93J73p2J00j10J58j27l07K70J7k41L57n0J6r7K61j26q9j22K05J81l42
3936g4r2l6J24K67k79K53J61k58p6j74J58q3O7k6J34j21J39J23j09K8j83j81K15
$$ y = [-61, 119, 138, -139, -22, -45, -40, 111, -276, 59, 147, -170, -72, 96, -47, 73, 180, 23, 45, -65, -175, 209, -11, -68, 57, -258, -43, 35, 142, -271, 112, 132, 97, 97, -15, -10, 215, -67, -86, -122, 90, 47, -361, 120, 131, -64, 40, 200, 68, -61, 35, -224, 144, 70, -71, -31, 307, -31, -58, -318, -252, -107, 25, -14, -110, 84, -138, 71, 76, 130, 105, 7, -251, -164, 186, -41, -300, 167, -2, -24, -143, 8, 320, 126, 63, 82, -109, 75, -108, -216, -237, -119, 47, -107, 150, 74, 34, -56, 75, -68, 163, 187, -125, 97, 79, 211, -247, -34, 80, -159, -30, -162, 220, 57, -175, 120, -74, 22, -112, 49, -21, -6, 6, -15, -6, 95, -44, -17, -197, -151, 89, 67, -13, 16, 212, 121, -79, 71, -67, 64, -129, 44, -28, 72, -38, 120, -7, -314, -44, -27, -268, 89, 39, 55, -42, 219, 93, 4, -118, 87, 268, -74, -166, -202, -78, 189, -90, 163, 324, 66, -10, -184, -26, -109, -42, -68, 66, -55, 84, 207, 98, 126, -57, -238, -23]
3959b3J32J48m50M20k48%J93m14K92L8j58j75L08J52k21N1o9j21M43m31K09J66
3981B42l67J77K3j9ro8J04j16J58m26K45j5J3P2J02l9k0p0P0r5j11K93k6k58R6
4006d4J64j95M3J41L6m9o0m1j54Q0N6p7P3k47M57l24J38o4J16k50O7L09Jk66l4
4031a24L02Q5p3m43L69j6l17l4K06PK6r0J76J26j31Ml2m0J15Pj42j86K41K47k77
4056Fl30L28p5j03N1M4J01r6J37k42K09k13Q1J33k61K55k14K38K13m17J68J25
4078A38l31K90k66K31o6k39M08k35Q0k04K56q8r3K02j53J50k36L29k9N2j93L9
4100D2o2%J43J18l52MJ16K55k41J75j01J81m58J89r4K01k76K79q2j06o1J81j43
4123i2j6J32j56M14k88q5K97l53q5L94P0p9k02j5N7N6J54k64J70k04N2rj39J35
$$ y = [-23, 109, 257, -193, 227, -21, -21, 172, -242, 50, 88, -70, -245, 63, 215, -6, 45, -24, -145, 298, -133, 76, 242, -125, 52, 75, 56, 47, -21, 83, -33, 125, -301, -56, -71, -58, 14, 116, 77, 57, -13, 57, -38, -149, 144, 118, -140, -44, 120, -75, -32, 109, 145, 96, 36, -5, -159, -79, -23, -100, -27, -274, 183, -141, -3, -67, 49, -201, -134, 175, 176, -90, -124, 178, 263, 190, -253, 116, 100, -217, -251, -45, -38, -12, -102, 74, 200, 69, 73, 41, 1, 116, 123, -19, -205, 36, 283, 6, -324, 4, -71, -174, -123, -79, 22, -74, 63, -179, 30, -183, -102, 31, -230, 25, -189, 49, 262, -155, 13, 138, -193, 97, -169, 62, -4, -243, 165, -70, 10, -194, 62, -26, -119, 83, -70, 80, -156, 173, 144, 196, 3, 42, -20, -20, 123, 241, -111, -107, 9, 264, 23, 198, 97, 278, -180, 9, -85, 116, -160, 119, 37, -69, -130, 51, -92, -108, 24, -132, 282, -6, -91, 206, -147, -232, 162, 232, 153, -49, -64, -7, 49, 203, -61, 109, -95, -43, -52, -191, -56]
4147e6k5J95j02J39l05M15j53j93L04k42J64k41J75j65j50L43j30j4J7K10l50
4168a64J90j35J07oK08k38r5K01OM3Kj92J95J48j70j47j7J2L62l62P6k28J53p0
4192a21J63r8K4J17j16J35k41K75k62J88p4o7O5N6j32P4j05n4L36k19K72j35j67
4215h6R5lk5j71L20k59j26M40k0L7l57k0Q5k8q0J79N1R8j19J29l17J79J42j70
4239b6J07r7m6n6k32K76j1M3k62K22r3K26N5n2J15k35J55M9k11k3J42j88P2RN
4264e6MK89l97J72p0j03K30k65K31k97K72K53j96k17L30p3j19o4J6j3q3O4m4J92
4288E6k02K57j02J15j37m5J93J41k35j74J49j6o5J86j11kj93J82o0L0j38J00Q3
4311A2k30J75J77l8k43R1m5K25k04R3J67l04L39K6k75K8j8L26m82L10l00J01J83
$$ y = [-56, -81, 114, 12, 151, -154, 261, 108, -85, 219, -23, 141, -100, 75, -90, -240, 103, -27, -41, -24, 186, -164, 26, -109, -2, -8, 200, -38, -133, 68, 74, 117, 119, -73, 122, 270, 100, -47, -64, -52, 310, -52, 24, -204, -51, -121, 42, -56, -32, 85, -31, 104, -137, 138, -124, 64, -10, -77, -12, 44, -88, -14, -119, -173, 163, -56, 216, 81, -86, 9, 6, -19, -190, 130, -129, -255, 185, 165, 202, -155, -175, -90, -118, -198, -19, 32, 130, 11, 140, -177, 2, 144, -26, 81, -16, -62, -118, -350, -74, -85, -42, -304, -82, -175, 51, 106, 54, 169, -66, 89, 138, -73, -96, 46, -142, -70, -61, -56, -52, 237, -160, 12, -58, -161, 69, -196, 35, -262, 10, 263, 67, -150, 180, 107, -12, -76, -60, -73, -156, -92, -136, 56, -146, 111, 9, 124, -13, -58, 135, 276, 41, -133, 16, 0, -65, 121, 10, 8, -185, -3, -63, -33, -171, -71, 12, -218, -43, 134, 96, -147, -56, -101, 124, -80, 13, 180, -124, 215, 241, -34, -6, -24, 302, -180, 130, -170, -69, 114]
4334A14q5J06l80m0L68J39l32J9J75O0j17P0k7j78J23j66L6L56k05n0l0j7J34
4357G3l35J41P7q5J01Q7r8P7Pl7K14m12O5K0J44K72m60K13R1m2r2m0o6J10M6m7
4383B4J44r9R6r6k36J93j88k3K06pJ8K8r6J68q1nJ44j47k48%K8O3J99P4J90m54
4409a05j02L76k90j71N28j93l3q9P0J36k88M38k37J77j94n6O8K7j06J07J5j49
4431g1Q5O3j90R5n8J50L8l14K04o6n1l8k9K75p6q6K45r2l03K37J80j29k67J0K59
4456G1N5j61O8q9J08l8J08j07K4J75k20j18N7J04j69N6J43J08j34L7N3j59J2j14
4480a30J81N8j49l4J58K19n90J97J3k9r2K81J52j70Jk88J71J69J04k01M3jk14
4503a51L68n7m01L31j11Q8j28%K00m11K33J1L14k93J13p4Qj05R1K58j91j51K09
$$ y = [114, 29, 135, -245, -285, 83, 222, -110, -91, 84, 144, 27, 97, 70, -108, 15, -151, -115, 241, 36, -14, -44, -61, 73, -262, -121, -44, -129, -28, 59, -39, 38, 45, 8, 222, -190, -125, -105, 39, 311, -149, 64, 155, 113, 21, -19, -85, 25, 71, 24, 168, 69, 165, 69, -167, 26, -162, -185, 21, 14, 32, 60, -36, 132, 51, 46, 190, 43, -205, -205, -177, -114, 85, 159, 349, -105, -207, 169, -121, -292, 236, 43, 10, -79, -9, 127, -161, 277, 40, 217, 23, -33, 35, 62, -44, 63, 78, -71, 14, 77, -113, -18, -76, 74, 112, -202, 2, -64, -115, -153, -182, 93, 17, -69, 176, 84, -219, 18, 198, 69, -198, -188, 71, 126, -35, 33, -56, 52, 14, 122, 15, 39, 214, -6, -124, -67, 37, -132, -76, 67, 175, 41, 78, 131, -28, -16, -130, 51, 109, -40, -74, 84, 303, -287, -90, -77, -106, -198, 83, 235, 65, 66, -222, -51, 118, 222, 21, 64, 63, -151, 217, 160, -241, 90, -21, 67, -61, -61, 139, -272, -39, -28, 286, -7, 106, 32, 40, -65, 26, 284, 93, -58, 151]
4526A51r9k39J10l9l6J32J97k40J59J57k84J25N0P1m23L25k12k6K35q0j39r2K5
4549a72K37l7j26L68m45K78j43N6j19J97j18O8K4Q4N0k01K74k06K69l95m3qJ98
4572I0n6L7j32K45L1k85l3K32j27l4l7J92Lj81J29Pn7PQ7M4l10J42o9L4J47m17
4598c11J85J44j81K8J00J72M5J3j82K49k44L7j63K23k02N14l21r3J49k1j34J44
4620A51k18P5j33j9K60j95r1O7L10N7j76k06j24q1K21Q6j41M06R0l38l7k2K60
4643B02j79m6n9J00J67l4k16J24k8Lj13N4m8J64l8J8j09J54j34k2j05K94rk41
4667a01J65r2J56k62l21O01r2q1j24K85j11j63J03K72j38j27J3n0K79k35K5L24
4689C26j59k96K97M1q8m1j95O2o0J02J1j0P0R6N3l40J07J37k46N4K3J49Q6j73
$$ y = [151, 52, -187, -77, -116, -152, -20, 177, -63, 96, 253, -31, 94, 144, 215, -208, 117, -95, -121, 114, 34, -105, -197, -172, 65, 28, -98, 270, -175, 103, -40, 16, -103, 94, -24, 44, 68, 152, 202, 1, 275, 69, 338, -57, -100, -108, 90, 34, 71, -61, 184, 215, -70, -103, 129, 2, -32, -69, 123, 126, -55, 74, 81, 24, 31, 118, 162, -148, -6, -75, -41, 106, -311, -126, 18, -163, -135, -35, 137, 182, 195, 13, 262, 18, 55, -108, 115, -87, 427, 106, 13, 162, 141, 7, 151, -67, 8, -125, -144, 116, -79, -170, -103, 207, 264, 88, -118, -242, -323, -102, -16, -157, 249, 339, 1, -36, -58, 202, 23, -23, -82, 18, 185, 151, -65, 59, 31, 34, -79, -25, -73, 91, 53, 71, -38, 116, -18, -40, -145, 149, 140, -101, 64, -28, 128, -134, -455, 146, 54, -27, -151, 134, 23, -140, -37, 235, 97, -30, -17, -67, 212, -23, 2, 326, 167, -129, 168, 209, 121, 80, -115, -53, -113, -11, 0, -10, 60, 156, 209, -131, -24, 113, -133, -79, -56, 93, 179, 6]
4713Fj35K48k1k41K81j59j08K37q7k2Q5l05K6J35J52J46m72Q8P2l9L05m36K58
4736A4Nj38J29l2MP0j21Q9Q3K5M1q3Qj32j4o8M8M6K09l9o2k61P4K40o3j70nJ19
4764A6L6J6j34L34l20Q5n9j68M23l13LM6J4k29M37l83J70J52n3N6m8k0P1k78J90
4789D4J89j98L5m65N69r4l9J8r7k3K9J99j38j52J34q3m7J09jJ72q2J12J16j68
4813A39k42j8J16P2j05J96j64J40M9l83M07Lj84R8j18M4p6j49O1Q9L21l16pJ12
4837H5J21k53m0P8K28l06K42k46J46m6K0M5M2o8j87L16K8m26M74j89P7k00r9J26
4861c2R0k8l6j58Q3k0J07K11l84J81O9k23K14Lj73OJ09j66J10P6J5j22j19J50
4885c7L5L4k5r5j02J67Q7k15K96l18J57K83k70m3k23J30M28k77j25L2M9l2K27
$$ y = [6, -129, 119, 98, -143, 138, -21, -129, 108, 21, -1, 84, -221, -195, -60, 92, 238, -234, -146, -74, -113, 192, -244, 14, 19, -119, 10, -22, -18, 52, -69, 20, 103, 128, 169, 86, 94, -38, -52, -120, -72, -26, 183, 144, 82, -179, -105, 135, 72, -98, -103, 16, 52, 68, -66, 268, -52, 33, -26, -194, 229, -84, -81, -35, -21, -250, 187, -196, -26, 126, 73, 129, 81, 61, 132, -146, 44, 233, 35, 70, -395, 174, 80, 41, 59, -38, -61, -32, 167, 29, -123, 11, -72, -119, -10, -11, 161, 79, 191, 307, 139, -103, -121, -5, 67, -38, 158, -6, 134, 183, -200, 207, 210, 26, 124, 6, 50, -26, -175, -114, -25, 296, -20, -27, 85, 206, -47, -87, -9, 219, -87, 155, -91, 55, 9, 29, 74, 116, 48, -139, 177, 205, -221, 253, 64, 141, -59, -158, -32, 58, 30, -6, -164, -81, -101, 6, 217, -167, 14, 83, -140, 74, 77, -96, -90, 19, -147, -37, 39, 54, -68, -187, -37, -2, 32, 7, -88, -190, -23, 64, -151, 145, -173, -16, 267, -3, -46, -269, -139, 289, 12, -113, -81, -32, -64, 163]
4908A63l84L97j93J13j25j36K98k01k8P5K3N2mmJ13k05Q6k11K54L6o7mj26O0l5
4933e3J3K5L44k47J13r6k87K75o0L87l75p5j58L69m81L30q1R6k21J89p2r8J70
4956GJ96k93Q9O2j92J82k97L27j7j06p2R2k9J51q0nj6r1J4k28K08j02J98j54j6
4981a72K42j52K18n6k23Qp3M12k61PMp3J63J45k20j23J56J00q9j83K87K7q3k08
5005a47J68j00l9L95m46J86k7k13K46R9k38l8J04K81k91j6K95m89M77k70J61j36
5027c8j04M9P1L18j10j72j5J17j64k16K66O1KK9l12J44N1P8K0j20J61k30j48J7
5051b45J00L33l14J84k04R3N2j41r8J09N9J20R7r2j34K32K1j06K2J17o7k13L18
5074B43k64K4Q2k4K64l36j11J14k05K40RJ49j73l9n9J66l31M06k01j38K31L4j15
$$ y = [163, -221, 176, -17, 96, -29, -165, 133, -68, -96, -21, 2, 54, 50, 46, 159, -46, 40, -171, 83, 119, 52, 48, -78, -18, -53, -40, -15, 329, 82, 195, 99, -188, 87, 27, 414, 39, -36, -194, 175, -306, 24, -57, 39, -182, 7, -65, -163, 7, 203, -90, -1, 61, -131, 51, -246, 81, 64, -42, -114, -22, -51, 100, 20, 15, -1, -92, -78, -306, -98, -200, -2, -156, -172, 70, -82, 136, 80, -143, -135, -208, 204, -57, -50, -46, -119, 44, 189, -31, -154, 2, 102, 13, -170, 117, 144, 61, -147, 21, -79, -118, 277, -169, 17, -10, -223, 23, 122, -116, -154, -50, 231, -60, -76, 219, -270, 207, -63, 98, -38, -142, -93, -22, 296, 186, 14, -1, 116, -48, -264, 2, 63, 65, 94, -218, -74, -23, 55, 75, -45, 116, -114, -262, -245, -145, 188, -126, 58, -146, -53, -1, -142, -240, -131, -72, 48, 145, 53, -81, 151, 172, 66, 88, 205, 138, -75, 243, -21, 3, 85, 61, 325, -11, -122, -8, -213, 27, 36, 185, 12, -27, -86, 80, -251, 155, -46, -184, 47, 81, -34]
5097c4J10J29k01Pq6J07N3N7l19q7K93J10k83M3L11j69k32J03N5K36j94K11k85
5120f5L93k47l18K34L40n21P3L04l59K30j4j96J06k4P3p0J73p9J08l27K20k4m0
5143c0J00m2J89k38P7k42J05K79r9l16M13l58J85o1j94J97R8J48k68Q0J46J03
5165B72k56j16J35j23J72l5o0oL3J35n2j16k21O87m66J55L0l77L79l03L37l09
5187a05J97J0j77J77k3j87J50j5M3J6m8j16J1j02j00K71r4K11O7l83K83k22O4
5210g2J9P9j72J88P6j18L5L4k04J51j2l1j36Lj0L63k5J7p4l1k75j20K47K6%M1
5236aJ48j30K9j44L07j39l7j9j85L98m85J53l3O7J29J82j29j51m5Q4K5j92K52
5259H4k18K17j74o0J33k48K25K12l19L6J33L8J35L3m24O3R6K11p0J8p9j39N7M2
$$ y = [-34, 76, 205, 4, 11, -75, 32, 85, 142, -177, -264, 29, 139, -144, -101, 210, 41, -191, -88, -33, 203, 9, 220, -65, 328, 81, -237, -3, 337, -184, -111, 193, -166, 64, 50, -146, -40, -64, 9, -61, 112, 33, 141, -186, 34, 10, -30, 70, 28, 217, -21, 56, -186, -81, 198, 99, -217, 196, -162, 23, -38, -232, -35, 63, 211, -57, 23, 169, 272, 16, -100, 35, -88, 84, 49, -11, -17, 16, 151, 99, -17, -238, 449, -17, 138, 168, -209, 170, -133, 204, -105, 92, 102, -75, 102, 79, -108, 42, 27, 70, 86, 38, -78, -67, -169, -269, 2, -92, 119, 186, -197, 86, -136, -72, -53, 26, -146, 42, 118, 0, 35, 69, -135, 16, 4, -27, -163, -160, -170, 193, 168, 185, 111, 80, -195, -315, -68, -42, -42, -1, 147, 17, 46, -98, 209, 70, 33, 14, -171, 227, -258, -105, -138, -71, 58, 240, 111, -40, -85, -1, 24, -168, 84, -134, 83, -91, -151, -18, -266, -41, 171, -148, -112, 21, 59, 194, 227, -197, -134, -38, 173, 103, 121, 42, -97, -40, 2]
5283Bj25J64j94J48R0k06M2J02j35M8N3L39r1l70J68k7j00J90j02L91k52j05p7
5306d7J58k93J66m3J30L8k07J10K78k69j53M03k51J38q5J57l25q5K51O9N1l98
5328b07M6K54j59K13k15K7R1O6j44j68K90k36lJ34J31k70M78m58r6l3J95R6j35
5351a03K2J3j63J02M00m63L03j71Q6J43l15K03q9R7O1Pj74Q9m8nJ38j36K7J83
5375B07j17k38K46N5l59R0K60k7j38J83J22l49j7J55j72J92k51K8QJ39m4j14K1
5398a20j8K16K6l65K17K24l45K57j36J59m5O0p9j21K79l91M10k48M9P1LLj87K56
5422A75q4k40L1K63j42K00m8%m14J44J30n6O4j70J24J95l78K46q8n2L53q8k33
5445f8j1Q8p9L21l12n4J24J48j19o5J75k45K33k87K83k70J3qK19j45M6r7K49j55
$$ y = [2, -123, 41, -153, -5, 85, -121, -79, 23, -112, -64, -11, 328, 237, -133, 35, 8, -92, 98, -4, 387, 135, 30, -47, 111, -182, -16, -59, 71, 109, -98, 12, 290, 21, -132, 271, 20, 158, 73, 230, -95, -180, 71, 140, 191, -207, -161, 93, -66, 147, -68, -41, 50, 116, -28, -196, 94, -142, -145, -11, 120, -150, 328, -130, -226, -259, -64, 32, -103, -81, -68, -231, -129, 271, -192, 111, -60, 26, 169, -146, 57, -32, 65, 126, 133, -41, 48, 0, -5, 133, -3, 24, 207, 90, -148, 98, 153, -206, -116, 144, 117, -21, 162, 284, -65, -82, 73, -99, 93, -158, -130, -122, 17, -27, -141, -120, -138, 78, 104, -261, -44, 180, -165, 92, -44, 115, 70, 130, 51, -70, 209, -182, 228, -20, 29, 100, 103, 106, -81, 175, 91, -149, -118, 145, 3, 203, 155, 155, -259, -115, 15, -41, 23, -147, -23, 172, -206, 40, -48, -100, 253, 165, -68, -79, 9, -70, 251, -61, -115, 9, 157, 38, -27, 148, -97, 136, -151, 132, -138, -125, -133, 86, -59, -13, -110, 139, -16]
5469a6J6J98j56j70J09q9j3J10k10J40J51K93k35Q1m7q9l1m1J1r3K79k76R2l40
5493c26N33j47j27pJ59j55o9K74k84J26j00J97J61n36K62K14l33J53J73l63J58
5514c7J26k13O2J60j70p1m1J5J80P1j53L65oj85J10j13j3j64Q4M3J19j57J34j26
5538B0J03k22J86l6J59k20k46K39J03J52j81j24q1O2N0Q0n0O4k9j24K7p9mM8L2
5563g1p5J12j11K70K08l49k49M4J42K07r8K5ro1k1j24K55J95k06N8K98o23K01
5586A8prj75K19J34Q1l77j57M02q0N8m8o1R3j98k78L36J12j84J48R5j66r4L01
5610A63k21K68k20J92k9k39J5R8j45J71L5j34K77l15O5K0l75K01j89M55k00J38
5632C1k3l9K3j16K48p1j26o8J17k09J61K93l35j69N7K37Jp5l6R9K12k77L18m61
$$ y = [-16, 0, 198, 42, -128, -19, -108, -121, -11, -221, -81, 70, 363, 128, 209, 162, 73, 42, 1, 12, -81, 198, -78, 14, -326, 207, 60, -67, -74, 85, -70, -139, 135, -149, -23, -123, 74, 235, -301, -39, 175, -158, -5, 168, -195, -37, 89, -124, -62, 98, -72, -143, -184, -169, 11, 82, -71, 294, 288, 103, 213, 100, 87, -77, 7, 50, 169, 12, 146, 20, 123, -99, 87, 51, 210, -10, -256, -17, 86, 238, 57, -67, -148, -86, -36, 44, -6, 58, 29, -95, -68, -147, -151, -103, -71, -146, -34, -145, 125, 333, -16, -265, -221, -79, 128, 30, 55, 46, -15, -36, -160, 95, 290, 84, 142, 440, -183, 18, 11, 2, -173, 46, 180, 261, -116, -273, 129, 49, 107, 59, -2, 91, -107, -385, -49, 63, -121, 27, 122, -44, -138, 163, -58, 210, -10, 182, 153, -86, -71, 27, -118, 53, 88, -46, 231, -84, -19, 1, -374, -173, -362, 93, -107, 31, 8, -31, -8, -124, 124, 53, -73, -141, -24, -233, -72, 221, -114, -283, -226, 11, 12, -63, -99, 0, 212, -65, 253, -208]
5656b08L82j18j45M9j78J95m2j1P9J19m8n8R7J35k81j4K45l1n1n4r9MJ14j98P6
5681d1l0L04l21K14j91j11M15k5l50J62K8J96k01j03j9K7J31p2Jm3q6K51L1k30
5705f3K7L8K21k31J26m7k37J52j88L76J04l23K73k12Qj6j44L24k66r1J45J86k95
5728a33L05o5j11K60j47k76J46J24j83L05o0k55k2J78k75K89o2m4j01J60J28j49
5750A2R8N0j93K9J35j52n0N7o6Q9L78n21J24p6n4N3n7qJ91n5j66L43j05j8J47
5775A85j62J59k32K86k50p0k8J59R1O7j12j89N8J61j14l9J29k3J27q6j33K15j23
5798G6J41o3j60oL4J19o2J02o9o3n0j27Q7J64M9l11P6J92j5Lj94k08L18k02N0
5823a19P5j37K47n6O1q5P7j69j22K56k03J57Q7r7P5l60M48m32K84j16K40l44M1
$$ y = [-208, 174, 56, -89, -40, -218, -23, -65, -76, 3, 122, 74, 16, 113, 248, -33, -47, 198, 167, 116, 62, -37, -33, 81, -117, -41, -71, 233, -88, 126, -65, -176, 239, 214, -136, 26, 54, 250, 49, -54, -73, -46, 85, 13, 14, -29, -115, 136, 167, -63, -36, 2, 223, -8, 118, 71, -166, -14, -202, 174, 278, -45, 228, 16, 24, 8, -136, 188, -78, -169, -24, 162, -133, 172, 107, -4, 256, 109, -167, -21, 103, -80, 225, 165, -90, -112, 66, -209, 80, 18, -26, -127, 33, 161, 12, 110, 160, -33, -4, 131, -21, -71, -14, -80, 9, 387, -134, -10, -86, -140, -87, -144, -152, 39, -16, -182, 161, 56, 38, 185, 23, 182, -50, 236, -14, -84, -112, 47, 138, 205, 93, -96, -38, 123, 9, -30, 99, 76, 203, 117, -16, 199, 76, 217, 154, -6, -12, 22, 141, 79, 181, 112, 49, -1, -128, -41, 123, 172, -139, -63, 129, 114, 117, -77, -285, 33, -169, -119, -44, -181, 66, 10, 71, -14, 63, -106, -228, 28, -175, -18, 69, -28, 47, -313, 135, -297, -13, -129, 111, -233, -192]
5846a92J77j16J44n5R9r1j06O4J26r0j25J62j31OM85l93o3P7r1K06j40M1K6J60
5870A80l49J72K8j14j78L83o0O4j49J31j71kl24K28O17n32K9K99k15kj47J35K27
5893B50j57j74Q5P2j90L31o2k16K08l57K60k26J32j3L38l15o5N5K07l95J64J85
5915A17m2j67J11j81J63L4q3k03J97r8J66k18J80J2l0O4j0M9J82k49q0j41K28
5938AP5j11pO5m8j05mj38N39m08J96j25j24K03O3q9k70L54k41K36J3J25j73j3
5962A4Q2P6p7r3J94k40J44O0P6l95N0J67k53L38l22J27N03l32p6n7J24j15L6O5
5986I6J5n8k01L43k74K24J44l53n3J43J15j90N3j30L14j02J10lnjm85L52O1k63
6010a48L13L4O5m10R5J06k36K68rj44j34K37N8j95O9J43l68K97j70J62P6l19L17
$$ y = [-192, -15, -131, 13, -42, 57, -34, -140, -76, 50, -40, -165, -3, -134, -128, 357, -36, -99, -22, -113, 93, -47, -6, 20, 180, -169, 3, 31, -83, -261, 122, 62, 126, -23, 108, -63, -65, -389, -161, 456, -76, -47, 252, 37, 35, -112, 23, 250, 93, -81, 4, 76, -114, 217, 155, -61, 147, -210, 50, -176, -44, -57, 281, -34, -99, -44, 163, -232, -68, 117, 75, -92, 19, -162, 1, 35, -48, -251, -54, -152, 14, -204, -24, -12, -42, 22, 12, 61, 243, -6, -86, -227, 1, 76, -35, -42, 23, -25, -130, -134, -272, 267, -141, 55, -70, -194, 9, 72, -17, -287, 67, -174, 62, 75, 200, 27, 14, 96, 172, 95, 2, 196, -44, 100, 160, 236, -159, -109, 58, -195, 143, -179, -52, 451, 119, 43, -14, 110, -5, 31, 96, 111, 53, -148, 195, -79, 145, 289, -64, -117, 26, 141, -49, 4, -126, 188, 86, 196, 193, 188, 187, -298, 54, 115, -148, 165, 199, 264, -146, -51, 55, -181, 87, 78, -66, -200, 37, 95, -100, -31, 112, -256, 41, -129, 33, 109, -210, 107]
6033A07m7J95l04K9m0n3J57n4P4k6J8N5l24o2L00j21K33k46K22P0k8k39K61J06
6057B83j50K3k12J38J95j85p3J04j59J17j18k31L09L9k75lJ42j28M31j29k28J89
6079G9j38m9J12J48J6p6j18r9M74j00l18P1M2k15m7L10m8j49J91j39O9k5N6P5
6103A22J49j42R0k67J00Nj83M3J6M7J34j10k12K39j04L08l02K0j32J7K07j89K83
6126A39k59P2K03k54J69k94K56J30k17L8M2r8L79l57j27L71k56K93l04J08j42
6147a08q2L33j18R2l43J68K90j17R9l67J22K89q9k6J35j3l88L00n1k30P6P8q6
6170c6K15l56%J02Q5J82j60m6K4j08J98j63l8K60l25l0J4N1L61j36l0j24q5K48
6194A03k8r8N6m5r6k4M5k9K21j24q7K3n0L26r8j31K20j59m2nj79K0K26j82J51
$$ y = [107, 60, 255, -49, -20, -60, -113, 44, -10, 64, 38, 56, 111, -213, -275, 25, -96, 137, -109, 113, 183, 155, -84, 177, 283, 133, 156, -56, 82, 277, 92, 19, 123, -36, 81, -37, -268, 41, 80, -195, -198, -56, -184, 247, 118, -110, 79, -59, -108, 4, 152, 168, 92, -26, -125, 349, 249, -69, 2, 44, -171, -218, 92, 44, -105, 86, -53, 16, -9, 47, 122, 271, 129, 219, -48, 52, 57, -126, -83, -67, -20, 114, 4, -208, 31, -73, 235, -67, -47, -179, -162, 45, -144, 139, -120, -48, 155, -99, 70, -224, 32, 162, -55, -17, 25, -73, 306, -51, -178, 193, -63, 230, -74, 34, -108, -190, 143, 25, 117, -226, -58, 232, 115, 214, -153, -31, 258, 169, 143, 278, 265, -123, 177, 126, -104, -28, 50, -36, 179, -177, -177, -75, 10, 192, 32, -14, 10, -98, 100, -63, -101, 159, -166, -196, -182, -131, 230, 94, 64, -60, -145, 103, 75, -23, 33, -12, -108, -132, -87, -116, 105, -19, -106, -83, -133, 193, 95, -36, 184, 25, -17, -22, -201, -181, 45, -137, 14]
6219A4r6p3K19p8L9Nr0J73q1j56J09j25N1N7Q4P9p7Kj23p7K7K91j75l8R6n5j86
6246a84k1Q6J44J13j59j26J61j16O4L0l00K41J49j02k53N08k65J1M4k26Q7J85
6268G1J97q7p6j48O6M4L6m7L6O3J16k50p7m5J4J51k5p2j57L26j59n2J41j79K18
6293A05j05q1L83m43J72j2k79L45Q0m12K11J24k03Q8M8J44j21l2q1L56j70j32
6315a5n9O0L2J7j05K03j11lJ32l04J51J05l59N02m70K40j3K3m9j43M5J5J51J8
6339F3j65j17K97O6j99j56j2M26l05j35j6M21n81K36L23k67K36O4k26k44K87j0
6361a4J72lj28J0K58m63L12j07j10J73l4Q7j48j19J2J46q4k04J94k40N02J7k61
6384c2J27j62J00j90L24N4l31K93j95J16J4M0jL6k92J80j33p3j12K80K01l29K47
$$ y = [14, -82, -155, 64, -14, 25, 30, -60, 113, 32, -124, -15, -140, -89, -32, 52, 131, 54, 56, -67, -144, -117, 174, -1, -39, 57, 2, -184, -205, -119, 25, 138, -21, -147, 14, -102, -38, -8, -308, -67, 82, -20, -273, 235, -30, -19, 25, -201, -114, 71, 268, 181, 105, -43, 23, 67, 103, 56, 92, 155, 271, 21, -56, -101, -87, 64, 39, -33, -190, 136, -23, -75, 66, -113, 105, 0, -81, 302, -141, 31, 19, -260, 85, 165, -247, -36, 88, -115, -27, 21, 165, 44, 12, -69, 287, 117, -15, -74, -14, 18, 35, -70, 133, 22, 19, 151, -153, -2, 103, -256, 246, -224, 16, 3, 26, -23, -166, -121, -106, 45, 63, -102, -219, 78, 144, -55, -211, -223, 203, -102, -237, -253, 168, -413, -177, 146, -121, 115, 179, -47, -291, -4, -14, 158, 155, 27, 37, 295, -168, 144, 37, -73, 100, 66, 153, 5, -114, -102, 44, -40, -244, -50, -290, 212, 229, -32, 95, -67, 33, -157, 167, 221, -110, 183, -12, 104, 118, 158, 157, 193, -99, 81, -52, -125, -237, 43, 244, -85, 162]
6407A62l70N26l66q9K10k41R9p7J28J32K11l59K5j01K76J00r2r0p1p1K3LJ00L2
6431A00j54q0K52m8l21O0N8O8l7j14J53L13j4j72on0L06m79J20K05r8J57j43r8
6455b2K6L9L8k45K74k30M3J35k06J81J74l37J2K88J46l11j22J64J37r8pk37J25
6478c3M7o2L9q2M7RO1k3l8q5mK98k62K09m2l73M87m88L63J75m58J84N6N8N6K82
6504D21l03j58R5K57l10j32j0L05kn0J8j7M0k10J91n2l67N86j94J76j36j67m3
6527f2L8P0K67q2l50L35M3l26J07Q8j82J21j77J38o7J2j22J54l2j79K9K58l8n
6551C8N3k33Q8p0K02L9j43j30K95j8o6j08J35J9q0K32j3j55q7Q0p4k52J93P8L0
6576E3k16L01J15m36J37J51Q8k80L0r3J89p8L3K55m67j4K96m1j0j34K27rj12n3
$$ y = [162, -208, 318, -48, -137, 73, -168, -69, -146, -18, 114, 325, -34, -9, -110, 166, 266, 174, 84, 13, -58, -35, -32, 68, 100, -54, -134, 118, 70, -251, -191, -133, -65, -102, -216, -63, 250, 236, 64, 58, 8, 314, -165, -45, 160, 62, 219, 76, -22, 4, 43, 81, -164, 110, -120, -77, 58, -148, 33, 207, -130, -118, 170, 316, 5, -117, 47, 184, 86, 79, -158, -33, 14, -48, -9, -91, -44, -35, 26, 3, -35, -120, -124, 174, -88, 121, 79, -294, 193, -295, 68, 243, -215, -31, 25, 83, 139, 421, 118, -40, 55, 312, 2, -130, -140, 165, 163, 113, 131, 114, 154, -56, 135, 83, -284, 302, 108, 284, 148, -19, -62, -24, 46, 313, 231, -119, 216, 259, -67, 40, 128, -54, 67, -110, 28, -39, -27, -149, 5, -27, -206, -177, 81, 43, 38, 91, -142, -54, -124, 78, 117, -26, -156, 139, 121, 55, -53, 82, 101, 21, 253, 240, 85, -2, 78, 4, -248, -55, 23, 53, -163, 138, 253, -183, -46, 105, 193, -87, -57, -150, 39, -39, -6, 249, -218, -232, 64, 23, 13, -121, 106, 97, -15, -68]
6600f8J80K0r2j32o6L60l02R8k5L07k13P9p3n2m7j31K35j48P3m1R3J8q6Q7j59
6625h5k9K37j63j0j17M2q2K86p7q3M2p7O5J05j58L01n96L99k7K31m0o0j59K6J50
6650A21j94n3K60K13n50N0m8J32K71l7L1k72J36P6m38L50Lm3J63k55j4K24O9k85
6674i0R1P1J62l08j33L88k16J69k48J65l8R7l53N7K75Jj34j1Q2k96m0K15j22K85
6698F9R9j24j2J53k42K23k11P4j01J19l9J88j60k71L27m1j66L37n3k23L45m39
6720a48J05k20L33j25N5o4q5L04k44J82Q2m80M94O7m37K46k94K96O2k63J32JN0
6743D9k0n4J15p7r2J39k35M16j00P1l70l4M29k71q1L44k64Pk05M53k00o0K06k79
6767a13K33J1j77K22j33k2k34N9m7K92j84J66K16k36O0K27j47n0O4j70m5J03p7
$$ y = [-68, 112, 132, 40, -92, -158, 202, -100, -2, -27, 280, 67, 146, 73, 21, -26, -157, 78, -70, 3, -38, 55, 73, -13, 74, -85, -114, 123, -40, -50, -167, -125, -207, 79, 2, -81, -39, -116, -51, 54, -104, 197, -399, 0, -27, 204, 164, 104, -55, -29, 121, -73, -126, 134, 347, -203, -153, -201, -69, 202, 165, 196, -76, 60, 136, -302, 48, 51, 8, 171, -84, -98, 126, 195, -90, 1, 72, 234, -74, -207, 181, -35, 134, -114, 51, 13, 110, -243, -186, 89, 90, -44, -55, 27, -269, -309, -94, -216, 69, 168, 44, 32, 185, -57, 166, -45, 29, -72, 47, 8, 196, 36, -235, 92, 51, -115, 222, 169, -54, 291, -148, -43, -263, 70, -55, 0, -64, -149, 155, -89, 93, 175, -305, 189, 256, -181, 65, -229, 67, 129, -134, -2, -1, 49, 29, -25, 90, 13, -79, 60, -175, 241, 141, 212, -158, -192, 237, -34, -115, 229, -35, -28, -233, 220, 20, -40, 166, -113, 120, 131, -46, 176, 43, 21, -213, -154, -201, 91, -93, 73, 289, 53, 113, 340, 193, 143, 207, 37, -8, 95, 18]
6790A8J62J67k34N4k55J02mK8qk0K28l34O9L00j65K2l2j84K26j65L6j76L98k14
6814A9j06J04L3j66M00m01m7J56N8M6k45L18j67P0j27j1R8J65o7j41m1R7j65L49
6838B29l29K59j63j5l2K03l0k12k6J91lrm8m9j79J41L3j52j15M09J38k22m4j52
6862a77K12L2j48J47r3j33J83j89l8o2P1L20j57J39nl74L72j06l7L8J6P7o0j36
6886a08K50nq6j52J81P8o2j49K3J15l6K7l32L13j71J57nJ69j09j70J19n4K01j07
6910H7k63N6M4NoN3Q1K2j66J8j58J59J2J28K6p7k6m8M1J32r5l1l6k89O06l07j69
6937b01J07O6J49j1q5M0j68K41k27J89m11J65j22K33K21j40k31R0J55j1L0k68
6959a89k5J83j32n1L03k14J1n5N16k28Oj87j23J2K5R7j22O3LL59l06M1j59Q6J27
$$ y = [18, 180, 347, 113, 167, -88, 14, 10, 38, 30, 10, 238, -96, -27, 273, 108, 130, 98, -86, 140, -25, 11, -165, 233, 19, -87, 17, 50, -116, 284, -117, -164, -8, 50, 96, -149, 169, 2, 72, -55, -66, 32, 197, 130, -11, -52, 45, -120, 229, -100, 159, -4, -19, -51, 152, 122, -90, -116, 75, 72, 63, 15, -34, -213, -72, -39, -191, -306, 103, 241, 19, -25, -177, 35, 67, -81, 66, -27, -160, 23, -166, -204, -266, -195, 125, -32, 107, 102, -272, 100, -6, -43, -5, 11, 88, 28, -108, 142, 137, 51, -101, 80, 158, 96, -53, -30, 85, 49, 76, -256, 57, -114, 43, 38, 207, 98, -72, 47, -7, 194, 87, -176, -120, -76, -71, -77, -24, 57, 79, -87, -69, -227, -68, -56, 72, 98, 21, -5, -53, -12, 120, 25, -6, -42, -331, 275, -32, -201, -94, -28, 121, 110, 25, 65, -103, 138, -89, 100, -311, -146, -268, -35, 186, 46, -185, -95, 60, 49, 79, -189, -214, -31, -163, -214, 89, -125, -114, -169, 347, 119, 125, -62, -185, -173, -148, -51, -173, -110, -107, 252, -54, -13, -172, -86, 41]
6984D1M9J8l99K08J91J5j03m2M1n8J74j62J11r8j8K20l74K93m05L51j06k04K62
7007Ej94Q3J95p1j54K16p9J89m02M68m46Q0R1J58l18m1J01J65j32J18L03k96J26
7030A65o7P5O2l48K51j24J19j95K26jl01J91q1K2k27L51l85K60q2K29p7j0j33
7053h0J5J41q3JJ38p2J47j75J19n1j52J01n3R8Lk86N7K26k15Q9k2L5l5K53o3j53
7079a7J83p0N6j26j05j35J28J09K1m9R7k34l6L00jL7k45K96j44j5k00P2J12J2
7103D6r6Nj66K70Q3j28p5r7j77M47n9l47K40OJ33p6K5j64J40M9J33m06J50n2M0
7128g6J99ok37p6M45k26j61J30q0j06N14l57QK56l02N5nj8L4J69k30J07K7J03
7152A67m0j20m9j91J72Oq9J24L0L7M1N7k02j72L30j88J35J65n6j90o2K32r2J42
$$ y = [41, 90, 108, -291, -83, 108, 123, 20, -22, 19, -39, 135, -27, 84, -14, -32, 188, -186, 107, -298, 53, -53, -257, 5, -189, -106, 89, 18, -136, 80, 1, 190, -212, 256, -190, -110, -19, 139, -179, -220, -119, 46, -86, 32, 335, 39, 165, 98, 173, 235, -113, 138, 14, 133, -62, 164, 163, -138, 53, -28, -6, -233, 118, -267, -7, -89, 140, 63, 53, -80, -65, 76, -7, -6, 132, 60, 207, 32, 151, 100, -52, 49, -4, 94, 97, -189, -132, 94, -121, -32, -54, -19, -54, 199, 136, -17, 166, 96, 152, 26, -79, -214, -86, 23, 44, -5, 92, -142, -178, 122, 121, 158, -87, 209, 65, 50, -150, -78, 34, 46, -50, -45, -211, 59, 142, 14, -61, -158, -335, 112, 53, -294, -54, -48, 85, 9, 34, -130, 10, 59, 192, -214, -64, -116, -76, 123, 117, -120, -196, 249, 23, -138, -8, -88, -194, 320, -37, -29, 227, -75, -20, -25, -43, -9, 160, -70, 37, 64, 167, 127, 7, -42, -233, -61, -55, -144, -20, 10, 47, 88, 145, -57, -229, 101, -87, 48, 213, 157, -33, -95, 137, 45, 187]
7176A87r9k7P5j66J56K2l00J31k5K9K24k45lK61l96J94ppj68J00q4L86k74j3N4
7201Ek16P5J90K55k24j08j23l1J64N7j03J59j54j81J38J10o9O3j22K16J38k71
7223c2R7L0j2M2j86J31j10k32N03m61K24K36k04o7L18j73o6O6j62L9k6k9J81J83
7247B90m89L94l59Q0K19l5k19K02O8K5j02j05K0OK04k66J97j07l07M18j08j42
7269a16q1L2J81O7L9J9k34N5J30l68K21m8J92k92K54J43l70M83m0l58L85m88J96
7292Bq2K64l93K41q7J66JN7j84m8K6nj06J64k46K52j7k0j60K90n0N1j15q0l23
7317d02M22P8l35K48k51N4L67n69K83K28k22P4J32q3q3k21K75O0m0j29l5N9J78
7340H8J7j96K17N0j57r6PK3LJ41k56K10J15m0j06lK33j04k89K55n8J25r0J70j41
$$ y = [187, 88, 61, 136, -30, 126, 148, -152, -21, -46, -17, 207, -38, -41, 220, -176, 18, 11, 4, -164, -64, -148, 238, -36, -49, 5, -211, -136, 54, 309, 85, -23, -146, -177, -13, 44, -59, 100, -54, -235, -97, 13, -56, 7, -115, 101, 239, -32, 65, 95, 83, 125, -61, 70, -40, -272, 231, -230, -6, 230, 26, -41, 277, 104, 38, 104, -58, -19, -45, -74, 107, 290, -199, 195, -164, -84, 135, 100, -119, 83, 151, 176, 74, -31, -11, -5, 199, -67, 130, 23, -284, 134, 26, -116, -197, -165, 16, 83, 122, 141, -93, -38, 92, -276, -55, -103, 89, -203, 51, 194, -176, 307, 267, -91, 294, -194, 2, -80, 184, -209, 32, -55, 111, 112, 169, -15, -63, -37, -42, -148, 16, -230, 22, 5, -15, -175, 115, 65, 116, 1, -79, -402, 20, 98, -237, 11, -240, -186, 181, -388, -105, 123, -99, -25, 107, 24, -59, -280, -5, 55, 15, -114, -149, -90, 88, 105, -91, 126, 176, 19, -77, -70, -47, -44, 97, -159, 51, 166, 126, 20, 17, 250, 146, -143, 112, 54, 179, 89, 259, 118]
7365A18j20k08k3P8J97K09l9j73L19k41k00K85p9k20J03Q7l2p3k86K14K27J8m49
7388b88K50Rl6P1J5P0l4q4j32J51n1m0o7l4M20o5k99K04l69oK98m0K3QJ56o0O1
7415A31j42J17L9O3j07j47J55l16j46M15M4j70M7N5J88l94L82l1k93L01k97NJ13
7438A2O0J25J64j50m69K96o2K21k73j22L41j31J40j26J17Jq1k8o1L8k47j64N14
7461A15j13j49K84l45Q7L12k9o2j69J51pj15o9R3K11m26J02K44j1O6l42K57J02
7484A87k4o5R8P7l14J14j95K33M9j88J17K55l75k3L6K30j33k41K31n9j56j9j52
7507c17N49k04J6Q9j57J13J66k38J60q9q7p2o1j0J02o8J61K23j79J57n23Q1L00
7530A12q8m6P6Mmr5J57n8Jo0J52j39r3M4j98J72RJ26j40J10M7k2K89k51m8O5l37
$$ y = [118, -2, -210, -233, -155, 42, 251, 212, 39, 358, 117, -83, 202, 123, -97, 6, 93, 61, -12, -298, -84, 143, 161, -288, -38, -29, -65, 6, 21, 91, 57, -27, -159, -8, -59, -99, -166, -200, 220, 155, -144, 60, -309, -315, -17, -57, -34, -26, 130, 70, 131, -11, 106, 145, 208, 101, -46, 109, -207, -353, 62, 106, -64, -17, 38, 226, -168, 214, 183, -110, 191, -106, -101, 12, 72, 197, 361, 211, -258, 38, -24, 197, -76, -198, 143, 12, 152, 26, 143, 144, 63, 35, -26, 12, -235, -399, 115, 2, -147, 137, -208, -121, 191, 162, 100, -69, 82, 75, -40, -109, -16, 195, -231, -129, 115, 104, 170, -172, 85, 187, 163, 98, 196, 273, -41, 73, -122, 111, 160, -28, 89, 344, -31, -54, -18, 212, 79, -162, 69, 10, -146, -165, -317, 232, 28, 44, 133, -24, 89, 255, 17, 177, 88, 1, -71, -132, -142, -40, -108, 53, 276, 97, 254, -269, -188, 112, 24, -22, 54, 58, 54, -41, 116, 58, 59, -1, 151, 12, -81, -37, -235, -63, -54, 72, -68, 42, 89, 67, 356, 105, 57, 122, -215]
7557b15L81l68M8L70k06R1l06M19l1j46N4j26K40j50J03q5n3n7J3L4J43l09M32
7580B76k38L35k74j16j02M4ko9K4L3K19l42K40j58J74j13L9j30K07K90l58J92
7602A71K6k95j18N40l72j15Q1j01Q3J46j70o5L41j4p6j93J76M8j51O4l2o9J25
7625C0l8J37J44l85R7m4J86j37j05K34m09Q1K27M4k18J83L7K9k18r7K20j07K15
7648A06L5J40l08J40j53j59Q8K66p0k24J82j73J08o9J1M1k87K32P3L6Qk96K98
7671B5j05l3J82l3K63m89L31j98J10M0%k50L8J16p3J48j12J04k7m5j97K13Q7j95
7695a00J66J56p1k92J80J26j71L43l53J39p9j69L7L9J52l04L0J43lK7j99M45k98
7718e6kK8j06L43j39J01j85n6M9j29L42l03L46k66J94k79k38L85o2qL7n3P3j55
$$ y = [-215, 166, -202, -154, 216, 10, 101, -205, 214, 183, 37, 91, -35, 205, 55, 158, 73, 20, -37, -24, 10, 153, -156, 276, 38, 373, 99, -17, -119, -75, -77, -146, -122, -89, 130, -212, 28, -130, 44, -69, -30, -160, 47, 337, -21, 171, 197, -98, -216, 324, -48, -163, -82, -183, -100, 46, -124, -189, 152, 138, 62, -131, 45, 93, -58, 6, -26, -95, 30, -8, 129, 273, -112, -15, -59, 127, -10, -115, 119, -290, -209, 18, 62, -156, 27, 64, 93, -125, -222, -2, -109, 106, 141, 281, -27, 113, -40, -199, -111, 155, 85, -139, 43, -130, -22, -91, -80, -39, -326, -94, -21, 15, 23, -273, 25, -80, -113, 69, 36, 299, -190, 141, -57, 53, 93, 93, -157, -119, -3, -76, 72, -40, 64, 37, -8, -205, 8, 95, -100, 66, 222, 151, -141, 39, 165, -6, 337, -16, 123, 44, -125, -88, -49, 103, -201, -171, -28, -31, -4, -203, 242, -56, -58, -30, -136, 207, 68, 169, -16, -72, -23, -152, 190, -113, 233, -33, 161, -118, -356, 29, -33, -41, -4, -57, 16, -139]
7742a39Q3j03j71M21k73K99k3q4J00j58J91o5N9n0j13R6n6k26oJ38J63j26j52
7765a95L85k40j5K01r9k60L97n9n2j94J40K2mq0l3J92n4O2j16K30m79m0L10J6
7789C5Rl4p5kK00j35j98K68j4k55j1K14j23J22j09J0M8K53l82J77K38l13K36j12
7813D7k22J39q0K41k34J25K03j37j42Q7r3J67l9J85m01J11L02j03j36j42j10J66
7835f6J83j73R2l2R5J66j66kj35J8J5J45j58R8J4J01j06j77J86N8l42J67J47K7
7859A55j06L1j08J22o3J51r2m20M73j29n0J17j27m3j21K64k32P8J09L02k73q6
7881d8R2r6j3N5K25m45J46K21Q9j71j01J69j02J03j2%k43j09K75j63K50J2k17
7904h3Rq5J24J9m7M8n0N4j30q7L69m0J40j34j75L88m35N2J80j77J75M6k16L58
$$ y = [-139, -56, -159, -330, 91, -182, 117, 94, 10, 110, -48, 143, 78, 137, 87, -26, 70, 14, -212, -218, -80, 83, -43, -195, 190, -50, -65, 136, 37, -223, 174, 115, 63, -131, 9, 31, 27, -53, -86, 106, 52, 114, -2, 228, -251, -291, 19, 35, 44, 10, -65, -67, 133, -2, -200, 68, 54, -201, -212, 2, -121, 1, -108, -98, -50, 203, -179, -2, 236, -77, 159, 47, -175, -36, -116, 125, -109, 16, 219, 82, -60, 27, -66, 101, 62, 247, -154, -43, 259, 156, 20, -122, -232, -66, 117, -56, 36, 4, 99, 265, 99, 97, -38, -20, -5, 140, -18, 80, 94, 195, 89, -88, 98, 156, -186, -19, 128, 155, 49, 80, -28, 94, 31, 182, 90, -330, 143, 14, -36, 81, -46, -89, -210, 54, -178, -100, 9, 311, 38, -48, 44, -52, -65, -10, 215, -230, -84, 137, 226, 55, -46, 123, 21, 124, 112, 112, -131, -240, 35, -128, 122, 134, -83, -74, -159, -35, -16, -63, -15, -65, -11, -141, -228, 141, 101, 241, 107, -68, 320, -115, -63, 117, -60, 115, 161, -55, 303]
7928C03o6j79k27K28k50L39K6n3r6L9l5J58k03o3RK38k45K17j59K20J5k33R2k2
7952E3k6J21l09K16J84j96j94J24J9j16j62K07J67M9k51O6K46l92P7K94j85J10
7974A02p3k86R4J89O4j3m0j31K10K2k7lp3j22J24k18N16j98P5l48K5J73N3p8l03
7999b66L71k55J33L1J0r2O9J32j53j45J53k21K30r5j8L79k48J09k86M0K5k39L78
8022D2j01L08j41l03J44J1K60l29p1J96j4K43R5j54r5j13O4k0n6J1K05J12l61
8045f7P7J1k34J25K47j53k9K1oK12j99k58L90k15nl8N5Q8j48K96L2j80oJ60j53
8070B3k29K20J96j16k4k70J73K35j45q2j07J79r3O4O6j38J39J31l3j45j4J02m87
8093c55K99jp4J98R2l51J91m6J55j61j7J07j76p2L20k17o6R1N20l29J1J60j11
$$ y = [303, 237, 58, -169, 59, -191, 148, 174, 121, 25, 64, 29, 187, -16, -79, -70, 168, -77, 140, -19, 201, 216, -17, 75, 53, 27, 148, -161, 55, 239, 43, -151, -27, -8, -124, -286, -79, 88, 137, -114, -48, 198, -194, -117, 177, -8, 102, 29, -257, -163, 26, 90, 77, 37, -94, 116, 138, 111, 108, 35, -87, 37, -181, 335, 137, 212, -136, -111, 62, 115, 37, -266, 105, -150, -17, 14, 24, -68, 1, 133, -20, -165, -12, -233, -3, -98, -116, 263, 15, 124, -162, -122, -97, -336, 42, -59, 249, 108, -195, -51, -40, 220, -109, -180, 16, 2, 245, 340, 186, 91, -22, 42, 22, -34, -23, 182, 294, -67, 10, 21, -213, -88, 159, 6, -23, -2, -8, 204, 5, -253, 137, -78, -83, -121, -66, 22, -126, 170, 202, 22, 16, 176, 23, -206, 14, 210, 94, 70, -200, -27, 208, 63, -19, -126, 53, -40, 24, 90, -48, 91, 222, 189, 44, 30, 132, -355, -56, -57, -131, 67, 159, -192, -1, -47, 108, -53, -70, 37, -139, -211, 109, -108, -174, -83, 437, 108, 119, 279, 168]
8116A68m7J04k41J56K0j58o3k34L48k03n9K81l3K7k60n3K74Q8j52k65L20J2k2
8139Hj12K66j48l93N51J0l50j47L83j70J79o6R0q1P3o0J86j65N9k31J66k51L32
8162A29j10k35M73k66j66K03j08J18j69K9K75k33RJ58k22M6j50k6J22K01J41l53
8184a34k7J72j04K91j41j48O7
$$ y = [168, 121, 225, -16, 140, 160, 2, -61, -295, 53, -150, -209, 72, 39, 66, -194, -247, 27, 115, -37, -302, 18, 30, 8, -104, 162, 14, -379, 172, 182, -168, -315, 68, -102, 77, 11, 101, 20, 93, 33, 219, 54, 113, -118, 48, -203, 129, 19, -216, 257, -9, -175, 28, -80, 38, -131, -102, 173, -60, -51, 107, -115, -69, -219, -245, -123, 78, 219, -134, -161, 11, -93, 198, 57, -91, -24]
8191b4
$$ Imaginary data points
##PAGE= N=2
##DATA TABLE= (X++(I..I)), XYDATA
0@%%%%%%%%%%%%%%%lJ1j6J6j6J6k3L1l2L5m3M9n7O7p5Q8j02J13j26J44j64J84
37I7k04K28k55K84l16L50l87M28m74N23n77O37p02P72q50R37j034J143j266J406
57G40j567J755j976K243k571K986l529M274n364P116j0375J8428p4353j15957
71a78150J66700J10711n5082p1835J1941J9385J7885Q10r580j5173k5536k1527
83d9451M0594N4460k3710o1327R728N4935K6192l2279n9149j4653O1786M9418
95E6544l3254n2026Q66K2928J4119Q837k181k3387k3933Q369M5715K7534m4932
108E199n7773K4963N9488j728l7541q757J1070R719N049j2342j1397J5572P968
121I490j4599Q595K0775k2309l0896K0732L4708j2750m2861j2095M0940M1470
$$ y = [0, 0, 0, 0, 0, 0, 0, 0, 0, 0, 0, 0, 0, 0, 0, 0, -3, 8, -8, 8, -8, 8, -15, 16, -16, 19, -24, 25, -32, 35, -40, 48, -54, 59, -67, 77, -87, 97, -107, 121, -134, 150, -166, 184, -203, 225, -249, 274, -303, 334, -368, 404, -446, 491, -543, 600, -666, 740, -827, 928, -1048, 1195, -1376, 1610, -1919, 2355, -3009, 4107, -6268, 12160, -62193, -178150, -11450, 99261, 44179, -27656, -15715, 3670, 21555, 22365, 12785, -2388, -27924, -49451, -8857, 45603, 21893, -39434, -29706, 25229, 51421, 19142, -40007, -54660, 7126, 56544, 23290, -28736, -27870, -4942, 9177, 18014, 15833, -7554, -31487, -23118, 22597, 50131, 5199, -52574, -27611, 31877, 30149, -7392, -16149, -5079, 4640, 9689, -2653, -14050, 1522, 9490, -5109, 3486, 24261, 1952, -28944, -8212, 26496, 13746, -29115, -41210, -270, 41200]
133D1200j9139m1520R116K7622j3782j8740K0109J4321k3902j9043J7298K6594
145B0134l024l3123j4168L1815K6550k5236l1040K0651L8008q343l6944m815K8434
158H899P343k6386q595K6103O466k7832n307L4112J2432l1287k1512J8082K5277
171A7795j811k1543q976J3565J0365q980p043P235M948o782o781M953J1162n53
185G554j3816l29J9233k0k8046o330K9017J3656k3092j7547J3277J9230k047j2384
199a644O16R275n779j5991L662K0018K300k0062j0276J6339J7796r503k1539O250
213h538K4648l454k7326J663K7601J213k4855l666J9937J474k0058k177K2369
226H831P474k3588j3687K2222J8989j3915j6528P022J0780m054q943q96Q515M905
$$ y = [41200, 22061, -19459, -10343, 17279, 3497, -15243, 4866, 19187, -4715, -23758, -6460, 20134, 17110, -16013, -30181, 1634, 28184, 2948, -28092, -7441, 30567, 22224, -14720, -19535, 8899, 16242, -10144, -18739, 7364, 13830, -14002, -19309, 14803, 27235, -4052, -25564, -7482, 17795, 15984, -5559, -14535, -970, 9395, 415, -6628, 607, 5555, -1227, -8008, -3055, 8107, 7554, -6262, -6591, 12642, 12622, -15424, -21754, 7263, 20919, -2173, -19720, -6443, 12787, 10740, -1644, -1028, 8247, 2468, -13523, -9861, 10157, 12457, -7605, -17881, -1542, 16254, 6751, -14788, -8538, 16110, 12656, -14670, -13007, 14594, 15807, -9048, -12714, 7223, 8697, -11361, -13538, 8831, 16305, -7283, -20970, 1252, 20241, 6326, -10202, -3180, 7600, 3546, -5397, -6293, 2222, 7127]
240G127j0800j0131J1575J7201p579j6827L599J4850j673j5618k695J6347P654
253A3030j6879j1017J4289J2450r079r591O219N522m456m820J667P800K457j0403
267b811q516R525J1794p024j1978M515J2342k448j4508R61J8934L262k1330p547
281a4829K1381P970k0446p244J7438N481j6305o341J4791J1822p690j4714J702
294f984J4039J481j2704l998J0639L466r377n644Q416R819n399j1607K691J2946
308G784k434j3135L232J4227l358j5811L64J4945L945j1158n899O735M733n884
322a714k970O367M403n134n043K131N064K382m591p846R92R775L04r656J340J2887
338H691n87j4413k216J2897M405j1376n828R118N997p549n975P569P263o726r280
$$ y = [7127, -3673, -13804, -2229, 14972, 7393, -9434, -5835, 9015, 7342, -8276, -10971, 5376, 13030, -3849, -14866, -577, 11873, 2794, -6797, -578, 4944, 488, -4332, -2665, 5135, 7592, -2811, -11327, -1802, 9992, 2968, -9010, -4495, 7847, 5399, -9109, -8148, 10786, 14048, -7282, -14829, 6552, 14522, -5924, -13168, 4270, 9751, -6554, -12895, 1896, 13718, 6028, -8686, -6984, 7055, 8536, -4168, -8166, 2473, 5939, -3438, -9082, -666, 9153, 3754, -7853, -5162, 7784, 5350, -7785, -4553, 9674, 6316, -9495, -9131, 5814, 9759, -1399, -7298, -563, 4170, -1714, -4684, 1683, 6086, 952, -4091, -1960, 3104, 5486, 895, -6951, -5959, 3816, 4120, -5536, -4196, 8691, 8104, -6309, -8525, 4372, 8777, -2599, -8427, 691, 6688, -861, -6836, 733, 7996, 1270, -8010]
353h010L230R375J885o987l509N264M191o407p028O765J0118o535j3062M983J5143
368I416j580j4564L99J2639j025j1805N69J2867J057j2951l285R557M320o630
382a016l574N597L099m594k770K536L783J63k958l758R33N209L25n157J81M559
398B558k087o027L069Q552n80p882j409N381J372m848j638N095J402n002j201
413c245M573K295j622l058k207R16M384J53m797J113O798k512q584K081R256j491
429D053r715m02R245K091q064j456R345J184j1118k670J0210L233p292k522L934
444E6J147k096l74J660L136q29n146j990N367K996l883l058J959L305j266l405
460b421J262N300j127p981L5P837r2m957J998L715k802k602J666N04q11j1o5j169
$$ y = [-8010, -4780, 4595, 6480, -507, -4016, 1248, 5439, -968, -7996, -1231, 8887, 2352, -10710, -5727, 9416, 7836, -6728, -6329, 6310, 5285, -6520, -5951, 6916, 7973, -4978, -8263, 1294, 5614, -1016, -4590, 1007, 4106, -488, -3258, -722, 3061, 3224, 266, -3492, -2559, 2650, 2975, -2182, -2001, 2558, 471, -5556, -2487, 6065, 5485, -2397, -3806, 1575, 2947, -1901, -3539, 1556, 2958, -2044, -3245, 1328, 3623, 2001, -1057, -3264, -2348, 2036, 2189, -2608, -1495, 5303, 2791, -5793, -3712, 5544, 4053, -5662, -6064, 3181, 5272, -2792, -4248, 5097, 6281, -4837, -7507, 2703, 5936, -1356, -3878, 56, 1203, -893, -1267, 393, 3529, 2700, -2446, -4436, 931, 3927, 44, -3014, -1055, 2250, 984, -2421, -1159, 4141, 3014, -4967, -4932, 2905, 2813, -2144, -146, 3569, 767, -1835, -169, 335, -476, -487, -552, -1721]
478a721J193K715K87k454j732J781J368l447j383N775K372p369k299P655J368
493D109o509p18M753l14l519M78L924J411l035l769J677L154q66k362J220J137
509G71p27o87j024Q10L875q40n207J024N640k234n026K921M631l662n209L371
525a573N634j792m542P56L605j250l645J989M444k895l601K545K106k268m07J875
541I81j689j559K306J759j692l58K094l84l148l14K780R10k294j639K457Q15j970
558i45K00K769q73k603L16J031q3J332R38l164j423K922O71k599M09L123n56m227
576b762N75M224J082m033p18L536o0n330J044O192j718n698J520M136j200j949
592a159K121J523k088k358J083J876m07j280K58M28q77K59J651j80j391P51J17
$$ y = [-1721, -528, 2187, 2474, 20, -1712, 69, 1437, -2010, -3393, 2382, 4754, -2615, -4914, 2741, 4109, -2400, -3118, 1635, 1321, -2198, -1720, 2204, 3615, 580, -3189, -1512, 1642, 776, -1586, -366, 771, 44, -643, -1667, -857, 3018, 2178, -3029, -2005, 3635, 1401, -3625, -704, 3927, 265, -4944, -1573, 4061, 2269, -2273, -1517, 2088, 838, -2807, -818, 3626, 731, -2870, -325, 1781, -487, -894, 981, -708, -2267, 39, 1798, 106, -252, 1842, 1458, -1690, -2004, 776, 1686, -608, -2247, 210, 1025, -945, -745, 2024, 1151, -1452, -1136, -105, -188, 1144, 2082, -1082, -2505, 417, 1088, -1511, -1102, 2021, 1465, -2762, -2187, 2037, 3119, -914, -1632, 1904, 1844, -3486, -2442, 3750, 2032, -3666, -2146, 1990, 790, -1159, 962, 2485, 397, -1961, -878, 998, 591, -689, -431, -3, -880, -621, 1030, 850, -541, 210, 327]
609C27j715P40L110j317k432J011O06j777L77K590k97k383k68J727L40n23k63
626a47J845j030k962J233L775k037l407K927K168m049j335N026O57l268j046K910
642A260o3k455K50K347m9l183n60L190R47k448K57J866j493j380K421M91j635
659b37M90M65j919K05K157o16j955O49J513p28j050J068J987j020k609O07K649
676A656j131k476J931K121l567j457M271J453m283L8L223j137k598J477K473j175
692H19k556N27K130j18k467J237K297j982k161K723J645k461j80J696p72k226
708a849J526J180q91j84R9l58l45J433O73r07r68O66O49q62r27J744P08k847j053
727b513L166O25k820Q48L192j558l310J577L181j453k436J570J556j973j968K622
$$ y = [327, -1388, -648, 2462, 1145, -1287, -276, 330, -1447, -1070, 1520, 1223, -1160, -1428, 299, 639, 116, -147, 1698, 668, -2294, -1061, 2714, 677, -2730, 197, 2365, -1684, -3019, 2007, 2664, -604, -1650, 1260, 1197, -1258, -1008, 1339, 1290, -1893, -2453, 737, 1684, -764, -507, 1359, -134, -1514, 907, 1398, -237, 253, 718, -1201, -996, 1161, 545, -1410, -761, 752, 24, -1026, 42, 2029, 1009, -1600, -993, 1656, 525, -1951, -20, 2101, -1466, -2923, 1348, 2801, -1482, -1444, 1779, 642, -1956, -479, 1994, 819, -1737, -1210, 920, 802, -1665, -428, 1869, -113, -2274, 449, 2094, -367, -547, 1149, 377, -1849, -323, 857, -34, -218, -119, -477, -822, 611, 1284, 377, -591, 75, 724, -138, -1065, 679, 1387, -1460, -2513, 653, 1278, -1542, -694, 2498, 940, -2370, -793, 2388, 935, -1501, 69, 1625, -348, -2316, 306]
743C06J748k632k100K612J968k222n32K593j89k725J24J876k81j464P19O65j226
760g60p6J190M00q53J42J76p66j66J177O13j063r67J218K75j506P90J758j082
778E00k208J342K341j653j707J702J422k624j288K832J456l010o05K641J22k397
794a134K4K937M7k945O0K324n66j931J007R30j543q82J451J031p65k03M29J16
812C87r12N21Q45q50k29P42k66j303O13J495r96j235J239Q56j278p84K329R41
830B115k898q27K335M98k512M60K374p08k746J193K633j188k500J421K110j650
846A10j970K182J365k256j243J893R47j731j57K022l5k188M10J650j03j480N70
863a4M95j096m72J397J16p63L42J96r46K17J382L95j610M1J117j36j857O54J940
$$ y = [306, 2054, -578, -2678, -66, 1902, -320, -852, 1741, 1552, -1173, -1049, 827, 546, -918, -199, 466, -760, -836, 354, 754, -99, 43, 219, -547, -713, 464, 1077, 14, -953, 265, 540, -966, -176, 1582, 500, -1708, -366, 1975, 322, -1385, 317, 1739, -885, -2173, 659, 2115, -895, -1500, 1141, 1263, -1134, -1110, 1827, 1874, -1071, -1011, 1313, 747, -1184, -177, 753, -790, -1672, -221, 810, 45, -158, 271, 387, -525, -4, 841, -9, -238, 504, 238, -1065, -452, 1043, 47, -1188, 51, 907, -371, -1155, 1174, 2115, -783, -1610, 725, 1223, -1289, -829, 1545, 837, -1909, -716, 1917, 729, -1771, -350, 1760, 110, -1860, 322, 1687, -569, -1812, 81, 1028, -703, -860, 1162, 1127, -1061, -651, 999, 896, -584, -14, 481, -615, -1087, 310, 426, -337, 5, 201, -745, -528, 854, 1249, -361, -320, 797, 661, -1196, -542, 1398]
882A398r47k298P90K373q89k167K200J590k801j012K500J390k246j174J769J96
898F72k174M34K034r9k056K93J895n08j181R20J000j401p32J115K33r12oJ200
916G27p16p36P15Q08l91p50O62j22j154P42J404j118j267P27J351j578o26K253
934I31K94k225l05K586J74k657M27K433j033k429Q92K511o49k467P63K243j528
951c9j646J846J754j685j795J381J297j219j64N97m3j109L41Q62j91k77L61k6
969B45o15L86N40p0j186R21M42j285p69J793Q15j503q50J841o4j595N10J809q34
988E31j852R36J485p22j725J455Q37j499j050K262R15k016o34J938M31k532N37
1005g03K030m81k170M72J879r11j008R27R87j009n74M41Q35n21l47K96l17j73
$$ y = [1398, 451, -1847, -1057, 1316, 427, -1740, 460, 2050, -751, -1763, 737, 2127, -119, -1293, 476, 672, -1502, -1068, 966, 867, -1189, -896, 999, 491, -690, 230, 1230, -171, -903, 212, 445, -467, -473, 727, 11, -725, -10, 798, 407, -343, 319, 197, -957, -215, 1189, 71, -1196, -469, 882, -696, -1322, 931, 1225, -1000, -1305, 1281, 1455, -1202, -775, 1658, 625, -1804, -912, 1599, 950, -1517, -754, 1489, -39, -1685, 161, 1915, 230, -1565, -184, 1113, -106, -270, 327, 284, -825, -484, 378, 187, -90, 271, 245, -370, 16, 556, 486, -700, 221, 663, -622, -1391, 402, 1217, -286, -1136, 705, 641, -954, -444, 1365, 531, -1321, -385, 1100, 378, -1347, 108, 945, -554, -1604, 658, 1573, -443, -1077, 861, 1292, -1240, -703, 1327, 846, -1324, -852, 1027, 116, -892, 35, 1022, 13, -561, -120, 715, 194, -153, 143, -174, -347]
1023c47M09N02p19m23J217l27j400J003J883j499j620J676Q62j747q84J804J288
1040A678k425j139K093J102j669o13J969j60k146N42J994j81k206N06J259q74
1056b70m88J175N35j291o56J282M99j068R5R52k01j241K15J112n84q24O96N63
1074E01j020k28J463k53q43N24M79j238P7J331pj587N4J545n87j283M48J857p20
1093E13k001R02K248j107j857J364J823k004j686J876J506j809p85J317M31j079
1109c48j69J480k99j382M1R25R9p40K51P63r57n16J378k16p23N80P81j088m42
1128e82J070L55j064j97R21l53j340N69J500m17j303M89J131q14o07J424N72j495
1146a41r13J696N44k294n8K140k89j875M40K136p75j306N68J226r46j086P10J430
$$ y = [-347, 62, 564, -155, -578, 639, 312, -1088, -85, 1798, 299, -1321, 355, 1217, -530, -1414, 390, 1678, -747, -1886, 207, 1309, -360, -973, 996, 836, -1310, -768, 1226, 1045, -1161, -655, 604, -270, -758, 417, 952, -339, -995, 287, 786, -282, -187, 765, 564, -677, -462, 650, 66, -758, -62, 501, -519, -747, 716, 463, -380, 144, 623, -615, -538, 793, 786, -801, -747, 798, 211, -1072, -624, 1233, 513, -1488, -586, 1662, 555, -1302, 62, 1885, -119, -1805, 71, 1577, -232, -1017, 300, 731, -348, -517, 963, 664, -718, -677, 248, 347, -393, -142, 621, -336, -852, 526, 310, -413, 167, 948, -140, -582, 488, 843, -221, -418, 503, 150, -1190, -621, 879, 462, -841, -352, 779, -35, -642, 782, 1354, -141, -1054, 642, 1186, -1108, -1166, 974, 685, -1190, -750, 1386, 611, -695, -127, 1099, 153, -933, -223, 1207]
1164A207q21j405J024N27o97m5O21m9q25L69N68o14J9O73k52j165Q55Q20j023
1183b13m29P49Q49j077r91J558Q52j171q89J201L83j700P6J793m15j825L27J684
1201G62l77j493J170J130j314p95J258M21j038n01R75L18j128J94J154j34j200
1218e98K96J043o79p02P01Q29r04q11R88o5j24R7J87n13l54J015J59r72Q9J125
1238H07m60r29L29J189p92j470J148J125r70j227J568N77j197q50J433P10j607
1255f16k64J423j10j393J54J618j72j472N83R99o70m92Q44L66p62m08P34r9n57
1274b94L94M04m15p06O41L01n70k08J018J1q08j92J014j71j342Q27O44j209l94
1293a055J754L65j523m34J533o7j158j59J678n56j200P4J576k85j581P30J368
$$ y = [1207, 386, -1019, 5, 532, -165, -210, 411, 362, -463, -94, 474, -140, -121, 552, 300, -865, -10, 810, -213, -642, 107, 956, -121, -1112, 446, 1298, 127, -762, 439, 822, -878, -802, 991, 576, -1249, -922, 762, 385, -1108, 62, 1192, -122, -917, 341, 762, -276, -777, 198, 516, -612, -418, 736, 602, -598, -302, 741, 62, -640, 61, 890, -14, -825, 163, 98, -26, 71, 258, -255, -609, 406, 565, -407, -318, 807, 347, -582, -253, 936, 144, -1326, -178, 947, -23, -1250, 318, 895, -302, -1152, 281, 991, -616, -880, 543, 433, -960, -806, 812, 640, -832, -249, 750, 80, -412, 432, 798, 36, -372, 362, 263, -294, 100, 504, 89, -617, 24, 325, -245, -453, 565, 576, -232, -424, 590, 419, -923, -96, 548, -661, -1055, 699, 1064, -459, -893, 640, 573, -585, -744, 934, 378, -822, -748, 828, 543, -1038, -308, 1060]
1310A060j097j064J395N07j053n06R83J91q06OQ97m17q09K63O48J0k62L46M20
1329G12j048j30Q96j38o57N64O01j199k35R75L97j135j70J184j94j412N92J545
1347A148r49j119L64J337q14r72J184O93j196p98J501M55r15p93J495k56q59J18
1365c76R69j19j273O93P50o50n75P61M76q84m71Q41L47p78K87M03l58p80Q71L45
1385D79o65j55P18j78q18L30J115o80q47O17Q56q35r83J068Q11j113o15J367J23
1404E95j163O6J270r9j534M96J195p60n22K17P93q60n32R74N05j040k57Q68K00
1423D12r71M85P67n72o07L13N11m71l13O27j5n78L90J34r7n22Q17J71o71l43P42
1444B09M70j190l43J062J11j261N70J282p94j060O92J033r67l81O91J168j398
$$ y = [1060, -37, -1101, 294, 801, -252, -758, 225, 416, -390, -384, 513, 96, -713, -450, 198, 208, -54, 292, 712, -336, -466, 430, 292, -365, 199, 800, -399, -634, 341, 738, -397, -567, 617, 423, -989, -397, 1148, 199, -920, -556, 781, -33, -1005, 179, 872, -324, -1122, 379, 834, -81, -874, 621, 365, -494, -376, 593, 474, -799, -106, 644, -6, -581, 180, 656, -228, -699, 142, 489, -289, -2, 401, 43, -737, 134, 479, -186, -341, 377, 199, -619, -289, 826, 146, -701, -84, 772, -63, -1046, 22, 833, -280, -895, 472, 595, -568, -502, 768, 669, -865, -369, 826, 66, -456, -239, 554, -306, -838, 136, 641, -399, -656, 212, 412, -559, -74, 693, 121, -486, -173, 338, -133, -446, 181, 166, -412, -22, 112, 15, -507, 310, 481, -190, -533, 209, 679, -511, -854, 208, 319, -942, -372, 910, 116, -944, -252, 781, -186, -567, 124, 1292, -106]
1461a06p57J065O97j153m91J035M67j207j45J119N3r89K30M37l43m03N00M75n79
1480i5J1L69j45l42L82K12n20k56N34K62o54l42J157l54p22nJ002o3r54M21N00
1501C98p63j97R36K82r86l72J012M1p72RJ084l81j181Q24R17n22j088M82J152
1520H75q22q02J051M70q71l36N83L42q20J26N47r2o03J32l6M29j36J90o1p14M64
1541h4O75p63n97J192L78j338j18J256J36j189l17J568l2j362l4J323j30j226
1559f62J57J114k20j234Q54N79n51o15O72J07n74P0Q78l45q70P20O43p69n44O18
1579B8N62q87k74P61N43j027l50Q46L4m79o6R10n11n10M12%k82M94R1l48m68N95
1601G4M72m94q27O94P13j026p00J571O89j917n54J538P60j435m11J604M3j211
$$ y = [-106, -863, 202, 899, -254, -745, 290, 757, -450, -595, 524, 577, -412, -182, 255, -88, -491, 9, 484, -95, -84, 285, 140, -202, 180, 392, -128, -384, 150, 412, -242, -584, 573, 219, -503, -508, 494, 431, -523, -102, 398, -365, -562, 374, 656, -330, -702, 310, 351, -421, -412, 672, 291, -890, -66, 851, 329, -759, -277, 875, 53, -749, 302, 772, -99, -435, 148, 490, -330, -204, 343, 251, -352, -220, -256, 173, 37, 227, 166, -548, -84, 591, -172, -769, 423, 801, -537, -655, 601, 737, -452, -769, 799, 767, -595, -629, 694, 564, -662, -505, 609, 389, -845, 9, 588, 37, -578, 94, 201, -373, -303, 575, 230, -640, 80, 723, -46, -590, 28, 590, -297, -571, 190, 733, -294, -644, 202, 236, -243, -309, 601, 90, -420, -8, -8, -290, 204, 295, -53, -521, 74, 546, 52, -775, -81, 632, -394, -1094, 477, 1166, -751, -1305, 233, 993, -442, -853, 751, 794, -417]
1619d17m06J210L49r08K2K93ro49M15K33k68L4M81m69j92N10P02j241m25J167
1639D32L44j436o1J214J98r24m95J436m26o71Q5O70l22n15J31P67j42j52Q9l26
1659a04m89O75O31q32m81Q25M66q39o06J198M58j529l44J280O40j201n54J378
1677E72L05j077n27J159N9n60l63L17L27o17N48k61K1K63qo50J66J152m01r00
1697d75l4J418j69j286k45J646j50j240m12J597J70j362n4J036k58o26O1P09k78
1716D8l14Q5j66L17j1N99n50m53P49M91j226k00J068M48j437p03J570P53j222
1735a54p60J495K74j091k67R28J53m25n84K40O15k64k45l11K79N31o2p83K09R42
1755G20q5j721K88J757j91j433j75J727M1j624j65J442K27j522k17J227L43r60
$$ y = [-417, -823, 387, 736, -172, -150, 143, 134, -515, -100, 133, -135, -101, 380, -89, -281, 229, 931, -310, -735, 432, 776, -660, -721, 493, 691, -233, -728, 708, 282, -389, -304, 366, 44, -471, -340, 427, 285, 133, 222, -104, -593, 82, 713, -119, -600, 225, 691, -148, -754, 444, 902, -627, -971, 309, 949, -252, -806, 572, 877, -200, -727, 432, 491, -69, -432, -115, 212, -405, 143, -118, -97, 166, 158, -492, -326, 826, 425, -475, -509, 909, 740, -546, -791, 855, 705, -535, -947, 650, 820, -542, -596, 440, 182, -444, -383, 326, 48, -266, -181, -347, -30, -41, 558, 8, -445, 304, 795, -431, -631, 437, 885, -552, -1255, 315, 1068, -154, -914, 581, 855, -236, -503, 425, 578, 153, -431, -191, 424, 160, -85, -396, -117, 414, 352, -431, -222, 720, 635, -1086, -798, 959, 768, -665, -840, 887, 928, -696, -861, 581, 808, -714, -931, 296, 639, -321]
1773c21j92P10K50n28k38L75p6J77j25n83N49L07K87j412K39J169K2j145JJ155
1793F21K73j434j80J353L53j448l29J177O2n75j69N72j65J9l23j88K24M67J14
1812D24p18j81R06K48j483J36J425J12j618q2J748J75j711m80J625L99j433n09
1830a017J387L99q90m46O21M04m51k50j00P10J27o45o44N88J148n69j065r3J588
1849H02j28j532L28J445r1j581m6J751j75j291J3Q89L14j034l97Q61K60l76m03
1868c91rN47K80l50l81k0P00K01j247K89R96J21j315j47J323K87j431m04J544
1887E93L14j189q93J652L31r60p29Q34M36Q6p95m7N23M58n43n58L55J036k90j623
1907a009O65J437k57j630K4J769j77j664O5J491L83k022J17J594Q7j358j6P83
$$ y = [-321, -513, 197, 447, -81, -319, 56, -20, 157, 32, -551, -2, 305, 592, -820, -581, 588, 610, -535, -534, 621, 894, -540, -720, 633, 986, -462, -791, 386, 448, -127, -296, 276, 111, 130, -193, -381, -157, 310, 424, -294, -475, 431, 679, -804, -668, 757, 869, -749, -831, 917, 1092, -619, -1099, 526, 925, -508, -1017, 370, 769, -121, -567, 54, 458, 7, -243, -343, 367, 494, -151, -795, -207, 941, 372, -693, -786, 802, 674, -858, -530, 915, 824, -757, -803, 948, 773, -518, -505, 384, 698, -336, -733, 128, 388, 12, -391, -400, 147, 427, 77, -304, -324, 376, 577, -670, -381, 615, 736, -579, -726, 597, 884, -547, -951, 593, 907, -282, -1175, 477, 808, -152, -881, -47, 389, 475, -320, -367, 156, 614, 71, -487, -132, 904, 614, -1009, -344, 1093, 836, -794, -770, 999, 822, -842, -777, 714, 1097, -925, -808, 786, 873, -485, -501, 282]
1925B82J68o00l00K54L75rj78m24K56M20J28r32K68J268l77j272P7J493k64j316
1945f83K03R60K62j310m91J441K30n61p43P37M12k46l37m05N48L24k37m99J69
1964b26J162p58j195N40J286k42j729M78J459L15k004J10J540M84j858k68J521
1981F15J67j202l81J286L8n12p43N50M63o3p59M2O07N39n98p11O92P60l50j209
2001g69p9J506j56j227J25J444k0j669M07J023n2r02j56N43K67n14j33J90J53
2020a9K96l17n18N30N31j71j032L55J161l01j460M40J636m85j627M64J309j35
2038F57j370j4J319L9j047j12O89M43o29n88N04J31K47m96p9L51P35n74j155N26
2058d23J094j35j279M47J276n70j481O45J276j72j447M0J421j75j026RQ13L8m85
$$ y = [282, 450, -150, -450, -196, 179, 170, -8, -432, -176, 244, 372, -560, -292, 976, 599, -673, -596, 897, 633, -683, -480, 480, 742, -568, -1059, 382, 612, 51, -692, 45, 457, 211, -126, -531, 17, 341, 104, -395, -226, 936, 178, -1017, -477, 809, 567, -1162, -684, 775, 1090, -914, -804, 736, 1220, -638, -906, 615, 782, -420, -801, 485, 523, 11, -732, -182, 281, 218, -541, -499, 108, 647, 49, -662, 30, 790, 440, -769, -848, 658, 502, -725, -600, 844, 824, -845, -438, 585, 533, -369, -525, 18, 285, -229, -362, -172, -19, 277, -40, -558, -28, 503, 332, -700, -345, 816, 515, -945, -505, 1131, 646, -981, -517, 792, 657, -713, -727, 592, 631, -416, -528, 161, 604, -25, -613, -109, 22, 269, -227, -306, 45, 780, 206, -949, -423, 671, 536, -743, -296, 980, 410, -1071, -426, 850, 678, -769, -729, 692, 517, -509, -500, 313, 351, -134]
2077a34j03K35O7o5L1l6K8O63o40n73J28J025j68j170N61O81k30q50L7J371j38
2098G20j170j40R56K97j017l7M65J88m16J51Q2J29J66k73n72L90P02l13j015N57
2118a50P89j52j229N79Q86l93j139L40J367o82q68P9J353o09n24j38R37j78n03
2137b35j16M20J10j08l82K04R2L00k49k68l3O30k72m73r6J192l56j069Q1J027
2157C99J84j249L56P83k19m13k83Q60k87j80J0m2J66j20Mj90J66M92k52m78n6
2178c49R52j78j114K92R05k66r84M57J023m78r69K77J029k01p34j7M76N5m24j8
2198b66N09q7k46q8p0J95K57m2o20M10N97n82n81M33Q59m94q52L92Q04q6j170
2219g28M56P47k16o30J17R36m87m67M9J54J98l13K10O4j90L83l5l67r2O64j51
$$ y = [-134, -237, -2, 65, 0, 31, -5, 23, 686, 46, -527, -399, 626, 458, -712, -151, 530, 300, -550, -513, 858, 720, -450, -590, 366, 663, -354, -391, 74, 262, -154, -3, 79, 208, 374, 101, -471, -81, 621, 308, -707, -150, 639, 487, -742, -163, 723, 330, -809, -469, 898, 216, -652, -573, 780, 171, -353, -491, 446, 268, -235, -351, 69, 179, 71, -311, -107, -15, 285, 36, -232, -265, 365, 93, -380, -476, 716, 360, -709, -628, 399, 583, -666, -310, 473, 254, -159, -442, 418, 131, -49, -39, -81, 85, -35, -31, -221, -55, 437, 185, -293, -349, 603, 425, -689, -397, 508, 242, -742, -285, 738, 260, -709, -432, 597, 396, -338, -355, 121, 176, -248, -266, 243, 156, -90, -178, -248, -53, 204, 162, -458, -48, 549, -33, -614, -181, 678, 184, -668, -276, 528, 442, -728, -272, 475, 259, -371, -254, 682, 195, -272, -223, -69, 129, -184, 26, 90, -100, 283, 248, -119, -211, 453, 302]
2240C02q68R7R47l68q01N77N63j33q77L34R16l55p97J50N30J1k50j26J19K4J82
2261A77k95m18O95L72o31m37K39O23k16n27M0R54n77n33L33J063p55m94K87N94
2281D94l14l54j49N29L28j012N18K15k74QK42k02q5P3m1q4j11L57K9o74J99O41
2303C33k61m67M03M83l73o52M19O28l68l38L5L46j49k56K45J6j38O2l8k8QJ70
2325H0K7m58J01P69j49o90pR94l91o24K75N83j99n92J7Q67l92o19J71L69R6l80
2347a52J60J74j28M8K67m05k26N18k33Qk25M33k7m57J51L85P7o20J57O51o34k03
2369b81L68L47m54m41M50M10l88r3J38o2M3k10K31q2j86J61K59j96j61M05q2m50
2391b74K35K96P2p13K34M57pm62j72P23j09q54P00M38n33k20J89R2k46L68M9n04
$$ y = [302, -566, -469, 478, 110, -691, -114, 449, 316, -561, -227, 689, 334, -463, -313, 217, 228, -22, -148, -29, -5, 177, -118, -536, 159, 531, -100, -537, -298, 325, 109, -418, -378, 576, -1, -534, -201, 862, 107, -387, -100, 494, 180, -174, -323, 206, 534, -478, 40, 255, -19, -11, 231, 29, -56, 17, -24, -108, -219, 138, 167, -507, -308, 333, 72, -395, 8, 491, 118, -534, -115, 513, 145, -193, -158, 188, 39, -217, 28, 44, -94, -32, -70, -98, -90, 80, 107, -351, -250, 519, 370, -320, -327, 667, 276, -348, -73, 510, 311, -281, -264, 603, 211, -408, -237, 132, 228, -152, 8, 182, 54, 102, 369, -36, -262, 256, 23, 31, -194, 239, 212, -245, -94, 291, 368, -252, -95, 556, -78, -281, 87, 434, -20, -461, -11, 399, 11, -82, 56, -6, 37, -173, 58, -24, -210, -49, 210, 14, -147, 258, 176, -274, -39, 257, 329, -384, -150, 307, 300, -162, -334, 389, 280, -574, 126, 564, 31, -189, 0, 92, -154, 214, 263, -241]
2413b41M33k05j14J16p4J71J09m49K30L42Pj053M62Q09k83p80O45M32o57j63M01
2434A38R2m03k39M90J09l25J50J9R1m22P1K39j28J25L43k38m92J03M15n2j66k35
2456c15Q71n40m39J69N14l15j7K42m7j0j7K95j15l06%L38l33j80L31L08n39j94
2478b99O76m9m25k4L39j63n31M69L92j63o57M73L56k53m75M14L50m16j81M02j87
2499D8j54N7J30O6m79K23J56j25j9K3j05J31Q6Q8j13j10Q6K80k45k37N40R2m00
2522A9q8L68m8k64m7J76K89m15J97J37l74m15M98L19k76n10M49J61l34K5M69O7
2544D03o43K18L82k80o07N07K87j76k19K07J00j86j26L13J51m94O5K07R7m64R6
2565a62M01q4k81J98o9j45L2J99pj84K11p2J25k67J67J99k2m75J48L43l07l24
$$ y = [-241, 192, -13, -127, -11, -85, 86, 195, -254, -24, 318, 325, -728, -266, 543, 260, -520, 125, 557, -100, -263, 138, 230, -173, -412, 78, 187, -138, 12, 31, 122, -300, -229, 10, -118, 7, 350, 112, -380, -277, 138, 86, -80, -315, 556, 16, -423, -254, 260, -55, -72, 170, 123, 113, 96, 391, 276, -30, -30, 308, -25, -205, 126, 434, -105, -299, 377, 328, -97, -121, 218, 55, -476, -7, 385, 222, -435, 38, 394, 141, -334, 80, 430, 14, -167, 235, 48, -106, -49, 81, 147, -332, -109, 47, -78, -97, -74, -179, -48, 38, 126, 13, -97, -11, 269, 24, -213, 327, 419, 19, -69, 299, 251, -13, -60, 116, 405, -10, 187, 324, -50, -465, 33, 352, 76, -434, 15, 176, -158, -133, 336, 403, -240, -22, 360, 80, -527, -20, 267, 91, -128, 79, 179, -7, -133, 180, 331, -163, -98, 109, 206, -258, -162, 239, 155, -126, 72, 3, -142, -110, 89, 82, -102, 109, 37, 162, -105, 62, 261, 239, -236, -88, 255, -52, -376]
2587c76N98J47p51L92K77k11q2N9K74k93k43K06K07r1j97L43n08J40j3K10N7j58
2609a3N9M0l57K82J28O3j04m61O87j53m11L77k04J90k04J00P4Nk07J12%j5j13
2632a25M18k19l29LJ95J47l17J37L58m98k33N25Rj74l30O21J5o24K36K33J68m48
2654b32N5L43k42j78L25J51k39k61M68j96j17J59K35j39k22O0M41l32j95K72k16
2675f0j92M08N9j0j48l25L83j57k43K18L99m16rK64J17l66k18L74M7l00L84r1
2697A18Mm19M40L51p07J18J97L19m23j48J05K90l38lp9Q5L6J48n8o6J8K07j7k63
2721h5P5K04p8j61J70p0j08J0j04M49l46n3J80j83j54J24K97r4j94J6L73m90k2
2744b44J02K94k29J9o8L32k36j92M30J31m39jK98k27k68M17j66L75m15J09J40
$$ y = [-376, 222, 369, -382, 10, 287, 76, -6, 53, 327, 34, -209, -3, 204, 113, -84, 259, -249, -109, -122, 88, 145, -13, 46, 86, -271, 11, 139, 202, 98, -363, 324, 171, -240, 137, -67, 123, -81, 19, 93, 98, -109, 3, 3, -12, -125, 293, 74, -255, -252, -57, 90, -227, -90, 268, -230, -463, 62, 71, -103, -433, 188, 203, -421, -185, 48, 216, -232, -177, 166, -76, -254, 71, 222, -17, -278, 190, -6, -123, 36, 271, 132, -90, -30, 411, 79, -116, 156, -60, -252, 156, 215, 205, 57, -268, 115, -42, -285, -67, 332, -84, -93, 171, 288, -78, -296, 78, 125, -175, 209, 118, 122, -297, 143, 494, -213, -95, 102, 421, -2, -150, -45, 245, -93, -96, -175, -90, -54, 94, 36, -30, -12, 195, 178, -85, -10, 194, 116, -45, 125, 55, -53, -43, -147, 302, -44, -97, 83, -100, -254, -130, 167, 73, -121, -105, 268, -222, -244, -142, 152, -77, -58, -126, 206, -30, -222, 208, 339, -100, -101, 197, -30, -298, 119, -47, 328, -87, 22, 162]
2765A62k96J13K41j25k96K19J62o8j20q2N4k1k87M86m30J27P1K81j10j35k3P6
2787aj5j31M31j43j85M5K59j10k88k0L07O9m08K06J57r1l08K12J71j00m34M47
2809G0K95m73J94p9J00l13rM91k21n2l6J92k63k01K54K11j94J2J42q0k76L13P8
2832A55r5k60N52k78q8l16N27n4k08Ml0J84j26l40O27l37k68N05P3l16j0K94K30
2855D25m06l1J62n8l97K09J80j3l13J79K58k07m9P1O0l0l51L95J0l39K4M91n28
2878b58R3L8L72o8k57L53k95k27J70L34j16n38Q9M64l15k69L45R3p7k12M49j36
2900C2j84j30N45n5n95K31L77k11j98J58K32k17j1J93P8k21m1J32r0k38r2L51
2922D6r3q7l9J12M6J7K88l35M6r9Q7Q2m6K92j29m30J70K3R4j97j73M67K4l29J16
$$ y = [162, -134, -21, 220, 95, -201, 18, 180, 112, -8, -90, -36, -57, -344, 142, -288, -161, -90, 191, 81, -54, -77, -1, -16, -147, 284, 141, -44, 1, 260, 150, -138, -158, 149, 218, -190, 16, 173, 82, -226, -14, 157, 57, -377, 70, 365, -108, 86, 7, 107, -206, -215, 276, 55, 3, -33, 159, -104, -305, -51, 160, -34, -22, 120, 40, -236, 77, 155, 60, -200, 352, 74, -14, -330, 197, 143, -65, -61, -91, 93, -33, -373, 254, -83, -351, 154, 227, -89, -99, 195, 425, 19, -12, 150, 92, -305, -96, 84, 71, -242, -63, 195, -12, -61, 10, 70, 40, -311, 84, 94, -245, -221, 270, -258, -165, -127, 245, 177, -80, 273, -22, -249, -79, 255, 139, -399, -310, 154, -161, -430, -85, 8, -69, -281, 168, 32, -152, -282, 263, 208, -387, -156, 221, 10, -188, -30, 202, -15, -26, 167, 245, 24, -17, 115, 25, -213, -305, 46, -47, -134, -173, -61, -15, 2, 290, -45, 1, -98, -11, 71, 25, 317, 188, -242, -72, -49, 45, -152, -325, 142, 166, -163, -47]
2947d7K12l31m0K4L27L3m16J12K95j31j90R8K06l79J81J66M82o22r8J78R6j66
2969a0J04O1m02Q2K74K39k96j85L57p3l09P7J78l9j90J68J26k44L3K13K0m11K05
2992b2L03j91k88K91J21j62k67J33L39l17q7K71L50n66Q3k15L74j99j15M59k29
3013F6j34K05j54m9J3K86m05p6N4J45k8J75k02O4J05j08k8n6j27J35L14k18q5
3036a08j17L48p2m2L3P3l25J09L01l00j47L65j06K6q6MJ38j6l29jL80k47N5r8
3060a62L97j76j42K51n8l35L6M03J08m30j32M55q3l31J52M5N6l5R2J05k36j32
3082a52L75k88J71j81K57m8K3k90K33l49R6J24m3RK9J96q5j95J59K05m2m66J55
3105a07M5k7J5J22K0j17j10L01o3l5j55L9L8M4R6M7r2j39N7j55k25M96j62J69
$$ y = [-47, 165, -166, -206, -182, 145, 178, -238, -126, 169, 38, -152, -54, 152, -227, -46, 120, 602, -20, -118, 60, 156, -10, 94, 155, -247, -165, 109, 348, 52, -133, 224, 151, -158, -81, 97, 58, -132, 36, 162, -82, -49, 164, 184, -227, -22, 281, 90, -198, 93, 214, 52, -215, -82, 257, -60, -147, 124, 474, -92, -9, -224, 150, -49, -164, 295, 66, -68, 137, -17, -66, -53, 233, -172, -248, -194, -49, -77, 98, -104, -40, 65, -43, -71, -127, -254, -119, 195, -23, -108, -225, 123, 51, 9, 42, 115, -210, -101, 200, -100, -247, 118, 12, 38, -48, -44, 94, 78, -251, -252, 128, -119, -64, -162, 235, 59, -83, 168, 110, -225, -189, 214, 322, -108, -240, 215, 132, -199, -47, -2, 54, 19, 111, 216, -20, -152, 223, -65, 106, -75, 182, 134, 157, -133, 100, -249, -153, -29, -72, -63, -34, 162, 77, -118, 41, 246, 204, -262, -107, -62, -89, -74, 48, 68, -49, -159, 142, 79, 44, -111, -72, -34, 10, 106, 153, 61, -78, -21, -176, -401, 95, -67, 102]
3129A02o3r8J1j38j29N52p3k15n3Q8J21j28j90M05q2l52K85J09m7m39L99J90j57
3152I8n9k46K06n3k21M55r5k1k24M44l62l26K11M55k67p0kJ41j07j13L30j43k78
3175b47L10o4J41R8k97J21k03R2O5Q2l19J72J81q4o5L2m8j0j24K51K14n26K4M38
3199B34j88r6O8J68m3l14L33j73K4j42P8J09p2k03N62l10l43L54j97J40R4JJ73
3222B57j66k27J43j29J13p8J36mj98m0J49p5r3J74J65j87J38P9j19j66j52M97
3244B17l39R9j95K17K7k39Q6K26j32%K44J23n69O6L42R8l57j11K88m5o5N4j4j18
3268i7o1J06K65j58j58K38j3J69j04j17M3k44K29R9k29k61J25K43K3r0K24j15
3290A17k0k21K85L1m16P3K85k03J50k11J29o4QL5Q5J37j59k1p0l6K34k61j27K80
$$ y = [102, 39, -59, -48, -186, -315, 237, 164, -51, -104, -16, 105, -23, -213, 192, 110, -242, 43, 152, 105, -334, 65, 255, 98, 39, -207, -1, -54, -275, 180, 85, 64, -160, 284, -78, -404, -193, 262, -5, -75, -77, 64, -43, -156, 174, 31, -247, 63, -1, 140, 238, -59, 62, -141, -49, 16, 98, -221, -49, 132, 48, -17, 15, -33, -43, -167, 84, 298, -228, -204, 234, 46, -50, 18, 186, 143, -171, 162, -11, 13, -129, -51, 58, -14, -217, 345, 35, -308, 46, -151, -11, 83, 84, 257, 91, -136, 7, -122, -9, -87, 49, 45, -153, -193, -44, -119, -212, -38, 127, -60, 78, 157, 38, -128, -280, 217, -122, -23, -218, -1, 26, -213, -127, 99, -33, -33, 211, 334, -235, -169, 173, 271, -86, -197, 91, 46, -19, 35, 21, -97, -158, -52, 213, 55, -103, 135, 122, 291, 187, 70, 113, -131, 98, 197, -32, -293, -168, 75, 98, 8, 232, 117, 97, -124, 161, 192, -224, -151, 134, -69, 81, -130, -1, -65, -57, -22, 63, 200, 41, 20, -50, -86, 148, -113, -240, 40]
3314D0J0K18l67o5K36O0k07r9J35J55l07K41K8k4j30J14j28j1n1J54K66k59j26
3337a17J88l6J8k1q8J34k32K03J02l76L16K16k48o0j44M17l71p1J16J4M6r3p5
3360a62L00m84L80O7Jk09j80L83J05l66Q7K97j09l63L51l9j12M3p0m5q6L04Q5
3383A78k61JJ82j78K34j74l00K85j9J8K0k81M60%R0k62j83J71M0r8n2K77j03m8
3407cj76L13q4k35J85K25j23P4j41J89j63l42J38L61j11k48J41pj21M8J14l9j63
3430a68J36Q9j78n2K75mn9R8L2l39K52k23N1L3J15j48J93l7o2O9j86Q2R3j3J69
3455B18k29j50L83l66J34O8k03j13J60J76qJ10l45M08j01k0j41J9J99l79J08M00
3477C28k14m33L56K5j59j71M46j41k55J70L36k22o7J89q3k42j17L27o8n5J17m9
$$ y = [40, 50, 268, -99, -164, 72, 132, -75, -174, -39, 116, -191, 50, 78, 54, -76, 38, -90, -101, -152, 2, 268, 9, -117, 71, 35, 53, 32, -56, 78, -154, 49, 151, -225, 91, 307, 59, -1, -145, 272, -99, -170, -54, -40, 6, -87, -162, 138, -346, 34, 101, 102, -107, -287, 96, 201, -165, -78, 219, 110, -253, 98, 59, -53, -10, -80, -125, -211, 93, 178, -83, -82, 100, -78, 156, -18, -318, -33, -52, -34, -14, -295, 165, 165, 255, -7, -190, -19, 21, -77, -129, 148, 45, -3, -179, 134, 50, -185, 0, 225, 102, 176, 35, 224, 61, -281, -143, 218, 107, -141, 0, -7, -128, -80, 34, -5, -168, -32, 57, -121, -173, 102, 98, 39, 137, 169, -170, 82, -141, -90, -57, 58, -90, 103, 66, 4, 73, -113, -31, 62, 49, 218, -11, -161, 222, -144, -10, 58, -145, -258, -98, 78, 70, 180, -165, 243, 142, 122, -19, 0, 199, -180, -72, 328, 114, -319, 37, 62, -97, -268, 178, 37, -218, -48, 288, 66, -1, 188, 105, -137, -254, 73, 5, -50, 67, 18]
3499A8j56j58L51j19n6K3PJ82k55jK37j24q8M9J06J67j63j77R0L3m8J55Q5Pm15
3524b50q8M25Q2j08J18o6o8N6o6p4j0R2J33k60J05k28L23r1l60O21j72k31n9J04
3548g2Q7k48N12q4j71r2m1m5j48J77O6K31k21j64K58j7l9q4O2J1R3J58j55j24
3572e0J23K10k57l57J55K09J89k57q7QK29j4l45J08O2j42J8J64O9jn0k0m6K48
3596A66j96p6j37M10l39J06m4K28k79L7J56j94O01n61j8J56J42l27M15j83q8j38
3618a63K58rj90O8MJ10l11J68J1K0n3L27q6k44j88R1K30o2q9M05k28j43J42J13
3642A81k14J79j53J60j94l6oo6j05J51o9QL74l40L67r5r6l1R0lj60K03J30n14
3666b39K33P2l4j14K07j02k26L8Q0J87j53Q7N8r0Q5k63J79R5r0J3O8j49n3L01
$$ y = [18, -138, -296, 55, -64, -120, -97, -90, 92, -163, -164, 73, -51, -139, -90, 16, 183, 20, -157, -67, -34, -82, 73, 158, 165, -250, -338, 87, 169, 61, 179, 113, 45, 101, 35, -39, -49, 43, 176, -84, 21, -207, 116, 25, -335, 286, 114, -117, -176, -72, 15, -233, 279, 195, 24, -68, -109, -154, -302, -125, -59, 172, -49, -213, 45, 28, -11, -95, -33, -22, 71, 229, 74, -50, 73, 283, 26, -331, -176, 33, 222, -35, -122, -114, 115, 101, -244, -136, -74, -216, -198, -34, 35, 34, -16, -36, -82, 166, -30, -106, -243, 167, -172, -66, -110, 118, -161, -124, 32, -162, 439, -122, -140, 16, 158, -169, 246, 63, -25, -163, 95, 86, -104, -36, -32, 78, -233, -65, -54, -34, -87, 240, 154, -90, -278, -187, 43, -19, -108, 297, 69, -74, 68, 181, -33, 146, -7, 153, -41, -77, -83, -149, -254, -103, -172, -164, 210, -130, 237, 142, 46, 15, 105, 102, -58, 145, 275, -239, -6, 66, 32, -82, 125, 23, -203, -165, -85, 102, -51, 36, 94, 4, 89, -174, 5, 100, 10, 23, 91, -58, -111, 190]
3690A90j90r2J90J09P2m98K4M40l10j8j96M77j98R6Mj54Om2J79N6k57J73L1n2
3714D0k16K24O5j98q4J47Q9j15q4J24O6j18j44L7J41J15j87J58Lj70L17k3k61
3737g4k7K80k78j90J06K8j30O22j91k69M03m46K77j84J1J38J3Nk13L15K6l15o9
3760a62K8K37r1k04J28P5l00q1M16j91R8k43L55J98l86k6K21j62R9J26K08l28
3782A5J3J37j34k15J65J53k72L97k73J19j77L7l4L12k98L5O7O1j83L00j32k46
3804a53J36j18O4o5J91o1o9J71k8p7k21J72K14J17l30k9K00o6p5K10j61L0p8m8
3828g4Q8J09QM6m2m8j26K09j59R3j9q6j29j26J79N05l92j57J77Q9kj96l9K32k15
3853g5O0M5J26k81J3L46j1k45k05L97k26L08k44J06k70m6M31j98Q2k32J33J53
$$ y = [190, 0, -92, 98, 207, 279, -219, -195, 245, -65, -83, -279, 198, 0, 96, 100, -54, -48, -90, 89, 145, -112, 61, 92, 40, -176, 48, 113, -85, -169, -22, 67, -48, -132, -8, 58, -60, -204, -167, -26, 89, -98, 60, 63, -107, 210, 187, -74, -101, 179, -99, -289, -183, -155, -285, 337, 146, -123, 280, -166, 111, -73, -62, 76, 89, 94, -119, 196, 222, -93, -162, -134, 103, 12, -192, -64, 11, -289, -370, 46, -145, -47, -290, 65, 263, -123, -149, 72, -90, 9, 135, 343, 15, 28, 165, 31, -184, -19, 134, -138, 259, -14, 105, -72, -35, -69, 243, -55, -20, 47, 108, -75, 225, 93, -153, -17, -135, -71, -136, 55, -6, -75, 96, 68, -9, -230, -58, 156, 273, -57, -86, 114, 48, -27, 183, 22, 52, -26, -74, 14, 123, 131, 177, 135, 87, -39, 170, 11, 104, 85, -1, -130, -256, -77, 428, 36, -121, 56, 145, 143, -53, -92, 140, -75, -15, 30, 156, -125, -112, 234, 223, -22, -227, 170, -56, 252, 8, 114, -156, -202, 229, 31, 113, -119, 14, 167]
3875A67ql99M93l19n3J06j45J02n4K51l14P0K0J99j93P5k33J78J88k30J28J36
3897A65m43J38J07Q3n9j34L98l50K60l27O9J54k19J76M6J63m95K96m0J11J59r4
3919A64m8n9r9J31q9q5K6J85k92R5L31j91m16K81M17l26l47M82j4r4j18J68l57
3942b55K02k5J60j57j3o0J19K17j88k40K25m0L3o5p8L49r8j9P7o2k92K87J09j26
3966F0j7l2j53P6J23p0J08R9k01J05j36J1q7K05L1l65N09k74j07J94j14P3j15
3989g7r2Oj05J25L11m02R7J40M9J54l11L46l74N3q2J44lk3K83j69oj47K76l76
4013a83N3J67P5k21K7r1R6k73L04kj0J83k11J50j41l7k7K39j67j6P9J85j07p4
4037bj05K47k06k3J03Q6k12j02K17k0P0k8j11k5J89j21J81m5m8l2j52j61L15P0
$$ y = [167, 159, -240, 253, -66, -119, -13, -158, -56, -110, 141, -173, -103, -83, 116, -77, -2, -235, -57, 131, -99, 29, 165, -278, -140, -33, 50, -9, -143, 255, -95, 165, -162, -93, 61, -158, 18, 64, 227, -268, 28, -12, 99, 258, 164, 116, 57, -42, 89, 0, -85, -59, 126, -166, -71, 260, 69, -347, -66, 351, 25, -322, 160, 146, 52, -66, 102, -255, -53, -78, 82, -75, -88, -148, -29, 188, 0, -240, -15, -55, -22, -87, -165, 184, 86, 67, 144, 82, -210, 77, 186, 60, 43, 11, -142, -66, 57, -13, 95, 194, -7, 98, -38, -27, -114, 91, 122, -243, 266, -8, -115, 79, -35, 38, -77, -169, -163, -268, -143, 168, -234, -137, 3, 52, 206, -105, 241, -133, -80, -162, -18, -21, -44, 239, 70, 64, -83, 193, -183, -130, 37, 112, -109, -82, -173, -77, -350, -46, -48, -58, 125, -86, 64, -77, -114, -141, 98, -69, -85, -6, 179, 72, -2, -107, 140, -66, -89, 14, 100, -112, -214, 3, -17, 53, 25, -86, -111, 78, -43, 138, 93, 45, 13, -139, -300, 15, 85]
4061H5M7k22J20j10k4J47J50K2l76K55j2l60K74j9N3k15J14q7J46j33J01N1J05
4084A12k96O3N15l65j01M0RL6l7NJ67o2j88O5N0M8j98J44L0o5r5k5J41J3o5L42
4110B83L3m21J38m28K33K40J08j61j07J7q2M89k91k26J05p2J01L43k03M5j96k9
4132h1J07M8j34N8J47m16K97K5J18j47O9J65k53j37J8K40l35J88J98j03L5l84
4154b77RM26l41L35j9j07q7K27k73K17j07K1k03J77j48K34Rl11L47Q0j43k28K45
4177H3p4k9J62r7nj69J10K29k69pk81L77K95m14k5k4O2P5j56K13k7q6L4J35m25
4202c13M16j28j40J87k23M43j88K8l54M53jl19J13K64k65R6Ok40k8J90M4L1p3
4225aJ48j42j50K9r5J75k09M4L83O4k49k7K35l65L71k19k8n4r2K38k76K29k21
$$ y = [85, 132, -90, 30, -80, -104, 43, 193, 215, -161, 94, 82, -278, -4, -23, 30, -185, -71, -158, -12, -145, -44, 7, 112, -184, -121, 394, 29, -72, -32, -23, 13, -24, -19, 148, 86, -102, -37, 13, 61, -137, 7, 37, -28, -123, -148, -7, 6, -59, 283, 316, -105, 33, -395, -162, 78, 186, 25, -82, -65, -147, 342, 51, -175, -70, -142, -41, 302, 99, 144, -52, -81, 26, 74, -60, -2, 145, -271, 26, 51, 169, 22, 91, 256, 3, -134, -116, 124, -211, -23, 175, 72, 107, -277, -268, 158, -183, 152, 133, 26, -61, 166, -107, 110, 3, 24, -179, -2, -150, 84, 93, -218, 129, 209, 66, -162, 83, 9, -20, 142, 45, 40, -129, -19, 210, -59, -66, -347, 30, 325, -89, -114, -138, -76, -1, -157, 56, 29, -57, -23, 112, -313, 103, -25, -165, 22, -201, 242, 54, 82, -272, 181, 180, -139, -26, 238, -27, 69, 75, -165, -193, -3, 41, 72, -1, 147, 5, -145, -116, -211, -36, -245, -201, 182, 246, -3, -30, 205, -160, 211, -8, -36, -90, -182, 56, -220, 9, -212]
4248b12K32o8Q7oJ61k99P7j76K53J1j59J80j60n7j19K87R0k97L30k50J2K31N2
4271B00k2k99N1K21p3l67L32n0J36o5j38J77r2l3j02k78N25j9l4J11q6j79N2O
4295b6K6o0K6J6l04N3L22Q5n8j5K32m42J40J53j93J14K02j72j92J79j63P9o2K70
4319B10l27L57j03j46j43L90k35j33j42M53m41oJ73K6K06Q2l45j0L1N5L86l81
4341d3N0K78j99l23N13k73J49l01%M28m98J67j38R9k29L44p6J48n9o7R3k26J81
4364A8nN7k7j79J94j38J31M8p3k24Q4R8K1J31j67K07j87k13L67J09j85j4m1J36
4388A48m09L74k16O2M31n07J67Q8k81K38j2K26j13l36J98lp3K86j29l47M97k90
4410ar1J89l4P0p5j36J97j56p5N0MK43k84n7J40r5P2j34r2P59m73J14j79R7q6
$$ y = [-212, 20, -48, 39, 33, 194, -105, -28, -204, 49, 60, -99, 81, -79, -136, -255, 32, 122, -175, 155, -95, -83, 148, 200, 178, -121, -70, 151, 78, -289, 43, -7, 129, 64, -74, 103, 11, -22, -124, -402, 123, 104, 70, 181, 95, -84, -32, -26, 0, -60, -34, -18, -322, -269, 53, 138, 80, 65, 297, -145, -5, 148, -45, 69, 271, 99, -93, 86, -77, 2, -60, 210, -117, 240, 137, -9, -152, 238, 3, -130, -272, 181, -260, -266, -93, -67, 139, 221, -124, -134, -103, -48, 338, -43, 7, 285, 86, -237, 276, 3, 152, -149, -149, 279, -219, -52, -190, -91, -320, 24, -52, 96, 37, -30, 63, -163, 18, 13, 70, 43, -136, 58, -80, 51, 99, 26, -198, -114, -16, 5, 136, -31, 176, -11, -224, 143, 252, 67, 53, 12, 148, -261, 113, -103, -41, 390, -117, 50, 138, -143, 95, 83, 309, 196, -140, 58, 55, -18, 268, 139, -208, 289, -1, -92, 97, 63, 133, 58, -78, 119, -37, -112, -62, -58, 185, -99, -156, -16, -111, -39, -173, -265, 494, 21, 135, -44, 53, -33]
4435c3J76k23O9k29J08J02Q6R1k52P9J7n0R5l15L53r1j29J85j66o9L22k58K29
4458I7K0k00K94j48k04K5l1qJ06K66j07Q1j43m59M65j2k29Q4j5R9K19k99M2j38
4482a95J05J81m3k37K0K71R7k32J66l6K6j18j61J71L8J17k81J01L01m51L24j51
4504A3j85k98O57k73Q0L6M9j68J45q0j85J15J1J28J06j78k3K86m31J90J1rK56
4527B53j68l17K85j27r2K55o1n4j51L76o7j34m5j67L40p9l7j08NP4j76N6L97j85
4551G3k89K70k70l8K29L04l55j05M74j38k46M0O8J30j11R4n4l13K12k51K26k0
4573g0n0N0J98k73L8J50n8j39l6K38j72K71M0j58L0J21o1j17K10J9j83j35k1K70
4597A62j55n7J6k7Q7Q3j30K62l49k85K57K82J36k26j24J21r2J43k58j00L91k66
$$ y = [-33, 143, -80, -11, -240, -132, -30, 56, 147, -105, -26, -9, -59, 36, -279, 74, -17, -146, 39, -127, -196, 126, -132, 97, 117, -83, 211, 63, -141, -116, -147, -155, -49, 217, 110, 191, 48, -411, 54, 42, -187, -103, -118, -19, 200, -99, -57, -195, -90, 91, 48, -189, -169, 102, 199, -33, 133, 97, 123, 5, -156, 15, 53, 170, -111, -10, 291, -160, 164, 13, -172, -470, 187, -86, -6, 30, 79, -89, 56, -24, -209, -94, -83, 45, 151, -27, -50, 236, -195, -5, 6, -3, 253, 85, -232, 53, -74, -166, 89, 28, -26, -177, 199, 132, -2, -47, -214, 126, 47, 10, -98, -93, -19, -195, -139, 258, 73, -216, 54, -216, -254, -25, 279, -76, -181, 293, 155, -91, -51, 17, 147, 36, 130, 76, -237, -25, -276, -50, -70, -120, -70, 128, -145, -107, 43, -15, -154, -190, 48, -124, 147, 187, 29, 59, 180, 119, 2, 212, 231, 48, -87, -108, 162, 7, -50, -34, -61, 26, 109, -21, 241, -108, -393, -136, 146, 282, 56, -68, 53, -39, 104, -154, -254, 137, -129]
4619a29K29r7KJ90k80p5K28l09J60J58l72L26j26o5J32J2j1j54L07N1q3j87O1
4642c2J74j02r9K00p1o4j95L45j58J52l7k10K27k75J63r4J15r2j05Q7K31m63K19
4665h4q0L40k22M8k0k83K6K03J28K46m02o0l9J01J68j98Q1K5j35L75m28M65k46
4688IN2j9q0k17K6L78k15m0m3K09j10K1K5J84j23j42K15l15K69k11l8K43mr8J95
4713A71m20k2O3J15J9m6R6n6k4K22m20K45P3k87J50k22K47N6p9L41k54k53J35
4736a50j0j9J80k01M0P4K06j15K67l91J71Rk14O1k25L62k62J70L9j13R6K9R4j2
4760H6j46l8O6K61k76j8o2J15J55r7j04J24J25j54l23K3K68p5J14m9J64j91j49
4783a81L07%N8j41M7j83LQ6N2p3Q7j04K50k64M7M9o6M10l51R9k92J61J81j90m6
$$ y = [-129, 100, 3, 5, 195, -85, -160, 68, -241, -81, 77, -295, 31, -95, -160, -28, -16, -27, -181, 126, 177, 94, -93, -32, 142, 40, -59, 141, 70, 6, -189, 156, -2, 150, 113, -97, 130, -145, 18, -76, 39, -53, -158, -71, 160, -303, -84, -164, 176, -46, 2, -18, -301, -275, -72, 56, 302, -100, -160, -199, -98, 70, -128, -47, -22, -157, 218, -210, 255, 9, 61, 42, -38, -255, -229, 149, -66, -106, -149, 60, -50, -29, -4, 180, 57, -85, 130, -185, 84, -127, -165, 78, 74, -24, 171, -249, -271, -208, -93, -74, -120, -24, -80, -104, 118, -302, -57, 16, -271, -121, -343, -96, -40, -119, 222, -32, -285, -150, -160, -179, 1, -200, -160, -86, 120, 5, 272, -119, 52, 61, -153, -92, -317, 45, -217, -47, -8, -121, -25, 4, 98, 86, -60, -98, -32, 229, -47, -65, -127, -12, 143, 46, -58, 66, 191, 37, -286, -263, 5, -70, 44, -5, 159, -32, -181, 126, 126, 184, 43, 90, -93, -90, -4, 48, -25, 62, -42, 208, -56, -9, 40, -26, 384, 33, 132, -160, 1, 182, -8, -54]
4808e4J96j32n8R3n4M1j63J28J72l38L2J50j95J49O2J11j83L1J59k80K14l08K26
4831am6M9R5p2j3K1j09J12r8j56N7J85l7j11J71j62J83L8k61r3L07l03K08j25
4855a61J87l9l36M36l06JK90j0k1J07l52M24k16l34M10j66K5P4L52m12k19L39
4877G3o2M8RK03m47N4J72j63J35LK05j51K1j02L38l36j45K83m3L3J2K5k79J92
4901G8P4k21l9k10K33J76JP6l38K42k4k8K7J8M0r7JK22j17j74k41K64L3K6O2j13
4927b9l1j9N0k38J70J7o6KJ92k58L29Nq5k2p1J86k19O1J21j9p3Q6L23j76l66K98
4953A68l76L17k71Rl5m4K41P6o3j58K52r1j94J12M4K79k14l51K40J46l50J24M56
4976C17l52O6O6j98J88J1j27J32l2j55J81J65l91K08r6k0J38j46J49n7K1K54j19
$$ y = [-54, 142, 10, -48, 45, -9, 32, -131, -3, 169, -169, -137, 13, -182, -33, 29, 140, -43, -12, 147, -133, 81, -227, -1, -47, 2, 97, 25, 12, 33, -76, 36, -62, -218, -161, 24, -13, -124, 47, -115, 68, 106, -155, -248, 59, -244, -36, -161, 26, -13, -349, 87, -219, -218, 72, 62, 41, 148, -204, 220, 4, -330, 80, -86, -61, 13, 365, -47, -266, 73, 11, 59, 68, 271, -176, -122, 50, -113, 22, 25, 230, 79, 100, -2, 336, 0, -145, 138, 95, 128, 140, 165, -114, 78, 152, -69, -108, -318, -85, 91, 92, 168, -170, 72, 48, 20, 47, 65, 105, 8, 9, 231, 114, -60, -301, -37, -4, 22, 84, -29, -60, -79, -29, -267, -97, -80, -146, -144, 48, -210, 119, 124, 39, 17, -54, 132, -87, -26, 95, 76, 3, 89, 412, 236, -130, 168, -208, 109, -162, -153, -188, -232, 9, 85, 22, -136, 116, 25, -169, -57, -13, 266, 52, -299, -59, 87, -263, -139, 317, -35, 31, 97, -101, 87, 98, -29, 103, 71, -84, 97, 262, -129, 79, -17, -37, 101, -45, 104, 47, 68, 322, 203]
4999B03l64K87k64L87n42K37R0k94L67j30O9J11k42L31o6k83J46J82l11k98M06
5020B2J61m09J52K62m1j94l3J64K0j72k66L04m0m2J1J5J34k29P6q0J91po4R8k26
5045a93M66j85J25l67J98K29p1k09J85j73J92k43K47k50m7p6K51J7K7j51k2K72
5067B22k39Q4k3j56J38J95j82O0k66L18k93K55k79K81k17J33k4L19j86q2q7l6
5089f5j39L17k40O3P6p8l3K22M2J03j00p06O14r2L77n01mK22j08r1J65k83K56
5112A7J23k87J81N4N5M0j34j13j6J15m0k47M90J28l20j88J25J13j56J20j45m8
5134a33L09j55M8q7j02M9K0Lj9j47J45Jr2N8L06k69r9M33l07J49k52L28l01N7
5158e7J91r8n7N1K39k16m3k09L97q4j3n9R0Pq2J19l51M4J68l6k05K63N7j39J9
$$ y = [203, -161, 126, -138, 249, -293, -56, 34, -260, 107, -23, 46, 157, -85, 246, 180, -103, 43, 225, -86, -384, 22, 183, -226, -74, 188, 147, -47, -80, 84, 104, -68, -334, -30, -70, -112, -101, -86, 48, -181, -105, -185, 6, -1, -65, 33, -193, 273, 88, 213, -154, 44, 273, 202, -7, 178, 5, 197, -46, 201, -49, -96, -172, 79, 96, 123, -28, -50, 222, -17, 67, 44, -112, 26, 221, 39, 99, -167, 151, -142, 113, -166, 115, -102, 31, 7, 326, 140, 58, -29, -65, -204, 113, -127, -64, 12, -66, -99, 123, 165, 268, 168, -538, 76, -16, 361, -140, -144, 78, -30, -121, 44, -239, 17, 140, -147, 34, 88, 143, 183, 49, -64, -80, 35, -5, -252, 238, 366, 46, -142, -17, 96, -60, 60, -85, -133, 176, 21, 69, -18, -120, -71, -51, -48, -67, -214, -69, -68, -160, -102, 204, -65, -164, 269, -38, 111, -141, 187, -114, -57, 134, 36, -21, 30, 269, 53, 10, -199, 198, 114, 101, 42, 132, 139, 57, 176, -175, -131, 37, 1, -204, 59, 116, -23, -4]
5183dK53l52L4J93j30j02n0K32J14l46Q1L86m62M23o8l45M1R7n9K23l61N7L7K27
5207A19k09P1L37l16J10r1Q8k77K74j49j3L33k75k13J52K20k7k77K3l3kL4K37
5230A16k9k61R0J00k07J42kL3n4n4j75M25l85J77K27j65K36n11J82P1J8j23J50
5253AJ32j41j7J10k04l1oj04L13O1nk59J55l10M92k56L19j65j88j55K9L27J29
5276B27l29m0K88M2l55M0L20o3j50j47L19l50M5J70J43k17j77N65l66Kq9K27k02
5299i7k87N07j39P0J07j70K8J87p7j53L8j00J37j44J03j7j33K7K03q0j90M3K27
5322I0k94J09K50j66j63n5P0L8K9J94j79L0J34P1p5N2j29QR3m66J53M3J13j11
5346a61L1J74j66K22R5j52K6o5R7o7M%K60k68N6j50k45K44K7o2M41k80l43L41
$$ y = [-4, 249, -103, -69, 124, -6, -108, -158, 74, 188, -158, -77, 309, -153, 270, 202, -143, -102, -5, -64, 159, -202, -145, -108, 119, -90, -19, 318, 2, 112, 21, 109, -168, 106, -43, -56, 277, 2, -211, -59, 161, 134, -143, -120, -153, -155, -121, 116, 87, -174, -84, 16, -191, -49, -51, -18, -72, -126, -301, 124, -261, -84, 143, -22, 214, -297, -115, -44, -26, -149, 1, 133, -8, -25, 85, -119, -150, -156, -260, 53, 114, 109, -150, 5, -305, 187, -69, 250, 85, -103, -258, -229, 98, 227, -102, -142, 146, 188, -167, -127, 193, 130, -20, -167, 152, -198, -153, 17, 160, -57, -234, 331, -35, -33, -122, 105, -97, -384, 123, -16, 54, 161, -9, 19, 206, 129, -24, 14, -86, 51, -93, 10, -7, -140, -113, 90, 10, -180, -137, 90, -204, -95, 155, -11, -174, -229, -159, -121, -92, 102, -77, -47, 87, 158, 83, 135, 6, 14, 107, -359, -206, -163, -50, -161, -130, 44, -122, 100, 195, 43, 69, 4, 101, 34, 38, 38, 298, 30, 86, -64, -309, -65, -38, -100, 341, 61, -282, 59]
5370E9j40Q3j40L5J42%k0P9j84M2L44l39R8m11N16K00n44J99J94l37J20J98j14
5393H0j31l3LJ4n5M9K33j48r7k40K60J46p4J85k51K0l9j19K42L2j97M3J0j52J11
5418a08J51l67N0L30R6j24j62K04l4r0q5L39k19J53k44J74q4r8m5j61M30r4k7
5441a5j19M23j67j09kL8q8K06r4k05o4O06n22J0J44j95P5L59l06N2m6M7P4j41
5465c9j18N0L03l00K30rk78O6J96O7j61K7j46J63p4k32K19J32k29J9m0K59l28
5488b23N2l1Q9n3JJ36k58J80J20n6mKJ57m1l29J86R3J65J17k73j33o5J85J07q1
5513D3J79k75M45m37J17l81L24n9j12J95j96K50l28J53j08J92Mk03K28k16J49
5534c6J38J1k42J8n2P5J98r2K4n1J02J19Oj76J97l35O6j03K58j29p7M1N7j5l19
$$ y = [59, -81, 2, -138, -103, 39, 39, 19, 98, -86, -44, 300, -39, 59, -352, 164, 364, -180, 19, 213, -124, -4, 194, 80, -51, -84, -81, -67, -122, -73, 160, 12, -85, -325, -65, 81, 7, 192, -59, -39, -78, -197, 45, 77, -120, -77, -67, -219, -108, 43, -324, -274, 56, 152, 28, -134, 70, 36, -54, -139, 200, -19, 134, -110, 64, -20, -118, -163, -324, 106, 12, -15, -134, 289, 122, 13, 11, 49, -39, 167, 73, -132, -196, 410, -112, -102, 42, -153, -78, 281, -25, 27, -19, 28, 102, -39, -157, -107, 196, -104, 126, 117, -161, -95, 101, 168, 7, 34, -112, 51, -23, -255, -36, 96, -133, -114, -154, 105, -223, -171, -202, -113, -166, -165, -29, -287, -107, 13, -43, -47, -45, 112, 71, -258, -72, 21, 186, 303, 30, -103, -168, 17, 124, 43, 222, -53, 392, -45, 72, -309, 15, -44, -156, 39, -157, 93, -235, -82, -190, 2, 6, -197, 31, -185, -36, 102, 113, -129, -111, -163, -88, 110, 18, 42, -9, 93, 212, 218, 42, 239, -96, -30, -133, 125, -4, -81, -40, 17, 2, -317]
5559c17Q7K10J54j53K12j70j71P6J75j94N3k05K29J88l23J51l25M49r8J40l48
5580a80J99p9j05K29k5pj61L06l0j31m6K09l00J20k36K05m4r6K66j22j29R8p4
5603a33L09k25M2j30M6K92k78K19k40L40j63K12m50J38q0K11l18m1M06J79l61
5624b5J15j70J38J99l30J37j91K23j90J22m0k8j17J52Pk4k95K84J39r5j71L7K43
5647A20j1j58Jk61L61k14L57j8k9j91j21J15J13Mkj82j14K25R7K94l48k20M4J07
5671c1O6o1o4K48j91J94J1l80M56k49k05J67K24m05K89k8r7K26j56l8O2J88l64
5694a38%J54q7K45k65M8O5r6RP9%n18L99J72k03J40O0L3J25m42L29m2j25O3J42
5719A47L3j14j1j56L9k34K56j52m6K27j10J59J24k79L5q6J85K3j76K1J59j22K0
$$ y = [-317, -230, -20, 134, -19, 193, 23, -148, -72, 103, -91, -38, -243, -14, 174, -149, 2, -323, 126, 28, 168, -180, 19, -60, -165, 64, 39, 32, -129, 177, 147, 16, -30, 179, -121, -1, -237, -32, -76, -172, 94, -28, -157, -59, -133, 176, -49, -7, -137, -91, 201, -77, 142, -98, 242, 79, 291, -159, -21, -101, 110, -208, -249, 157, 336, -25, 90, -80, 58, 257, -73, 64, -127, 96, -94, 28, -12, -40, -157, -5, 2, -22, -317, -33, 106, 11, -160, -123, 120, 109, -49, -48, -309, 52, -162, 195, 177, 148, -43, -164, -49, 64, 68, 66, -116, -230, -5, 92, 386, 38, -182, -138, -31, 35, -26, -90, 158, -33, 161, 172, -208, 248, -1, -206, -39, 185, -220, 69, 41, -56, 170, 14, -24, 38, 226, -138, -138, 16, -71, 174, -91, -43, 22, -74, -65, 14, 14, -504, -105, 67, -136, 4, 64, 97, 222, -220, 109, 67, -58, 5, 147, 180, 66, 55, -101, -62, -296, -40, -192, -238, -11, -121, 38, 162, -117, -82, -168, 17, 40, -136, -115, 44, -78, -58]
5742e8R0j84K31j9L5P2k73J13j24Ql0L11m3j57K62l63M1R8M6j28K74q2j69J17
5766F8R5j22q6M2P9j70k6M0J11j29K27k6j34n1J81Q1l22K31R7k0k35J9K57j10
5790I7J29l15K01k4j76J48L06m85J55K36j96J40k86Q8j08K40n7mj49RK02j43J39
5813A47k30n7K71j62QJ7j04N6M2k34M67l84L47k74K08P4m6Q1K7m50L0J01J58M7
5837A40l40Q5J85j32j57K85k7N3j10l2J66j56J9J02o0j74K82k59J4K42k74P6J86
5860A14J35j25r1J23j6n7k59L46l02O3p0j04K58PL6J73l67k1rJ85j56K73M1k38
5884f1O2j75Q3J37j47J46j61n4J07K20k42K05j28r2K38n4k33K12k93J31j16K01
5906a4J32k45K47N6j08j13k21N14k70L08j98r1J16j71K58j12l52K28o2J74n5j97
$$ y = [-58, 32, -152, 79, 60, 95, 167, -106, 7, -117, -109, -139, 172, 129, -28, 234, -129, -88, 10, 56, -72, 202, 120, -49, 68, 163, 41, -45, -3, 76, -94, -120, -80, 31, -98, 129, 103, -31, -82, 99, 180, -142, 89, 186, 166, -69, -50, 207, 97, 226, -89, 112, 88, -88, 60, 366, -119, 36, 272, 76, 216, -70, 18, -90, 150, 93, 89, -60, -51, 151, 8, 147, -83, -140, 131, -31, -23, -6, -110, -54, -12, -246, 221, -163, 184, -90, 118, 192, 146, 227, 254, -196, -166, -65, 93, 140, -200, -115, 70, -62, -219, 66, 39, 92, -18, -50, 116, -40, -21, 81, 21, -153, 129, -130, -116, 126, -148, -72, 114, 249, 124, 33, 156, 140, 83, -176, 170, -132, -69, -139, -243, 15, 22, 58, 231, -136, -157, -166, 19, -137, 136, 177, -61, 1, -174, -91, 46, -101, 45, -116, -170, -63, 157, -85, 120, -8, -100, 138, 84, -149, 63, -230, -99, -215, -14, 118, -127, 120, 176, 68, -45, -266, 248, -22, 286, 88, -3, 113, -58, 200, 88, -264, -36, -98, 76, 21, -176]
$$ [...]
8191H
##END NTUPLES=NMR FID
##END=
