##TITLE=1H_LO3-5488m
 CDCl3,8 sc, 
 30.03.2021
##JCAMPDX= 6.0         $$ Bruker NMR JCAMP-DX V2.0
##DATA TYPE= NMR FID
##DATA CLASS= NTUPLES
##ORIGIN= UXNMR, Bruker Analytische Messtechnik GmbH
##OWNER= root
$$ XWIN-NMR		Version 3.5
$$ Tue Mar 30 12:41:25 2021 Russian Standard Time (UT+4h)  she@DPX200
##.OBSERVE FREQUENCY= 200.131506
##.OBSERVE NUCLEUS= ^1H
##.DELAY= (6, 6)
##.ACQUISITION MODE= SIMULTANEOUS
##.ACQUISITION SCHEME= undefined
##.AVERAGES= 8
##.DIGITISER RES= 18
##SPECTROMETER/DATA SYSTEM= spect
##.PULSE SEQUENCE= zg30
##.SOLVENT NAME= CDCl3
##.SHIFT REFERENCE= (INTERNAL, CDCl3, 0, 15.7039)
##AUDIT TRAIL= $$ (NUMBER, WHEN, WHO, WHERE, WHAT)
$$ ##TITLE= Audit trail, XWIN-NMR		Version 3.5
$$ ##JCAMPDX= 5.01
$$ ##ORIGIN= Bruker BioSpin GmbH
$$ ##OWNER= she
$$ F:/spectra/data/she/nmr/H-F/1/audita.txt
$$ ##AUDIT TRAIL=  $$ (NUMBER, WHEN, WHO, WHERE, WHAT)
(   1,<2021-03-30 12:40:23.59 +0400>,<she>,<DPX200>,
      <created by zg, POWCHK disabled, PULCHK disabled
       configuration hash MD5:
       00 E9 B6 7A A2 85 ED C7 34 08 36 98 17 FE 4E 26
       data hash MD5: 16K
       61 84 4E E6 98 62 FC 42 DD D6 1E 3D 53 E2 63 D9>)
$$ ##END=
$$ 
$$ hash MD5
$$ C4 03 09 2D D6 1F FE E6 28 4C A1 D8 64 E6 3D AB
##$RELAX= 
##$RELAX= 
##$RELAX= 
##$RELAX= 
##$RELAX= 
##$RELAX= 
$$ Bruker specific parameters
$$ --------------------------
##$DU= <F:/spectra>
##$EXPNO= 1
##$NAME= <H-F>
##$PROCNO= 1
##$TYPE= <nmr>
##$USER= <she>
##$AMP= (0..31)
100 100 100 100 100 100 100 100 100 100 100 100 100 100 100 100 100 100 
100 100 100 100 100 100 100 100 100 100 100 100 100 100 
##$AQSEQ= 0
##$AQ_mod= 1
##$AUNM= <au_zg>
##$AUTOPOS= <>
##$BF1= 200.13
##$BF2= 200.13
##$BF3= 200.13
##$BF4= 200.13
##$BF5= 200.13
##$BF6= 200.13
##$BF7= 200.13
##$BF8= 200.13
##$BYTORDA= 1
##$CFDGTYP= 0
##$CFRGTYP= 5
##$CHEMSTR= <none>
##$CNST= (0..31)
1 1 145 1 1 1 1 1 1 1 1 1 1 1 1 1 1 1 1 1 1 1 1 1 1 1 1 1 1 1 1 1 
##$CPDPRG= <>
##$CPDPRG1= <>
##$CPDPRG2= <>
##$CPDPRG3= <>
##$CPDPRG4= <mlev>
##$CPDPRG5= <mlev>
##$CPDPRG6= <mlev>
##$CPDPRG7= <mlev>
##$CPDPRG8= <mlev>
##$CPDPRGB= <>
##$CPDPRGT= <>
##$D= (0..31)
0 1.2 0 0 0 0 0 0 0 0.06 0 0.03 0 0 0 0 0.0002 0 0 0 0 0 0 0 0 0 0 0 0 
0 0 0 
##$DATE= 1617093623
##$DBL= (0..7)
120 120 120 120 120 120 120 120 
##$DBP= (0..7)
150 150 150 150 150 150 150 150 
##$DBP07= 0
##$DBPNAM0= <>
##$DBPNAM1= <>
##$DBPNAM2= <>
##$DBPNAM3= <>
##$DBPNAM4= <>
##$DBPNAM5= <>
##$DBPNAM6= <>
##$DBPNAM7= <>
##$DBPOAL= (0..7)
0.5 0.5 0.5 0.5 0.5 0.5 0.5 0.5 
##$DBPOFFS= (0..7)
0 0 0 0 0 0 0 0 
##$DE= 6
##$DECBNUC= <off>
##$DECIM= 32
##$DECNUC= <off>
##$DECSTAT= 4
##$DIGMOD= 1
##$DIGTYP= 9
##$DL= (0..7)
0 120 120 120 120 120 120 120 
##$DP= (0..7)
150 150 150 150 150 150 150 150 
##$DP07= 0
##$DPNAME0= <>
##$DPNAME1= <>
##$DPNAME2= <>
##$DPNAME3= <>
##$DPNAME4= <>
##$DPNAME5= <>
##$DPNAME6= <>
##$DPNAME7= <>
##$DPOAL= (0..7)
0.5 0.5 0.5 0.5 0.5 0.5 0.5 0.5 
##$DPOFFS= (0..7)
0 0 0 0 0 0 0 0 
##$DQDMODE= 0
##$DR= 18
##$DS= 0
##$DSLIST= <SSSSSSSSSSSSSSS>
$$ [...]
##$SUBNAM2= <"">
##$SUBNAM3= <"">
##$SUBNAM4= <"">
##$SUBNAM5= <"">
##$SUBNAM6= <"">
##$SUBNAM7= <"">
##$SUBNAM8= <"">
##$SUBNAM9= <"">
##$SW= 16.9725357007746
##$SWIBOX= (0..15)
0 0 2 0 0 0 0 0 0 0 0 0 0 0 0 0 
##$SW_h= 3396.73913043478
##$TD= 16384
##$TD0= 1
##$TE= 0
##$TE2= 300
##$TE3= 300
##$TEG= 300
##$TL= (0..7)
0 120 120 120 120 120 120 120 
##$TP= (0..7)
150 150 150 150 150 150 150 150 
##$TP07= 0
##$TPNAME0= <>
##$TPNAME1= <>
##$TPNAME2= <>
##$TPNAME3= <>
##$TPNAME4= <>
##$TPNAME5= <>
##$TPNAME6= <>
##$TPNAME7= <>
##$TPOAL= (0..7)
0.5 0.5 0.5 0.5 0.5 0.5 0.5 0.5 
##$TPOFFS= (0..7)
0 0 0 0 0 0 0 0 
##$TUNHIN= 0
##$TUNHOUT= 0
##$TUNXOUT= 0
##$USERA1= <user>
##$USERA2= <user>
##$USERA3= <user>
##$USERA4= <user>
##$USERA5= <user>
##$V9= 5
##$VALIST= <valist>
##$VCLIST= <CCCCCCCCCCCCCCC>
##$VD= 0
##$VDLIST= <DDDDDDDDDDDDDDD>
##$VPLIST= <PPPPPPPPPPPPPPP>
##$VTLIST= <TTTTTTTTTTTTTTT>
##$WBST= 1024
##$WBSW= 4
##$XGAIN= (0..3)
0 0 0 0 
##$XL= 0
##$YL= 0
##$YMAX_a= 53960
##$YMIN_a= -36723
##$ZGOPTNS= <>
##$ZL1= 120
##$ZL2= 120
##$ZL3= 120
##$ZL4= 120
##$ABSF1= 10
##$ABSF2= 0
##$ABSG= 5
##$ABSL= 3
##$ALPHA= 0
##$AQORDER= 0
##$ASSFAC= 0
##$ASSFACI= 0
##$ASSFACX= 0
##$ASSWID= 0
##$AUNMP= <proc_1d>
##$AZFE= 0.1
##$AZFW= 0.1
##$BCFW= 1
##$BC_mod= 2
##$BYTORDP= 1
##$COROFFS= 0
##$CY= 11.3945322036743
##$DATMOD= 1
##$DC= 2
##$DFILT= <>
##$DTYPP= 0
##$F1P= 15.9154993809931
##$F2P= -4.1035820241983
##$FCOR= 0.5
##$FTSIZE= 0
##$FT_mod= 4
##$GAMMA= 1
##$GB= 0.15
##$INTBC= 1
##$INTSCL= 1
##$ISEN= 128
##$LB= 0.24
##$LEV0= 0
##$LPBIN= 0
##$MAXI= 10000
##$MC2= 0
##$MEAN= 0
##$ME_mod= 0
##$MI= 1.114404
##$NCOEF= 0
##$NC_proc= 0
##$NLEV= 6
##$NOISF1= 3.799351
##$NOISF2= 2.8
##$NSP= 1
##$NTH_PI= 0
##$NZP= 0
##$OFFSET= 15.70392
##$PC= 1
##$PHC0= -11131.93
##$PHC1= 32.40094
##$PH_mod= 1
##$PKNL= yes
##$PPARMOD= 0
##$PSCAL= 0
##$PSIGN= 0
##$REVERSE= no
##$SF= 200.130013532006
##$SI= 16384
##$SIGF1= 3
##$SIGF2= 2
##$SINO= 400
##$SIOLD= 16384
##$SREGLST= <1H.CDCl3>
##$SSB= 0
##$STSI= 0
##$STSR= 0
##$SW_p= 3612.71676300578
##$SYMM= 0
##$S_DEV= 0
##$TDeff= 0
##$TDoff= 0
##$TI= <>
##$TILT= no
##$TM1= 0
##$TM2= 0
##$TOPLEV= 0
##$USERP1= <user>
##$USERP2= <user>
##$USERP3= <user>
##$USERP4= <user>
##$USERP5= <user>
##$WDW= 1
##$XDIM= 8192
##$YMAX_p= 0
##$YMIN_p= 0
$$ End of Bruker specific parameters
$$ ---------------------------------
##NTUPLES= NMR FID
##VAR_NAME=  TIME,          FID/REAL,        FID/IMAG
##SYMBOL=    X,             R,               I
##VAR_TYPE=  INDEPENDENT,   DEPENDENT,       DEPENDENT
##VAR_FORM=  AFFN,          ASDF,            ASDF
##VAR_DIM=   8192,          8192,            8192
##UNITS=     SECONDS,       ARBITRARY UNITS, ARBITRARY UNITS
##FACTOR=    0.0002944,     1,               1
##FIRST=     0,             0,               0
##LAST=      2.4114304,     0,               0
##MIN=       0,             -36723,          0
##MAX=       2.4114304,     53960,           0
$$ Real data points
##PAGE= N=1
##DATA TABLE= (X++(R..R)), XYDATA
$$ plain form
0 0 0 0 0 0 0 0 0 0 0 0 0 0 0 0 0 0 0 8 -8 8 -8 8 -8 16 -16 16 -24 24 -31 32 -39 40 -48 56 -63 71 -79 87 -96
39 -96 109 -119 134 -149 164 -181 202 -220 243 -268 296 -326 359 -397 437 -482 535 -593 662 -743
59 -743 840 -955 1100 -1282 1526 -1862 2360 -3169 4708 -8609 39078 53960 -36723 20266
73 20266 20251 2260 27710 -279 -84 24530 -2999 9092 12857 -8725 3996 12995 -878 -5833
87 -5833 -912 8473 4874 -5707 -8350 7517 10850 -6986 -3143 4967 -406 6343 733 -4490 3206
102 3206 -2374 5244 6086 -15544 -342 9796 -7770 -3520 -4610 -5104 6432 -9116 -11700 4356
116 4356 -4266 -6631 -1454 -8296 -4967 1575 -2885 -7808 -5547 -1399 1258 -1132 -9371 -5135 5355
131 5355 -2871 -5258 -746 -4111 1530 1480 -5454 543 -289 411 3869 -3050 708 4883 2448 4432
$$ packed form
0@%%%%%%%%%%%%%%%%%Qj6J6j6J6j6K4l2L2m0M8n5O3p1P9q8J04j19J34j50J66j83
39i6K05k28K53k83L13l45L83m22M63n11N64o22O85p56Q34r19J017j128J255j405
59g43J583j795K055k382K808l388M222n529P877j3317M7687J4882r0683N6989
73B0266j5j7991K5450k7989J95K4614k7529J2091L765k1582J2721Q999j3873m955
87e833M921R385l599j0581k643J5867L333j7836L843Q110n373O749n610n223P696
102C206n580P618Q42k1630J5202J0138j7566M250j090m94J1536j5548k584J6056
116D356q622k365N177o842L329O542m460m923K261M148K657k390q239M236J0490
131E355q226k387M512l365N641n0o934N997q32P00L458o919L758M175k435J984
$$ plain form
147 4432 -1693 2209 11127 1545 905 5105 2830 7528 4734 141 3414 4548 5188 2464 -855 1990
163 1990 2330 3662 164 -4172 3120 1879 -2457 555 -3296 -240 2794 -4205 -2003 -501 -1429 1746
179 1746 -3165 -4054 512 -220 -106 -3242 -4218 1449 -974 -2691 -1844 -4732 -318 310 -4977 -3013 -2456
196 -2456 -1721 -187 -4293 -4043 -656 -606 -1851 -4293 -1870 -106 -1354 -713 -3449 -1726 2435 -997
212 -997 -1195 -792 -716 3548 819 -2134 1395 2318 3093 2058 -391 3057 4062 2855 3157 1498 3426
229 3426 5290 3390 2451 2190 4071 4919 2189 1298 2322 3944 3092 -15 977 2202 1757 1818 -1151
246 -1151 -585 2177 703 279 -1034 -2241 1987 679 -2652 -943 -955 505 67 -3342 -1501 155
262 155 -1094 -1158 -2120 -2161 -462 -730 -1968 -3236 -1765 236 -1697 -2714 -2971 -1544 278 -2556 -3448
$$ packed form
147D432o125L902Q918r582o40M200k275M698k794m593L273J134O40k724l319K845
163A990L40J332l498m336P292j241m336L012l851L056L034o999K202J502r28L175
179A746m911q89M566p32J14l136r76N667k423j717Q47k888M414O28n287J964N57
196b456P35J534m106K50L387N0j245k442K423J764j248O41k736J723M161l432
212i97j98M03P6M264k729k953L529R23P75j035k449L448J005j207L02j659J928
229C426J864j900r39k61J881Q48k730q91J024J622q52l107R92J225m45O1k969
246a151N66K762j474m24j313j207M228j308l331J709j2J460m38l409J841J656
262A55j249o4r62m1J699k68j238j268J471K001j933j017k57J427J822k834q92
$$ plain form
279 -3448 -1594 -1298 -977 -1822 -3131 -900 -852 -1061 -902 -2566 -324 982 -829 -632 -617 1131 2437 -168
297 -168 -79 2023 2249 1801 651 926 2445 2249 1811 874 1065 2491 2113 1713 704 814 2755 1993 27
316 27 468 1599 1831 625 -205 360 963 999 38 -863 -120 91 650 -505 -1772 -103 724 -1160 -1389
335 -1389 -1930 -449 400 -2006 -2184 -734 -1100 -568 -1443 -2465 -938 -587 -973 -1552 -2556 -627 79 -1291
353 -1291 -2225 -1816 324 -469 -1718 -1257 -641 150 -157 -1778 -561 -91 131 734 -1023 -475 1342 1082
371 1082 792 -290 697 2702 1020 740 1639 1873 2668 2124 1029 1927 2659 2505 2433 863 1406 2846
389 2846 2301 1002 742 2079 2455 1231 140 727 1761 1333 9 242 135 592 1146 -662 -730 -74
407 -74 310 272 -1390 -1496 209 -246 -1273 -1681 -1637 -284 -1516 -2071 -1455 -1713 -827 -1339 -2340 -2209 -1421
$$ packed form
279c448J854K96L21q45j309K231M8k09J59j664K242J306j811J97J5J748J306k605
297a68Q9K102K26m48j150K75J519j96m38r37J91J426l78m00j009J10J941p62j966
316B7M41J131K32j206q30N65O03L6r61r01P43K11N59j155j267J669Q27j884k29
335a389n41J481Q49k406j78J450l66N32q75j022J527L51l86n79j004J929P06j370
353a291r34M09K140p93j249M61O16P91l07j621J217M70K22O03j757N48J817k60
371A082k90j082R87K005j682k80Q99K34P95n44j095Q98P32j54p2j570N43J440
389B846n45j299k60J337L76j224j091N87J034m28j324K33j07M57N54j808o8O56
407g4L84l8j662j06J705m55j027m08M4J353j232n55O16k58Q86n12j001J31P88
$$ plain form
426 -1421 -630 -1594 -3256 -1237 -556 -1275 -1583 -2179 -1062 -247 -1496 -840 -1331 -874 542 -1217 -1042 -317
444 -317 -571 1298 -468 -1582 1127 917 728 841 -260 1523 1633 476 1462 959 1467 2808 1269
461 1269 678 1734 2288 2073 336 805 2008 1619 1425 446 718 1590 576 744 245 -329 1359 642
479 642 -393 12 -708 493 395 -2024 -270 319 -642 -435 -1203 -1145 23 -960 -1603 -1291 -1379 -483 -619 -1871
499 -1871 -1603 -876 -306 -1402 -1879 -1416 -576 -710 -1713 -1312 -381 -1111 -209 -623 -1503 380 -14 -182 141
518 141 -775 763 1002 -533 333 787 884 1547 362 551 1749 1556 1330 983 1192 1711 1906 1356 521
537 521 1558 2359 1562 1242 633 1319 2660 479 315 1730 642 1197 1028 -698 1077 1134 6 412
555 412 -807 -198 1194 -1039 -996 -369 -735 -135 -1130 -1638 -350 -952 -839 -1371 -1908 -1296 -1070 -995 -1771 -2313
$$ packed form
426a421P91r64j662K019O81p19l08n96J117Q15j249O56m91M57J416j759J75P25
444c17k54J869j766j114K709k10j89J13j101J783J10j157R86n03N08J341j539
461A269n91J056N54k15j737M69J203l89j94r79K72Q72j014J68m99n74J688p17
479F42j035M05p20J201r8k419J754N89r61K07p68N8J168r83o43L12q8Q96j36j252
499a871K68P27N70j096m77M63Q40j34j003M01R31p30R02m14q80J883l94j68L23
518A41r16J538K39j535Q66M54R7O63j185J89J198j93k26l47K09N19J95n50q35
537E21J037Q01p97l20o09O86J341k181j64J415j088N55j69j726J775N7j128M06
555D12j219O09J392k233M3O27l66O00r95n08J288o02J13n32n37O12K26P5p76n42
$$ plain form
575 -2313 -450 -943 -1845 -1189 -2014 -711 -659 -2461 -879 -1325 -1010 44 -1849 -1081 195 -793 93 -854
593 -854 -1142 1060 -140 -739 74 -173 1006 665 -139 592 978 1070 1013 487 1092 1287 1364 1221 202 1397
613 1397 1829 1097 759 450 1510 1733 386 650 861 1002 1576 131 174 747 401 774 -161 -709 685
632 685 433 -443 -167 -361 256 256 -1100 -672 -635 -474 -258 -1436 -942 -874 -310 -749 -1614 -1053 -592 -484 -862
653 -862 -1507 -901 -81 -878 -847 -956 -812 164 -824 -715 -240 -357 269 -94 -745 146 414 128 200 -555 583
674 583 1134 289 491 249 935 1239 720 700 799 1146 1047 541 923 1107 1200 1599 598 406 1493 1076 1073 453
696 453 227 1383 930 -11 899 436 557 748 -290 158 233 -166 4 -612 -400 201 -287 -527 -929 -404
716 -404 5 -816 -1437 -1110 -753 -662 -1504 -1254 -975 -1175 -836 -1524 -1589 -679 -769 -776 -856 -1673 -385 -541 -1288 -745
$$ packed form
575b313J863m93r02O56q25J303N2j802J582m46L15J054j893P68J276r88Q86r47
593h54k88K202j200n99Q13k47J179l41q04P31L86R2n7n26O05J95P7j43j019J195
613A397M32p32l38l09J060K23j347K64K11J41N74j445M3N73l46L73r35n48J394
632F85k52q76K76j94O17%j356M28L7J61K16j178M94O8N64m39q65N61M61J08l78
653h62o45O06Q20p97L1j09J44R76r88J09M75j17O26l63o51Q91K68k86P2p55J138
674E83N51q45K02k42O86L04n19k0R9L47r9n06L82J84R3L99j001j92J087m17lo20
696D53k26J156m53r41R10m63J21J91j038M48P5l99J70o16K12O01m88k40m02N25
716d04M09q21o21L27L57R1q42K50K79k00L39o88o5R10r0pq0q17J288j56p47N43
$$ plain form
738 -745 -1022 -271 8 -926 -702 16 -39 153 -433 -457 383 552 119 -199 64 1027 735 499 213 264 967
759 967 759 363 828 894 1286 899 375 998 1066 772 954 280 913 1213 745 385 295 650 788 151 286
780 286 221 334 534 22 -283 210 16 155 -227 -593 200 -32 -619 -563 -698 -563 -244 -419 -591 -704 -150
801 -150 -461 -1171 -527 -296 -223 -591 -828 -384 -245 -223 -310 -612 -465 95 -284 -375 -390 -233 97 -71 -277 -24
823 -24 231 484 110 -90 542 581 599 476 138 634 833 828 410 354 741 1270 433 479 641 845 956 322 479
846 479 840 727 863 264 400 850 406 452 160 -196 201 303 -250 -548 -371 98 -151 -553 -276 -283 -77
867 -77 -572 -795 -564 -479 -655 -690 -1012 -1094 -365 -862 -1086 -1171 -810 -474 -843 -1340 -706 -581 -536 -1030 -824 -702
889 -702 -470 -578 -498 -620 -248 -141 -222 -551 -291 -20 413 -317 90 134 576 564 167 307 542 892 489 302
$$ packed form
738g45k77P51K79r34K24P18n5J92n86k4Q40J69m33l18K63R63k92k36k86N1P03
759I67k08l96M65O6L92l87n24O23O8k94J82o74O33L00m68l60r0L55J38o37J35
780B86o5J13K00n12l05M93j94J39l82l66P93k32n87N6j35J35L19j75j72j13N54
801a50l11p10O44K31P3l68k37M44J39K2q7l02J47N60l79r1j5J57L30j68k06K53
823b4K55K53l74k00O32L9J8j23l38M96J99nm18n6L87N29q37M6J62K04J11o34J57
846D79L61j13J36n99J36M50m44M6k92l56L97J02n53k98J77M69k49m02K77pK06
867g7m95k23K31Q5j76l5l22q2P29m97k24q5L61L36l69m97O34J25M5m94K06J22
889g02K32j08Q0j22L72J07q1l29K60K71M33p30M07M4M42j2l97J40K35L50m03j87
$$ plain form
911 302 664 970 731 834 496 619 1134 743 658 659 749 1162 515 487 919 767 697 474 118 674 459 384 128
934 128 -88 398 229 311 -75 -51 -127 297 -425 -278 -79 -258 -96 -650 -713 -366 -432 -361 -841 -901 -567 -556 -722
957 -722 -1176 -645 -275 -571 -839 -787 -762 -215 -370 -755 -503 96 -273 -31 -300 -26 522 -60 140 -26 338
978 338 303 176 29 269 531 911 666 98 421 744 579 527 169 612 865 694 491 346 708 740 578
999 578 371 137 330 652 -49 -9 128 389 386 -217 -167 76 406 -137 -359 -529 -280 40 -580 -450 -534 -423
1021 -423 -401 -572 -905 -464 -389 -741 -823 -693 -663 -306 -879 -1046 -546 -478 -795 -766 -1053 -454 -242 -373 -776 -335
1043 -335 -236 116 -69 -531 -225 407 238 -198 -281 293 53 442 277 500 650 547 746 460 404 979 1023
1064 1023 356 775 455 893 942 380 755 843 585 711 15 508 1017 661 334 535 314 590 283 -18
$$ packed form
911C02L62L06k39J03l38J23N15l91q5JR0M13o47k8M32j52p0k23l56N56k15p5k56
934A28k16M86j69Q2l86K4p6M24p22J47J99j79J62n54o3L47o6P1m80o0L34J1j66
957g22m54N31L70k96k68N2K5N47j55l85K52N99l69K42k69K74N48n82K00j66L64
978C38l5j27j47K40K62L80k45n68L23L23j65n2l58M43K53j71k03j45L62L2j62
999E78k07k34J93L22p01M0J37K61lo03N0K43L30n43k22j70K49L20o20J30q4J11
1021d23K2j71l33M41P5l52q2J30L0L57n73j67N00O8l17K9k87N99K12j31m03M41
1043c35R9L52j85m62L06O32j69m36q3N74k40L89j65K23J50j03J99k86n6N75M4
1064A023o67M19l20M38M9n62L75Q8k58J26o96M93N09l56l27K01k21K76l07l01
$$ plain form
1084 -18 183 16 319 233 -221 -40 43 -224 -11 -463 -267 1 -236 -315 -606 -423 -451 -505 -740 -514 -351 -455
1106 -455 -988 -876 -478 -632 -378 -792 -766 -409 -380 -524 -522 -403 -53 -150 -394 87 -188 -40 261 -290 -93 30
1128 30 207 146 146 -43 559 484 222 148 515 311 268 459 377 561 594 609 378 629 307 1118 376 228 211 603
1152 603 279 99 -91 238 166 98 106 -285 -110 103 -223 -78 19 -251 -77 -378 -156 -283 -229 -168 -508 -345
1174 -345 52 -437 -233 -494 -566 -406 -513 -325 -301 -718 -286 -480 -819 -688 -303 -368 -300 -717 -378 67 -160
1195 -160 -187 -149 52 243 104 143 -115 93 426 291 24 313 359 571 370 251 342 306 412 651 560 634 613
1218 613 678 716 411 642 461 467 487 566 659 414 353 49 412 194 464 233 138 255 14 174 -2 -112 348
1241 348 -77 -210 -362 -227 71 -81 -155 -135 -74 -367 -258 -413 -267 -230 -508 -260 -394 -352 -161 -361 -518 -534
$$ packed form
1084a8K01j67L03q6m54J81Q3k67K13m52J96K68k37p9k91J83k8n4k35K26J63j04
1106d55n33J12L98j54K54m14K6L57K9j44KJ19L50r7k44M81k75J48L01n51J97J23
1128C0J77o1%j89O02p5k62p4L67k04m3J91q2J84L3J5k31K51l22Q11p42j48j7L92
1152F03l24j80j90L29p2o8Ql91J75K13l26J45R7k70J74l01K22j27N4O1l40J63
1174c45L97m89K04k61p2J60j07J88K4m17M32j94l39J31L85o5O8m17L39M45k27
1195a60k7L8K01J91j39L9k58K08L33j35k67K89M6K12k01j19R1l6J06K39r1P4k1
1218F13O5L8l05K31j81OK0P9R3k45o1l04L63k18K70k31r5J17k41J60j76j10M60
1241C48m25j33j52J35K98j52p4K0O1k93J09j55J46L7k78K48j34M2J91k00j57j6
$$ plain form
1263 -534 -468 -441 -688 -419 -376 -472 -211 -506 -213 -135 -148 -240 -264 -183 179 118 -98 89 77 182 395 169 483 111
1287 111 429 411 -139 72 312 222 473 -77 182 691 567 237 229 332 640 476 -17 234 510 386 317 196
1309 196 108 41 133 215 -18 -21 79 -37 -38 -175 -46 120 -160 -42 -360 -368 -221 -366 -308 -484 -459 -393 -172 -516
1333 -516 -394 -87 -130 -544 -519 -211 34 -75 -122 -389 -108 -303 -166 -158 -237 -94 -20 10 -10 51 261 74 235
1356 235 -51 516 273 325 278 480 527 386 54 375 153 447 499 436 534 644 651 444 164 603 486 315 317
1379 317 511 371 498 309 265 127 256 140 -21 306 82 174 72 35 -365 40 -63 -227 -129 -524 -275
1400 -275 -149 -258 -331 -377 -357 -312 -591 -680 -306 -408 -229 -815 -501 -309 -266 -440 -267 -302 -219 -164 -683 -499 -177
1423 -177 -393 4 -205 -184 -237 -88 -11 20 129 5 103 -40 271 -144 530 508 81 205 421 494 439 342 269
$$ packed form
1263e34O6K7k47K69M3r6K61k95K93P8j3r2k4Q1L62o1k16J87j2J05K13k26L14l72
1287A11L18j8n50K11K40r0K51n50K59N09j24l30qJ03L08j64m93K51K76j24o9j21
1309A96q8o7R2Q2k33lJ00j16jj37J29J66k80J18l18qJ47j45N8j76K5O6K21l44
1333e16J22L07m3m14K5L08K45j09m7k67K81j95J37Qp9J43P4L0k0O1K10j87J61
1356B35k86N67k43N2m7K02M7j41l32L21k22K94N2o3R8J10Pk07k80M39j17j71K
1379C17J94j40J27j89m4j38J29j16j61L27k24R2j02l7m00M05j03j64R8l95K49
1400b75J26j09p3m6K0M5k79q9L74j02J79n86L14J92M3j74J73l5Q3N5n19J84L22
1423a77k16L97k09K1n3J49P7L1J09j24R8j43L11m15O74k2m27J24K16P3n5r7p3
$$ plain form
1446 269 524 440 237 246 387 278 271 103 179 575 379 151 246 66 31 156 -19 134 -123 291 -46 -66 -299
1469 -299 -270 -93 -152 -103 -345 -371 -105 -187 -555 -226 -112 -300 -321 -372 -341 -277 -321 -457 -298 -393 101 -352 -468 -110
1493 -110 -185 -80 -283 -242 -117 -66 32 2 -208 -25 93 263 278 -75 474 338 189 262 299 268 624 378 237
1516 237 231 132 474 434 504 360 378 520 246 318 549 344 160 373 415 60 369 250 259 524 87 110 27 -108
1540 -108 34 -53 -24 -66 152 -309 -109 -99 -269 -359 -185 -247 -445 -168 -353 -281 -637 -477 -317 -267 -254 -253 -379 -257
1564 -257 -178 -527 -404 -466 -226 -551 -480 -587 -291 -39 -165 -311 -134 136 218 -191 -232 148 -84 -41 -10 13 248
1587 248 176 104 269 301 164 403 614 423 254 330 220 471 133 325 194 160 19 19 296 333 542 251 227
1610 227 11 304 79 54 477 129 -5 177 -150 96 218 -461 83 57 -5 -263 -168 -262 -256 -288 -295 -258 -385 -273
$$ packed form
1446B69K55q4k03RJ41j09pj68P6L96j96k28R5j80l5J25j75J53k57M14l37k0k33
1469b99K9J77n9M9k42k6K66q2l68L29J14j88k1n1L1O4m4j36J59r5M94m53j16L58
1493a10p5J05k03M1J25N1R8l0k10J83J18J70J5l53N49j36j49P3L7l1L56k46j41
1516B37or9L42m0P0j44J8J42k74P2K31k05j84K13M2l55L09j19RK65m37K3q3j35
1540a08J42q7K9m2K18m61K00J0j70r0J74o2j98K77j85P2l56J60J60N0J3Jj26J22
1564b57P9l49J23o2K40l25P1j07K96K52j26j46J77K70Q2m09m1L80k32M3L1K3K35
1587B48p2p2J65L2j37K39K11j91j69P6j10K51l38J92j31l4j41%K77L7K09k91k4
1610B27k16K93k25k5M23l48j34J82l27K46J22o79N44k6o2k58R5r4Ol2pL7j27J12
$$ plain form
1634 -273 -200 -306 -577 -510 -43 -502 -231 -246 -256 -161 -179 -178 -250 -8 -154 -219 -317 -85 124 -122 -69 42 162 19
1658 19 16 -70 16 100 117 473 211 313 340 365 223 312 295 354 517 365 395 419 388 237 148 214 317 478 -45 226
1684 226 199 336 310 -21 69 -83 66 -66 154 133 -164 51 -344 -293 282 54 -123 -195 -486 -179 -390 -177
1706 -177 -262 -397 -370 -241 -196 -353 -337 -511 -595 -275 -258 -204 -364 -232 -48 -244 -10 -271 55 -48 -373 -134
1728 -134 -66 -120 -153 -81 233 328 -34 -45 129 156 93 185 349 158 137 118 160 273 287 512 315 235 106 432 357
1753 357 286 307 263 346 315 76 303 237 159 45 -47 112 236 108 293 -89 -226 273 -231 9 -51 -6 142
1776 142 -102 -260 -277 -18 -411 -391 -240 48 -253 -11 -227 -288 -94 -317 -619 -293 -231 -279 -193 -265 -216 -439 -6
1799 -6 121 -66 -165 124 -167 36 -59 77 240 207 63 256 171 155 71 157 209 101 249 529 222 172 314 -11
$$ packed form
1634b73P3j06k71O7M67m59K71j5j0R5j8Jp2K42j46o5r8K32K09k46N3J11J20j43
1658A9lq6Q6Q4J7L56k62J02K7K5j42Q9j7N9J63j52L0K4l1j51q9O6J03J61n23K71
1684B26k7J37k6l31R0j52J49j32K20k1k97K15l95N1N75k28j77p2k91L07k11K13
1706a77q5j35K7J29M5j57J6j74q4L20J7N4j60J32J84j96K34k61L26j03l25K39
1728a34O8n4l3P2L14R5l62j1J74K7o3R2J64j91k1j9M2J13J4K25j97q0j29L26p5
1753C57p1K1m4Q3l1k39K27o6p8j14r2J59J24j28J85l82j37M99n04K40o0M5J48
1776A42k44j58j7K59l93K0J51K88l01K42k16o1J94k23l02L26O2m8Q6p2M9k23M33
1799fJ27j87r9K89k91K03r5J36J63l3j44J93q5j6q4Q6N2j08J48K80l07n0J42l25
$$ plain form
1823 -11 298 323 186 470 254 244 256 169 68 191 38 155 471 14 208 224 79 120 277 -156 -189 -77 -31
1846 -31 -3 9 -89 -69 -346 -393 -216 29 -342 -127 -550 -488 -303 -253 -335 -380 -244 -392 -501 -539 -312 -93 -98 -331
1870 -331 -358 -143 -329 -350 47 -209 -79 -663 -114 -17 28 170 -157 68 284 158 178 73 231 109 97 126
1892 126 93 135 266 199 305 265 175 271 303 454 309 623 296 165 197 306 109 107 156 188 25 99 178 -40 121
1917 121 -260 -61 -95 -28 214 70 -208 -148 -57 -131 -160 -27 -45 -335 -122 -183 -137 -261 9 -327 -341 -188 -16
1940 -16 -244 -271 -113 -159 -336 -68 -121 -79 -197 -170 -183 14 22 12 -98 141 225 152 208 -198 327 -42 -66 -59 229
1965 229 310 -169 329 45 179 341 348 177 36 66 360 397 315 103 47 143 -17 197 157 101 93 175 192 162 43
1990 43 99 35 -287 -115 167 -77 -206 -155 -198 27 -341 -251 -64 -99 -333 -142 -152 -260 -205 -425 -388 -20 -372
$$ packed form
1823a1L09K5j37K84k16j0J2q7j01J23j53J17L16m57J94J6j45M1J57m33l3J12M6
1846c1K8J2r8K0k77m7J77K45l71K15m23O2J85N0q2m5J36j48j09l8K27K19nk33
1870c31k7K15j86k1L97k56J30n84N49R7M5J42l27K25K16j26K0j05J58j22j2K9
1892A26l3M2J31o7J06m0r0R6L2J51j45L14l27j31L2J09j97kM9L2j63P4P9k18J61
1917A21l81J99l4O7K42j44k78O0R1p4k9J33j8k90K13o1M6j24K70l36j4J53J72
1940a6k28k7J58m6j77K68n3M2j18K7j3J97Qj0j10K39Q4p3N6m06N25l69k4PK88
1965B29Q1m79M98k84J34J62Pj71j41L0K94L7q2k12n6R6j60K14m0n6qQ2J7l0j19
1990D3N6o4l22J72K82k44j29N1m3K25l68R0J87l5k34J91j0j08N5k20L7L68l52
$$ plain form
2013 -372 -193 -290 -540 -311 -358 -344 -168 -240 -345 -161 -463 -241 -143 -17 298 -131 -119 58 106 -83 49 -125
2035 -125 11 203 290 82 122 11 178 140 327 361 142 425 157 223 116 159 104 208 260 402 234 238 310 333
2059 333 -120 -1 18 243 9 -69 159 44 255 48 131 -34 -70 -90 -86 -78 -187 -73 -139 -116 -205 -229 -413 -293
2083 -293 -130 -69 -300 -38 -299 -335 -142 -149 -316 -13 -114 -223 -203 -94 -195 -230 -64 -154 -67 -49 -266 -432 -320
2106 -320 169 -61 -28 20 255 -33 193 -168 249 367 27 215 359 -100 332 126 37 107 305 264 -40 330
2128 330 92 361 277 377 290 103 126 288 -92 17 37 67 138 29 58 -57 1 -78 145 89 -192 250 -151
2151 -151 -48 46 -123 -238 -224 -218 -243 -64 -326 -235 -105 -172 -168 -217 -83 -194 -159 -223 -207 -269 -378 -147 -271 -90 -496
2176 -496 -87 29 29 78 -103 1 -73 19 -96 133 180 104 -4 317 -129 176 206 336 446 319 75 529 92
$$ packed form
2013c72J79r7k50K29m7J4J76p2j05J84l02K22R8J26L15m29J2J77M8j89J32j74
2035a25J36J92Q7k08M0j11J67l8J87L4k19K83k68O6j07M3n5J04N2J42j68MP2K3
2059C33m53J19J9K25k34p8K28j15K11k07Q3j65l6k0MQj09J14o6K3q9k4j84J20
2083b93J63O1k31K62k61l6J93pj67L03j01j09K0J09j01l5J66r0Q7J8k17j66J12
2106c20M89k30L3M8K35k88K26l61M17J18l40J88J44m59M32k06q9P0J98m1l04L70
2128C30k38K69q4J00q7j87K3J62l80J09K0L0P1j09K9j15N8p9K23n6k81M42m01
2151a51J03R4j69j15J4Ok5J79k62R1J30o7Mm9J34j11L5o4J6o2j09K31j24J81m06
2176d96M09J16%M9j81J04p4R2j15K29M7p6j08L21m46L05L0J30J10j27k44M54m37
$$ plain form
2199 92 182 206 14 297 337 100 318 431 272 347 86 204 144 -13 260 220 -23 3 279 -93 -174 67 -45
2222 -45 -69 0 -55 166 179 -70 -20 -87 -224 -156 -184 -335 -38 -190 -116 -93 -33 -137 -184 4 1 -233 -162 -354 10
2247 10 -34 -159 -11 -10 154 -171 64 3 -169 -159 -26 -391 -15 -141 -16 72 -51 27 -28 39 -32 212 244 187
2271 187 245 136 131 151 155 243 339 104 35 337 167 173 335 416 -150 -23 1 223 100 60 -29 145 214 88 278
2296 278 173 -24 -13 193 -156 -255 -104 -137 188 -81 5 -207 -141 27 -454 -278 -258 -368 -399 -106 -198 -178 -392
2319 -392 -66 -3 -18 -135 -276 -29 -307 33 303 -327 -47 -316 -214 195 20 205 120 266 -19 101 -2
2340 -2 310 172 179 139 248 154 325 278 98 34 280 214 85 132 -108 143 189 101 380 242 147 167 77 33 46 212
2366 212 52 11 16 77 -57 -46 -83 152 68 -127 -18 45 -152 -215 -214 81 -160 -11 -208 -190 -65 72 -391 -174
$$ packed form
2199I2R0K4j92K83M0k37K18J13j59P5k61J18o0j57K73m0k43K6K76l72q1K41j12
2222d5k4O9n5K21J3k49N0o7j37O8k8j51K97j52P4K3O0j04m7J88lk34P1j92L64
2247A0m4j25J48JJ64l25K35o1j72J0J33l65L76j26J25Q8j23P8n5O7p1K44L2n7
2271A87N8j09nK0MQ8R6k35o9L02j70OJ62Q1n66J27K4K22j23m0q9J74O9j26J90
2296B78j05j97J1K06l49r9J51l3L25k69Q6k12O6J68m81J76K0j10l1K93r2K0k14
2319c92L26O3j5j17j41K47k78L40K70o30K80k69J02M09j75J85q5J46k85J20j03
2340bL12j38Pm0J09r4J71m7j80o4K46o6j29M7k40K51M6q8K79j38r5K0r0m4J3J66
2366B12j60m1NO1j34J1l7K35q4j95J09O3j97o3JK95k41J49j97J8J25J37m63K17
$$ plain form
2390 -174 -256 -185 -115 -326 -284 -65 -180 -398 -203 -161 -173 -276 -31 -13 -203 -190 -76 -128 -69 -163 77 -152 136 -129
2414 -129 201 -68 -77 -129 70 279 7 29 93 180 148 107 80 316 -59 95 -18 231 173 -30 259 -107 134
2437 134 223 308 66 0 115 -133 -44 249 158 41 -20 -47 64 32 93 48 114 -281 -289 -33 -13 -153 -232 -138 -120 79
2463 79 -211 -274 -128 126 -108 -320 -328 -28 -1 -24 -108 -235 -48 118 163 -3 -360 14 121 53 -86 96 -9
2486 -9 -3 163 -52 -16 292 311 -59 19 155 255 166 -104 127 221 271 194 7 40 165 228 76 297 130 221 102
2511 102 178 330 90 -18 17 -25 -52 99 89 30 37 -239 86 100 93 -337 -119 -72 -148 201 -311 -133 -79 140 -117
2536 -117 -286 -354 -70 -520 -62 -187 -178 -237 78 2 20 -200 -132 -406 -148 55 -294 -19 -43 -15 -48 95 43 -13
2560 -13 -29 -58 -33 179 -130 -69 254 180 40 107 160 97 347 18 75 93 120 95 65 160 54 220 -59 225 178
$$ packed form
2390a74q2P1P0k11M2K19j15k18J95M2j2j03K45J8j90J3J14n2N9r4K40k29K88k65
2414a29L30k69rn2J99K09k72K2O4Q7l2m1k7K36l75J54j13K49n8k03K89l66K41
2437A34Q9Q5k42o6J15k48Q9K93r1j17o1k7J11l2O1m5O6l95qK56K0j40p9R4J8J99
2463G9k90o3J46K54k34k12qL00K7k3q4j27J87J66M5j66l57L74J07o8j39J82j05
2486iOJ66k15L6L08J9l70P8J36J00q9k70K31R4N0p7j87L3J25O3j52K21j67R1j19
2511A02P6J52k40j08L5m2k7J51j0n9Pk76L25J4pm30K18M7p6L49n12J78N4K19k57
2536a17j69o8K84m50M58j25Rn9L15p6J8k20O8k74K58K03l49K75k4K8l3J43n2n6
2560a3j6k9K5K12l09O1L23p4j40O7N3o3K50l29N7J8K7k5l0R5j06J66k79K84m7
$$ plain form
2585 178 100 178 334 96 41 216 135 153 -45 -58 38 116 112 -6 -59 33 84 7 89 -73 -296 -201 -57 -332 22
2610 22 -168 21 -345 -90 106 -243 -5 -164 53 -326 36 -177 -258 -107 -175 -99 -122 -11 16 -43 5 169 -76
2633 -76 -20 -95 79 -114 146 44 -174 45 147 -166 127 262 82 57 -29 53 264 184 93 238 114 127 294
2656 294 308 171 129 147 -167 90 130 125 70 150 64 -13 125 79 -122 -79 -3 195 -109 -22 -80 -141 -205 -120 -272 -254
2682 -254 -272 -350 -100 2 -228 -274 -1 -158 -144 -133 -183 -187 -304 -4 -228 -129 -257 -235 -92 -189 -74 -349 -12 -295
2706 -295 -247 -132 -213 72 134 69 -173 -25 -22 125 -57 -144 282 -39 159 382 162 25 163 167 133 446 103
2729 103 269 289 243 187 177 353 400 222 206 -114 -8 134 -18 -18 -138 164 92 -93 -50 209 43 216 64
2752 64 317 -212 -54 -184 -178 -50 -208 -102 -161 72 -182 -181 -14 -177 -303 -90 -245 -226 -480 -182 -71 -66 -157
$$ packed form
2585A78p8P8J56k38n5J75q1J8j98j3R6P8mj18n3R2N1p7Q2j62k23R5J44k75L54
2610B2j90J89l66K55J96l49K38j59K17l79L62k13q1J51o8P6k3J11K7n9M8J64k45
2633g6N6p5J74j93K60j02k18K19J02l13K93J35j80k5q6Q2K11q0r1J45j24J3J67
2656B94J4j37m2J8l14K57M0nn5Q0q6p7J38m6k01M3P6J98l04Q7n8o1o4Q5j52J8
2682b54j8p8K50J02k30m6K73j57J4J1n0mj17L00k24R9j28K2J43r7J15k75L37k83
2706b95M8J15q1K85O2o5k42J48LJ47j82q7M26l21J98K23k20j37J38Ml4L13l43
2729A03J66K0m6n6j0J76M7j78j6l20J06J42j52%j20L02p2j85M3K59j66J73j52
2752F4K53n29J58j30OJ28j58J06n9K33k54JJ67j63j26K13j55J9k54K98J11Nr1
$$ plain form
2775 -157 -51 -179 -117 -193 -178 222 33 32 168 -63 366 -39 -40 -25 63 92 -108 354 -79 13 22 161 252 -137 157
2800 157 81 63 -55 244 134 142 -167 -115 150 58 232 317 228 33 225 75 42 72 -129 131 177 179 99 -129 -314
2825 -314 30 -67 14 -237 -183 -7 -85 -184 -100 -127 -129 -67 -48 -93 -273 9 -28 -8 -370 -184 231 -435 -146 58 -5
2850 -5 -189 -212 -206 -238 -84 2 37 -321 -22 117 52 -104 91 51 -88 128 108 30 20 280 393 315 26 83 240
2875 240 292 64 409 163 86 189 261 97 342 62 155 168 -44 275 142 18 -115 -36 278 141 115 5
2897 5 75 -28 52 106 46 66 39 111 55 97 -30 49 -118 5 -122 -7 -25 -264 -41 -200 -115 3 -88 64 -269
2922 -269 -77 -121 -15 -85 57 -179 -174 -103 4 -44 -417 6 -117 295 -162 197 -281 -250 -261 -53 -50 322 148
2945 148 114 -148 191 65 281 149 21 254 149 96 153 136 -26 296 -57 -368 -27 213 105 -61 155
$$ packed form
2775a57J06j28O2p6J5M00j89jJ36k31M29m05jJ5Q8K9k00M62m33R2RJ39R1l89K94
2800A57p6j8j18K99j10Ql09N2K65r2J74Q5q9j95J92j50l3L0k01K60M6Kq0k28j85
2825c14L44r7Q1k51N4J76p8r9Q4k7kO2J9m5j80K82l7K0l62J86M15o66K89K04o3
2850ej84k3Ol2J54Q6L5l58K99J39o5j56J95m0j39K16k0p8j0K60J13p8k89N7J57
2875B40N2k28L45k46p7J03P2j64K45k80R3J3k12L19j33j24j33P9L14j37k6j10
2897EP0j03Q0N4o0K0k7P2n6M2j27P9j67J23j27J15j8k39K23j59Q5J18r1J52l33
2922b69J92m4J06p0J42k36NP1J07m8l73M23j23M12m57L59m78L1j1K08LL72j74
2945A48l4k62L39j26K16j32j28K33j05n3N7j7j62L22l53l11L41K40j08j66K16
$$ plain form
2966 155 255 -20 54 -56 -38 64 -191 24 -154 -93 -40 -143 68 -92 -226 -294 -17 -332 -74 -330 -128 -13
2988 -13 -82 -10 64 7 -157 -148 -107 -166 -36 8 63 47 40 -44 -55 -60 -106 -258 -2 82 139 210 -143 134 246 -26 -96 241
3016 241 -89 123 30 233 153 332 -54 40 22 -48 -86 180 -21 106 371 106 91 -23 368 80 53 130 104
3039 104 144 -47 155 305 -81 32 255 194 -84 -94 -51 -140 23 227 22 58 -258 198 -90 -108 -28 -192 -255
3062 -255 -217 -84 -103 -362 37 178 -179 -40 -94 -186 -102 -266 -102 -48 -373 -81 -175 195 78 -52 118 -158
3084 -158 32 -27 -28 -287 47 -110 329 312 71 154 -19 -113 72 -93 135 -29 148 186 -16 60 172 139 176
3107 176 -9 82 33 120 10 9 190 249 292 -15 106 -113 136 110 122 -21 -111 -99 -216 -166 180 199 -48 -236
3131 -236 -82 39 -46 2 -257 35 -174 -157 -23 -63 -193 -269 -137 29 -138 -40 -156 -83 -132 -109 -28 -80 -26 -89
$$ packed form
2966A55J00k75P4j10J8J02k55K15j78O1N3j03K11j60j34o8K77l15K58k56K02J15
2988a3o9P2P4n7j64RM1n9J30M4N5j6pq4j1nm6j52K56Q4N7P1l53K77J12k72p0L37
3016B41l30K12r3K03q0J79l86R4j8p0l8K66k01J27K65k65j5j14L91k88k7P7k6
3039A04M0j91K02J50l86J13K23o1k78j0M3q9J63K04k05L6l16M56k88j8Q0j64o3
3062b55L8J33j9k59L99J41l57J39n4r2Q4j64J64N4l25K92r4L70j17j30J70k76
3084a58J90n9jk59L34j57M39j7k41Q3j73r4J85j65K28j64J77L8k02P6J12l3L7
3107A76j85R1m9Q7j10jJ81N9M3l07J21k19K49k6J2j43r0J2j17N0L46J9k47j88
3131b36J54J21q5M8k59K92k09J7J34m0j30p6J32J66j67R8j16P3m9K3Q1n2N4o3
$$ plain form
3155 -89 -56 -197 -76 -344 -187 38 305 71 183 27 15 -12 -70 -7 54 48 156 -16 81 45 209 -170 26 298
3179 298 -12 23 274 66 130 376 94 66 13 125 280 196 -81 107 127 41 -42 114 -199 -83 -98 30 -119
3202 -119 188 -79 158 204 -364 94 -88 57 60 -34 -66 -67 33 -128 -391 -4 -71 58 -131 190 -209 -197 -1
3225 -1 -385 64 -86 -2 -111 -159 -107 -8 -279 -82 -138 6 -201 -125 75 -303 -113 -109 -115 -113 90 -350 121 61 45
3250 45 216 20 85 -19 -91 100 315 -34 97 104 -77 -43 -14 74 23 10 84 224 74 111 -33 -32 161 -131 -54
3275 -54 41 -38 -103 136 -229 305 -98 -192 -213 -156 -84 -268 58 -165 -59 21 -147 44 47 -283 -215 11 -107 80
3299 80 -171 -181 -21 -104 88 109 -14 19 -129 -254 -103 -165 -141 57 190 87 168 85 -51 -11 -70 34 206 188
3323 188 108 63 117 4 -33 214 65 106 205 187 262 27 80 68 47 218 15 82 2 100 105 37 75 2 146 6
$$ packed form
3155h9L3j41J21k68J57K25K67k34J12j56j2k7n8O3O1oJ08j72R7l6J64l79J96K72
3179B98l10L5K51k08O4K46k82k8n3J12J55q4k77J88K0q6q3J56l13J16j5J28j49
3202a19L07k67K37M6n68M58j82J45Lr4l2jJ00j61k63L87o7J29j89L21l99J2J96
3225al84M49j50Q4j09m8N2R9k71J97n6J44k07P6K00l78J90MoKK03m40M71o0j6
3250D5J71j96O5j04p2J91K15l49J31Pj81L4K9Q8n1j3P4J40j50L7j44JJ93k92P7
3275e4R5p9o5K39l65N34m03r4k1N7P2j84L26k23J06Q0j68J91Ll30O8K26j18J87
3299H0k51j0J60q3J92K1j23L3j48j25J51o2K4J98J33j03Q1q3j36M0n9J04J72j8
3323A88q0m5N4j13l7K47j49M1R9j8P5k35N3j2k1J71k03O7q0R8No8L8p3J44j40
$$ plain form
3349 6 40 206 123 190 44 138 15 74 -61 -61 -160 85 -272 -192 75 -186 -61 -117 -107 -227 -81 -109 -16 168 -227
3374 -227 -180 -331 -58 -157 -103 -183 -357 -234 -222 -52 -309 -102 -105 -86 130 28 123 -75 -11 134 -62 244 234 -137
3398 -137 24 195 76 84 -22 272 -84 -219 136 112 15 -114 180 -139 23 276 149 -32 -74 104 91 44
3420 44 135 96 118 26 154 94 71 -136 -117 -30 -66 -86 -145 -23 -116 -19 -103 -10 188 111 100 -100 -85 50 -183 -22
3446 -22 15 -267 27 -226 9 -48 126 -95 144 -115 -173 -138 -198 -41 -238 -147 -98 159 -14 188 -97 46 -148
3469 -148 -92 3 -23 -188 -273 -164 176 -168 -9 221 41 -49 89 -173 167 267 113 89 185 194 90 -143 -35
3492 -35 127 38 -59 -54 297 -283 265 127 36 2 34 91 -223 66 -101 41 113 -208 -28 -209 59 25 -196 -252
3516 -252 69 -80 -36 -121 -158 314 -248 138 -94 -137 251 -211 -86 -84 -97 -80 -116 66 -11 -192 -73 -133 -19 -75
$$ packed form
3349FL4J66q3O7j46R4j23N9j35%r9K45l57Q0K67k61J25n6J0j20J46k8R3J84l95
3374b27M7j51K73r9N4q0j74J23J2J70k57K07lJ9K16j02R5j98O4J45j96L06j0l71
3398a37J61J71j19Qj06K94l56j35L55k4r7j29K94l19J62K53j27j81m2J78j3m7
3420D4R1l9K2r2J28o0k3k07J9Q7l6k0n9J22r3R7q4R3J98p7j1k00J5J35k33J61
3446b2L7k82K94k53K35n7J74k21K39k59n8L5o0J57j97R1M9K57j73K02k85J43j94
3469a48N6R5k6j65q5J09L40l44J59K30j80r0J38k62L40J00j54k4R6Rj04k33J08
3492c5J62q9r7NL51n80N48j38r1l4L2N7l14K89j67J42P2l21J80j81K68l4k21n6
3516b52L21j49M4q5l7M72n62L86k32m3L88m62J25Kj3J7l6J82p7j81J19o0J14n6
$$ plain form
3540 -75 -29 -272 51 -57 28 -101 164 -91 -14 34 238 -19 -138 -206 3 6 26 282 -8 -68 -52 150 -47 120
3564 120 117 -60 165 -93 -14 235 -62 22 69 -23 -12 82 -79 37 -146 -90 39 53 -116 177 44 -16 -85 82
3588 82 -70 -32 -37 -39 -80 151 -41 -276 203 -116 143 -99 -222 51 -36 -79 38 148 -208 -238 48 47 -121 -33
3612 -33 -62 -121 140 -144 -78 -19 46 -61 86 11 222 -7 257 70 -182 -58 -238 -32 152 -137 228 2
3634 2 322 139 213 -45 -54 -22 -135 -126 83 62 -2 6 -2 -13 -90 106 -77 67 139 154 -94 73 -81 119 -183 37
3660 37 15 32 45 -143 -150 21 -273 -10 -66 -280 -86 130 68 -291 55 -113 -62 -19 60 -75 10 27 -250 83
3684 83 -210 -190 -229 -139 71 -138 117 -78 151 -59 107 15 -28 21 -55 99 42 -50 92 7 66 339 70 -10
3708 -10 196 160 18 189 -133 69 0 183 237 154 12 260 33 238 -191 -28 205 250 38 197 249 84
$$ packed form
3540g5M6k43L23j08Q5j29K65k55P7M8K04k57j19o8K09LK0K56k90o0J6K02j97J67
3564A20lj77K25k58P9K49k97Q4M7r2J1R4j61J16j83N6J29J4j69K93j33o0o9J67
3588H2j52L8nkm1K31j92k35M79l19K59k42j23K73q7m3J17J10l56l0K86jj68Q8
3612c3k9n9K61k84O6N9O5j07J47p5K11k29K64j87k52J24j80K06J84k89L65k26
3634BL20j83P4k58rL2j13RK09k1o4Qqj1p7J96j83J44P2J5k48J67j54K00l02K20
3660C7k2J7J3j88pJ71k94K63n6k14J94K16o2l59L46j68N1M3P9j35Q5J7k77L33
3684H3k93K0l9R0K10k09K55j95K29k10J66r2m3M9p6J54n7r2J42q5N9K73k69q0
3708a0K06l6j42J71l22K02o9J83N4q3j42K48k27K05m29J63K33M5k12J59N2j65
$$ plain form
3730 84 -119 170 -124 398 71 93 -28 -88 -89 -170 -24 69 110 -211 189 -155 -11 50 -9 -320 -48 -179 -197 -180
3754 -180 128 -54 -7 -244 -131 -181 48 -68 -224 -105 95 -185 -196 326 179 28 -167 120 -4 65 -94
3775 -94 9 -9 124 329 215 -181 101 -143 28 94 -118 143 -71 -60 100 186 356 238 252 -217 -86 20
3797 20 -135 -33 -126 -7 -147 -181 -77 15 -91 -112 -92 -97 19 30 12 -93 97 35 -49 -76 -166 6 28 -83 -70
3822 -70 6 51 -64 74 150 -143 -115 -158 -22 -197 -136 78 -64 -8 -153 110 -89 2 104 112 -141 -149 120 22 152
3847 152 -27 -31 145 -39 -39 338 283 -8 86 273 34 -20 13 341 -99 214 153 321 136 -6 12 -9 79 26
3871 26 212 254 176 64 -17 142 129 110 141 -4 131 186 -145 -178 296 94 -86 -29 43 -28 -66 -127 -95 -152 128
3896 128 -74 -384 -64 174 -94 -111 -164 133 -89 107 -202 -7 42 -219 -136 -52 211 -109 -37 31 69 -82 -192
$$ packed form
3730H4k03K89k94N22l27K2j21o0jq1J46R3M1l21M00l44J44O1n9l11K72j31j8J7
3754a80L08j82M7k37J13n0K29j16j56J19K00k80j1N22j47j51j95K87j24O9j59
3775i4J03j8J33K05j14l96K82k44J71O6k12K61k14J1J60Q6J70j18J4m69J31J06
3797B0j55J02r3J19j40l4J04R2j06k1K0nJ16J1j8j05J90o2q4k7r0J72K2j11J3
3822g0P6M5j15J38P6k93K8m3J36j75O1K14j42N6j45K63j99R1J02Qk53qK69r8J30
3847A52j79mJ76j84%L77n5k91R4J87k39n4L3L28m40L13o1J68j85j42J8k1Q8n3
3871B6J86M2p8j12q1J59j3j9L1j45J35N5l31l3M74k02j80N7P2p1l8o1L2n7K80
3896A28k02l10L20K38k68j7n3K97k22J96l09J95M9k61Q3Q4K63l20P2O8L8j51j10
$$ plain form
3919 -192 -64 -92 44 -72 97 214 -98 102 -12 173 0 9 -79 -147 -77 88 -148 -22 46 83 -254 38 -84
3942 -84 176 328 178 -53 60 99 -144 15 198 110 -17 -167 -108 -140 95 -79 -200 102 -14 -63 108 -33
3964 -33 120 228 -74 83 112 -4 -65 -97 -89 248 -26 83 -146 -300 31 -167 246 -330 16 -178 -143 -225 15
3987 15 -97 -217 -20 89 -44 86 153 179 56 -133 55 -4 -258 3 -108 -169 -148 149 219 47 11 120 -143
4010 -143 39 -106 58 38 186 41 116 32 115 -3 244 -15 53 -74 47 -161 -31 8 -82 117 33 -57 -80
4033 -80 78 -333 -197 -44 -60 -203 -228 0 -274 -221 -321 -63 -250 -102 -156 -87 81 -135 158 -197 -123 -6
4055 -6 -34 -6 -48 -122 -306 -300 -35 -305 -63 -132 5 35 -58 177 63 -38 53 13 86 8 -25 -46 147 56 -113 250
4081 250 -103 228 -11 218 175 120 28 -92 134 -136 268 46 -25 13 -133 193 -159 -74 25 -24 -47 -123 -132 -27
$$ packed form
3919a92J28k8J36j16J69J17l12K00j14J85j73Rq8o8P0J65k36J26O8L7l37K92j22
3942h4K60J52j50k31J13L9k43J59J83q8j27j50N9l2K35j74j21L02j16m9J71j41
3964c3J53J08l02J57K9j16o1l2QL37k74J09k29j54L31j98M13n76L46j94L5q2K40
3987A5j12j20J97J09j33J30O7K6j23j89J88n9k54K61j11o1K1K97P0j72l6J09k63
4010a43J82j45J64k0J48j45P5q4Q3j18K47k59O8j27J21k08J30L9r0J99q4r0k3
4033h0J58m11J36J53j6j43k5K28k74N3j00K58j87J48n4O9J68k16K93l55P4J17
4055fk8K8m2p4j84OK65k70K42o9J37L0r3K35j14j01R1m0P3p8l3k1J93r1j69L63
4081B50l53L31k39K29m3n5r2j20K26k70M04k22p1L8j46L26l52Q5R9m9k3p6rJ05
$$ plain form
4105 -27 204 235 107 -11 138 145 -106 -15 -67 -86 33 227 101 53 10 256 -290 -107 133 28 31 -282 58 8
4129 8 68 52 18 -278 -45 -16 22 106 13 -73 -132 110 67 -28 -111 98 -75 206 25 -106 140 -80 189 -34 60
4154 60 -2 -120 81 98 41 -89 200 -15 315 83 17 57 348 180 38 3 78 -66 255 14 255 233 40
4177 40 212 -251 -125 227 -107 149 11 29 -31 180 -136 -196 88 -157 40 -110 -70 -278 -136 -32 47 21
4199 21 -12 127 103 24 -238 88 -39 103 -132 -53 -22 -40 19 288 120 93 -72 25 80 -94 -155 -335 -117 94
4223 94 177 -317 116 213 -114 44 -94 -210 334 116 -43 -63 70 -169 -202 288 31 68 61 115 -131 -269 -225
4246 -225 192 58 -3 -63 8 -115 125 35 199 61 -176 -92 -23 49 105 48 -10 -96 -192 6 64 -128 109 -58
4270 -58 7 144 -4 -48 11 -191 -295 58 -236 -194 -136 151 -86 162 -130 -107 -48 -3 -49 10 133 -160 -202 -84
$$ packed form
4105b7K31L1j28j18J49Pk51R1n2j9J19J94j26m8m3K46n46J83K40j05Ll13L40n0
4129HO0j6l4k96K33K9L8Q4r3q6n9K42m3r5q3K09j73K81j81j31K46k20K69k23R4
4154F0o2j18K01J7n7j30K89k15L30k32o6M0K91j68j42l5P5j44L21k41K41k2j93
4177D0J72m63J26L52l34K56j38J8o0K11l16o0K84k45J97j50M0k08J42J04P9k6
4199B1l3J39k4p9k62L26j27J42k35P9L1j8N9K69j68k7j65R7N5j74o1j80K18K11
4223I4Q3m94M33R7l27J58j38j16N44k18j59k0J33k39l3M90k57L7pN4k46j38M4
4246b25M17j34o1o0P1j23K40r0J64j38k37Q4O9P2N6n7n8q6r6J98N8j92K37j67
4270e8O5J37j48m4N9k02j04L53k94M2N8K87k37K48k92K3N9M5m6N9J23k93m2J18
$$ plain form
4294 -84 99 1 160 89 -35 -72 86 41 94 74 -209 -45 -16 53 111 -125 6 3 30 98 -59 247 -13 125 71
4319 71 110 70 -40 55 64 -21 -73 70 38 223 49 116 -44 198 66 42 185 -184 87 105 -72 -128 111 -21
4343 -21 -188 -109 -122 -140 -25 67 44 -287 -22 214 -163 -56 -150 -93 -230 29 -31 -175 -158 -158 -320 -207 77 -74
4367 -74 84 -50 155 -95 -64 -157 -3 328 15 261 -124 194 -85 53 224 249 -83 84 -201 248 83
4388 83 -135 47 108 55 131 285 183 -154 262 116 80 12 72 -46 98 158 -154 66 -14 -204 -10 -62 -62 121
4412 121 89 -84 -120 -127 -79 -126 -196 121 -280 -202 102 162 -18 -74 11 -20 -137 -278 -192 -144 -15 -88 -248 -170 41
4437 41 1 -9 -57 99 22 172 -52 -14 -114 -121 164 45 -13 -61 96 -161 -204 75 16 60 -3 103 -18 160 -22
4462 -22 -174 138 18 -95 -166 404 -234 43 -120 145 119 262 124 -56 268 57 -30 82 153 -86 -18 -3
$$ packed form
4294h4J83r8J59p1j24l7J58m5N3k0k83J64K9O9N8k36J31lK7O8j57L06k60J38n4
4319G1L9m0j10R5Rq5n2J43l2J85j74O7j60K42j32k4J43l69K71J8j77n6K39j32
4343b1j67P9j3j8J15R2k3l31K65K36l77J07r4N7j37K59o0j44J7%j62J13K84j51
4367g4J58j34K05k50L1r3J54L31l13K46l85L18k79J38J71K5l32J67k85M49j65
4388H3k18J82O1n3P6J54j02l37M16j46l6o8O0j18J44O0l12K20q0j90J94n2%J83
4412A21l2j73l6pM8m7p0L17m01P8L04O0j80n6Q5l1j17j41Q6M8J29p3j60P8K11
4437D1m0j0m8J56p7J50k24L8j00pK85j19n8m8J57k57m3K79n9M4o3J06j21J78j82
4462b2j52L12j20j13p1N70o38K77j63K65k6J43j38j80L24k11q7J12P1k39O8J5
$$ plain form
4484 -3 -14 70 -52 -86 70 -180 -216 -318 -34 -211 259 15 84 206 11 114 -214 163 -119 274 58 16 -134
4507 -134 122 -28 -58 32 -196 22 -8 -211 21 -174 -173 -248 3 -143 107 42 -70 -73 36 158 146 211 73 -191
4531 -191 -18 -106 135 -24 127 144 -235 -172 24 154 91 272 -21 -86 -144 144 -102 -393 72 408 151 133
4553 133 206 87 52 -52 -55 -85 -167 211 177 -156 -313 -41 -26 69 -77 176 -35 78 112 200 122 -135 16 157
4577 157 -255 20 -58 -57 109 -132 -254 -35 172 -81 113 -210 222 -118 -34 143 41 59 35 -26 -1 86 34
4600 34 61 45 -14 93 -141 -68 201 10 105 -153 -31 -46 -246 -35 121 -15 174 109 -2 71 -109 165 -8
4623 -8 353 59 87 -131 68 90 43 -82 -11 211 158 152 96 -35 24 185 76 -41 18 -233 -143 -53 -85 81 -112
4648 -112 3 -163 75 -127 218 -114 -177 -61 -163 -163 -140 14 -124 68 -167 -5 -47 22 -180 282 -92 -38
$$ packed form
4484cj1Q4j22l4J56k50l6j02K84j77M70k44O9J22j95J03l28L77k82L93k16m2j50
4507a34K56j50l0R0k28K18l0k03K32j95Jp5K51j46K50o5j12lJ09J22j2O5j38k64
4531a91J73q8K41j59J51J7l79O3J96J30o3J81k93o5n8K88k46k91M65L36k57j8
4553A33P3j19l5j04ll0q2L78l4l33j57K72J5R5j46K53k11J13L4Q8p8k57J51J41
4577A57m12K75p8JJ66k41j22K19K07k53J94l23M32l40Q4J77j02J8k4o1K5Q7n2
4600C4K7j6n9J07k34P3K69j91R5k58J22j5k00K11J56j36J89o5j11P3j80K74j73
4623hL61k94K8k18J99K2m7j25P1K22n3on6j31N9J61j09j17N9k51R0R0l2J66j93
4648a12J15j66K38k02L45l32o3J16j02%K3J54j38J92k35J62m2O9k02M62l74N4
$$ plain form
4670 -38 46 -60 166 118 117 149 352 87 111 -104 111 172 -53 -35 114 77 72 125 15 32 43 194 -37 173 1
4695 1 66 71 -213 102 3 -146 -5 -84 -244 94 266 44 35 -56 30 -129 10 -146 135 38 345 43 -265 1
4719 1 -246 -274 -262 -120 -81 60 161 -25 -74 57 -68 20 -269 -104 92 -71 34 68 -117 157 -103 -115 -167
4742 -167 -171 228 69 1 -143 -44 39 -296 -150 129 -95 -16 219 51 102 156 -113 -86 -65 294 43 -135 -16
4765 -16 -14 101 34 139 183 258 -51 -63 35 5 4 -3 -194 -137 -51 -134 43 6 190 33 -115 -86 21 104 -138 -75 -231
4792 -231 -64 -85 43 0 17 -134 -108 -77 -64 -241 131 38 -97 -44 -91 71 -13 -132 -193 -198 -135 -73 -125 -49 22 -97
4818 -97 89 -33 92 10 128 -143 42 243 29 99 112 149 115 -147 23 74 137 164 189 96 184 129 -173 -106 242
4843 242 -152 49 84 -43 2 155 20 -48 239 -199 85 109 -97 13 -167 297 -51 -77 82 -133 26 -128
$$ packed form
4670c8Q4j06K26m8jL2K03k65K4k15K15O1k25J8J49l7nN3j10J7J1J51k31K10j72
4695AO5Nk84L15r9j49J41p9j60L38J72k22rr1Q6j59J39j56K81r7L07l02l08K66
4719Ak47k8J2J42L9J41J01j86m9J31j25Q8k89J65J96j63J05L4j85K74k60j2n2
4742a67mL99j59o8j44R9Q3l35J46K79k24P9K35j68N1N4k69K7K1L59k51j78J19
4765a6KJ15o7J05M4P5l09j2R8l0jpj91N7Q6q3J77l7J84j57j48K9J07Q3k42O3j56
4792b31J67k1J28m3J7j51K6L1J3j77L72r3j35N3m7J62q4j19o1nO3O2n2P6P1j19
4818i7J86j22J25q2J18k71J85K01k14P0J3L7l4k62J70N1O3K7K5r3Q8n5l02O7L48
4843B42l94K01L5j27M5J53j35o8K87m38K84K4k06J10j80M64l48k6J59k15J59j54
$$ plain form
4865 -128 21 -8 -116 -166 -109 -192 162 -103 -227 38 235 -30 -181 -241 -316 -225 -68 -7 10 -99 92 -10 -2 43
4889 43 148 254 52 -85 208 -204 15 -333 -101 128 -30 66 -78 -33 -3 -45 18 230 28 -100 114 -106
4911 -106 -191 34 254 201 -90 -141 121 -74 -23 11 -43 336 30 -263 38 91 244 38 166 38 -85 -129 -11
4934 -11 91 182 -98 -175 127 12 140 -81 -346 36 -48 -153 -254 44 1 -446 -157 -107 52 120 58 62 110 -27
4958 -27 -81 -224 233 -140 -4 129 188 15 -17 -236 145 -53 -94 3 -19 -127 1 -83 -125 -65 70 112 -10 59
4982 59 129 284 138 -52 -244 -100 218 -6 20 127 155 34 176 94 -2 28 -54 164 -21 119 -204 49 158
5005 158 158 85 -61 -8 40 55 -43 -13 -134 14 -220 -89 -94 181 -26 -84 -377 65 -167 -161 -11 -162 13 -42 -225
5030 -225 -145 100 14 -71 8 -296 -89 36 -334 -158 -113 -91 -23 -142 -24 7 84 51 -106 -167 -96 -266 90 86 -171
$$ packed form
4865a28J49k9j08n0N7q3L54k65j24K65J97k65j51o0p5R1J57O1J7j09J91j02QM5
4889D3J05J06k02j37K93m12K19l48K32K29j58R6j44M5L0m2O3K12k02j28K14k20
4911a06q5K25K20n3k91n1K62j95N1L4n4L79l06k93L01N3J53k06J28j28j23m4J18
4934a1J02R1k80p7L02j15J28k21k65L82q4j05j01K98m3m47K89N0J59O8o2MM8j37
4958b7n4j43M57l73J36J33N9j73l2k19L81j98m1R7k2j08J28q4m2O0J35M2j22O9
4982E9P0J55j46j90j92J44L18k24K6J07K8j21J42q2r6L0q2K18j85J40l23K53J09
5005A58%p3j46N3M8J5r8L0j21J48k34J31nK75k07n8k93M42k32OJ50j51J75n5j83
5030b25Q0K45q6q5P9l04K07J25l70J76M5K2O8j19J18L1P7l3j57o1P1j70L56mk57
$$ plain form
5055 -171 -18 94 149 43 291 116 318 67 -196 -121 -205 -149 53 -57 216 -33 93 78 51 57 315 52 183
5078 183 44 301 128 109 47 -13 13 72 -173 260 40 -32 -39 -172 -140 -202 -163 71 -18 38 -231 106 -4 -298
5102 -298 80 -81 -108 -133 -129 120 28 -287 -66 -77 13 -159 3 218 67 9 141 198 106 126 70 -31 -72 -128 -65
5127 -65 2 19 112 -8 39 -46 111 -133 -54 -122 -57 218 23 -11 -62 158 113 128 51 -91 106 -40 -66 16 -129
5152 -129 201 -68 88 -10 160 53 82 -14 166 45 -85 -27 149 59 -184 34 56 101 -259 -412 -5 125
5174 125 122 -111 29 -42 46 -94 -209 -31 -89 -85 -109 -104 -96 -76 -47 76 -147 -108 224 58 -5 -109 -89 -86 160 43
5200 43 -23 -44 -139 44 -280 -10 -71 -137 -36 50 -6 -108 -329 -34 145 142 -62 -66 51 111 54 92 250 -52 70
5225 70 155 32 -69 137 66 326 -146 -67 -113 -58 -245 -4 -51 -137 48 11 -127 -190 -17 39 11 -15 -107 24 183
$$ packed form
5055a71J53J12N5j06K48j75K02k51k63P5q4N6K02j10K73k49J26j5k7OK58k63J31
5078A83j39K57j73j9o2o0K6N9k45M33k20p2pj33L2o2L9K34q9N6k69L37j10k94
5102b98L78j61k7k5MK49r2l15K21j1R0j72J62K15j51n8J32N7r2K0n6j01m1n6O3
5127f5O7J7R3j20M7q5J57k44P9o8O5K75j95l4n1K20m5J5p7j42J97j46k6Q2j45
5152a29L30k69J56r8J70j07K9r6J80j21j30N8J76r0k43K18K2M5l60j53M07J30
5174A25lk33J40p1Q8j40j15J78n8Mk4NQK0K9J23k23L9L32j66o3j04K0LK46j17
5200D3o6k1r5J83l24K70o1o6J01Q6n6j02k21K95J79lk04mJ17O0n7L8J58l02J22
5225G0Q5j23j01K06p1K60m72P9m6N5j87K41m7q6J85l7j38o3J73N6k8k6r2J31J59
$$ plain form
5250 183 -234 46 -98 -16 -88 -99 54 -6 88 -164 -141 -198 53 -75 -177 -127 -237 -214 72 -92 114 -124 -83
5273 -83 -17 -127 -207 212 158 229 32 6 -77 298 31 155 73 -3 82 -97 73 -135 33 97 104 -29 92 108 -16
5298 -16 23 -3 87 -175 -157 -83 -351 -159 -15 273 51 147 6 37 -9 -42 72 18 -142 115 89 63 67 -217 -110
5323 -110 22 3 -94 11 18 -51 -169 245 -170 -9 -134 -30 87 35 16 -101 -171 -188 -74 -18 -185 19 -29 104
5347 104 124 -4 -111 -178 -265 -58 -28 -49 -68 -25 -135 -245 -163 212 -10 -49 30 -194 -21 -154 39 82 -55 218
5371 218 217 75 389 278 80 -44 217 198 -59 140 126 -119 -19 80 203 -155 32 -21 -12 96 53 -87 -145
5394 -145 -215 -84 73 153 4 220 29 10 -93 -76 11 -238 -15 -86 101 48 -148 -159 -117 -196 -102 -147 -5 138
5418 138 84 -138 44 92 -51 116 -111 -43 -14 -109 232 -58 -15 115 -126 -31 176 134 11 -58 -82 58 128 200
$$ packed form
5250A83m17K80j44Q2p2j1J53o0R4k52K3n7K51j28j02N0j10K3K86j64K06k38M1
5273h3O6j10q0M19n4P1j97k6q3L75k67J24q2p6Q5j79J70k08J68O4Pj33J21J6j24
5298a6L9k6R0k62J8P4k68J92J44K88k22R6j41L1m6l3J14n4j60K57k6k6Mk84J07
5323a10J32j9r7J05Po9j18M14m15J61j25J04J17n2j9j17p0j7J14N6j67K04m8J33
5347A04K0j28j07o7q7K07L0k1j9M3j10j10Q2L75k22l9P9k24J73j33J93M3j37K73
5371B18jj42L14j11j98j24K61j9k57J99j4k45J00R9J23l58J87n3RJ08m3j40n8
5394a45p0J31J57Q0j49K16j91j9j03J7Q7k49K23p1J87n3j96j1M2p9R4m5J42J43
5418A38n4k22J82M8j43J67k27O8K9r5L41k90M3J30k41R5K07m2j23o9k4J40P0P2
$$ plain form
5442 200 80 -57 -86 -5 -124 138 9 152 -30 79 248 109 -112 18 -265 8 8 -54 -221 93 -30 -166
5464 -166 90 251 -165 17 16 12 49 -168 35 -328 -169 16 -116 -14 -111 -207 -62 -8 39 -215 270 279 -124 125
5488 125 -140 235 107 194 24 -59 156 -65 -84 -109 94 149 -248 -4 11 -183 -66 115 -171 -79 -86 42 -79
5511 -79 -156 22 -5 12 -71 70 -24 -191 70 58 154 105 97 -243 -237 2 145 49 -78 96 139 194 -120 -127 363 -123
5537 -123 112 50 9 -92 -154 63 -130 24 142 -77 99 293 154 24 67 124 82 51 31 -193 156 -140 -83
5560 -83 -100 -69 -236 -243 0 -222 18 55 141 -21 15 -119 122 133 84 -117 8 -8 -243 155 35 167 -56 113
5584 113 -181 78 -101 45 -19 -173 -113 -11 166 -32 -192 54 432 -62 69 284 150 188 151 -78 3 -105
5606 -105 9 24 -119 100 142 79 -8 51 256 52 -66 -122 62 46 -218 132 -87 -78 -213 -16 106 -237 -52
$$ packed form
5442B00j20j37k9Q1j19K62j29J43j82J09J69j39k21J30k83K73%o2j67L14j23j36
5464a66K56J61m16J82jmL7k17K03l63J59J85j32J02r7r6J45N4M7k54M85Rm03K49
5488A25k65L75j28Q7j70q3K15k21j9k5K03N5l97K44J5j94J17J81k86R2pJ28j21
5511g9p7J78k7J7q3J41r4j67K61j2R6m9ql40OK39J43r6j27J74M3N5l14pM90m86
5537a23K35o2m1j01o2K17j93J54J18k19J76J94j39j30M3N7m2l1k0k24L49k96N7
5560h3j7L1j67pK43k22K40L7Q6j62L6j34K41J1m9k01J25j6k35L98j20J32k23J69
5584A13k94K59j79J46o4j54O0J02J77j98j60K46L78m94J31K15j34L8l7k29Q1j08
5606a05J14J5j43K19M2o3q7N9K05k04j18n6J84j6k64L50k19Rj35J97J22l43J85
$$ plain form
5629 -52 214 -4 37 94 106 257 98 -273 -16 -134 -98 11 -31 -221 187 -68 -133 -30 -157 28 6 -99 -58
5652 -58 206 178 -104 -83 -130 -48 -138 42 -15 140 34 -84 -164 276 -26 -35 -179 -21 -29 -17 -91 160 261 192 -3
5677 -3 271 -24 36 -23 15 133 -13 -29 125 -225 -68 112 -100 -75 -114 -167 99 373 4 -4 273 -93 146 59
5701 59 157 -234 -133 7 99 72 -95 40 13 94 -111 192 -179 -81 79 24 9 -173 162 38 14 -135 146
5724 146 -126 40 -86 117 202 -376 85 -83 -139 -68 87 -121 77 -95 90 22 134 130 -1 97 32 77 22
5747 22 -57 54 67 129 -35 90 -94 -40 156 -196 41 -212 52 -148 137 -75 76 -10 150 -159 -229 170
5769 170 -5 -247 47 21 -417 -4 203 -18 -93 -58 -52 -158 -184 -83 304 -213 -305 24 -4 -55 -118 -213 96 -138
5793 -138 234 114 -131 -121 10 27 70 0 11 323 82 -115 209 37 -83 200 42 -194 125 -14 92 -88
$$ packed form
5629e2K66k18M1N7J2J51j59l71K57j18L6J09m2j90M08k55o5J03j27J85k2j05M1
5652e8K64k8k82K1m7Q2r0J80n7J55j06j18q0M40l02rj44J58qJ2p4K51J01o9j95
5677cK74k95O0n9L8J18j46j6J54l50J57J80k12K5l9n3K66K74l69qK77l66K39q7
5701E9R8l91J01J40R2k7j67J35k7Q1k05L03l71R8J60n5j5j82L35j24k4j49K81
5724A46k72J66j26K03Q5n78M61j68n6P1J55k08J98j72J85o8J12mj31R8o5M5n5
5747B2p9J11J3O2j64J25j84N4J96l52K37k53K64k00K85k12J51q6J60l09p0L99
5769A70j75k42K94k6m38M13K07k21p5L5Oj06k6J01L87n17r2L29k8n1o3r5L09k34
5793a38L72j20k45J0J31J7M3p0J1L12k41j97L24j72j20K83j58k36L19j39J06j80
$$ plain form
5815 -88 123 104 66 154 -6 141 187 -125 132 -40 -280 -44 169 21 173 -99 336 33 -13 82 37 -138 6
5838 6 314 -133 -67 98 182 -246 -30 32 -130 175 -98 -213 -85 186 66 -17 -73 85 -65 1 -22 291 -78
5861 -78 -72 153 74 121 25 2 -61 56 63 -43 -170 96 -104 6 -235 12 52 -2 -7 -31 89 -126 -21 88 48
5886 48 100 -85 85 285 179 -255 -322 84 195 84 262 151 -168 217 29 -33 -122 201 82 -8 -182 15
5908 15 228 -70 61 38 -35 3 -67 133 119 -56 24 -211 100 -169 -55 -23 -87 68 -235 -61 429 190 -108
5931 -108 64 70 -12 106 223 -55 100 64 -81 -102 66 -161 87 -90 67 45 -409 24 -51 -59 -120 -68 87 -59
5955 -59 140 80 -100 91 214 -67 -110 39 -84 -49 -86 29 -174 36 126 7 -52 -55 25 109 70 63 211 110 102
5980 102 -55 -153 97 -13 203 146 246 24 41 32 -80 -6 -8 -67 105 21 -23 100 -13 -52 -157 -232 203 4
$$ packed form
5815h8K11j9l8Q8j60J47M6l12K57j72k40K36K13j48J52k72M35l03m6R5m5j75J44
5838FL08m47O6J65Q4m28K16O2j62L05k73j15J28K71j20q3n6J58j50O6k3L13l69
5861g8OK25p9M7r6k3o3J17Pj06j27K66k00J10k41K47M0n4nk4J20k15J05J09m0
5886D8N2j85J70K00j06m34o7M06J11j11J78j11l19L85j88o2q9L23j19r0j74J97
5908A5K13k98J31k3p3L8p0K00j4j75Q0k35L11k69J14L2o4J55l03J74M90k39k98
5931a08J72Oq2J18J17k78J55l6j45k1J68k27K48j77J57k2m54M33p5qo1N2J55j46
5955e9J99o0j80J91J23k81m3J49j23L5l7J15k03K10R0j19n9lQ0Q4l9pJ48j01q
5980A02j57r8K50j10K16n7J00k22J7rj12P4kn9J72q4m4J23j13l9j05p5M35j99
$$ plain form
6004 4 23 -38 -138 -39 -447 -148 -47 148 -311 -89 41 121 -239 -153 91 107 105 -58 31 -95 5 -52 -25 30 -84
6029 -84 114 -176 -28 -49 -123 39 -51 -67 -178 -203 -17 238 52 110 54 258 -143 134 -110 66 86 138 90 108
6053 108 339 -3 116 115 10 248 54 94 -95 -120 -93 135 56 -126 38 110 13 46 -133 -31 87 62 130 -42
6077 -42 35 27 -149 -10 -205 -101 -70 199 -40 19 -49 20 2 182 -21 70 31 186 98 -190 -80 150 211 -205
6101 -205 -85 -43 -23 192 -322 -27 282 -62 12 -68 1 -178 -207 -133 186 -73 164 -96 -26 89 70 109 23 323
6125 323 -4 -95 -144 59 -21 -235 -121 52 80 110 -107 12 164 1 -47 -17 86 -143 81 -152 22 -98
6147 -98 -90 -20 -45 -94 117 -57 -240 151 -203 6 -181 -136 -94 -54 -157 -103 -79 -4 177 66 -105 36 -12 -58 -51
6172 -51 -54 -247 -196 135 -111 227 0 49 26 -79 7 195 -164 -222 9 158 -75 17 103 -111 52 -132 -11
$$ packed form
6004DJ9o1j00R9m08K99J01J95m59K22J30Q0l60Q6K44J6kj63Q9j26J00n7K7N5j14
6029h4J98k90J48k1p4J62r0j6j11k5J86K55j86N8n6K04m01K77k44J76K0N2m8J8
6053A08K31l42J19jj05K38j94M0j89k5K7K28p9j82J64P2r7L3j79J02J18k5O8j72
6077d2P7qj76J39j95J04L1K69k39N9o8O9j8J80k03R1l9J55q8k88J10K30O1m16
6101b05J20M2K0K15n14K95L09l44P4q0O9j79k9P4L19k59K37k60P0J15j9L9q6L00
6125C23l27r1m9K03q0k14J14J73K8L0k17J19J52j63m8L0J03k29K24k33J74j20
6147i8QP0k5m9K11j74j83L91l54K09j87M5M2M0j03N4K4P5J81j11j71J41m8m6P
6172e1lj93N1L31k46L38k27M9k3j05Q6J88l59n8K31J49k33R2Q6k14J63j84J21
$$ plain form
6195 -11 -11 -45 -88 101 154 123 -129 9 -28 -11 -113 -49 29 91 141 233 -195 108 -187 -12 -62 -65 219 29 -3 -78
6221 -78 234 67 -49 13 -42 49 -18 -305 29 -162 111 -128 35 9 42 -231 -156 61 -58 345 49 -21 6
6244 6 -29 -161 120 100 232 -218 -39 186 -57 79 38 210 -5 110 -24 70 -236 43 -98 -74 82 18 113
6267 113 -164 24 55 -72 197 -200 0 52 218 108 171 18 156 22 241 119 -9 -9 149 319 -32 -30
6289 -30 -143 -132 -136 139 -28 160 248 -5 121 159 89 -65 101 38 113 -70 -193 -167 -50 46 69 -43 -8 54 -275
6314 -275 144 -308 -270 175 -30 -85 -66 -143 39 44 106 -87 -70 -224 177 -71 -14 93 -35 -247 80 32 301
6337 301 145 -240 -81 -72 -90 -2 59 -79 -104 3 156 13 117 126 -163 -14 306 110 -51 -28 228 -167 -16
6360 -16 230 240 55 -114 63 -155 120 -106 133 101 44 -98 -151 -135 -105 -203 75 97 -163 6 -161 -10 229
$$ packed form
6195a1%l4m3J89N3l1k52J38l7J7j02O4P8O2N0R2m28L03k95J75n0lK84j90l2p5
6221g8L12j67j16O2n5R1o7k87L34j91K73k39J63k6L3k73P5K17j19M03k96p0K7
6244Fl5j32K81k0J32m50J79K25k43J36m1J72k15J15j34R4l06K79j41K4J56o4R5
6267A13k77J88L1j27K69l97K00N2J66j10O3j53J38j34K19j22j28%J58J70l51K
6289c0j13J1mK75j67J88Q8k53J26L8p0j54J66o3P5j83j23K6J17R6K3j12L5O2l29
6314b75M19m52L8M45k05n5J9p7J82NO2j93J7j54M01k48N7J07j28k12L27m8K69
6337C01j56l85J59Rj8Q8O1j38k5J07J53j43J04Rk89J49L20j96j61K3K56l95J51
6360a6K46J0j85j69J77k18K75k26K39l2n7j42n3J6L0r8K78K2k60J69j67J51K39
$$ plain form
6383 229 95 16 64 88 -91 -177 124 -71 -24 47 -56 -241 -46 -160 -168 -240 -157 57 52 150 55 -66 -21 -57 -100 175
6409 175 92 217 -109 16 66 59 -48 -56 17 -52 135 112 -128 11 177 127 123 163 -75 -90 -216 55 -250 -37 95
6434 95 -45 -35 160 -81 -216 -124 -126 12 164 352 14 255 81 26 -281 -31 -189 111 -78 -189 113 -228
6456 -228 73 -166 -71 -29 -116 -299 9 -163 128 37 -109 -4 -75 83 -16 78 -55 -76 -12 -73 -74 -50 118 -179
6480 -179 -144 155 24 -65 24 158 120 53 172 218 191 -93 -68 51 -46 34 -52 76 -95 67 -4 203 -11 63
6504 63 53 119 191 34 -4 84 -65 261 95 64 120 140 -157 29 51 94 201 256 -86 57 -98 157 -185 39
6528 39 242 59 36 -168 -159 48 -25 -182 169 80 15 195 -60 -47 72 -114 -112 -31 10 29 109 -60 7 40 -18 -53
6554 -53 -105 4 -22 -237 198 82 -139 96 -204 -119 98 24 -149 -42 42 87 -1 -87 -95 249 -5 94 218 99
$$ packed form
6383B29j34p9M8K4j79q6L01j95M7P1j03j85J95j14qp2Q3K14nR8r5j21M5l6m3K75
6409A75q3J25l26J25N0pj07qP3o9J87k3k40J39J66n0mM0k38j5j26K71l05K13J32
6434I5j40J0J95k41j35R2kJ38J52J88l38K41j74n5l07K50j58L00j89j11L02l41
6456b28L01k39R5M2q7j83L08j72K91r1j46J05p1J58r9R4j33k1O4o1jK4J68k97
6480a79L5K99j31q9Q9J34l8o7J19M6k7k84K5J19r7Q0q6J28j71J62p1K07k14P4
6504F3j0O6P2j57l8Q8j49L26j66l1N6K0k97J86K2M3J07N5l42J43j55K55l42K24
6528C9K03j83k3k04RK07p3j57L51q9o5J80k55J3J19j86KQ1M1J9Q0j69O7L3n8l5
6554e3n2J09k6k15M35j16k21K35l00Q5K17p4j73J07Q4M5q8q6qL44k54R9J24j19
$$ plain form
6578 99 158 169 90 4 -137 -4 -188 61 131 62 180 112 10 -105 319 195 34 148 173 183 -11 -8 112 299
6602 299 -243 -18 50 -12 123 162 -200 7 -309 117 -9 -51 3 -50 0 39 -14 -234 -277 53 29 201 299 -57
6626 -57 -46 -35 -151 -178 -75 149 -53 330 89 -92 -26 -115 -177 -44 96 -100 -55 9 -24 -33 -48 -123 57 200 70
6651 70 194 6 71 -33 141 249 -272 -58 107 -6 -23 170 78 227 85 59 -60 108 -40 -57 240 -24
6673 -24 -32 -58 35 -10 260 261 280 154 -155 -356 -75 -19 24 148 -138 63 -41 -111 167 91 82 -33 -202 -35 88
6698 88 -129 -4 58 93 -45 205 -178 -180 43 -5 4 19 -69 -139 -8 162 -62 216 45 -180 48 3 35 -23 4
6723 4 -85 149 -63 -117 255 -77 92 -193 -4 202 -46 107 191 249 94 10 182 292 -64 130 -155 -58 -4
6746 -4 215 151 51 64 -155 -103 200 100 -12 -265 -171 47 14 -11 32 68 179 109 -225 -81 -89 -45 -29 5 -214
$$ packed form
6578I9N9J1p9q6j41J33j84K49P0o9J18o8j02j15M24j24j61J14K5J0j94LJ20J87
6602B99n42K25O8o2J35L9l62K07l16M26j26m2N4n3N0L9n3k20m3L30k4J72R8l56
6626e7J1J1j16k7J03K24k02L83k41j81O6q9o2J33J40j96M5O4l3rj5p5J80J43j30
6651G0J24j88O5j04J74J08n21K14J65j13j7J93r2J49j42k6j19J68j48j7K97k64
6673b4qk6R3m5K70JJ9j26l09k01K81N6M3J24k86K01j04p0K78p6rj15j69J67J23
6698H8k17J25O2L5j38K50l83kK23m8RJ5q8p0J31J70k24K78j71k25K28m5L2n8K7
6723Dq9K34k12n4L72l32J69k85J89K06k48J53Q4N8j55q4J72J10l56J94k85R7N4
6746dK19o4j00J3k19N2L03j00j12k53R4K18l3k5M3L6J11p0l34J44qM4J6L4k19
$$ plain form
6771 -214 -47 126 -10 139 18 41 36 384 142 215 -63 -415 -149 216 -52 -131 -177 -65 113 -16 -39 88
6793 88 -85 240 -51 160 -62 -138 -50 77 146 87 82 271 -124 -203 20 184 -224 -91 49 60 37 73 35 79
6817 79 -180 214 54 -116 88 -52 70 117 156 28 -30 -179 35 135 130 74 -29 -130 23 89 49 107 -6
6840 -6 -38 -24 3 -25 -131 -214 36 -17 166 53 155 29 142 87 49 -6 -96 -247 -140 175 -19 -166 143 119
6864 119 -52 -269 -213 146 -90 273 -145 -4 -167 -7 163 -37 -58 17 -141 273 180 66 88 -96 -42 -20
6886 -20 -243 -85 -90 -228 143 115 216 180 35 71 -126 33 80 11 184 -78 -77 154 -53 33 -13 241 -300 -49
6910 -49 120 31 191 -16 -226 -286 12 -75 -64 -47 190 -81 -42 119 -213 -145 17 -112 -42 349 67 152 39
6933 39 102 -40 55 -271 -56 -176 -86 -42 -58 -144 56 70 -66 -21 258 26 -7 -215 -6 -140 -97 -7 -95 84
$$ packed form
6771b14J67J73j36J49j21K3nL48k42P3k78l52K66L65k68p9m6J12J78j29k3J27
6793H8j73L25k91K11k22p6Q8J27O9n9nJ89l95p9K23J64m08J33J40J1k3L6l8M4
6817G9k59L94j60j70K04j40J22M7L9j28n8j49K14J00nn6j03j01J53O6m0N8j13
6840fl2J4K7k8j06q3K50n3J83j13J02j26J13n5l8n5r0j51J07L15j94j47L09k4
6864A19j71k17N6L59k36L63m18J41j63J60J70k00k1P5j58M14r3j14K2j84N4K2
6886b0k23J58nj38L71k8J01l6j45L6j97J59M7o9J73k62JK31k07Q6m6K54n41K51
6910d9J69q9J60k07k10o0K98q7J1J7K37k71L9J61l32O8J62j29P0L91k82Q5j13
6933C9O3j42R5l26K15j20R0M4j6q6K00J4j36M5K79k32l3k08K09j34M3R0q8J79
$$ plain form
6957 84 -176 -57 183 27 -74 166 247 288 130 30 79 -98 17 62 5 -103 30 -40 -234 168 -195 376
6979 376 53 5 7 90 -341 256 -24 262 -67 -51 -86 -91 -255 -223 26 -221 -34 -566 -154 44 -32 -104 138 -220
7003 -220 36 -69 43 -47 -51 -13 96 -5 9 16 178 246 113 172 80 -208 159 346 51 -107 154 -35 48 304
7027 304 -231 -81 -238 -109 -11 -146 23 55 140 112 13 154 209 -35 82 -117 -95 151 -107 48 125 -191 -62
7050 -62 131 -85 -40 -46 28 -219 -86 199 -1 2 -6 84 -18 376 150 50 -54 -101 -297 -25 73 -3 -271 161
7074 161 -226 59 68 85 136 -32 58 231 40 -21 145 -143 -107 -10 -17 12 179 -66 -149 114 -227 93 21 33 -96
7099 -96 3 -173 48 130 184 -12 -30 90 -195 302 3 96 139 57 -70 269 68 -163 150 -50 -222 88 128
7122 128 217 16 4 -57 -11 -179 -29 -212 217 28 -157 109 -64 -68 -34 -43 110 -252 121 201 -44 125 -70
$$ packed form
6957H4k60J19K40j56j01K40Q1M1j58j00M9j77J15M5n7j08J33p0j94M02l63N71
6979C76l23m8KQ3m31N97k80K86l29J6l5nj64L2K49k47J87n32M12J98p6p2K42l58
7003b20K56j05J12r0mL8J09j01J4PJ62O8j33N9r2k88L67J87k95j58K61j89Q3K56
7027C04n35J50j57J29R8j35J69L2Q5k8r9J41N5k44J17j99K2K46k58J55P7l16J29
7050f2J93k16M5oP4k47J33K85k00LqR0j02L94k26j00j04m7j96K72R8p6k68M32
7074A61l87K85RJ7N1j68R0J73j91o1J66k88L6R7pK9J67k45q3K63l41L20p2J2j29
7099i6R9j76K21Q2N4j96j8J20k85M97k99R3M3q2j27L39k01k31L13k00j72L10M0
7122A28Q9k01j2o1M6j68J50j83M29j89j85K66j73mL4rJ53l62L73Q0k45J69j95
$$ plain form
7145 -70 220 -9 -45 -152 -180 -21 85 -187 132 -43 27 -122 -260 9 103 61 -36 116 110 -146 -99 -142 386 -137
7169 -137 46 182 -290 -44 -98 186 -43 250 127 160 -18 93 125 -69 219 188 174 -1 16 -62 -24 107 42
7192 42 -11 -22 238 -77 -113 -260 49 16 -139 333 -227 31 115 -43 -6 -89 406 83 86 -113 -180 92 -123 150
7216 150 -40 171 -87 -80 19 7 11 163 78 -2 103 -90 -106 103 412 -175 -35 -321 67 -72 62 77 -144
7239 -144 -54 -128 14 -52 -185 -71 -89 -72 -164 22 11 -77 49 -102 -123 29 58 -133 -90 -40 -109 73 161 17 -25
7264 -25 25 69 -64 -1 -149 283 364 116 72 81 24 -273 71 -14 -26 -45 207 -48 25 -31 40 325 1 29 164
7289 164 13 -77 23 -53 106 -179 -6 -119 255 128 -112 -120 -81 29 68 -214 163 -96 -85 -281 51 42 271
7312 271 -202 -72 216 -1 151 185 -10 62 68 -76 17 45 -19 -64 176 -256 34 -43 62 84 241 -86 176
$$ packed form
7145g0K90k29l6j07k8J59J06k72L19j75P0j49j38K69R4m2r7J52ok56M7m3N28n23
7169a37J83J36m72K46n4K84k29K93j23L3j78J11L2j94K88l1j4j75J7p8L8J31o5
7192D2n3j1K60l15l6j47L09l3j55M72n60K58Q4j58L7q3M95l23Lj99o7K72k15K73
7216A50j90K11k58PR9j2MJ52q5q0J05j93j6K09L09n87J40k86L88j39J34J5k21
7239a44R0p4J42o6j33J14j8J7r2J86j1q8J26j51k1J52K9j91M3N0o9J82Q8j44m2
7264b5N0M4j33O3j48M32Q1k48m4Rn7k97L44q5j2j9K52k55P3n6P1K85l24K8J35
7289A64j51r0J00p6J59k85J73j13L74j27k40qL9J10L9k82L77k59J1j96L32rK29
7312B71m73J30K88k17J52L4j95P2Oj44R3K8o4m5K40m32K90p7J05K2J57l27K62
$$ plain form
7335 176 -43 82 73 -30 12 -111 139 -11 9 -207 -111 208 -24 -14 53 -170 -103 80 -241 356 281 23 -69
7358 -69 -258 -93 -185 -170 42 32 113 -64 -77 -89 177 58 73 -8 -144 96 84 95 55 44 -178 -163 -118 124 80
7383 80 -192 69 -126 -33 -63 46 88 -142 -115 -72 2 114 165 274 93 -334 -26 -73 4 -24 299 34 115 -105
7407 -105 -196 -186 0 218 149 149 -118 204 67 -79 -92 6 22 299 -163 -22 280 232 21 -116 -129 28 170
7430 170 226 33 62 98 209 -125 -80 49 13 171 -84 -32 44 70 -17 78 129 -63 31 40 -132 84 -27 -31 90
7455 90 -79 -134 41 -228 -155 48 40 86 94 147 6 -5 31 -132 -180 -41 -115 -12 19 -154 33 -97 -61 -3 -16 -79
7481 -79 -121 -84 -73 196 -40 -253 -60 116 28 29 9 31 21 -32 -27 -43 -136 19 178 23 -4 -118 7 135 -62
7506 -62 -6 -28 47 66 210 -23 -43 99 -8 111 30 -98 -73 100 205 -91 -92 39 -80 4 -147 32 -69 -139
$$ packed form
7335A76k19J25rj03M2j23K50j50K0k16R6L19k32J0O7k23O7J83l21N97p5k58r2
7358f9j89J65r2J5K12j0Q1j77j3j2K66j19J5q1j36K40j2J1m0j1k22J5M5K42m4
7383H0k72K61j95R3l0J09M2k30K7M3P4J12N1J09j81m27L08m7P7k8L23k65Q1k20
7407a05r1J0J86K18o9%k67L22j37j46j3R8J6K77m62J41L02m8k11j37j3J57J42
7430A70N6j93K9L6J11l34M5J29l6J58k55N2P6K6q7R5N1j92R4Rj72K16j11mJ21
7455I0j69n5J75k69P3K03qM6QN3j41j1L6j63m8J39p4J03L1j73J87j30L6N8j3o3
7481g9m2L7J1K69k36k13J93J76q8Jk0K2j0n3Nj6r3J55J59j55k7j14J25J28j97
7506f2N6k2P5J9J44k33k0J42j07J19q1j28K5J73J05k96jJ31j19Q4j51J79j01p0
$$ plain form
7530 -139 116 80 -73 31 30 -143 -211 -94 187 16 3 -72 -18 -124 -46 -58 -138 -189 -121 107 281 -52 -116 -163 -64
7555 -64 152 -112 -47 -97 112 -8 -20 192 105 -114 98 -13 69 45 44 1 96 -203 230 200 24 -185 -165 198
7579 198 -188 -64 -34 53 110 32 29 110 -25 -42 -9 -19 369 -66 -161 -91 290 5 10 1 35 -59 309 62 -86 25
7605 25 -101 -134 131 98 -146 57 -142 147 71 121 -301 -203 86 55 -64 16 1 55 195 85 87 -8 33 36 50 -48
7631 -48 177 227 -143 100 6 -112 104 -62 -133 5 -241 169 -31 -172 329 151 -15 -236 -135 -7 -75 -128
7653 -128 -69 137 125 121 235 -17 145 191 -128 32 307 98 82 180 -51 -131 207 -125 -51 187 -141 13 -30
7676 -30 2 72 -57 74 -13 201 -227 23 -76 345 100 18 151 -35 53 -249 132 136 -112 -104 -193 -123 21 40 109
7701 109 158 111 142 -80 176 159 171 150 110 1 34 280 151 -93 -3 142 77 156 33 -330 216 -87 178 255
$$ packed form
7530a39K55l6j53J04jj73o8J17K81j71j3p5N4j06P8j2q0n1O8K28J74l33o4m7R9
7555f4K16k64O5n0K09j20j2K12q7k19K12j11Q2k4jm3R5k99M33l0j76k09K0L63
7579A98l86J24L0Q7N7p8lQ1j35j7L3j0L88m35r5P0L81k85NrL4r4L68k47j48J11
7605B5j26l3K65l3k44K03j99K89p6N0m22R8K89l1j19Q0j5N4J40j10Kr5M1LJ4r8
7631d8K25N0l70K43r4j18K16j66p1J38k46M10k00j41N01j78j66k21J01J28o8n3
7653a28N9K06j2mJ14k52J62M6l19J60K75k09j6R8k31q0L38l32P4K38l28J54m3
7676c0L2P0j29J31q7K14m28K50r9M21k45q2J33j86Q8l02L81Mk48Qq9P0J44J9O9
7701A09M9m7L1k22K56j7J2k1m0j09L3K46j29k44R0J45o5P9j23l63N46l03K65P7
$$ plain form
7725 255 -3 146 159 9 17 80 16 -105 -91 -15 7 143 -90 49 186 378 -142 -86 -43 108 225 -242 28
7748 28 160 -111 111 -40 -15 117 -87 -22 -77 64 115 -22 134 222 -26 -27 -24 -146 -22 123 -38 112 271
7771 271 270 169 142 -76 98 87 -78 114 16 -26 -45 -94 156 1 -101 127 -143 130 -45 -133 130 -288 -84
7794 -84 132 291 47 -166 190 -66 -167 23 253 128 -87 50 41 -257 -112 -10 47 16 -215 -108 55 -135
7816 -135 99 53 -101 -38 353 -43 -231 12 3 -257 11 -27 167 51 117 71 -205 -187 52 -26 -122 -122 -35 -374
7840 -374 -127 -88 -194 -185 115 42 84 -14 109 -31 143 -70 76 72 -111 124 37 -2 -40 100 -183 -52 -243 27
7864 27 -43 103 -18 30 110 -118 -216 -11 235 -66 291 -175 166 -107 -116 29 398 81 73 103 -139 -61 69 42
7888 42 -248 59 -153 -154 247 62 -197 41 -125 148 -58 2 -145 -65 -64 -21 -114 -85 164 51 -75 -18 -167 113
$$ packed form
7725B55k58J49J3j50QO3o4j21J4P6K2J36k33J39J37J92n20N6M3J51J17m67K70
7748B8J32k71K22j51K5J32k04O5n5J41N1j37J56Q8k48jLj22J24J45j61J50J59
7771B71jj01k7k18J74j1j65J92r8m2j9m9K50j55j02K28k70K73j75q8K63m18K04
7794h4K16J59k44k13L56k56j01J90K30j25k15J37rk98J45J02N7l1k31J07J63j90
7816a35K34m6j54O3L91l96j88K43rk60K68l8J94j16O6m6k76J8K39p8r6%Q7l39
7840c74K47L9j06RL00p3M2r8J23j40J74k13J46mj83K35q7l9l8J40k83J31j91K70
7864B7p0J46j21M8Q0k28r8K05K46l01L57m66L41k73rJ45L69l17qL0k42P8J30k7
7888D2k90L07k12jM01j85k59K38j66K73k06O0j47Q0JM3r3K9K49j13j26N7j49K80
$$ plain form
7912 113 39 -112 -168 -34 106 -222 -168 254 0 65 -35 21 35 -43 147 -68 198 31 -2 20 34 -62 212 -18
7936 -18 195 4 -277 400 18 -44 -184 350 150 150 80 -23 258 112 29 -185 164 234 -190 45 -171 59
7958 59 120 -25 113 98 157 -35 -222 -32 220 53 128 -141 32 -183 -76 193 -67 158 30 109 220 83
7980 83 -157 -192 5 80 89 -42 -29 -53 -129 -171 -58 -165 -50 -50 -224 -126 -63 81 -39 173 67 -192 -194 -6 -177
8005 -177 -26 -18 -198 23 -81 61 154 4 247 -219 334 46 41 -241 38 -41 172 -199 -32 238 -130 -173
8027 -173 -31 -177 -81 -79 166 -62 188 70 114 412 205 -117 -77 -13 -221 34 -243 -125 71 -59 -36 115
8049 115 -123 43 -110 155 285 -263 -170 18 179 124 -18 98 101 48 66 138 -133 32 16 105 59 -48 144
8072 144 -6 48 -9 5 6 308 8 -95 -69 195 128 -94 -34 56 -146 186 38 17 96 202 177 106 134 30 -99
$$ packed form
7912A13p4j51n6J34J40l28N4M22k54O5j00N6J4p8J90k15K66j67l3K2J4r6K74k30
7936a8K13j91k81O77l82o2j40N34k00%p0j03K81j46q3k14L49P0m24K35k16K30
7958E9O1j45J38j5N9j92j87J90K52j67P5k69J73k15J07K69k60K25j28P9J11j37
7980H3k40l5J97P5Rj31J3k4p6m2J13j07J15%j74R8O3J44j20K12j06k59kJ88j71
8005a77J51Qj80K21j04J42R3j50K43m66N53k88nk82K79p9K13l71J67K70l68m3
8027a73J42j46R6KK45k28K50j18M4K98k07l22M0O4k08K55k77J18J96j30K3J51
8049A15k38J66j53K65J30n48R3J88J61n5j42J16Ln3J8P2k71J65j6Q9m6j07J92
8072A44j50N4n7J4JL02l00j03K6K64o7k22O0R0k02L32j48k1P9J06k5p1K8j04j29
$$ plain form
8097 -99 -35 14 77 -356 136 100 -192 162 -153 157 206 53 -160 281 132 287 -179 215 -14 -196 121 104
8119 104 -69 -144 83 -42 41 72 80 33 -11 -102 38 -36 -28 103 -137 -130 -197 -241 14 134 63 16 -19 -244 -151 72
8145 72 134 -253 -233 -230 37 27 19 -199 -57 110 -187 -62 34 -343 -31 239 208 164 -258 223 62 65 112 -4 -280
8170 -280 -56 129 45 131 130 -21 36 -321 -298 -4 40 229 231 32 -265 149 54 50 -22 -103 -116
$$ packed form
8097i9O4M9O3m33M92l6k92L54l15L10M9j53k13M41j49J55m66L94k29j82L17j7
8119A04j73p5K27j25Q3L1Qm7m4r1J40p4QJ31k40Po7m4K55J20p1m7l5k25R3K23
8145G2O2l87K0LK67j0qk18J42J67k97J25R6l77L12K70l1m4m22M81j61LM7j16k76
8170b80K24J85q4Q6jj51N7l57K3K94M4J89Kj99k97M14r5mp2q1j3
8191a16
$$ Imaginary data points
##PAGE= N=2
##DATA TABLE= (X++(I..I)), XYDATA
$$ plain form
0 0 0 0 0 0 0 0 0 0 0 0 0 0 0 0 0 0 -6 8 -8 8 -8 8 -16 16 -16 24 -24 30 -32 40 -43 48 -56 64 -72 81 -93 102
38 102 -117 128 -143 159 -177 197 -217 241 -267 293 -323 356 -392 430 -477 524 -580 641 -709
57 -709 790 -881 988 -1115 1270 -1461 1705 -2028 2485 -3176 4367 -7023 30397 -25723 -9064
72 -9064 42858 -11232 14779 385 -15184 14774 -3631 -12577 7481 -16490 -8077 5825 -8541
85 -8541 -15145 -4840 1184 -1984 -12621 -11012 1346 6594 -11695 -11463 3352 -2556 -2563 -1625 -10418
100 -10418 -1035 -1757 -3225 2429 -14412 -7169 11362 -8344 -9696 188 -4683 4017 -3516 -12103
114 -12103 6483 2509 -7386 1385 -1820 -2018 5454 887 -4534 -1026 3914 4245 1053 -4259 -1168
129 -1168 9754 3264 -3925 4155 2983 3704 6920 -786 3231 6748 3213 6982 1802 1955 8571
$$ packed form
0@%%%%%%%%%%%%%%%%oJ4j6J6j6J6k4L2l2M0m8N4o2P2q3R1j04J20j36J53j74J95
38A02k19K45k71L02l36L74m14M58n08N60o16O79p48Q22r07J001j104J221j350
57g09J499j671J869k103K385k731L166l733M513n661P543j1390L7420n6120J6659
72i064N1922n4090K6011j4394j5569K9958j8405q946K0058k3971Q413J3902j4366
85h541o604J0305O024l168j0637J609J2358N248j8289K32J4815n908pR38q793
100a0418R383p22j468N654j6841P243J8531j9706j352R884m871Q700p533q587
114a2103J8586l974r895Q771l205j98P472m567n421L508M940L31l192n312L091
129a168J0922o490p189Q080j172P21L216p706M017L517l535L769n180J53O616
$$ plain form
144 8571 3744 3593 1577 544 9599 1548 -4078 3743 884 1293 801 -5388 -1472 773 -1206 -2915
160 -2915 -6269 -2812 -1089 -2395 -3626 -7158 -1607 617 -6115 -2652 -2805 -2895 1895 -4116 -4095 784
176 784 -1606 138 -1840 -4650 1372 777 -1668 -2270 -3818 1720 944 -3475 -798 -2135 410 2652
192 2652 -3222 -1857 1346 438 2060 -527 -1146 3213 2835 605 -420 1773 4324 2019 1833 1219
208 1219 1593 5835 2861 291 3170 3077 4926 3617 -564 3039 5053 2946 2536 231 2662 4413
224 4413 1360 1143 497 1318 2942 202 -1088 -305 114 818 -1707 -3065 -945 -192 -1109 -3876 -3195
241 -3195 -628 -1353 -2178 -3582 -3334 -306 -1640 -3154 -2551 -3342 -496 -319 -4317 -2393 -1060 -1349 -762
258 -762 -3550 -2061 607 -1226 -2076 -1763 -1752 70 -350 -1875 -1908 -569 1404 -470 -2013 -444 95
$$ packed form
144H571m827j51k016j033R055q051n626P821k859M09m92o189L916K245j979j709
160b915l354L457J723j306j231l532N551K224o732L463j53r0M790o011K1M879
176G84k390J744j978k810O022n95k445o02j548N538p76m419K677j337K545K242
192B652n874J365L203r08J622k587o19M359l78k230j025K193K551k305j86o14
208A219L74M242k974k570K879r3J849j309m181L603K014k107m10k305K431J751
224D413l053k17o46Q21J624k740j290P83M19P04k525j358K120P53r17k767O81
241c195K567p25q25j404K48L028j334j514O03p91K846J77l998J924J333k89N87
258g62k788J489K668j833q50L13J1J822m20j525l3J339J973j874j543J569N39
$$ plain form
275 95 1418 -228 -1613 1034 1545 1000 773 -293 1669 2503 737 1516 782 1848 3689 1142 1040
292 1040 1974 2894 3429 1042 314 2910 2414 1532 559 436 1925 1706 762 -471 -137 1226 690 -552
310 -552 -1018 -966 908 -13 -2449 -1740 -38 -461 -1382 -2152 -1420 -665 -937 -2069 -2133 -1478 -1034 -1170 -1598 -2463
330 -2463 -1086 68 -1345 -1959 -1262 -594 461 -1421 -2084 621 63 -440 -125 -1116 132 913 18 -368
348 -368 -792 873 1720 195 -459 570 1893 1395 -221 643 1460 1671 1572 425 1175 2208 1656 2167
366 2167 938 1112 3301 2291 1226 1134 1165 3214 1979 44 1517 1783 1563 1064 -334 544 925 303
384 303 -162 -996 -930 561 -361 -1806 -1862 -501 27 -1772 -2235 -1688 -692 -978 -2451 -1693 -1532 -1163 -813
403 -813 -2173 -2536 -972 -906 -1308 -2351 -2433 -456 -1000 -2197 -1795 -1308 -226 -994 -1991 -1233 -754 -386 -173
$$ packed form
275I5J323j646j385K647N11n45k27j066J962Q34j766P79p34J066J841k547j02
292A040R34R20N35k387p28K596m96q82r73j23J489k19r44j233L34J363n36j242
310e52m66N2J874r21k436P09J702m23r21p70P32P55k72j132o4O55M44j36m28q65
330b463J377J154j413o14O97O68J055j882o63K705n58n03L15r91J248P81q95l86
348c68m24J665Q47j525o54J029J323m98j616Q64Q17K11r9j147P50J033n52N11
366B167j229J74K189j010j065r2L1K049j235j935J473K66k20m99j398Q78L81o22
384C03m65q34O6J491r22j445n6J361N28j799m63N47R96k86j473P58J61L69L50
403h13j360l63J564O6m02j043q2J977n44j197M02M87J082p68r97P58M79L68K13
$$ plain form
422 -173 -1419 -730 354 506 -137 -1055 565 1377 380 438 347 1056 2002 299 943 1436 884 2450 1246
441 1246 198 1831 1516 2184 1509 -94 2448 2389 657 1355 1059 1973 2239 354 939 1081 619 1739
459 1739 53 -570 551 765 234 -844 -995 290 -368 -851 -1320 -1258 -92 -1036 -1257 -1028 -1859 -505
477 -505 -593 -2009 -1022 -1305 -827 -415 -2203 -1310 221 -1505 -1029 -1279 -1528 141 -617 -1558 -769 -786 -54
496 -54 90 -1278 -647 659 789 -328 -314 383 1041 1055 63 262 1652 1203 1146 1374 213 1635 2132 444
516 444 1243 859 1829 2579 480 675 1889 1078 1386 676 413 1893 1462 492 436 540 1006 919 432 -699
536 -699 111 839 -348 -1101 -795 -578 371 -1225 -2375 83 -791 -1411 -699 -2816 -1275 -206 -2560 -1449
554 -1449 -1878 -1937 -268 -1710 -2521 -918 -1219 -936 -1327 -2370 -430 -449 -941 -798 -1183 -545 159 -446 -771
$$ packed form
422a73j246O89J084J52o43r18J620Q12r97N8r1P09R46j703O44M93n52J566j204
441A246j048J633l15O68o75j603K542n9j732O98k96R14K66j885N85J42m62J120
459A739j686o23J121K14n31j078j51J285o58m83m69O2J166r44k21K29q31J354
477e05q8j416R87k83M78M12j788Q93J531j726M76k50k49J669p58r41P89j7P32
496e4J44j368O31J306J30j117J4O97O58J4r92J99J390m49n7K28j161J422M97j688
516D44P99l84R70P50k099J95J214q11L08p10k63J480m31r70n6J04M66q7m87j131
536f99Q10P28j187p53L06K17R49j596j150K458q74o20P12k117J541J069k354J111
554a449m29n9J669j442q11J603l01K83l91j043J940j9m92J43l85O38P04o05l25
$$ plain form
573 -771 -1123 623 425 -880 -119 300 724 1114 -520 369 1373 683 1313 451 209 2205 1104 1145 1263
592 1263 781 2461 1477 244 1624 1303 1423 1604 374 1001 1547 751 759 322 784 1283 722 69 -126
611 -126 506 991 -83 -348 -229 327 411 -944 -766 -317 -598 -290 -797 -1462 -175 -774 -826 -739 -1638 -174
631 -174 -281 -1599 -819 -882 -518 -363 -1651 -1220 -142 -710 -319 -1033 -890 -249 -122 -148 -622 -154 295 -140
651 -140 -255 -199 -14 1163 219 225 611 452 1379 632 -130 1322 931 872 1290 174 1069 1653 686 844 621
672 621 973 1595 648 364 843 995 1087 264 275 268 700 667 -345 -143 432 213 -194 -366 -606 225 -245 -841
694 -841 -811 -1202 -34 -213 -1582 -676 -838 -893 -603 -1709 -1403 -544 -883 -839 -1225 -1207 -493 -842 -1267 -1174 -914
715 -914 -380 -832 -1085 -762 -481 -124 -552 -902 -168 -265 257 -304 -549 488 413 -53 401 -99 754 1411 53
$$ packed form
573g71l52J746j98j305P61M19M24L90j634Q89J004o90O30q62k42J996j101M1J18
592A263m82J680r84j233J380l21J20J81j230O27N46p96Qm37M62M99n61o53j95
611a26O32M85j074k65J19N56Q4j355J78M49k81L08n07o65J287n99n2Q7q99J464
631a74j07j318P80o3L64J55j288M31J078n68L91p14J43O41J27k6m74M68M49m35
651a40j15N6J85J177r44OL86j59R27p47p62J452l91n9M18j116Q95N84r67J58k23
672F21L52O22r47k84M79J52R2q23J1pM32l3j012K02N75k19m07j72k40Q31m70n96
694h41L0l91J168j79j369R06j62n5K90j106L06Q59l39M4l86J8P14l49m25R3K60
715i14N34m52k53L23K81L57m28l50P34r7N22n61k45J037p5m66M54n00Q53O57j358
$$ plain form
736 53 512 755 820 1303 302 425 1687 1137 938 862 717 1463 1322 721 618 782 1125 1085 425 476 866
757 866 923 741 -31 496 578 559 392 -320 246 445 -191 22 -40 -120 150 -400 -451 -421 -292 -18 -622 -755 -414
780 -414 -409 -599 -712 -1309 -551 -378 -806 -855 -1021 -598 -416 -784 -693 -672 -408 -189 -522 -744 -419 -152 -122 -577
802 -577 -204 31 218 -60 -471 -45 705 103 -30 27 490 762 417 221 511 287 956 578 122 694 882
823 882 716 610 424 523 1078 542 204 63 638 359 110 255 15 337 600 -51 -179 -121 350 334 -378
844 -378 -583 -250 -282 -260 -483 -751 -313 -356 -718 -841 -785 -542 -522 -1100 -793 -756 -447 -374 -1276 -804 -424 -635 -724
867 -724 -618 -763 -434 -411 -521 -625 -591 179 -95 -315 -372 -90 50 202 -430 58 496 549 232 353 770 818
889 818 474 554 519 848 1252 507 560 586 1069 1107 564 500 783 1106 803 761 632 904 859 494 435 476 600 606
$$ packed form
736E3M59K43O5M83j001J23J262n50j99p6j45P46j41o01j03J64L43m0o60N1L90
757H66N7j82p72N27Q2j9j67p12N66J99o36K13o2q0K70n50n1L0J29K74o04j33L41
780d14Nj90j13n97P58J73m28m9j66M23J82l68R1K1K64K19l33k22L25K67L0m55
802e77L73K35J87k78m11M26P50o02j33N7M63K72l45j96K90k24O69l78m56N72J88
823H82j66j06j86R9N55n36l38j41N75k79k49J45k40L22K63o51j28N8M71j6p12
844c78k05L33l2K2k23k68M38m3l62j23N6K43K0n78L07L7L09P3r02M72L80k11q9
867g24J06j45L29K3j10j04L4P70k74k20n7K82J40J52o32M88M38N3l17J21M17M8
889H18l44Q0l5L29M04p45N3K6M83L8n43o4K83L23l03m2j29K72m5l65n9M1J24O
$$ plain form
913 606 219 -218 123 408 148 -131 -405 -59 220 -440 -748 -297 -201 -244 -382 -809 -381 -403 -700 -547 -909
934 -909 -572 -213 -750 -745 -745 -474 -227 -959 -952 -479 -399 -583 -553 -777 -508 -328 -367 -731 -592 49 38 -163 -386 -73
958 -73 399 251 -3 407 466 677 626 60 416 915 699 495 292 312 855 616 525 556 485 653 449 122 246
981 246 394 603 445 -45 350 557 256 204 -144 154 291 118 -65 -201 -2 -27 -514 -686 -432 -337 -313 -700
1003 -700 -841 -357 -431 -514 -540 -1106 -254 -419 -757 -625 -947 -473 -310 -721 -617 -540 -451 -263 -482 -538 -90 14
1025 14 -138 34 -107 -87 125 105 -99 284 667 204 365 105 442 501 640 377 594 587 930 659 408 840
1047 840 1024 978 618 563 1070 779 466 740 364 980 740 560 315 405 518 529 -89 120 344 299 407 -379
1069 -379 -84 128 -218 -359 -659 -444 14 -256 -335 -587 -719 -475 -567 -991 -732 -663 -599 -345 -1079 -805 -377
$$ packed form
913F06l87m37L41K85k60k79k74L46K79o60l08M51R6m3j38m27M28k2k97J53l62
934i09L37L59n37N%K71K47p32PM73Q0j84L0k24K69J80l9l64J39O41j1k01k23L13
958g3M72j48k54M10N9K11n1n66L56M99k16k04k03K0N43k39r1L1p1J68k04l27J24
981B46J48K09j58m90L95K07l01n2l48K98J37j73j83j36J99k5m87j72K54R5K4l87
1003g00j41M84p4q3k6n66Q52j65l38J32l22M74J63m11J04P7Q9J88k19n6M48J04
1025A4j52J72j41K0K12k0k04L83L83m63J61k60L37N9J39k63K17pL43k71k51M32
1047H40J84m6l60n5N07k91l13K74l76O16k40j80k45R0J13J1o18K09K24m5J08p86
1069c79K95K12l46j41l00K15M58k70p9k52j32K44r2m24K59O9O4K54p34K74M28
$$ plain form
1090 -377 -661 -605 -653 -560 -205 -649 -354 -482 -564 -149 -561 -451 -89 -246 -158 -184 -283 89 437 410 79 -82 569
1113 569 286 297 432 298 486 729 113 366 449 435 715 132 606 786 403 536 251 276 654 489 82
1134 82 104 370 304 98 -68 12 9 334 163 -328 -153 -148 191 -295 -488 -71 -215 -357 -648 -318 -581 -193 -390
1157 -390 -485 -557 -341 -70 -632 -644 -239 -458 -367 -259 -440 -479 -42 -241 -180 -329 -90 -395 -37 -185 -404 219
1179 219 62 -89 -50 54 74 414 -5 111 450 355 587 415 370 796 728 669 688 494 772 526 751 505
1201 505 537 723 734 108 539 468 404 344 195 336 378 348 307 138 457 459 27 -13 -237 86 -42 -217 -255 169
1225 169 -358 -13 -266 -642 -463 -392 -405 -709 -724 -366 -444 -652 -722 -702 -556 -428 -611 -621 -402 -592 -321 -314 -442
1248 -442 -248 -385 -436 -434 -403 -123 -363 -74 -72 -282 152 -36 -258 139 172 155 108 91 303 285 398 16 194 606
$$ packed form
1090c77k84N6m8R3L55m44K95j28q2M15m12J10L62j57Q8k6r9L72L48k7l31j61O51
1113E69k83J1J35j34J88K43o16K53Q3j4K80n83M74J80l83J33k85K5L78j65m07
1134H2K2K66o6k06j66Q0lL25j71m91J75NL39m86j93M17j44j42k91L30k63L88j97
1157c90r5p2K16K71n62j2M05k19R1J08j81l9M37j99O1j49K39l05L58j48k19O23
1179B19j57j51L9J04K0L40m19J16L39r5K32j72m5M26o8n9J9j94K78k46K25k46
1201E05L2J86J1o26M31p1o4o0j49J41M2l0m1j69L19Km32m0k24L23j28j75l8M24
1225A69n27L45k53l76J79P1j3l04j5L58p8k08p0K0J46J28j83j0K19j90K71Pj28
1248d42J94j37n1KL1K80k40K89Kk10M34j88k22L97L3j7m7j7K12j8J13l82J78M12
$$ plain form
1272 606 376 457 522 342 589 604 325 149 374 300 412 185 337 384 271 391 205 195 224 268 117 4 260
1295 260 502 120 23 -141 130 169 -110 -276 -279 -103 -147 -260 -405 -304 -64 -194 -141 -453 -413 -334 -322 -427 -142
1318 -142 -305 -165 -342 -343 -304 -297 -141 -182 -417 -191 -19 -23 165 -132 267 235 -42 -146 -6 400 219 236 239 92
1342 92 257 336 152 272 711 633 744 347 552 572 346 500 558 288 532 522 120 347 325 232 268 6 404
1365 404 427 140 168 -229 119 -8 116 -201 -294 -251 -166 -228 -178 -464 -408 -152 -244 -340 -570 -614 -213 -473 -561 -324
1389 -324 -434 -590 -400 -604 -570 -264 -684 -702 -378 -504 -533 -462 -460 -388 -109 -83 -493 -493 -44 207 14 57 -149 -77
1413 -77 154 309 94 69 383 251 254 290 474 453 340 196 210 370 617 296 215 500 260 206 552 101 424
1436 424 459 513 296 25 330 417 351 176 -61 233 25 45 168 -54 28 68 -301 -198 -57 -261 -163 -323 -325
$$ packed form
1272F06k30Q1O5j80K47J5k79j76K25p4J12k27J52M7j13J20j86j0K9M4j51j13K56
1295B60K42l82r7j64K71L9k79j66lJ76m4j13j45J01K40j30N3l12M0P9J2j05K85
1318a42j63J40j77jL9PJ56m1k35K26J72mJ88k97L99l2k77j04J40M06j81J7Lj47
1342I2J65P9j84J20M39p8J11l97K05K0k26J54N8k70K44j0m02K27k2r3L6k62L98
1365D04K3k87K8l97L48j27J24l17r3M3Q5o2N0k86N6K56r2r6k30m4M01k60q8K37
1389c24j10j56J90k04L4L06m20j8L24j26k9P1KP2K79K6m10%M49K51j93M3k06P2
1413g7K31J55k15k5L14j32LL6J84k1j13j44J4J60K47l21q1K85k40n4L46m51L23
1436D24L5N4k17k71L05Q7o6j75k37K94k08K0J23k22Q2M0l69J03J41k04R8j60k
$$ plain form
1459 -325 -51 -124 -405 -226 -239 -224 -282 -364 -237 -333 -371 -308 -468 -53 -426 -151 -240 -366 -85 -157 -246 -164 -199 58
1483 58 264 -99 -17 -14 44 -46 223 -41 413 135 101 374 184 438 493 292 357 509 154 416 384 179 303
1506 303 539 611 278 155 407 215 396 28 -33 243 278 -158 39 -43 59 115 126 159 -54 -106 -129 -140 -102 160
1530 160 -308 -468 -212 -202 -292 -337 -604 -175 -430 -420 -580 -641 -363 -548 -478 -470 -440 -427 -239 -364 -369 -342 -134 -171 -300
1555 -300 -238 -222 -18 230 88 -151 -228 97 -198 55 1 279 290 170 -11 357 191 151 415 200 368 390
1577 390 37 497 119 251 576 337 414 339 305 524 293 599 -41 217 -99 233 142 318 251 -164 280 -201
1599 -201 80 -124 -188 -16 -65 -77 38 -6 -417 9 -347 -37 -103 -84 -256 -357 -147 -355 -341 -221 -215 -235 -130
1622 -130 -291 -180 -327 -599 -283 -67 -53 -215 -268 -104 50 165 1 60 -180 51 -17 50 -260 24 296 336
$$ packed form
1459c25K74p3k81J79j3J5n8q2J27r6l8O3j60M15l73K75q9j26K81p2q9Q2l5K57
1483E8K06l63Q2LN8r0K69k64M54k78l4K73j90K54N5k01O5J52l55K62l2k05J24
1506C03K36P2l33j23K52j92J81l68o1K76L5m36J97q2J02N6J1L3k13n2k3j1L8K62
1530A60m68j60K56J0r0m5k67M29k55J0j60o1K78j85P0QL0J3J88j25nK7K08l7j29
1555c00O2J6K04K48j42k39p7L25k95K53n4K78J1j20j81L68j66m0K64k15J68K2
1577C90l53M60l78J32L25k39P7p5l4K19k31L06o40K58l16L32r1J76o7m15M44m81
1599b01K81k04o4J72m9j2J15m4m11M26l56L10o6J9j72j01K10k08J4J20Ok0J05
1622a30j61J11j47k72L16K16J4j62n3J64J54J15j64N9k40K31o8O7l10K84K72M0
$$ plain form
1644 336 124 256 230 318 220 318 330 385 345 321 124 330 402 227 246 325 433 -7 92 26 -9 128 123 -169 187
1669 187 -71 -110 295 -222 -119 135 9 -59 -251 -219 -133 -382 -257 -194 -321 -313 -509 -326 -612 -265 -293 -307 -571
1692 -571 -401 -648 -161 -91 -147 -474 -405 -134 -236 -336 -211 -237 -437 -359 -197 -142 133 13 -67 -79 209 98 119
1715 119 57 182 45 80 231 265 473 317 352 229 396 158 258 54 146 340 426 273 309 211 244 235 270 404
1739 404 293 48 331 191 48 127 156 124 -191 43 199 248 -44 -44 -102 -10 -278 -142 -35 -269 -256 -186 -72
1762 -72 -107 -212 41 -168 -366 -332 -254 -116 -323 -457 -494 -101 -193 -288 -132 -309 0 -460 -178 -90 -200 57 -446
1785 -446 -46 92 76 111 -98 73 249 51 118 -151 484 34 243 218 128 334 346 60 295 278 127 66 110
1808 110 135 206 94 229 198 -2 222 114 52 267 23 223 182 -19 -148 -158 120 -116 44 -117 -57 -296
$$ packed form
1644C36k12J32k6Q8r8R8J2N5m0k4j97K06P2j75J9P9J08m40R9o6l5J37nk92L56
1669A87k58l9M05n17J03K54j26o8j92L2Q6k49J25O3j27Qj96J83k86L47k8j4k64
1692e71J70k47M87P0n6l27O9K71j02j00J25k6k00P8J62N5K75j20q0j2K88j11K1
1715A19o2J25j37L5J51L4K08j56L5j23J67k38J00k04R2J94Q6j53L6r8L3rL5J34
1739D04j11k45K83j40j43P9K9l2l15K34J56M9k92%n8R2k68J36J07k34J3P0J14
1762g2l5j05K53k09j98L4P8J38k07j34l7L93r2r5J56j77L09m60K82Q8j10K57n03
1785d46M00J38j6L5k09J71J76j98O7k69O35m50K09k5r0K06J2k86K35j7j51o1M4
1808A10K5P1j12J35l1k00K24j08o2K15k44K00m1k01j29j0K78k36J60j61O0k39
$$ plain form
1830 -296 -36 -230 -258 -376 -295 -234 -404 -145 -74 -356 -316 -261 -389 -408 -167 -160 -260 -228 -350 -324 -362 -292 144 -186
1854 -186 -90 -245 46 -76 -268 -84 -29 41 14 48 -88 262 261 202 -14 128 -64 394 583 134 262 93 436
1877 436 434 122 172 370 338 365 284 279 213 195 363 536 189 372 358 72 73 418 234 77 -189 274 286 -77 16
1902 16 10 -141 215 -51 -192 -84 -120 118 -116 -226 -227 -308 -425 -299 -256 -62 8 -81 -426 -119 -343 -103 -73 -180
1926 -180 -149 -120 -175 -373 -299 -234 1 -167 -115 -320 -29 -50 -8 14 87 158 409 -83 305 281 58 273 28 251
1950 251 260 438 307 30 245 268 297 133 209 139 110 146 80 455 302 136 -74 242 -44 158 72 -135 -106 185
1974 185 65 32 -95 274 -94 -146 -54 -297 -367 -58 -54 -290 -34 -211 -16 -125 -395 -128 -158 -183 -352 -340 -316
1997 -316 -72 -251 -393 -111 -76 -10 -243 -162 158 -265 -65 18 -123 46 -59 248 70 280 -42 86 172 59
$$ packed form
1830b96K60j94k8j18Q1O1j70K59P1k82M0N5j28j9K41Pj00L2j22K6l8P0M36l30
1854a86R6j55K91j22j92J84N5P0k7L4j36L50jn9k16J42j92M58J89m49J28j69L43
1877D36kl12N0J98l2K7q1no6j8J68J73l47J83j4k86JL45j84j57k66M63J2l63R3
1902A6oj51L56k66j41J08l6K38k34j10jq1j17J26M3J94P0q9l45L07k24K40L0j07
1926a80L1K9n5j98P4O5K35j68N2k05K91k1M2K2P3P1K51m92L88k4k23K15k45K23
1950B51RJ78j31k77K15K3K9j64P6p0k9L6o6L75j53j66k10L16k86K02q6k07K9K91
1974A85j20l3j27L69l68n2R2k43p0L09Mk36K56j77J95j09k70K67l0k5j69J2K4
1997c16K44j79j42K82L5O6k33Q1L20m23K00Q3j41J69j05L07j78K10l22J28Q6j13
$$ plain form
2019 59 -24 289 142 106 437 329 250 212 295 475 71 331 180 258 135 323 221 3 206 37 257 49
2041 49 232 99 117 224 23 202 21 142 -121 14 -20 -104 -194 58 9 -332 -179 47 -192 -39 -454 -288
2063 -288 -279 -258 -134 -476 -214 -239 -169 -297 -473 -284 -7 -486 -407 -112 -264 43 37 -343 -200 -127 37 2 40 4
2087 4 130 178 14 -128 112 204 163 77 242 125 252 195 31 90 119 -28 -15 82 -61 346 245 85 257 366
2111 366 324 73 291 -56 78 141 57 143 59 436 179 32 -20 220 32 -58 -193 -84 -81 24 -270 -252 -62
2134 -62 -90 -161 -212 190 -43 -171 -319 -284 -119 -113 70 -100 -233 -47 14 -193 -302 -280 -147 -253 -118 -264 -53
2157 -53 -28 -205 -143 135 -78 81 -97 159 78 11 268 50 -42 255 349 -49 169 225 490 278 251 154 328
2180 328 23 561 366 230 96 310 290 321 201 158 140 317 -21 98 -86 131 58 46 160 212 -31 -281
$$ packed form
2019E9q3L13j47l6L31j08p9l8Q3J80m04K60j51P8j23J88j02k18K03j69K20k08
2041D9J83j33J8J07k01J79j81J21k63J35l4q4r0K52m9l41J53K26k39J53m15J66
2063b88RK1J24l42K62k5P0j28j76J89K77m79P9K95j52L07ol80J43P3J64l5L8l6
2087DJ26M8j64j42K40R2m1q6J65j17J27n7j64N9K9j47J3R7j43M07j01j60J72J09
2111C66m2k51K18l47J34O3q4Q6q4L77k57j47n2K40j88r0j35J09LJ05k94J8J90
2134f2k8p1n1M02k33j28j48L5J65OJ83j70j33J86O1k07j09K2J33j06J35j46K11
2157e3K5j77O2K78k13J59j78K56q1o7K57k18r2K97R4l98K18N6K65k12k7r7J74
2180C28l05N38j95j36j34K14k0L1j20m3j8J77l38J19j84K17p3j2J14N2k43k50
$$ plain form
2202 -281 -53 -74 -155 4 33 -182 -144 -45 -345 37 -211 -24 -101 -231 -419 -167 -101 -383 -322 -273 -305 -207 -245 -324
2226 -324 -227 -142 -143 -355 -76 -59 64 -141 -131 -126 -131 -201 146 35 119 13 209 -212 20 355 -274 -150 -149 12 -80
2251 -80 217 38 311 101 150 -42 206 205 25 32 149 181 229 201 132 230 244 287 -18 -26 -172 112 112 134 101 17 43
2278 43 -124 103 -5 -165 37 -114 -91 40 -135 -88 29 -64 -322 -111 -164 29 -330 -314 -144 -158 46 -41 5
2301 5 -156 51 -96 -186 137 -84 130 -72 -341 -17 -18 95 -56 163 -117 -67 9 -39 -57 160 286 -242 259
2324 259 98 -37 14 -130 -6 248 108 376 4 61 465 193 130 -8 460 285 167 275 -109 -61 -12 59
2346 59 267 7 43 38 89 -39 83 -162 -69 175 75 73 -186 -98 -125 -119 -339 -142 34 -220 -54 -123 -180 -187 -416
2371 -416 -208 -27 -35 -46 -294 88 -336 -245 -26 -73 -82 -194 62 -92 -19 -187 103 47 -162 80 208 -49 186
$$ packed form
2202b81K28k1q1J59K9k15L8R9l00L82k48J87p7j30j88K52O6k82O1M9l2R8l8p9
2226c24R7Q5jk12K79J7J23k05J0Nnp0L47j11Q4j06J96m21K32L35o29J24JJ61r2
2251h0K97j79K73k10M9j92K48jj80PJ17L2M8k8o9R8J4M3l05qj46K84%K2l3q4K6
2278D3j67K27j08j60K02j51K3J31j75M7J17r3k58K11n3J93l59J6J70j4K04q7M6
2301Ej61K07j47r0L23k21K14k02k69L24jJ13j51K19k80N0P6m8j8K17J26n28N01
2324B59j61j35N1j44J24K54j40K68l72N7M04k72o3j38M68j75j18J08l84M8M9P1
2346E9K08k60L6nN1j28J22k45R3K44j00kk59Q8k7Ok20J97J76k54J66o9n7pk29
2371d16K08J81qj1k48L82m24R1K19m7rj12K56j54P3j68K90n6k09K42J28k57K35
$$ plain form
2394 186 212 337 159 62 72 306 154 159 -104 129 210 71 131 80 169 363 157 123 225 151 225 386 95 148
2418 148 377 112 108 283 80 313 -135 38 65 -218 314 -4 -339 123 50 294 -164 40 -113 84 -120
2439 -120 -11 -168 23 -156 -55 77 -96 -310 -90 -240 -152 -18 -93 -243 -259 -160 -205 -125 -340 -239 8 -94
2461 -94 -142 -152 -172 116 -91 96 -4 35 -132 -43 136 79 186 -81 239 249 -14 146 278 270 246 212 355 247
2485 247 213 -129 396 315 129 51 305 270 -101 350 -44 6 -155 0 40 0 148 333 181 -180 199 -169
2507 -169 -179 211 -281 -306 -425 -191 -89 -158 -281 -130 -233 -188 -260 -146 139 -446 -457 -309 -271 -215 -152 -444 -231
2530 -231 -212 -36 -167 -122 113 108 -19 -225 -51 -57 58 5 -223 -235 125 89 154 51 -128 209 -34 176 126 88
2554 88 92 163 57 261 122 377 423 160 239 275 144 8 187 115 150 227 111 83 172 180 37 90 -129 109 281
$$ packed form
2394A86K6J25j78r7J0K34j52Nk63K33Q1j39O0n1Q9J94k06l4J02p4P4J61k91N3
2418A48K29k65mJ75k03K33m48J73K7k83N32l18l35M62p3K44m58K04j53J97k04
2439a20J09j57J91j79J01J32j73k14K20j50Q8J34p5j50j6R9m5Q0k15J01K47j02
2461i4m8j0k0K88k07J87j00L9j67Q9J79n7J07k67L20J0k63J60J32qk4l4J43j08
2485B47l4l42N25q1j86p8K54l5l71M51l94N0j61J55M0m0J48J85j52l61L79l68
2507a69j0L90m92k5j19K34J02o9j23J51j03M5p2J14K85n85j1J48L8N6O3k92K13
2530b31J9J76j31M5K35nj27k06J74oJ15n3k28j2L60l6O5j03j79L37k43K10n0l8
2554H8MP1j06K04j39K55M6k63P9L6j31j36J79p2L5P7j16k8Q9Qj43N3k19K38J72
$$ plain form
2579 281 309 -262 -204 -106 -18 37 68 -53 243 -44 92 3 -243 -210 -327 64 -265 -272 -120 -231 1 -232 -288 -219
2603 -219 -172 -179 87 -53 -195 -203 -126 -58 -111 -8 -109 42 73 -57 266 -121 -92 -150 -164 117 180 -3 -23 27 314
2628 314 134 235 130 82 69 123 324 392 67 13 53 197 127 -175 168 250 214 -84 -155 -71 199 -45 -184 -157
2652 -157 -173 -112 149 108 -22 -8 -256 -155 -120 -201 121 -100 -185 -234 -205 -174 14 -253 -21 -58 -6 -86 -106 5 -174
2677 -174 -208 -319 -136 -140 -25 -12 -70 -54 47 170 -88 -71 -2 -183 -28 13 41 26 40 88 35 -39 73 39 109 224
2703 224 -7 -91 30 197 218 222 -128 368 74 277 32 427 166 164 251 93 99 -75 34 11 -95 240 220 -2
2727 -2 17 72 123 -127 -5 125 -36 -157 26 -9 -41 -215 39 -173 -37 7 -252 -325 -210 -337 -140 -86 -306
2750 -306 -219 -122 -204 -168 -192 -176 -44 -54 -132 -99 -16 -99 -38 -187 233 -54 202 210 7 289 29 167 -104 117 37
$$ packed form
2579B81K8n71N8R8Q8N5L1j21K96k87J36q9k46L3j17L91l29pJ52j11K32k33n6O9
2603b19M7pK66j40j42qP7O8n3J03j01J51L1j30L23l87K9n8j4K81O3j83k0N0K87
2628C14j80J01j05m8j3N4K01O8l25n4M0J44p0l02L43Q2l6k98p1Q4K70k44j39K7
2652a57j6O1K61m1j30J4k48J01L5q1L22k21q5m9K9L1J88k67K32l7N2q0k0J11j79
2677a74l4j11J83mJ15J3n8J6J01J23k58J7O9j81J55M1K8j5J4M8n3p4J12l4P0J15
2703B24k31q4J21J67K1Ml50M96k94K03k45L95k61kQ7j58Oj74J09k3j06L35k0k22
2727bJ9N5N1k50J22J30j61j21J83l5l2j74K54k12J36M4k59p3J15j27J97N4k20
2750c06Q7R7q2L6k4J6J32j0p8L3Q3q3O1j49M20k87K56Qk03K82k60J38k71K21q0
$$ plain form
2775 37 116 30 85 73 -91 -116 101 183 -33 15 78 124 51 80 -56 76 -72 165 -77 50 18 -8 126 -123 -29
2800 -29 -64 312 71 273 -171 -85 8 -279 104 -57 -26 116 -158 -46 -83 -220 95 112 -266 -210 -14 -105 -70
2823 -70 -76 -40 -319 -282 -12 -125 -143 -132 -331 -242 -216 -100 20 11 -18 -432 -66 -140 -79 -170 17 131 21 65 15 42
2849 42 193 84 69 53 178 148 370 -30 53 234 296 252 350 95 239 107 222 209 235 73 -142 115 6
2872 6 226 138 -214 148 17 123 64 -149 276 245 302 -92 -110 17 -179 -61 -24 -43 -93 -120 -156 -73 -108 -123 -103
2897 -103 -202 -37 -328 -388 -171 -12 -64 -118 -317 -51 -114 -38 -88 4 -464 169 -26 -25 -121 132 2 -169 23 -22
2921 -22 171 14 312 0 186 44 124 -4 -235 101 -117 -26 -88 9 56 262 -130 -172 149 353 -45 167
2943 167 284 -38 1 -189 324 214 153 -14 131 90 -260 -35 -106 50 -121 -262 82 -239 -42 49 51 -16 -155
$$ packed form
2775C7P9q6N5j2j64k5K17Q2k16M8O3M6p3K9j36J32j48K37k42J27l2k6J34k49R4
2800b9l5L76k41K02m44Q6R3k87L83j61L1J42k74J12l7j37L15J7l78N6J96r1L5
2823g0oL6k79L7K70j13j8J1j99Q9K6J16J20rk9m14L66p4O1r1J87J14j10M4n0K7
2849D2J51j09j5j6J25l0K22m00Q3J81O2m4R8k55J44j32J15j3K6j62k15K57j09
2872FK20q8l52L62j31J06n9k13M25l1N7l94j8J27j96J18L7j9n0k7l6Q3l5j5K0
2897a03r9J65k91o0K17J59n2n4j99K66o3P6n0R2m68O33j95Jr6K53j30j71J92m5
2921b2J93j57K98l12J86j42Q0j28k31L36k18R1o2R7M7K06l92m2L21K04l98K12
2943A67J17l22L9j90N13j10o1j67J45m1l50K25p1J56j71j41L44l21J97R1Ko7j39
$$ plain form
2966 -155 -137 62 -18 -39 -124 65 146 -49 -230 -12 92 -35 -137 103 -71 3 83 -97 -64 -115 -149 -284 69
2989 69 96 -110 179 -68 140 42 -27 32 149 167 -34 53 26 4 256 -16 86 126 206 81 79 130 -103 33 168
3014 168 121 50 348 80 -58 118 -5 139 227 118 160 43 37 135 219 58 1 -61 -13 -105 37 260 -71 -36
3038 -36 -213 -206 -45 -126 -227 -140 -69 33 74 13 27 -117 -96 -44 -37 -94 -107 80 -319 -134 -167 -161 -93 -49 -17 -113 -136 -155
3066 -155 -310 -260 125 -123 -108 -123 241 99 -36 162 116 33 -69 -28 -97 93 -264 146 -42 171 237 -162 326
3089 326 416 54 137 249 -40 180 79 -4 -150 -253 -8 -42 84 58 222 402 4 -80 -141 28 212 -76
3111 -76 -80 -156 -108 107 90 -169 -178 30 112 -122 -139 -202 -73 -201 -6 -230 23 9 -79 -52 28 -282 105 -67 -248
3136 -248 -192 41 -23 -151 11 -180 26 -19 -28 -14 190 165 266 57 38 71 260 185 79 -266 -40 -83 163 171
$$ packed form
2966a55J8J99q0k1q5J89Q1j95j81K18J04j27j02K40j74P4Q0j80L3n1l4j35L53
2989F9K7k06K89k47K08r8o9N9J17J8k01Q7k7k2K52k72J02M0Q0j25kN1k33J36J35
3014A68m7p1K98k68j38J76j23J44Q8j09M2j17oR8Q4j61n7o2M8r2J42K23l31L5
3038c6j77PJ61q1j01Q7P1J02M1o1J4j44K1N2Pn7j3J87l99J85l3OO8M4L2r6k3j9
3066a55j55N0L85k48J5j5L64j42j35J98m6q3j02M1o9J90l57M10j88K13O6l99M88
3089C26R0l62Q3J12k89K20j01q3j46j03K45l4J26k6J64J80l98q4o1J69J84k88
3111g6mp6M8K15j7k59rK08Q2k34j7o3J29j28J95k24K53j4q8K7Q0l10L87j72j81
3136b48N6K33o4j28J62j91K06m5rJ4K04k5J01k09j9L3J89p5j06l45K26m3K46Q
$$ plain form
3160 171 22 433 -7 27 102 151 179 43 -15 -14 -112 96 -90 -128 63 345 269 89 -175 98 88 -11 86 -133
3184 -133 -3 8 32 4 66 -185 -119 -78 -141 -249 -62 -36 -9 -189 -197 -158 -22 -44 104 20 14 -100 146 -351 -76
3209 -76 -199 -191 -74 -179 -173 -97 -11 -121 -150 -51 -85 -33 86 -103 110 -111 0 167 86 71 118 -153 97 -47 -87
3234 -87 193 222 -103 194 174 116 96 15 419 131 121 270 139 105 155 83 -71 246 -28 187 -10 108 369
3257 369 96 -93 32 -127 -296 -59 30 -157 -184 126 114 52 -86 56 -62 -243 -324 -52 -91 97 -32 -265
3279 -265 -103 -112 6 -202 -28 -64 -342 10 -148 -30 -152 -2 110 135 146 24 6 300 77 -166 33 -165
3301 -165 -179 157 3 132 -73 56 53 -121 264 79 22 66 43 132 8 118 46 -81 304 -185 199 141 -24
3324 -24 20 -66 -45 25 83 47 -52 103 -55 236 86 -68 -313 4 59 -68 -171 -187 -258 -235 -94 14 -26 -149
$$ packed form
3160A71j49M11m40L4P5M9K8j36n8Jr8K08j86l8J91K82p6j80k64K73j0r9R7k19
3184a33J30J1K4k8O2k51O6M1o3j08J87K6K7j80qL9J36k2J48q4oj14K46m97K75
3209g6j23QJ17j05OP6Q6j10k9R9l4N2J19j89K13k21J11J67q1j5M7k71K50j44m0
3234h7K80K9l25K97k0n8k0q1M04k88j0J49j31l4N0p2j54L17k74K15j97J18K61
3257C69k73j89J25j59j69K37Q9j87k7L10j2o2j38J42j18j81q1K72l9J88j29k33
3279b65J62rJ18k08J74l6k78L52j58J18j22J50J12K5J1j22j8K94k23k43J99j98
3301a65j4L36j54J29k05J29lj74L85j85n7M4k3Q9j24J10p2j27L85m89L84n8j65
3324b4M4q6K1P0N8l6r9J55j58K91j50j54k45L17N5j27j03j6p1K3J41J08m0j23
$$ plain form
3348 -149 -20 -164 21 -114 -98 -119 -120 -104 -17 -337 -224 -315 69 -297 -44 -65 281 151 -76 -262 103 -5 -164
3371 -164 -17 -56 -151 -97 -216 -18 29 -16 88 -46 132 241 -15 155 81 73 109 -41 93 -18 -39 211 200 -76
3395 -76 -59 95 38 262 378 41 54 -109 97 5 -63 -17 27 122 251 -320 -120 70 -449 100 73 -55 -41 -36
3419 -36 -227 -174 -26 -188 -2 -182 -277 70 -110 -79 -141 -72 -26 143 -34 -242 -60 -34 -19 32 142 -208 64
3442 64 36 -160 -62 215 52 -77 154 26 -160 190 -306 -98 56 -15 -72 287 20 96 57 61 112 105 290 20
3466 20 407 257 -16 40 -190 95 -35 238 136 244 90 57 -227 182 -71 6 -8 -67 90 -63 -54 52 -6
3489 -6 130 -185 -249 -266 -151 -22 1 -40 18 155 23 -131 131 173 -245 -151 -112 -96 -257 -155 -39 70 -147 -54
3513 -54 213 27 -11 -215 -253 76 32 -221 -107 -87 -67 -70 97 46 206 32 -68 100 67 119 126 158 -25 -31 37 35
$$ packed form
3348a49J29j44J85j35J6k1jJ6Q7l20J13r1L84l66K53k1L46j30k27j86L65j08j59
3371a64J47l9r5N4j19J98M7m5J04j34J78J09k56J70p4qL6j50J34j11k1K50j1k76
3395g6J7J54n7K24J16l37J3j63K06r2o8M6M4R5J29n71K00J90n19N49k7j28J4N
3419c6j91N3J48j62J86j80r5L47j80L1o2O9M6J69j77k08J82K6J5N1J10l50K72
3442F4k8j96R8K77j63j29K31j28j86L50m96K08J54p1n7L59k67P6l9MN1pJ85k70
3466B0L87j50k73N6k30K85j30K73j02J08j54l3k84M09k53P7j4n9J57j53RJ06n8
3489fJ36l15o4j7J15J29K3m1N8J37j32j54K62M2m18R4L9J6j61J02J16J09k17R3
3513e4K67j86l8k04l8L29m4k53J14K0K0lJ67n1J60j74j00J68l3N2PL2j83oO8k
$$ plain form
3539 35 -72 -64 190 11 60 243 329 165 88 175 -69 293 -145 144 80 -260 70 -71 269 -11 55 -239 261
3562 261 -129 -43 -191 -194 90 211 62 57 -185 -283 -228 149 -205 -314 -93 -80 46 -193 -171 -96 -287 36 -69
3585 -69 -35 -86 -176 60 -16 -141 4 -151 -186 93 -117 56 72 -51 60 104 128 -35 -126 58 -57 243 215 26
3609 26 134 62 -111 46 -31 -64 44 109 230 136 237 -284 -148 61 130 38 -66 49 229 -7 -132 213 31
3632 31 142 86 38 -136 16 -300 118 -66 89 27 -213 -125 133 -280 -84 -217 56 64 -196 -191 -201 -73 -118 -15
3656 -15 -2 80 -55 -76 -298 -112 -79 -317 -199 -16 -411 59 -71 138 -232 134 19 -98 -12 -201 50 189
3678 189 -75 -11 218 6 -68 10 -125 81 114 -117 49 56 -92 -47 -69 3 89 402 39 218 -168 104 128 361
3702 361 375 57 86 -38 101 132 -71 -273 15 -4 13 60 -44 60 -56 54 71 -192 -135 -111 142 -58 -202
$$ packed form
3539C5j07QK54j79M9J83Q6j64p7Q7k44L62m38K89o4l40L30j41L40k80O6k94N00
3562B61l90Q6j48lK84J21j49nk42r8N5L77l54j09K21J3J26k39K2P5j91L23j05
3585f9L4n1r0K36p6j25J45j55l5K79k10J73J6j23J11M4K4j63r1J84j15L00k8j89
3609B6J08p2j73J57p7l3J08O5J21r4J01n21J36K09O9r2j04J15J80k36j25L45j82
3632C1J11n6m8j74J52l16M18j84J55o2k40Q8K58m13J96j33K73Qk60Nj0J28m5J03
3656a5J3Q2j35k1k22J86L3k38J18J83l95M70j30K09l70L66j15j17Q6j89K51J39
3678A89k64O4K29k12p4P8j35K06L3k31J66Pj48M5k2P2Q6L13l63J79l86K72K4K33
3702C61J4l18K9j24J39L1k03k02K88j9J7M7j04J04j16J10J7k63N7K4K53k00j44
$$ plain form
3725 -202 -40 -43 62 -202 -193 128 107 -184 -375 -75 -197 -291 211 44 -221 70 -58 -62 -119 -114 -40 -400 -23 56
3749 56 60 86 16 92 171 -118 126 20 277 26 88 172 157 111 287 -20 22 -127 -58 -31 185 149 55 -93 2 -10
3775 -10 100 190 123 53 -178 127 274 54 252 -118 -283 23 34 -189 -70 43 19 -10 -69 45 50 55 -179 -226
3799 -226 -161 49 -251 -13 -189 -59 -162 -321 153 -154 168 -77 195 -195 -315 -151 -110 -151 -184 -47 254
3820 254 -29 -335 163 106 8 -47 29 -90 74 -219 -45 -37 266 280 -198 280 149 34 359 35 20 50 72
3843 72 57 141 203 182 86 118 3 56 -101 110 156 47 221 110 -20 356 49 -80 -63 3 -36 113 129 -213
3867 -213 -44 174 -143 225 123 -38 -149 -75 -326 -159 -60 -264 -90 39 -275 -148 -165 -111 -99 -36 -293 -228
3889 -228 161 49 -53 -5 -126 -117 -129 128 184 4 56 19 -34 -77 -89 -200 -77 -45 -50 -15 -31 -61 -33 76 37 94
$$ packed form
3725b02J62lJ05k64RL21k1k91j91L00j22r4N02j67k65K91j28mn7NP4l60L77P9
3749E6MK6p0P6P9k89K44j06K57k51O2Q4j5m6J76l07M2j49O9K7K16l6r4j48R5j2
3775a0J10R0o7p0k31L05J47k20J98l70j65L06J1k23J19J13k4k9n9J14NNk34m7
3799b26O5K10l00K38j76J30j03j59M74l07L22k45K72l90j20J64M1m1l3J37L01
3820B54k83l06M98n7r8n5P6j19J64k93J74QL03J4m78M78j31j15L25l24j5L0K2
3843G2j5Q4O2k1r6L2j15N3j57K11M6j09J74j11j30L76l07j29J7O6l9J49J6l42
3867b13J69K18l17L68j02j61j11P4k51J67R9k04J74J29l14J27j7N4J2O3k57O5
3889b28L89j12j02M8j21Rj2K57N6j80N2l7n3m3j2j11J23L2nL5j6l0K8J09l9N7
$$ plain form
3915 94 311 79 105 2 -3 -26 60 51 -58 193 83 -13 140 -73 -218 37 -87 -16 49 -119 -178 -150 13 3 4
3940 4 -141 -205 21 -72 87 -1 -90 -155 -276 10 115 -190 -20 77 -137 6 -79 104 -57 -82 -144 -125 -327 -60
3964 -60 196 -31 29 -111 -8 -157 87 24 112 -13 -31 -176 221 13 25 62 50 6 119 -77 153 58 -65
3987 -65 3 66 163 -172 85 -4 55 -8 261 -39 56 -68 -28 34 5 132 230 -111 -103 172 345 31 42 23 -1 47
4013 47 -4 -3 -93 -199 -60 55 -25 -114 -141 9 -137 -76 -138 75 -240 -82 11 -162 185 50 77 127 -47 -58 -248
4038 -248 -75 115 2 58 42 -25 24 -338 -172 21 -189 68 60 -153 217 83 86 90 -233 94 -57 73 -34
4061 -34 -140 -32 39 -1 184 60 168 31 -81 29 -11 -32 49 -81 110 -11 251 95 8 136 -85 163
4083 163 -156 121 188 -58 -185 -84 -62 180 5 -48 -40 -34 -90 315 -235 -268 -229 -20 -193 330 -227 -172 107 -20
$$ packed form
3915I4K17k32K6j03nk3Q6rj09K51j10r6J53k13j45K55j24P1O5j68n9K8J63j0J
3940Dj45o4K26r3J59q8q9o5j21K86J05l05J70R7k14J43q5J83j61k5o2J9k02K67
3964f0K56k27O0j40J03j49K44o3Q8j25j8j45L97k08J2L7j2m4J13j96K30r5j23
3987f5O8O3R7l35K57q9N9o3K69l00R5j24M0O2k9J27R8l41QK75J73l14J1j9k4M8
4013D7n1Jr0j06J39J15q0q9k7J50j46O1o2K13l15J58R3j73L47j35K7N0j74j1j90
4038b48J73J90j13N6j6o7M9l62J66J93k10K57qk13L70j34LMl23L27j51J30j07
4061c4j06J08P1m0J85j24J08j37j12J10m0k1Q1j30J91j21K62j56q7J28k21K48
4083A63l19K77O7k46j27J01K2K42j75n3QOn6M05n50l3L9K09j73N23n57N5K79j27
$$ plain form
4107 -20 39 -4 -43 -61 -138 -39 215 -292 50 -144 -61 -156 54 41 118 132 -112 15 25 -49 165 209 5 -185 13
4132 13 -99 -108 -123 44 172 109 60 -68 52 70 -114 88 92 104 -82 253 215 62 208 -179 0 43 -79 111
4156 111 314 -139 240 -62 7 -80 43 2 159 108 35 23 -206 34 -126 -314 171 -233 -158 -74 -122 -21 -110
4179 -110 -78 -200 -257 166 -42 106 -44 -307 -29 -165 -27 6 -166 139 7 -164 -67 -245 -50 -37 78 -43
4201 -43 -214 179 -63 266 15 20 81 -27 211 -145 212 127 -52 86 -165 186 -90 164 -20 -69 -172 -63
4223 -63 -101 -121 -53 162 140 148 -80 -182 193 102 -103 19 -115 116 -186 -160 -65 61 223 127 -76 -6 -50 -3 89
4248 89 8 236 -95 -301 -155 74 -62 -127 -270 25 -143 -251 30 -132 -73 -133 165 62 -148 -59 47 -91
4270 -91 36 187 5 -13 -106 -15 -6 -50 32 -102 91 8 83 -115 -73 8 15 122 61 120 134 108 -308 46 -45 48 25
$$ packed form
4107b0N9m3l9j8p7R9K54n07L42j94Q3r5K10j3P7J4k44J27J0p4K14M4k04j90J98
4132A3j12rj5J67J28o3m9j28J20J8j84K02MJ2j86L35l8j53J46l87J79M3j22J90
4156A11K03m53L79l02O9q7J23m1J57n1p3j2k29K40j60j88M85m04P5Q4m8J01q9
4179a10L2j22n7M23k08J48j50k63K78j36J38L3j72L05j32j71R7j78J95J3J15j21
4201d3j71L93k42L29k51NO1j08K38l56L57q5j79J38k51L51k76K54j84m9j03J09
4223f3l8k0O8K15k2Qk28j02L75r1k05J22j34K31l02K6R5J26J62r6k03P0m4M7R2
4248H9q1K28l31k06J46K29j36o5j43K95j68j08K81j62N9o0K98j03k10Q9J06j38
4270i1J27J51j82j8r3R1Rm4Q2j34J93q3P5j98M2Q1PJ07o1N9J4k6m16L54r1R3k3
$$ plain form
4297 25 95 -69 5 81 -181 38 112 46 189 -99 93 -316 -313 44 -77 -87 -22 128 -64 -47 -223 170 -73 71
4321 71 50 97 -135 -84 -15 -118 -95 -124 -152 -126 -114 26 -86 12 151 -355 -184 -123 -40 -121 25 -314 37 81 29
$$ packed form
4297B5P0j64P4P6k62K19P4o6J43k88J92m09LL57j21j0O5J50j92J7j76L93k43J44
4321G1k1M7k32N1O9j03K3k9k8K6J2J40j12R8J39n06J71O1Q3q1J46l39L51M4n2
$$ [...]
8191I0
##END NTUPLES=NMR FID
##END=
