##TITLE=1H_LO2-8026
 CDCl3,8 sc, 
 30.03.2021
##JCAMPDX= 6.0         $$ Bruker NMR JCAMP-DX V2.0
##DATA TYPE= NMR FID
##DATA CLASS= NTUPLES
##ORIGIN= UXNMR, Bruker Analytische Messtechnik GmbH
##OWNER= root
$$ XWIN-NMR		Version 3.5
$$ Tue Mar 30 13:01:10 2021 Russian Standard Time (UT+4h)  she@DPX200
##.OBSERVE FREQUENCY= 200.131506
##.OBSERVE NUCLEUS= ^1H
##.DELAY= (6, 6)
##.ACQUISITION MODE= SIMULTANEOUS
##.ACQUISITION SCHEME= undefined
##.AVERAGES= 8
##.DIGITISER RES= 18
##SPECTROMETER/DATA SYSTEM= spect
##.PULSE SEQUENCE= zg30
##.SOLVENT NAME= CDCl3
##.SHIFT REFERENCE= (INTERNAL, CDCl3, 0, 15.7039)
##AUDIT TRAIL= $$ (NUMBER, WHEN, WHO, WHERE, WHAT)
$$ ##TITLE= Audit trail, XWIN-NMR		Version 3.5
$$ ##JCAMPDX= 5.01
$$ ##ORIGIN= Bruker BioSpin GmbH
$$ ##OWNER= she
$$ F:/spectra/data/she/nmr/H-F/1/audita.txt
$$ ##AUDIT TRAIL=  $$ (NUMBER, WHEN, WHO, WHERE, WHAT)
(   1,<2021-03-30 13:00:03.65 +0400>,<she>,<DPX200>,
      <created by zg, POWCHK disabled, PULCHK disabled
       configuration hash MD5:
       00 E9 B6 7A A2 85 ED C7 34 08 36 98 17 FE 4E 26
       data hash MD5: 16K
       AC 2F F0 65 57 B1 73 ED 9C DA B5 29 86 F3 E5 18>)
$$ ##END=
$$ 
$$ hash MD5
$$ 3F E9 1D 9D 07 2D 70 BD 7C 55 BE 75 E8 AB 7F 70
##$RELAX= 
##$RELAX= 
##$RELAX= 
##$RELAX= 
##$RELAX= 
##$RELAX= 
$$ Bruker specific parameters
$$ --------------------------
##$DU= <F:/spectra>
##$EXPNO= 1
##$NAME= <H-F>
##$PROCNO= 1
##$TYPE= <nmr>
##$USER= <she>
##$AMP= (0..31)
100 100 100 100 100 100 100 100 100 100 100 100 100 100 100 100 100 100 
100 100 100 100 100 100 100 100 100 100 100 100 100 100 
##$AQSEQ= 0
##$AQ_mod= 1
##$AUNM= <au_zg>
##$AUTOPOS= <>
##$BF1= 200.13
##$BF2= 200.13
##$BF3= 200.13
##$BF4= 200.13
##$BF5= 200.13
##$BF6= 200.13
##$BF7= 200.13
##$BF8= 200.13
##$BYTORDA= 1
##$CFDGTYP= 0
##$CFRGTYP= 5
##$CHEMSTR= <none>
##$CNST= (0..31)
1 1 145 1 1 1 1 1 1 1 1 1 1 1 1 1 1 1 1 1 1 1 1 1 1 1 1 1 1 1 1 1 
##$CPDPRG= <>
##$CPDPRG1= <>
##$CPDPRG2= <>
##$CPDPRG3= <>
##$CPDPRG4= <mlev>
##$CPDPRG5= <mlev>
##$CPDPRG6= <mlev>
##$CPDPRG7= <mlev>
##$CPDPRG8= <mlev>
##$CPDPRGB= <>
##$CPDPRGT= <>
##$D= (0..31)
0 1.2 0 0 0 0 0 0 0 0.06 0 0.03 0 0 0 0 0.0002 0 0 0 0 0 0 0 0 0 0 0 0 
0 0 0 
##$DATE= 1617094803
##$DBL= (0..7)
120 120 120 120 120 120 120 120 
##$DBP= (0..7)
150 150 150 150 150 150 150 150 
##$DBP07= 0
##$DBPNAM0= <>
##$DBPNAM1= <>
##$DBPNAM2= <>
##$DBPNAM3= <>
##$DBPNAM4= <>
##$DBPNAM5= <>
##$DBPNAM6= <>
##$DBPNAM7= <>
##$DBPOAL= (0..7)
0.5 0.5 0.5 0.5 0.5 0.5 0.5 0.5 
##$DBPOFFS= (0..7)
0 0 0 0 0 0 0 0 
##$DE= 6
##$DECBNUC= <off>
##$DECIM= 32
##$DECNUC= <off>
##$DECSTAT= 4
##$DIGMOD= 1
##$DIGTYP= 9
##$DL= (0..7)
0 120 120 120 120 120 120 120 
##$DP= (0..7)
150 150 150 150 150 150 150 150 
##$DP07= 0
##$DPNAME0= <>
##$DPNAME1= <>
##$DPNAME2= <>
##$DPNAME3= <>
##$DPNAME4= <>
##$DPNAME5= <>
##$DPNAME6= <>
##$DPNAME7= <>
##$DPOAL= (0..7)
0.5 0.5 0.5 0.5 0.5 0.5 0.5 0.5 
##$DPOFFS= (0..7)
0 0 0 0 0 0 0 0 
##$DQDMODE= 0
##$DR= 18
##$DS= 0
##$DSLIST= <SSSSSSSSSSSSSSS>
$$ [...]
##$SUBNAM2= <"">
##$SUBNAM3= <"">
##$SUBNAM4= <"">
##$SUBNAM5= <"">
##$SUBNAM6= <"">
##$SUBNAM7= <"">
##$SUBNAM8= <"">
##$SUBNAM9= <"">
##$SW= 16.9725357007746
##$SWIBOX= (0..15)
0 0 2 0 0 0 0 0 0 0 0 0 0 0 0 0 
##$SW_h= 3396.73913043478
##$TD= 16384
##$TD0= 1
##$TE= 0
##$TE2= 300
##$TE3= 300
##$TEG= 300
##$TL= (0..7)
0 120 120 120 120 120 120 120 
##$TP= (0..7)
150 150 150 150 150 150 150 150 
##$TP07= 0
##$TPNAME0= <>
##$TPNAME1= <>
##$TPNAME2= <>
##$TPNAME3= <>
##$TPNAME4= <>
##$TPNAME5= <>
##$TPNAME6= <>
##$TPNAME7= <>
##$TPOAL= (0..7)
0.5 0.5 0.5 0.5 0.5 0.5 0.5 0.5 
##$TPOFFS= (0..7)
0 0 0 0 0 0 0 0 
##$TUNHIN= 0
##$TUNHOUT= 0
##$TUNXOUT= 0
##$USERA1= <user>
##$USERA2= <user>
##$USERA3= <user>
##$USERA4= <user>
##$USERA5= <user>
##$V9= 5
##$VALIST= <valist>
##$VCLIST= <CCCCCCCCCCCCCCC>
##$VD= 0
##$VDLIST= <DDDDDDDDDDDDDDD>
##$VPLIST= <PPPPPPPPPPPPPPP>
##$VTLIST= <TTTTTTTTTTTTTTT>
##$WBST= 1024
##$WBSW= 4
##$XGAIN= (0..3)
0 0 0 0 
##$XL= 0
##$YL= 0
##$YMAX_a= 54978
##$YMIN_a= -39365
##$ZGOPTNS= <>
##$ZL1= 120
##$ZL2= 120
##$ZL3= 120
##$ZL4= 120
##$ABSF1= 10
##$ABSF2= 0
##$ABSG= 5
##$ABSL= 3
##$ALPHA= 0
##$AQORDER= 0
##$ASSFAC= 0
##$ASSFACI= 0
##$ASSFACX= 0
##$ASSWID= 0
##$AUNMP= <proc_1d>
##$AZFE= 0.1
##$AZFW= 0.1
##$BCFW= 1
##$BC_mod= 2
##$BYTORDP= 1
##$COROFFS= 0
##$CY= 11.3945322036743
##$DATMOD= 1
##$DC= 2
##$DFILT= <>
##$DTYPP= 0
##$F1P= 15.9154993809931
##$F2P= -4.1035820241983
##$FCOR= 0.5
##$FTSIZE= 0
##$FT_mod= 4
##$GAMMA= 1
##$GB= 0.15
##$INTBC= 1
##$INTSCL= 1
##$ISEN= 128
##$LB= 0.24
##$LEV0= 0
##$LPBIN= 0
##$MAXI= 10000
##$MC2= 0
##$MEAN= 0
##$ME_mod= 0
##$MI= 1.114404
##$NCOEF= 0
##$NC_proc= 0
##$NLEV= 6
##$NOISF1= 3.799351
##$NOISF2= 2.8
##$NSP= 1
##$NTH_PI= 0
##$NZP= 0
##$OFFSET= 15.70392
##$PC= 1
##$PHC0= -11117.97
##$PHC1= 8.600929
##$PH_mod= 1
##$PKNL= yes
##$PPARMOD= 0
##$PSCAL= 0
##$PSIGN= 0
##$REVERSE= no
##$SF= 200.130013532006
##$SI= 16384
##$SIGF1= 3
##$SIGF2= 2
##$SINO= 400
##$SIOLD= 16384
##$SREGLST= <1H.CDCl3>
##$SSB= 0
##$STSI= 0
##$STSR= 0
##$SW_p= 3612.71676300578
##$SYMM= 0
##$S_DEV= 0
##$TDeff= 0
##$TDoff= 0
##$TI= <>
##$TILT= no
##$TM1= 0
##$TM2= 0
##$TOPLEV= 0
##$USERP1= <user>
##$USERP2= <user>
##$USERP3= <user>
##$USERP4= <user>
##$USERP5= <user>
##$WDW= 1
##$XDIM= 8192
##$YMAX_p= 0
##$YMIN_p= 0
$$ End of Bruker specific parameters
$$ ---------------------------------
##NTUPLES= NMR FID
##VAR_NAME=  TIME,          FID/REAL,        FID/IMAG
##SYMBOL=    X,             R,               I
##VAR_TYPE=  INDEPENDENT,   DEPENDENT,       DEPENDENT
##VAR_FORM=  AFFN,          ASDF,            ASDF
##VAR_DIM=   8192,          8192,            8192
##UNITS=     SECONDS,       ARBITRARY UNITS, ARBITRARY UNITS
##FACTOR=    0.0002944,     1,               1
##FIRST=     0,             0,               0
##LAST=      2.4114304,     0,               0
##MIN=       0,             -39365,          0
##MAX=       2.4114304,     54978,           0
$$ Real data points
##PAGE= N=1
##DATA TABLE= (X++(R..R)), XYDATA
$$ plain form
0 0 0 0 0 0 0 0 0 0 0 0 0 0 0 0 0 0 -8 8 -8 8 -8 8 -16 16 -16 23 -24 25 -32 37 -40 48 -55 61 -69 77 -87 96
38 96 -106 120 -133 147 -163 180 -200 220 -243 268 -294 325 -357 395 -435 477 -530 587 -653 728
58 728 -817 921 -1049 1207 -1410 1674 -2044 2589 -3479 5157 -9391 42137 54978 -39365 29849
73 29849 14324 -3688 34768 -4572 6191 36626 -8456 9822 17019 513 10325 4987 14478
86 14478 9873 -11264 16584 13890 -5729 -1873 -2300 15125 8565 -15068 2807 2981 -7496 -6114
100 -6114 -2382 8706 -9809 -14772 7019 -12136 -9046 3671 -14784 3046 -990 -19906 11374
113 11374 -2627 -20148 8582 -2858 -6158 7272 -10846 -1241 4748 -16877 -1984 11080 -5192
126 -5192 -7173 -2004 -5525 -5696 270 -907 -4249 -958 -2386 -3646 -407 -1874 -1301 2463 2426 -576
$$ packed form
0@%%%%%%%%%%%%%%%%qJ6j6J6j6J6k4L2l2L9m7M9n7O9p7Q8j03J16j30J46j64J83
38I6k02K26k53K80l10L43l80M20m63N11n62O19o82P52q30R12j007J117j240J381
58G28j545J738j970K256k617L084l718M633o068Q636j4548N1528J2841r4343O9214
73B9849j5525j8012L8456l9340J0763L0435m5082J8278P197j6506R812n338R491
86A4478m605k1137K7848k694j9619L856m27J7425o560k3633J7875J74j0477J382
100f114L732J1088j8515m963K1791j9155L090J2717j8455J7830m036j8916L1280
113A1374j4001j7521K8730j1440l300J3430j8118R605N989k1625J4893J3064j6272
126e192j981N169l521j71N966j177l342L291j428j260L239j467N73L764l7l002
$$ plain form
142 -576 -557 5163 2586 -1452 3011 1948 4813 7567 -2526 -480 3547 -2855 3085 4685 -2255 -682
158 -682 -214 -3185 -4035 750 756 -5169 2163 -595 -9787 4351 -34 -8669 7116 -2291 -4537 10321
174 10321 -6782 -5341 7803 -5410 1360 7285 -4212 992 -1220 -4311 2970 160 516 -1763
188 -1763 -3504 1575 -8099 -2370 6343 -9455 -2989 3893 -9258 -350 -296 -8745 1891 -2159 -5800
203 -5800 3579 -1140 -4731 -3178 -909 1181 -2227 2545 2139 -5141 2465 -393 -1155 9788 -2004
218 -2004 -1027 10724 -3621 767 9017 -1995 4424 6212 -130 6488 3047 -842 4244 3320 3583
233 3583 2226 3117 5397 -3631 521 6558 -1626 4230 4318 -4547 4183 2773 -4210 6558 2890 -4144
249 -4144 4209 3125 -2154 1783 783 -724 1845 1397 -210 386 433 -3186 -2699 1056 -1681 -2818
$$ packed form
142e76J9N720k577m038M463j063K865K754j0093K046M027o402N940J600o940J573
158f82M68k971q50M785On925P332k758r192J4138m385q635J5785r407k246J4858
174A0321j7103J441J3144j3213O770N925j1497N204k212l091P281k810L56k279
188a763j741N079r674N729Q713j5798O466O882j3151Q908N4q449J0636m050l641
203e800R379m719l591J553K269K090l408M772m06p280P606k858p62J0943j1792
218b004R77J1751j4345M388Q250j1012O419J788o342O618l441l889N086r24K63
233C583j357Q91K280r028M152O037q184N856Q8q865Q730j410o983J0768l668p034
249d144Q353j084n279L937j000j507K569m48j607N96M7l619M87L755k737j137
$$ plain form
265 -2818 1019 -3860 -5198 -1788 -4424 -1411 250 -6436 -2201 -304 -5998 -2731 -1402 -3137 112
280 112 -2309 -3415 664 -2266 -2418 536 -107 839 -1223 2346 1217 -4093 3222 2520 -1733 5848
296 5848 -933 -2620 6576 -2034 -1610 6983 -1326 -891 4572 -654 143 1014 870 1922 1090 2666 -350
313 -350 928 4636 -3785 310 7650 -2845 1821 5415 -5048 1988 3642 -2934 4629 2118 -3320
328 -3320 3211 913 -2463 633 600 911 -532 -1498 110 -2703 -712 -712 -3283 1312 -1352 -4834 1483
345 1483 -2548 -5722 1489 -1570 -2960 1135 -3765 -2693 2041 -3142 -1892 2070 -1148 -1369 405
360 405 -284 -1508 28 1953 -1133 216 1906 -2930 1581 1999 -4601 3009 3447 -3901 2688 158
376 158 -2996 3660 -673 -832 3509 -1531 414 1183 -667 2195 -386 1929 3161 -2308 2909 1420
$$ packed form
265b818L837m879j338L410k636L013J661o686M235J897n694L267J329j735L249
280A12k421j106M079k930j52K954o43R46k062L569j129n310P315p02m253P581
296E848o781j687R196q610M24Q593q309M35N463n226P97Q71j44J052q32J576l016
313c50J278L708q421M095P340j0495M666L594j0463P036J654o576P563k511n438
328c320O531k298l376L096l3L11j443r66J608k813J991%k571M595k664l482O317
345A483m031l174P211l059j390M095m900J072M734n183J250L962l218k21J774
360D05o89j224J536J925l086J349J690m836M511M18o600P610M38p348O589k530
376A58l154O656m333j59M341n040J945P69j850K862k581K315J232n469N217j489
$$ plain form
392 1420 -2139 5002 -369 -454 6115 -2722 7 4784 -3542 1840 2805 -3057 2496 -412 -2531 1173
408 1173 -1463 -500 -937 -1374 365 -4205 -954 -193 -5909 1226 -370 -6119 2076 -3069 -5721 2474
424 2474 -4228 -3829 1643 -3907 -1781 -658 -3588 -536 -1010 -427 -855 -2791 1427 -1664 -2644 2868
440 2868 -2417 -404 3160 -3576 848 2278 -3251 2491 1775 -1811 2609 1322 -204 1789 1288 1974
456 1974 1997 2274 1906 1222 3714 1233 695 5434 1635 918 5501 1158 1379 4246 443 2073 4247
473 4247 231 1163 3131 -147 -692 2456 924 -1425 1092 406 -2183 287 -938 -1833 833 -1066
489 -1066 -2683 -454 -400 -3203 -1776 818 -2341 -2097 899 -2841 -1088 954 -3449 503 1541 -3323
505 -3323 1229 309 -2497 1380 -277 -544 1237 -915 958 129 -569 824 -910 2243 759 -2438
$$ packed form
392A420l559P141n371q5O569q837K729M777q326N382R65n862N553k908k119L704
408A173k636R63m37m37J739m570L251P61n716P135j596n749Q195n145k652Q195
424B474o702L99N472n550K126J123k930L052m74N83m28j936M218l091r80N512
440B868n285K013L564o736M424J430n529N742p16l586M420j287j526J993n01O86
456A974K3K77l68o84K492k481n38M739l799p17M583m343K21K867l803J630K174
473D247m016R32J968l278n45L148j532k349K517o86k589K470j225q95K666j899
489a066j617K229N4k803J427K594l159K44K996l740J753K042m403L952J038m864
505c323M552r20k806L877j657k67J781k152J873q29o98J393j734L153j484l197
$$ plain form
521 -2438 3148 -204 -1851 3119 -1811 134 3841 -2866 569 2042 -2062 1981 516 -657 1423
536 1423 5 1514 -750 -485 3278 -1544 688 1802 -3643 2913 1212 -4397 3168 252 -2343
551 -2343 2905 -2356 -1090 1982 -1909 -1 -261 -1238 526 -1872 -185 -822 -2287 2349 -1731 -2734
567 -2734 1815 -2320 -860 636 -3863 685 1042 -3448 113 -174 -2445 68 -900 -1106 -811 -635 -1066
584 -1066 -1696 -681 -1346 -1712 878 -1770 -2638 1706 -1067 -2501 892 -1071 -841 752 -1411 -549 1656
601 1656 -405 -978 1977 822 -730 1598 1159 -325 1948 1482 384 1749 1586 817 1857 1895 33
618 33 1644 3165 50 598 2760 312 1236 2079 -791 1760 2155 -1390 1510 1260 -1072 1282 401
635 401 -730 612 -180 47 -479 -750 -184 -801 942 -564 -1784 1412 -970 -1983 1466 -1661 -1295
$$ packed form
521b438N586l352j647M970m930J945L707o707L435J473m104M043j465j173K080
536A423j418J509k264K65L763m822K232J114n445O556j701n609P565k916k595
551b343N248n261J266L072l891J908k60r77J764k398J687o37j465M636m080j003
567b734M549m135J460J496m499M548L57m490L561k87k271K513r68k06K95J76m31
584a066o30J015o65l66K590k648q68M344k773j434L393j963K30J593k163Q62K205
601A656k061n73K955j155j552K328m39j484K273m66j098J365j63p69J040L8j862
618C3J611J521l115N48K162k448R24Q43k870K551L95l545K900k50k332K354q81
635D01j131J342p92K27n26k71N66o17J743j506j220L196k382j013L449l127L66
$$ plain form
652 -1295 1594 -2169 -1108 1248 -2168 -165 285 -1547 -611 -543 -374 -810 -941 641 -1288 -421 866
669 866 -2331 467 1290 -2680 1304 918 -2067 1639 235 -1094 1985 -286 -67 1389 165 445
685 445 601 632 1323 -234 1198 486 -326 2086 21 -79 2401 -680 497 2602 -1095 768 1831
702 1831 -1130 1166 804 -877 1238 404 -704 168 174 -126 -849 203 108 -1420 464 -20 -1679 899
720 899 -364 -2069 1014 -949 -2023 762 -1437 -1677 269 -1236 -1136 -256 -1285 -950 -519 -896 -920
737 -920 -857 252 -1020 -1075 523 -1254 -661 807 -1354 -95 932 -1694 896 601 -1634 1184 798
754 798 -948 1183 501 -200 910 571 624 711 566 467 357 1711 443 -474 2330 381 -417 1996 -39
773 -39 62 2414 125 281 2012 -252 171 1284 -12 -231 469 610 -335 145 391 -565 90 316 -1553
$$ packed form
652a295K889l763J061K356l416K003M50j832R36O8J69m36j31J582j929Q67J287
669H66l197K798Q23l970L984l86k985L706j404j329L079k271K19J456j224K80
685D45J56L1O91j557J432p12q12K412k065j00K480l081J177K105l697J863J063
702A831k961K296l62j681K115q34j108Q72Ol00p23J052r5j528J884m84j659K578
720H99j263j705L083j963j074K785k199k40J946j505J00Q80j029L35M31l77k4
737i20O3J109j272n5J598j777N93J468k161J259J027k626K590k95k235K818l86
754G98j746K131o82p01J110l39N3Q7j45r9j10J354j268r17K804j949p98K413k035
773c9J01K352k289J56J731k264M23J113j296k19P00J41r45M80K46r56O55K26j869
$$ plain form
792 -1553 611 869 -2047 -62 -16 -1648 -74 -202 -1280 -308 -723 -1444 -50 -669 -1291 -581 -345 -1119
810 -1119 -1050 -218 -762 -677 -400 -1150 -366 -123 -1069 -582 10 -621 -547 565 -475 -881 688 -525 -246 1291
830 1291 -513 59 1684 -587 290 1524 165 441 1247 536 420 960 640 369 878 716 -183 1518
848 1518 1387 -725 1381 896 -622 1825 185 -560 1645 159 -16 1092 -120 194 338 -83 233
865 233 -613 167 35 -1143 655 -601 -461 705 -2011 -476 965 -1967 -288 482 -1836 -23 -367
882 -367 -1244 97 -699 -1036 2 -385 -550 -887 26 -35 -1399 721 78 -1319 1059 -503 -1209 1533
900 1533 -1058 -268 1930 -685 -314 1157 -277 425 512 184 767 182 783 191 675 1474 -113 740
918 740 1395 -547 1023 1665 -497 997 666 -78 1263 128 -216 789 538 -55 357 451 -130 -434
$$ packed form
792a553K164K58k916J985M6j632J574j28j078R72m15p21J394o19o22P10K36p74
810a119O9Q32n44Q5K77p50P84K43r46M87N92o31P4J112j040m06J569j213K79J537
830A291j804N72J625k271Q77J234j359K76Q06p11j16N40l20k71N09j62q99J701
848A518j31k112K106m85j518K447j640p45K205j486j75J108j212L14J44m21L16
865B33q46P80j32j178J798j256J40J166k716J535J441k932J679P70k318J813l44
882c67q77J341p96l37J038l87j65l37R13o1j364K120o43j397K378j562p06K742
900A533k591P90K198k615L71J471j434P02Q7l28N83n85O01n92M84P99j587Q53
918G40O55j942J570O42k162J494l31p44J341j135l44J005k51n93M12R4n81l04
$$ plain form
936 -434 581 -618 -249 915 -877 -226 215 -1021 -346 533 -1204 -504 203 -1024 -470 22 -845 -428
954 -428 250 -655 -908 551 -686 -891 222 -1068 -643 98 -936 -599 -437 -522 -546 -415 -313 -457 -477 -85
974 -85 -713 -391 346 -906 619 282 -884 626 141 -768 1232 163 -40 883 -11 404 629 -122 789
993 789 602 1026 128 183 1606 -125 248 1836 -287 477 1473 -1110 1086 561 -649 1172 538 -654
1011 -654 664 307 364 -221 13 847 -1059 -171 603 -1078 695 72 -1550 1316 -494 -1380 906 -1140
1029 -1140 -621 313 -910 -611 -402 -699 -391 -554 -554 -757 -550 245 -1036 -779 349 -1232 -40 62 -965
1048 -965 567 -89 -883 745 -19 -282 479 -100 105 335 198 360 -31 831 437 -168 1037 28 180
1067 180 1185 -101 108 1275 25 270 657 -52 481 1116 -148 241 832 285 -25 775 195 -104
$$ packed form
936d34J015j199L69J164j792O51M41j236O75Q79j737P00P07j227N54M92q67M17
954d28O78r05k53J459j237k05J113j290M25P41j034L37J62q5k4J31J02j44k0L92
974h5o28L22P37j252J525l37j166J510m85r09K000j069k03R23q94M15K25p51R11
993G89j87M24q98N5J423j731L73J588k123P64R96k583K196n25j210J821o34j192
1011f54J318l57N7n85K34Q34j906Q88P74j681J773o23j622K866j810q86K286k046
1029a140N19R34j223K99K09k97L08j63%k03K07P95j281K57J128j581J192J02j027
1048i65J532o56p94J628p64k63P61n79K05K30j37J62l91Q62l94o05J205j009J52
1067A80J005j286K09J167j250K45L87p09N33O35j264L89N91n47l10Q00n80k99
$$ plain form
1085 -104 805 207 -204 637 -147 -155 495 -40 -114 428 -45 -432 16 -273 -490 63 -173 -725 248 -115 -855
1106 -855 17 -293 -767 14 -686 -943 -226 -643 -919 -324 -199 -716 -372 -287 -920 -681 196 -628 -439 576
1126 576 -595 -101 536 -831 99 744 -593 410 640 -122 670 847 57 524 390 604 219 613 637
1145 637 121 848 686 27 1110 359 -142 940 292 267 1035 295 48 585 -3 -96 392 115 -260 363
1165 363 189 -79 43 379 -568 -271 400 -807 87 272 -957 87 92 -1099 203 -208 -949 -92 -304
1184 -304 -992 -126 -163 -917 -382 -192 -724 -543 -379 -675 -529 4 -385 -537 292 -208 -530 377 -138 -422
1204 -422 481 -180 -82 583 -29 158 385 106 392 445 256 176 214 368 130 339 349 24 538 371 -99 663
1226 663 482 -235 728 426 -133 800 420 -251 649 91 32 714 119 51 446 267 -136 59 467 -290 -112
$$ packed form
1085a04R09n98m11Q41p84qO50n35p4N42m73l87M48k89k17N53k36n52R73l63p40
1106h55Q72l10m74P81p00k57P17m17k76N95J25n17L44Q5o33K39Q77q24J89J015
1126E76j171M94O37j367R30O45j337J003K30p62P92J77p90M67j34K14l85L94K4
1145F37n16P27j62o59J083p51n01J082o48k5P68p40k47N37n88r3M88k77l75O23
1165C63j74k68J22L36r47K97O71j207Q94J85j229J044Nj191J302m11p41Q57k12
1184c04o88Q66l7p54N35J90n32J81J64k96J46N33l89j52Q29n00l22R07n15k84
1204d22R03o61R8O65o12J87K27k79K86N3j89q0L8J54k38K09J0l25N14j67m70P62
1226F63j81p17R63l02n59R33l80o71R00n58n9O82n95o8L95j79m03J95M08p57J78
$$ plain form
1247 -112 319 -619 93 446 -960 -310 295 -680 -124 -12 -577 -240 -368 -726 -359 -258 -352 -501 31 -390
1267 -390 -704 224 -397 -754 171 -422 -482 157 -193 -347 225 -208 -215 367 92 -461 156 251 33 178 109 -73
1289 -73 666 110 68 579 307 45 424 681 173 494 644 -16 499 356 -97 611 533 -83 485 687 144
1310 144 526 592 -56 306 359 -12 295 184 -5 -58 185 53 -199 -51 -218 -742 333 -111 -772 70 -594
1331 -594 -814 9 -743 -470 -33 -554 -204 -89 -633 -236 -324 -438 -224 -265 -354 -704 -236 286 -715 256 233
1352 233 -486 164 28 -513 565 38 -320 601 108 130 237 32 233 5 201 201 305 555 94 144 864
1373 864 -50 209 674 -222 665 692 -263 495 547 -2 503 35 177 242 418 384 -104 315 138 -414 214
1394 214 26 -306 364 -320 -399 105 -115 -270 202 -613 -307 145 -453 -229 -46 -266 -389 -458 -96 -298 -116
$$ packed form
1247a12M31r38P12L53j406O50O05r75N56J12n65L37j28l58L67J01r4j49N32m21
1267c90l14R28o21l57R25n93o0O39l50j54N72m33pN82k75n53O17R5k18J45o9j82
1289g3P39n56m2N11k72k62L79K57n08L21J50o60N15j43m53P08p8o16N68K02n43
1310A44L82O6o48L62N3l71L07j11j89n3K43j32k52J48j67n24J075m44o61Q42o64
1331e94k20Q23p52K73M37n21L50J15n44L97q8j14K14m1q9l50M68N22j001R71k3
1352B33p19O50j36n41J078n27l58R21m93K2J07k05K01k28J96%J04K50m61N0P20
1373H64r14K59M65q96Q87K7r55P58N2n49N05m68J42O5J76l4m88M19j77n52O28
1394B14j88l32O70o84p9N04k20j55M72q15L06M52n98K24J83k20j23o9L62k02J82
$$ plain form
1415 -116 52 -752 62 405 -764 111 -179 -654 68 -88 -238 94 -165 -203 -40 243 -269 -83 499 19
1435 19 -415 421 -320 -224 685 -381 219 331 -84 266 494 186 226 144 325 32 381 209 59 227 478
1456 478 71 442 167 5 687 -125 2 588 -42 225 493 -307 164 56 -65 -132 -217 200 -19 -14 -27 -433
1478 -433 163 273 -991 43 -84 -590 -192 -216 -417 -157 -338 -445 -136 -212 -185 -190 57 -301 -568 19 -525
1499 -525 -595 -30 -489 -384 134 -660 -138 313 -554 248 81 -286 181 -62 1 124 42 137 -34 193 345
1520 345 -80 722 343 -26 905 307 124 478 213 331 475 276 291 368 265 -31 449 192 -20 335 334
1541 334 -13 283 276 -179 101 239 -59 46 -32 -250 -17 -106 -289 -83 107 -385 -121 64 -286 -303 9 -327
1563 -327 -211 156 -458 -189 -174 -374 -313 -14 -91 -142 -278 -275 -344 1 -8 -141 372 24 -335 255 -76 -141 147
$$ packed form
1415a16J68q04Q14L43j169Q75k90m75P22j56j50L32k59l8J63K83n12J86N82m80
1435A9m34Q36p41R6R09j066O00J12m15L50K28l08M0q2J81k93L49j72j50J68K51
1456D78m07L71k75j62O82q12J27N86o30K67K68q00M71j08j21o7q5M17k19Nj3m06
1478d33N96J10j264J034j27n06L98k4k01K60j81j07L09p6K7nK47l58k67N87n44
1499e25p0N65m59J05N18p94N22M51q67Q02j67l67M67k43O3J23q2R5j71K27J52
1520C45m25Q02l79l69R31n98j83L54k65J18J44j99J5P7j03k96M80k57k12L55j
1541C34l47K96pm55K80J38k98J05p8k18K33q9j83K06J90m92K64J85l50j7L12l36
1563c27J16L67o14K69J5k00O1K99p7n1j36Lo9L45rj33N13l48l59N90l31o5K88
$$ plain form
1586 147 -143 117 192 -295 272 435 62 159 412 74 -109 248 3 136 329 449 -30 198 148 97 402
1607 402 330 -62 187 312 232 548 372 -30 57 338 183 -65 -70 -172 31 31 43 -164 116 -347 222 78 -116
1630 -116 -129 46 -274 52 -23 -163 -133 -11 -247 -465 -120 -475 -402 -91 -146 -18 -15 -206 -273 -47 -81 -348 67
1653 67 -172 -51 -50 -208 -526 240 166 -286 164 -41 -97 518 67 -88 103 272 -15 259 392 96 329 194
1675 194 281 251 279 316 259 433 145 515 432 179 328 260 246 242 43 249 262 284 98 81 23 -33 41 292 -153
1700 -153 -16 49 -262 -440 208 -584 -185 305 -586 -287 -6 -333 -204 -33 -371 -45 -329 -254 -418 -447 -160
1721 -160 -283 70 -115 -293 -22 1 -372 -140 -59 -135 -486 75 -85 266 117 120 10 -54 0 16 227 -15 78
1744 78 125 -99 187 401 1 398 204 110 408 231 40 273 364 16 285 356 105 -70 497 345 45 111
$$ packed form
1586A47k90K60P5m87N67J63l73R7K53l38j83L57k45J33J93J20m79K28n0n1L05
1607D02p2l92K49J25q0L16j76m02Q7K81j55k48nj02K03%J2k07K80m63N69j44j94
1630a16j3J75l20L26p5j40L0J22k36k18L45l55P3L11n5J28Lj91o7K26l4k67M15
1653F7k39J21Jj58l18P66p4m52M50k05n6O15m51j55J91J69k87K74J33k96K33j35
1675A94Q7l0K8L7n7J74k88L70q3k53J49o8j4mj99K06J3K2j86j7n8n6P4K51m45
1700a53J37O5l11j78O48p92L99M90q91K99K81l27J29J71l38L26k84P5j64k9K87
1721a60j23L53j85j78K71K3l73K32Q1p6l51N61j60L51j49Lj10o4N4J6K11k42R3
1744G8M7k24K86K14m00L97j94r4K98j77j91K33R1l48K69P1k51j75N67j52l00O6
$$ plain form
1766 111 -425 -10 342 25 183 284 -125 -228 129 -348 29 -76 84 -142 145 -61 -58 -80 -80 -404 -62 -64
1788 -64 -346 27 -159 -481 18 -263 -203 13 -551 -162 5 -212 -160 -60 -95 -66 87 141 -104 98 155 -240
1810 -240 59 -91 -458 155 121 -39 101 46 116 189 -289 55 212 391 227 49 50 393 63 654 80 90
1832 90 306 262 265 417 180 234 265 161 140 313 232 43 -6 399 -73 -18 29 -26 43 60 -253 108 185 -154 160
1857 160 -361 -72 -146 82 -355 -407 -132 62 -375 -301 -85 -198 23 -276 91 163 -241 -61 124 -424 -23
1878 -23 -159 -300 53 1 -256 -78 71 -53 -23 -323 -47 -328 -2 -52 -234 310 153 82 261 182 265 221 2
1901 2 123 414 55 128 0 282 154 123 -14 167 20 253 -67 206 312 -169 66 151 -18 -84 -104 24
1923 24 -6 -300 -42 67 59 -123 111 -84 -249 -51 -16 -197 -52 -41 -391 184 -263 -278 -163 -55 -306 -64
$$ packed form
1766A11n36M15L52l17J58J01m09j03L57m77L77j05J60k26K87k06Lk2%l24L42k
1788f4k82L73j86l22M99k81O0K16n64L89J67k17N2J00l5K9J53N4k45K02N7l95
1810b40K99j50l67O13l4j60J40n5P0P3m78L44J57J79j64j78JL43l30N91n74J0
1832I0K16m4LJ52k37N4L1j04k1J73q1j89m9M05m72N5M7n5O9J7l13L61P7l39L14
1857A60n21K89p4K28m37n2K75J94m37P4K16j13K21k99L67P2m04J80J85n48M01
1878b3j36j41L53n2k57J78J49j24L0l00K76k81L26n0j82N44j57p1J79p9Q3m4k19
1901BJ21K91l59P3j28K82j28l1j37J81j47K33l20K73J06m81K35Q5j69o6k0J28
1923B4l0k94K58J09qj82K34j95j65J98L5j81J45J1l50N75m47j5J15J08k51K42
$$ plain form
1945 -64 -279 9 -253 -290 -99 -227 41 2 -272 -93 -174 -215 200 132 -139 -17 143 87 -81 -63 291 184 -22
1968 -22 240 455 25 100 -23 294 -57 112 162 255 217 287 166 202 114 15 405 -23 57 333 188 67 166 12
1992 12 -25 84 195 188 -8 180 -98 -9 489 -415 -90 -214 -520 -192 103 -566 -412 -456 -234 -28 158 -249
2014 -249 -478 112 -524 -123 -284 165 101 -424 129 -625 138 -691 -726 -560 -254 -256 -143 -32 -83 -528 -20 -356
2036 -356 -686 339 17 457 457 -60 362 972 -791 714 -16 271 -286 -147 319 243 1000 -294 437 232
2056 232 12 457 370 236 320 174 -424 193 147 -783 1060 -248 605 282 639 269 540 294 -715 228
2076 228 82 -499 -224 66 -164 -529 -203 -203 -443 -226 -108 -320 -57 -337 380 215 -241 -74 114 -30 -410
2097 -410 -75 -211 -650 346 -119 -304 -541 -36 -218 -83 15 -18 -139 -41 124 -37 90 -74 -187 38 175
$$ packed form
1945f4k15K88k62l7J91j28K68l9k74J79q1m1M15o8k71J22J60n6j68J8L54j07k06
1968b2K62K15m30P5j23L17l51J69N0R3l8P0j21L6q8r9L90m28Q0K76j45j21R9j54
1992A2l7J09J11pj96J88k78Q9M98r04L25j24l06L28K95o69J54m4K22K06J86m07
2014b49k29N90o36M01j61M49o4n25N53p54P63q29l5J66L06kJ13J11n1m45N08l36
2036c56l30J025l22M40%n17M22O10j763J505p30K87n57J39M66p6P57j294P31k05
2056B32k20M45q7j34Q4j46n98O17m6r30J843j308Q53l23L57l70K71k46j009R43
2076B28j46n81K75K90k30l65L26%k40K17J18k12K63k80P17j65m56J67J88j44l80
2097d10L35j36m39R96m65j85k37N05j82J35R8l3j21R8J65j61J27j64j13K25J37
$$ plain form
2118 175 208 292 -89 40 78 55 286 137 81 -94 269 240 188 178 99 126 -203 -225 112 125 196 -102 11 314
2142 314 -88 210 -21 -96 181 743 188 -413 237 -45 -338 -53 82 -83 -181 -258 77 56 -238 -8 -91 -264
2164 -264 -199 20 -137 -78 -71 -323 -65 -51 30 -147 121 -375 -100 70 -201 130 171 -231 -204 -204 -272 0 89 25
2188 25 -26 48 -266 178 -10 106 -116 16 135 -207 447 48 -96 196 -24 182 200 -30 33 325 0 139
2210 139 -23 -78 168 121 74 191 129 98 -100 259 -17 252 -50 25 150 41 -46 -161 268 -34 -88 61 -141
2233 -141 48 40 -108 -19 -78 -100 94 -117 -82 -65 18 -96 -172 -200 -125 -315 -182 -171 -218 97 -42 38 -219 -2 -195
2258 -195 131 72 61 123 -177 -85 96 -54 -63 -51 242 70 -25 95 -136 178 176 87 199 88 -10 -82 318 53
2282 53 234 126 144 -104 -22 221 -247 136 -102 -136 185 -210 253 172 -63 273 -73 49 166 -42 234 38
$$ packed form
2118A75L3Q4l81J29L8k3K31j49n6j75L63k9n2j0p9K7l29k2L37J3P1k98J13L03
2142C14m02K98k31p5K77N62n55o01O50k82k93K85J35j65r8p7L35k1k94K30q3j73
2164b64O5K19j57N9Pk52K58J4Q1j77K68m96K75J70k71L31M1m02K7%o8K72Q9o4
2188B5n1P4l14M44j88J16k22J32J19l42O54l99j44K92k20K06J8k30O3K92l25J39
2210A39j62n5K46m7m7J17o2l1j98L59k76K69l02P5J25j09q7j15M29l02n4J49k02
2233a41J89qj48Q9n9k2J94k11L5J7Q3j14p6k8P5j90J33J1m7L15j39Q0k57K17j93
2258a95L26n9j1O2l00R2J81j50rJ2K93j72r5J20k31L14kq9J12j11r8p2M00k65
2282E3J81j08J8k48Q2K43m68L83k38l4L21l95M63q1k35L36l46J22J17k08K76j96
$$ plain form
2304 38 -72 105 -129 124 103 -418 23 -37 -260 38 -133 5 -113 -6 -224 -365 81 -161 66 -35 -90
2325 -90 -133 -174 3 -185 -27 -190 -102 -80 145 -568 40 -201 135 -110 22 -1 145 117 -258 -175 243 211 174
2348 174 -32 -10 206 -156 -19 400 196 123 244 37 215 201 31 -5 308 91 59 246 303 -209 2 196
2370 196 380 -19 35 117 -17 -95 43 75 42 -116 -14 -78 -4 134 63 27 127 -8 -171 -296 -185 65 -85
2393 -85 -32 -118 -187 -164 -246 42 -220 -75 -207 -144 -123 -33 -59 -65 -361 26 -49 -62 52 35 -170 193 -37 115 124 151
2419 151 57 290 -66 192 227 28 268 30 -24 -29 -42 351 87 243 87 -148 384 173 124 255 -133 28
2441 28 79 342 14 68 276 -72 53 319 195 -86 72 -107 -205 -8 -187 -136 -227 -76 10 -209 -14 16 -177
2464 -177 -135 -140 -245 -88 -290 166 -221 -57 -32 -103 -181 -208 -141 -126 14 -182 14 -246 -232 -310 -6 140 37 -63
$$ packed form
2304C8j10J77k34K53k1n21M41o0k23K98j71J38j18J07k18j41M46k42K27j01n5
2325i0m3m1J77j88J58j63Q8K2K25p13O08k41L36k45J32k3J46k8l75Q3M18l2l7
2348A74k06K2K16l62J37M19k04p3J21k07J78j4j70l6L13k17l2J87N7n12K11J94
2370A96J84l99N4Q2j34p8J38L2l3j58J02o4P4J38p1l6J00j35j63j25J11K50j50
2393h5N3q6o9K3q2K88k62J45j32O3K1R0k6ok96L87p5j3J14j7k05L63k30J52RK7
2419A51r4K33l56K58L5j99K40k38n4nj3L93k64J56j56k35N32k11m9J31l88J61
2441B8N1K63l28N4K08l48J25K66j24k81J58j79r8J97j79N1r1J51Q6k19J95L0j93
2464a77M2nj05J57k02M56l87J64K5p1p8k7O7J5J40j96J96k60J4p8L04J46j03j00
$$ plain form
2488 -63 -117 -145 -35 -66 50 100 -153 -63 175 -68 100 -82 -129 67 51 170 173 168 119 -79 -46 162 33 157 -6
2513 -6 93 -60 1 35 82 89 268 181 127 55 225 -36 -27 -86 -15 53 -204 250 -51 -53 41 -71 -213 107 -132 18
2539 18 1 -36 -111 -22 -20 -208 -159 -286 -175 -342 -329 -255 -186 -10 164 -115 26 152 79 44 134 18 -269 -131 34
2564 34 172 85 91 -40 79 -37 163 -63 -165 363 245 -133 -33 225 -125 11 -193 -71 160 57 44 174
2586 174 211 -56 -187 109 15 -27 1 274 178 261 -123 166 61 -116 15 -33 -61 55 47 -100 -52 13 -216 -168
2610 -168 11 -374 1 -31 66 182 -111 111 -78 82 -270 -100 -140 55 -48 217 -192 -107 -104 -158 29 181
2632 181 -210 -2 -40 -232 164 48 82 -117 -69 -382 -125 49 154 274 229 96 110 -64 238 152 -6 -42
2654 -42 -77 66 88 256 -69 -66 -66 140 132 -38 269 157 92 30 -69 -21 205 50 172 -79 155 231 -81 4 62
$$ packed form
2488f3n4k8J10l1J16N0k53R0K38k43J68j82m7J96j6J19Lnm9j98L3K08j29J24j63
2513fR9j53O1L4M7PJ79q7n4p2J70k61Rn9P1O8k57M54l01kR4j12j42L20k39J50
2539A8j7l7p5Q9Kj88M9j27J11j67J3P4O9J76J74k79J41J26p3l5R0j16k87J38J65
2564C4J38q7Oj31J19j16K00k26j02N28j18l78J00K58l50J36k04J22K31j03j3J30
2586A74L7k67j31K96r4m2K8K73r6Q3l84K89j05j77J31m8k8J16qj47M8O5k29M8
2610a68J79l85L75l2R7J16k93K22j89J60l52J70m0J95j03K65m09Q5Ln4J87J52
2632A81l91K08l8j92L96j16L4j99M8l13K57J74J05J20m5j33J4j74L02q6j58l6
2654d2l5J43K2J68l25L%K06qj70L07j12o5o2r9M8K26j55J22k51K34P6l12Q5N8
$$ plain form
2679 62 -327 -54 50 280 -51 -33 63 -193 11 -75 231 84 -109 -30 -128 -90 120 -130 46 38 -88 -148 42
2702 42 -17 -49 -62 66 195 -139 127 -127 122 -251 -184 -54 -84 -53 151 117 -55 -169 20 120 30 0 -81 261
2726 261 132 37 103 -37 -42 47 -99 203 174 73 73 74 116 -6 4 97 -145 306 189 -184 322 41 0 50 114
2751 114 31 -94 -62 -17 1 -142 47 -143 50 -73 6 -24 -4 107 -179 30 -44 -6 50 61 -199 -22 -220 -129
2775 -129 -212 -191 -80 46 -1 24 -338 -45 114 -19 -37 84 61 -201 -91 -71 -35 103 -36 -29 222 -138 205
2798 205 -64 -43 103 -155 131 100 137 52 -110 124 -44 340 46 143 98 65 -56 -204 76 -54 76 1 -87
2821 -87 17 -31 225 94 278 -164 -33 186 116 -124 -121 -6 45 12 128 -223 -125 87 -100 -182 -157 -183 -344 154
2845 154 4 40 -45 -112 -25 15 -169 -30 18 -170 -3 -104 -76 -101 -317 -81 79 -186 -239 -98 -122 76 -156
$$ packed form
2679F2l89K73J04K30l31J8R6k56K04q6L06j47j93P9r8L8K10k50J76qj26o0J90
2702D2n9l2j3J28J29l34K66k54K49l73O7J30l0L1K04l4j72j14J89J00r0l0q1L42
2726B61j29r5O6j40nQ9j46L02k9j01%JM2j22J0R3k42M51j17l73N06k81m1N0O4
2751A14q3j25L2M5J8j43J89j90J93j23P9l0K0J11k86K09p4L8N6J1k60J77j98R1
2775a29q3K1J11J26m7K5l62K93J59j33j8J21k3k62J10K0L6J38j39PK51l60L43
2798B05k69K1J46k58K86l1L7q5j62K34j68L84k94R7m5l3j21j48K80j30J30p5q8
2821h7J04m8K56j31J84m42J31K19p0k40LJ15N1l3J16l51R8K12j87q2K5k6j61M98
2845A54j50L6q5o7Q7M0j84J39M8j88J67j01K8k5k16K36J60k65n3J41k4J98k32
$$ plain form
2868 -156 46 -33 -114 36 197 -10 100 110 8 34 357 -95 282 27 -1 -55 283 146 -178 237 -243 -57
2890 -57 181 117 194 72 147 -40 -7 206 61 44 67 184 99 194 35 -57 -14 86 -164 156 23 84 -133 98
2914 98 108 -205 -54 -47 -170 -234 82 109 84 48 23 86 -156 26 -273 178 8 -87 103 76 -109 278 233 -275
2938 -275 -19 -293 -127 -253 9 22 -39 197 95 33 11 166 -160 42 -62 -18 71 281 -155 55 218 104
2960 104 -31 4 -96 -46 204 267 203 307 294 119 62 48 -165 166 114 -161 10 214 -48 -164 -276 22 -65
2983 -65 -171 85 163 69 -192 -408 -186 53 -251 -35 -129 -47 -103 -63 -388 -150 34 150 -17 -403 -54 -4 -63
3006 -63 -39 -94 -170 -256 4 -131 -97 42 -86 66 -81 -22 133 -44 -55 96 59 -4 -33 -189 72 -71 191 74
3030 74 256 -203 178 -34 -21 5 155 393 230 28 83 58 114 -55 32 409 151 -109 -208 49 -12 281 -157
$$ packed form
2868a56K02p9q1J50J61k07J10J0j02K6L23m52L77k55k8n4L38j37l24M15m80J86
2890e7K38o4P7j22P5j87L3K13j45j7K3J17q5R5j59r2M3J00k50L20j33O1k17K31
2914I8J0l13J51Pj23o4L16K7k5l6k5O3k42J82k99M51j70r5J90k7j85L87m5n08
2938b75K56k74J66j26K62J3o1K36j02o2k2J55l26K02j04M4Q9K10m36K10J63j14
2960A04j35L5j00N0K50O3o4J04j3j75n7j4k13L31n2k75J71K04k62j16j12K98q7
2983f5j06K56P8r4k61k16K22K39l04K16r4Q2n6M0l25K38J84J16j67l86L49N0n9
3006f3K4n5p6q6K60j35L4J39j28J52j47N9J55j77j1J51l7o3k9j56K61j43K62j17
3030G4J82m59L81k12J3K6J50K38j63k02N5k5N6j69Q7L77k58k60r9K57o1K93m38
$$ plain form
3053 -157 57 227 -14 174 -30 56 199 121 136 213 -221 64 116 -66 -14 -117 -32 38 6 -234 -43 -52 -2 100
3077 100 -177 -148 74 -223 -138 28 -84 -148 50 -106 55 -42 -54 198 29 175 -140 44 16 -7 -82 -181 28
3100 28 134 99 -111 68 -56 154 -126 -33 109 187 -86 -241 134 177 -183 208 114 -356 -110 60 -89 129
3122 129 76 253 -188 51 -3 -110 60 -62 54 122 34 84 22 -50 29 -365 29 -120 21 -131 -160 -218 51
3145 51 -171 -72 -209 40 -41 -18 -40 35 -59 -29 33 6 -21 42 145 -79 -67 77 -235 -191 -106 -118 49 -122 -147 198
3171 198 -109 -47 -169 86 101 -86 97 195 122 -30 180 39 -204 -53 -66 -47 -149 37 17 -80 -87 30 -180
3194 -180 200 166 27 5 27 126 -63 356 136 18 12 26 -110 73 11 -154 9 256 1 -151 168 -4 -98
3217 -98 -226 -105 6 2 -138 -52 83 28 -153 -1 -353 102 -151 16 182 -149 -148 -47 162 -3 116 144 165
$$ packed form
3053a57K14J70k41J88k04Q6J43p8J5P7m34K85N2j82N2j03Q5P0l2k40J91rN0J02
3077A00k77K9K22k97Q5J66j12o4J98j56J61r7j2K52j69J46l15J84k8k3p5r9K09
3100B8J06l5k10J79j24K10k80R3J42P8k73j55L75M3l60L91r4m70K46J70j49K18
3122A29n3J77m41K39n4j07J70j22J16O8q8N0o2p2P9l94L94j49J41j52k9n8K69
3145E1k22R9j37K49q1K3k2P5r4L0O2k7k7O3J03k24J2J44l12M4Q5j2J67j71k5L45
3171A98l07O2j22K55J5j87J83R8p3j52K10j41k43J51j3J9j02J86k0r7pJ17k10
3194a80L80l4j39k2K2R9j89M19k20j18oJ4j36J83o2j65J63K47k55j52L19j72r4
3217i8j28J21J11mj40Q6J35n5j81J52l52M55k53J67J66l31JJ01K09j65J19K8K1
$$ plain form
3240 165 -1 139 -212 190 -227 52 49 -40 80 176 69 -7 56 204 -135 82 -101 -37 -72 17 102 -130 127
3263 127 76 -195 179 94 -195 115 -33 137 285 -41 -207 -82 123 -55 132 -105 172 64 -107 -168 -66
3284 -66 -97 14 199 -141 -11 -185 -48 6 156 -6 73 -146 81 30 -54 46 -84 -240 -92 -65 -56 101 72
3307 72 -60 -59 58 -70 -252 49 -255 187 178 -28 39 24 -22 87 -108 -61 -80 143 179 98 154 -5 193 -64
3331 -64 -123 -184 1 117 257 -15 -21 -48 19 184 50 -5 -64 113 82 -82 160 81 -71 124 -47 -62 105 121
3355 121 -39 -251 130 256 168 175 59 -9 165 -108 59 -307 -36 118 202 -22 -124 -211 56 19 -136 37
3377 37 -207 -48 20 -249 59 -145 -96 -128 15 167 -16 138 -31 182 -28 69 31 -115 -32 -235 51 -10 -4
3400 -4 225 29 327 -125 39 -57 -67 -179 91 -110 -30 16 41 122 155 205 35 153 -4 125 186 -129 4 181
$$ packed form
3240A65j66J40l51M02m17K79lq9J20R6j07p6O3J48l39K17j83O4l5Q9Q5k32K57
3263A27n1k71L74q5k89L10j48J70J48l26j66J25K05j78J87k37K77j08j71o1J02
3284f6l1J11J85l40J30j74J37N4J50j62P9k19K27n1q4J00j30j56J48K7RJ57k9
3307G2j32JJ17j28j82L01l04M42rk06O7j5m6J09j95M7j9K23L6q1N6j59J98k57
3331f4n9o1J85J16J40k72ok7O7J65j34n5n9J77l1j64K42p9j52J95j71j5J67J6
3355A21j60k12L81J26q8Pj16o8J74k73J67l66K71J54Q4k24j02q7K67l7j55J73
3377C7k44J59O8k69L08k04M9l2J43J52j83J54j69K13k10R7l8j46Q3k03K86o1O
3400dK29j96K98m52J64r6j0j12K70k01Q0M6K5Q1L3N0j70J18j57J29O1l15J33J77
$$ plain form
3424 181 61 173 123 84 110 55 135 28 125 -8 -109 -30 169 -112 -36 -50 -163 82 84 -95 86 22 189 192 -227
3449 -227 -185 45 -58 1 139 -29 52 -236 -151 213 149 50 -45 127 -49 -76 -52 76 20 140 208 199 -59 110
3473 110 9 -222 151 108 105 126 -91 81 274 16 102 83 92 41 -23 -170 -141 52 -192 214 -91 -27 53 74 -100
3498 -100 154 128 96 -59 239 30 192 59 255 88 82 -180 -125 -38 -45 93 -13 -50 -61 124 -279 58 -15 34
3522 34 -43 124 -27 -165 -231 -271 -182 -44 118 -151 -175 -210 -173 -200 216 -124 19 -28 -102 -2 -9 -133 -71 2 -319
3547 -319 -93 31 43 -122 -47 169 72 18 -41 39 -123 18 -122 -121 -93 -60 -29 -139 98 199 -185 -131 137 153
3571 153 37 59 143 253 -54 7 71 -36 39 -181 -4 34 -132 161 -43 -107 202 -121 97 142 -88 -96 -15 -31
3595 -31 -216 22 -173 36 -31 -114 235 141 -43 33 109 -197 -68 -109 201 -73 32 -183 -38 -277 -35 -22 -197
$$ packed form
3424A81j20J12n0l9K6n5Q0j07R7j33j01P9J99k81P6j4j13K45Kj79J81o4J67Lm19
3449b27M2K30j03N9J38j68Q1k88Q5L64o4r9r5J72j76k7K4J28n6J20O8rk58J69
3473A10j01k31L73m3lK1k17J72J93k58Q6j9Rn1o4j47K9J93k44M06l05O4Q0K1j74
3498a00K54k6l2j55K98k09J62j33J96j67ok62N5Q7pJ38j06l7j1J85m03L37p3M9
3522C4p7J67j51j38o6m0Q9J38J62k69k4l5L7k7M16l40J43m7p4J00pj24O2P3l21
3547c19K26J24J2j65P5K16r7n4n9Q0j62J41j40JK8L3L1j10K37J01l84N4K68J6
3571A53j16K2Q4J10l07O1O4j07P5k20J77L8j66K93k04o4L09l23K18M5k30qQ1j6
3595c1j85K38j95K09o7q3L49r4j84P6P6l06J29m1L10k74J05k15J45k39K42J3j75
$$ plain form
3618 -197 -230 133 145 -188 140 -164 145 -50 -144 61 270 83 89 -52 -43 -36 27 87 32 199 -99 -26 71 -124 97
3643 97 16 8 40 -188 67 -94 -57 -41 271 -2 -96 -95 1 -65 118 87 -131 20 -25 33 166 -23 76 170 -44 44
3669 44 24 -157 -8 -17 -172 -89 -153 -135 47 -119 -164 -116 36 -14 -216 115 -84 101 -17 -243 15 -93 -120 39
3693 39 -192 -125 -50 367 23 228 105 -153 -251 -119 128 -62 -21 -180 -50 159 161 168 212 127 -8 40 36 -134 162
3718 162 -195 -3 198 151 177 219 11 100 -64 142 -110 -39 13 186 -16 -66 -4 -79 148 -116 -178 -37 59 -40
3742 -40 93 -43 -98 83 -222 -25 -36 174 248 -183 121 -51 48 69 -45 -208 -31 103 59 136 -41 67 -62
3765 -62 -28 -84 99 102 -27 -162 121 88 69 -104 15 117 131 238 -65 -50 -75 73 61 202 127 321 -188 119
3789 119 8 -261 -55 -93 57 94 -58 46 73 50 47 112 -22 -119 -177 139 251 117 327 -2 80 -413 25
$$ packed form
3618a97l3L63J2l33L28l04L09j95r4K05K09j87Oj41RPO3O0n5J67k98P3R7j95K21
3643I7q1qL2k28K55j61L7J6L12k73r4JR6o6J83l1k18J51m5N8J33j89R9R4k14Q8
3669D4k0j81J49rj55Q3o4J8J82j66m5M8J52n0k02L31j99J85j18k26K58j08k7J59
3693C9k31O7P5M17l44K05j23k58r8J32K47j90M1j59J30K09KPM4q5j35M8mj70K96
3718A62l57J92K01m7K6M2k08Q9j64K06k52P1N2J73k02n0O2p5K27k64o2J41R6r9
3742d0J33j36n5J81l05J97j1K10P4m31L04j72R9K1j14j63J77J34m4P7j77J08j29
3765f2L4n6J83Lj29j35K83l3j9j73J19J02J4J07l03J5k5J48j2J41p5J94n09L07
3789A19j11k69K06l8J50L7j52J04K7k3lO5j34r7n8L16J12j34K10l29Q2m93M38
$$ plain form
3812 25 93 22 -87 124 61 128 49 -55 -12 92 47 108 -180 -20 201 47 101 81 -37 70 -164 -98 -172 -57
3836 -57 -86 -3 112 -193 -158 6 -13 76 -202 -31 -194 69 -105 270 131 146 122 -349 148 -83 154 -121 51
3859 51 -240 -38 -128 -208 -165 226 -325 343 97 60 200 -120 127 -77 -47 51 14 131 -226 -31 208 68 156
3882 156 -4 -137 -29 162 117 35 147 -61 -103 378 -21 -11 -31 -20 -169 -36 -204 -164 -83 -164 -33 9 -176
3905 -176 36 189 1 -81 -84 -32 135 68 -177 54 -17 -149 88 -123 -13 -97 -269 -135 144 -209 150 175 61
3928 61 43 12 -154 -89 280 -4 -152 172 104 197 -122 138 125 -2 27 -81 -9 54 -57 223 -87 7 -29 263
3952 263 12 194 -75 -164 -96 53 -70 -64 303 130 177 26 66 -6 -248 170 -10 -98 159 -16 -68 -131 -82 -180
3976 -180 -33 141 -123 -83 -164 -86 -135 -330 123 -40 79 -300 -263 -140 -2 90 -220 141 20 -158 1 3 95
$$ packed form
3812B5O8p1j09K11o3O7p9j04M3J04m5O1k88J60K21j54N4k0j18J07k34O6p4J15
3836e7k9Q3J15l05L5J64j9Q9k78J71j63K63j74L75j39J5k4m71M97k31K37k75J72
3859E1k91K02r0q0M3L91n51O68k46l7J40l20K47k04L0R8l7J17l57J95K39j40Q8
3882A56j60j33J08J91m5q2J12k08m2M81l99J0k0J1j49J33j68M0Q1q1J31M2j85
3905a76K12J53j88q2lN2J67o7k45K31p1j32K37k11J10q4j72J34K79l53L59K5j14
3928F1j8l1j66O5L69k84j48L24o8R3l19K60j3j27K9j08P2O3j11K80l10R4l6K92
3952B63k51J82k69q9O8J49j23OL67j73M7j51M0p2k42M18j80q8K57j75n2o3M9r8
3976a80J47J74k64M0q1P8m9j95M53j63J19l79L7J23J38R2l10L61j21j78J59KR2
$$ plain form
3999 95 -39 -60 -8 -91 -191 116 0 -242 59 -88 167 256 22 47 80 143 -134 -24 -4 -36 70 -144 -114 174
4023 174 -206 250 -66 172 -81 -32 162 41 30 -12 11 -1 228 -25 -92 10 -43 -142 -125 -156 147 101 270 -239
4047 -239 -165 53 114 -44 -101 -83 -114 105 -145 -136 -275 -150 -99 95 -71 -377 -246 -46 285 -170 157 -155 12
4070 12 -176 -142 99 192 -159 245 -148 29 204 123 263 -28 -136 52 -247 33 -28 28 187 204 69 94 -66
4093 -66 188 -11 -276 -50 86 106 101 -19 -57 -3 69 -222 108 154 70 13 146 218 39 274 -18 -56 -148 -130 -49
4118 -49 75 -78 -15 84 41 73 89 -84 62 39 294 101 -190 133 -66 -54 -62 -19 -63 -13 -3 -84 -23 -57 -79 26
4144 26 44 83 -244 309 -65 -12 52 -303 119 -153 -3 -168 -90 24 -2 214 297 95 263 -82 12 143 51
4167 51 265 -97 -130 -5 -101 17 -22 -79 -107 -50 88 20 63 177 -126 -202 -88 148 -101 91 -113 50 27 72
$$ packed form
3999I5j34k1N2q3j00L07j16k42L01j47K55Q9k34K5L3O3k77J10K0l2J06k14L0K88
4023A74l80M56l16K38k53M9J94j21j1m2K3j2K29k53o7J02n3r9J7l1L03m6J69n09
4047b39P4K18O1j58n7J8l1K19k50Rj39J25N1J94j66l06J31K00L31m55L27l12J67
4070A2j88L4K41R3l51M04l93J77J75q1J40k91j08J88k99K80o1N6J59J7j35K5j60
4093f6K54j99k65K26J36K0nj20l8N4P2k91L30M6q4n7J33P2j79K35k92l8r2J8Q1
4118d9J24j53O3R9m3L2J6j73J46k3K55j93k91L23j99J2qM3m4N0J0q1O1l4k2J05
4144B6J8L9l27N53l74N3O4l55M22k72J50j65P8J14k6K16Q3k02J68l45R4J31r2
4167E1K14l62l3J25r6J18l9n7k8N7J38o8M3J14l03p6J14K36k49J92k04J63k3M5
$$ plain form
4191 72 -109 -22 -11 -1 50 63 237 112 56 -36 -25 129 54 17 -16 154 230 -165 -133 12 -110 -28 35 -281 -149
4216 -149 139 -127 -89 -25 6 -115 -26 -36 88 -45 40 -61 -37 -32 -206 82 -35 -133 21 30 -17 -111 66 134 63
4241 63 -80 301 45 114 134 -115 -195 175 -74 95 -144 77 -41 -29 131 75 104 -137 119 43 87 -110 -49
4264 -49 -218 128 42 -125 -91 100 -18 -100 -46 149 82 87 208 -22 161 246 -212 74 -44 25 116 -25 204 -354
4288 -354 -97 -152 -77 119 27 -84 -46 105 355 -222 269 62 -193 -146 -66 52 -27 -56 -78 245 -100 -99 -166 -40
4312 -40 34 25 114 110 100 -132 32 -59 47 112 -24 316 -163 127 272 134 154 415 98 -138 116 188 9 98
4336 98 -169 151 -107 -62 15 52 406 42 108 103 184 52 -151 -37 -401 -15 -168 258 -205 29 44 -15 181
4359 181 -191 30 71 -219 -176 -291 -194 -36 -246 112 105 -97 25 149 44 114 111 -12 14 104 -74 85 -167
$$ packed form
4191G2j81Q7J1J0N1J3J74j25n6r2J1J54p5l7l3J70P6l95L2J45j22Q2O3l16J32
4216a49K88k66L8O4L1j21Q9j0J24j33Q5j01K4Nj74K88j17r8J54Rm7r4J77O8p1
4241F3j43L81k56O9K0k49q0L70k49J69k39K21j18J2J60n6K9k41K56p6M4j97O1
4264d9j69L46q6j67L4J91j18q2N4J95o7NJ21k30J83Q5m58K86j18O9R1j41K29n58
4288c54K57n5P5J96r2j11L8J51K50n77M91k07k55M7Q0J18p9k9k2L23l45Jo7J26
4312d0P4rQ9mj0k32J64r1J06O5j36L40m79K90J45j38K0K61l17k36K54P2j79Q9
4336I8k67L20k58M5P7L7L54l64O6nQ1j32k03J14l64L86j53M26m63K34J5n9J96
4359A81l72K21M1k90M3j15R7J58k10L58pk02J22J24j05P0lj23K6R0j78J59k52
$$ plain form
4382 -167 -116 130 -75 -171 -263 -59 99 -100 -24 153 -119 -48 32 145 126 76 5 77 -63 153 157 180 244 212 80
4407 80 -78 364 46 -151 237 220 165 76 37 200 -149 -54 148 124 29 11 -1 -197 48 -30 107 264 -124 129
4431 129 -287 -85 118 -151 -119 34 120 -224 -124 237 -95 30 76 -92 18 47 -209 226 -122 -89 1 -111
4453 -111 -6 -106 -58 115 -150 33 160 -6 -70 -188 70 135 121 293 -112 -124 -25 -115 -67 -246 -62 -47 113
4476 113 192 147 190 -192 -61 161 -157 117 94 14 7 207 146 -6 -94 256 151 -179 -188 138 24 83 -122 19
4500 19 -50 -52 4 -29 -124 64 326 153 -3 45 31 -161 46 -41 -190 74 69 177 92 -142 -32 113 122 298 113
4525 113 -37 -52 -12 -180 -77 -77 171 -284 2 -157 120 56 -66 -104 -122 7 111 -119 -27 208 -218 -252 -23
4548 -23 -150 128 -17 243 240 -292 227 100 233 -20 -22 -1 -52 87 128 72 20 34 67 116 68 -270 218 -25 180
$$ packed form
4382a67N1K46k05r6r2K04J58j99P6J77k72P1Q0J13j9n0p1P2j40K16MK3O4l2j32
4407H0j58M42l18j97L88j7n5q9l9J63l49R5K02k4r5j8j2j96K45p8J37J57l88K53
4431A29m16K02K03k69L2J53Q6l44J00L61l32J25M6j68J10K9k56M35l48L3R0j12
4453a11J05j00M8J73k65J83J27j66o4j18K58O5j4J72m05j2R9r0M8j79J84J5J60
4476A13P9m5M3l82J31K22l18K74k3q0pK00o1j52q8L50j05l30rL26j14N9k05J41
4500A9o9kN6l3r5J88K62j73j56M8j4j92K07q7j49K64nJ08q5k34J10J45RJ76j85
4525A13j50j5M0j68J03%K48m55K86j59K77o4j22l8j8J29J04k30R2K35m26l4K29
4548b3j27K78j45K60ln32N19j27J33k53kK1n1J39M1n6n2J4L3M9m8l38M88k43K05
$$ plain form
4573 180 161 173 -41 51 -35 -55 73 -195 -137 -86 -105 -104 38 -306 30 56 -83 65 43 46 -13 47 -110 -209 -91 -131
4599 -131 44 248 -111 -108 182 6 -104 -131 50 22 -24 16 -4 102 51 66 -77 -34 44 75 92 -198 51 111 -178
4624 -178 -78 97 45 98 -199 -22 -50 6 -79 31 64 9 -8 252 264 43 154 -21 82 30 -99 -201 -91
4647 -91 266 -139 231 -50 89 102 135 69 -113 73 -79 -30 -87 21 -150 -61 234 -11 82 -23 -168 133 -155
4670 -155 30 120 44 0 -24 -49 -5 -97 206 -17 18 -115 50 -66 -155 -201 73 -99 1 57 -283 -10 -71 -7
4694 -7 -129 -13 19 68 -186 -38 -27 45 98 149 -104 127 15 61 -74 68 37 -101 -305 -92 247 -76 184
4717 184 -15 138 119 16 103 105 79 -129 -83 -46 -191 -201 -8 -310 -214 -128 117 -59 19 19 222 -89 140 -98
4741 -98 -133 -9 162 -97 54 187 -293 97 209 168 88 99 173 193 -44 -33 -81 -32 -190 -151 208 51 103 18
$$ packed form
4573A80j9J2k14R2q6k0J28k68N8N1j9JJ42l44L36K6j39J48k2Ln9O0j57r9J18m0
4599a31J75K04l59LK90j76j10k7J81k8m6M0k0J06n1J5j43M3P8L1J7k90K49O0k89
4624a78J00J75n2N3k97J77k8N6q5J10L3n5j7K60J2k21J11j75J03n2j29j02J10
4647i1L57m05L70k81J39J3L3o6j82J86j52M9n7J08j71Q9K95k45R3j05j45L01k88
4670a55J85R0p6m4k4k5M4r2L03k23L5j33J65j16q9m6K74j72J00N6l40K73o1O4
4694gj22J16L2M9k54J48J1P2N3N1k53K31j12M6j35J42l1j38k04K13L39l23K60
4717A84j99J53j9j03Q7Kk6k08M6L7j45j0J93l02R6Q6K45j76P8%K03l11K29k38
4741i8l5J24J71k59J51J33m80L90J12m1q0J1P4K0k37J1m8M9j58L9L59j57N2q5
$$ plain form
4765 18 -168 -259 -284 40 322 -349 -150 -55 117 15 12 -200 -25 61 21 89 -91 29 210 -1 56 265 196 277
4789 277 -81 -211 219 255 -255 316 -29 -122 73 -33 120 -42 -223 -145 35 -54 -57 -208 75 160 -45 23 -64
4812 -64 -46 32 -247 -220 -383 -18 -65 181 -21 -77 -209 -164 -39 268 8 -74 -40 159 104 63 125 -93 -48 -99 88
4837 88 -280 -59 -50 198 41 17 113 74 2 134 -82 -147 104 87 169 63 -168 -166 9 302 -145 -333 14 -40
4861 -40 116 -358 48 57 191 -158 -81 172 34 -51 30 -48 44 22 -225 -57 -106 -30 -123 100 -199 25 -255 -45
4885 -45 -170 -132 -1 32 74 -28 -65 13 -290 166 206 -14 -75 -157 71 126 296 46 -134 -16 213 50 193
4908 193 171 -238 -51 -10 199 96 -64 101 -92 -13 -137 -16 112 138 -12 196 135 -189 3 -40 242 -62
4930 -62 186 41 17 17 95 132 176 60 172 -45 -139 105 94 -6 109 -47 7 -57 -33 11 -258 399 -240 -75
$$ packed form
4765A8j86r1k5L24K82o71J99R5J72j02lk12J75Q6m0O8j80J20J81k11N7K09o9Q1
4789B77l58j30M30L6n10N71l45r3J95j06J53j62j81P8J80q9lj51K83Q5k05O8q7
4812f4J8P8k79K7j63L65m7K46k02n6j32M5J25L07k60q2L4J99n5m1O2k18M5n1J87
4837H8l68K21RK48j57k4R6l9p2J32k16o5K51j7Q2j06k31KJ75K93m47j88L47n4
4861d0J56m74M06RJ34l49P7K53j38q5Q1p8R2k2k47J68m9P6r3K23k99K24k80K10
4885d5j25L8J31L3M2j02l7P8l03M56M0k20o1q2K28N5J70k50j80J18K29j63J43
4908A93k2m09J87M1K09j03j60J65j93P9j24J21J28K6j50K08o1l24J92m3K82l04
4930f2K48j45k4%P8L7M4j16J12k17r4K44j1j00J15j56N4o4K4M4k69O57o39J65
$$ plain form
4954 -75 188 -13 142 37 -101 58 -66 -279 16 -1 288 -267 -264 135 -190 -177 265 14 -370 371 -102 -642
4976 -642 -17 137 104 638 625 270 44 302 -179 84 93 17 58 128 -52 -105 -149 49 2 -7 -35 28 112 166 78 32
5002 32 269 -20 -193 160 -153 167 0 -14 38 -254 -223 128 85 153 58 140 -56 -389 30 -85 -8 34 -122
5025 -122 4 -38 -187 62 83 173 -267 -91 -321 76 20 137 -68 -2 -134 107 173 -118 278 -108 -150 73
5047 73 -204 -112 93 -320 111 6 122 275 -65 -76 -113 -214 18 -24 -111 -131 128 -98 -53 104 233 111 -65
5070 -65 37 96 97 3 163 -146 53 -20 251 96 -220 -112 -172 -26 -172 -21 -182 -21 70 -118 -87 83 -141
5093 -141 112 54 3 -85 -92 -34 0 185 33 95 121 -228 -279 65 203 233 -223 -94 -69 79 -156 1 -113 -132
5117 -132 -240 0 31 52 106 170 -66 -45 -22 -254 5 62 -216 -134 107 1 -125 99 -50 85 -30 220 47
$$ packed form
4954g5K63k01J55j05j38J59j24k13K95j7K89n55LL99l25J3M42k51l84P41m73n40
4976f42O25J54l3N34j3l55k26K58m81K63Rp6M1P0j80n3m4J98m7rk8O3Q4N4q8m6
5002C2K37k89j73L53l13L20j67j4N2k92L1L51m3O8r5Q2j96l33M19j15P7M2j56
5025a22J26m2j49K49K1R0m40J76k30L97n6J17k05O6j32K41O6k91L96l86m2K23
5047G3k77R2K05m13M31j05J16J53l40j1l7j01K32m2q7k0K59k26M5J57J29j22j76
5070f5J02N9Jr4J60l09J99p3K71j55l16J08o0J46j46J51j61J61R1j88L1J70k24
5093a41K53n8n1q8pN8L4J85j52O2K6l49n1L44J38L0m56J29K5J48k35J57j14j9
5117a32j08K40L1K1N4O4k36K1K3k32K59N7k78Q2K41j06j26K24j49J35j15K50j73
$$ plain form
5140 47 -44 -179 67 42 122 83 222 -66 16 146 -17 43 -100 148 -95 192 -62 -225 47 55 -178 51 66
5163 66 -28 50 200 -116 176 33 -179 62 -41 119 132 -66 149 -37 -56 286 -289 137 88 107 -118 232
5185 232 -124 55 105 -40 -32 -33 461 67 233 29 102 -97 -42 -34 123 -75 -17 86 -125 -10 -26 -70 59 -43
5209 -43 -137 103 -154 -135 -179 -239 -66 -16 -4 206 24 169 289 -111 -24 103 -213 130 -9 167 -220 -264 0
5232 0 52 -195 127 21 105 35 -138 -277 78 119 31 39 63 -33 -40 -175 107 248 -30 -57 13 109 -115 145 -113
5257 -113 -11 30 -75 -2 247 216 30 -99 -74 -105 -100 -240 -105 -3 -146 -164 -45 29 -52 -170 -210 -53 -20 212
5281 212 148 -45 8 -119 18 135 -35 2 -218 -119 -153 -394 2 -65 53 88 79 -48 207 56 -133 -55 -74 167
5305 167 344 -182 78 93 103 -124 7 220 36 -76 -142 -3 16 -109 194 -193 23 14 -34 26 -25 137 188
$$ packed form
5140D7r1j35K46k5Q0l9J39k88Q2J30j63O0j43K48k43K87k54j63K72Qk33K29J5
5163F6r4P8J50l16K92j43k12K41j03J60J3j98K15j86j9L42n75M26m9J9k25L50
5185B32l56J79N0j45QjM94l94J66k04P3j99N5QJ57j98N8J03k11J15j6m4J29j02
5209d3r4K40k57J9m4o0J73N0J2K10j82J45J20m00Q7J27l16L43j39J76l87m4K64
5232@N2k47L22j06Q4p0j73j39L55M1q8QK4r6pj35K82J41k78k7P0R6k24K60k58
5257a13J02M1j05P3K49l1j86j29K5l1Nj40J35J02j43j8J19P4q1j18m0J57L3K32
5281B12o4j93N3j27J37J17j70L7k20R9l4k41L96o7J18L5rj27K55j51j89P8j9K41
5305A67J77n26K60J5J0k27J31K13j84j12o6J39J9j25L03l87K16rm8O0n1J62N1
$$ plain form
5328 188 -61 145 -55 272 -13 90 47 -146 -59 -103 -85 129 210 98 -82 -91 -42 -115 124 -137 31 87 -182
5351 -182 -105 -235 67 -179 -211 -120 117 128 83 54 -49 57 39 -24 78 93 -65 112 -94 -78 104 160 40 -14
5375 -14 -161 32 -174 -79 2 -46 -111 -9 24 -186 109 -1 124 21 56 115 -47 -240 -79 -172 -86 -47 -125 -128 -8
5400 -8 -18 23 156 -111 149 241 66 8 71 147 -23 1 106 84 -146 52 -68 -97 65 154 233 34 19 -200 6
5425 6 -29 57 -46 -226 332 278 229 284 75 -51 -88 -142 -52 -17 70 -9 -14 47 78 -72 -32 41 76 -71 410 -192 53
5452 53 96 -10 120 262 33 -116 -78 88 -20 -198 338 -11 224 68 92 -134 -30 171 -97 -13 -198 -86
5474 -86 -6 317 52 74 56 -107 95 201 62 184 136 -95 -118 54 63 -16 -215 8 -8 89 -185 -332 232 -128
5498 -128 15 -32 126 -117 -16 -350 -18 174 28 18 -9 -241 16 266 -284 -50 -118 -47 -204 265 -296 -86
$$ packed form
5328A88k49K06k00L27k85J03m3j93Q7m4J8K14Q1j12j80rM9p3K39k61J68N6k69
5351a82P7j30L02k46l2R1K37J1m5k9j03J06j8o3J02J5j58J77k06J6J82N6j20n4
5375a4j47J93k06R5Q1m8o5J02L3k10K95j10J25j03L5N9j62j93J61r3Q6L9p8lJ20
5400hj0M1J33k67K60R2j75n8O3P6j70K4J05k2k30J98j20k9J62Q9P9j99j5k19K06
5425Fl5Q6j03j80N58n4m9N5k09j26l7n4R0L5Q7p9nO1L1j50M0P3L5j47M81o02K45
5452E3M3j06J30J42k29j49L8J66j08j78N36l49K35j56K4k26J04K01k68Q4j85J12
5474h6Q0L23k65K2j8j63K02J06j39J22m8k31k3J72Rp9j99K23j6R7k74j47N64l60
5498a28J43m7J58k43J01l34L32J92j46j0k7k32K57K50n50K34o8P1j57M69n61K10
$$ plain form
5520 -86 77 -256 259 -33 -70 196 -109 -12 95 -97 34 -117 112 101 334 49 -17 -208 260 178 -20 49
5542 49 160 -67 140 -105 -15 -118 111 109 101 147 69 34 35 78 11 -71 54 154 -76 59 174 56 57 -219 -22
5567 -22 33 -114 -68 -173 -305 2 -163 192 11 -204 -180 -334 -62 153 -137 38 -108 -74 -95 -47 32 -252 94
5590 94 -114 103 -61 -162 26 5 -121 -126 118 -284 -154 98 66 158 -157 322 236 214 160 -143 -65 -6 -191 23
5614 23 109 144 -161 150 -203 362 254 -155 149 -61 -209 39 53 202 160 -245 -46 174 -169 -59 -47 221
5636 221 59 -344 149 -98 -50 72 31 -129 99 191 -173 -123 132 157 8 -237 -24 -109 193 4 -208 54
5658 54 28 33 -159 255 89 75 -196 -95 194 -254 319 15 158 121 13 -72 -114 55 56 -78 -65 4 110 4
5682 4 119 20 -122 -8 -141 -144 163 -19 168 121 406 -106 -104 8 -148 -170 268 155 -91 190 -123 35 -3
$$ packed form
5520h6J63l33N15k92l7K66l05R7J07j92J31j51K29j1K33k85o6j91M68q2j98O9
5542D9J11k27K07k45R0j03K29kqM6p8l5JM3o7q2J25J00k30J35J15j18Jk76J97
5567b2N5j47M6j05j32L07j65L55j81k15K4j54K72K15k90J75j46L4k1M8P9k84L46
5590I4k08K17j64j01J88k1j26nK44m02J30K52l2R2l15M79q6k2n4l03P8N9j85K14
5614B3Q6L5l05L11l53N65j08m09L04k10j48K48J4J49m2m05J99K20l43J10J2K68
5636B21j62m03M93k47M8J22m1j60K28R2l64N0K55K5j49k45K13q5L02j89k12K62
5658E4k6Nj92M14j66j4k71J01K89m48N73l04J43l7j08q5m2J69Jj34J3O9J06j06
5682DJ15r9j42J14j33lL07j82J87m7K85n12KJ12j56k2M38j13k46K81l13J58l8
$$ plain form
5705 -3 -53 -259 113 -158 -65 115 63 7 -187 40 89 -134 -21 23 -91 328 5 -127 0 128 -64 -62 145
5728 145 8 -180 208 -73 -103 -20 -259 -26 -10 -144 -189 127 105 225 101 -109 102 28 -225 -34 -142 -356
5750 -356 -130 -98 57 -196 62 -44 31 96 28 -84 -45 -73 107 0 -165 -36 263 102 -60 71 66 33 -172
5773 -172 121 96 -5 -342 -46 -49 -82 180 -27 -290 -67 208 -22 -44 173 76 138 106 -220 3 -71 96 -125
5796 -125 -147 4 115 72 78 151 162 -78 -44 48 -39 -62 242 99 93 6 39 -108 -5 -5 -38 -74 66 -118 -218 213
5822 213 108 142 -72 174 121 -210 33 -168 97 222 264 321 142 -217 -110 -89 111 -381 107 340 298 202
5844 202 -86 266 486 100 463 35 151 -120 -57 103 0 -231 -184 -99 82 172 37 -28 46 174 57 -67
5866 -67 -191 385 -386 222 57 273 -247 -62 -68 38 45 -9 -238 60 193 75 73 72 34 3 -181 229 -176 6
$$ packed form
5705cn0k06L72k71R3J80n2n6j94K27M9k23J13M4j14M19l23j32J27J28j92KK07
5728A45j37j88L88k81l0Q3k39K33J6j34m5L16k2J20j24k10K11p4k53J91j08k14
5750c56K26L2J55k53K58j06P5O5o8j12L9k8J80j07j65J29K99j61j62J31nl3k05
5773a72K93k5j01l37K96ll3K62k07k63K23K75k30k2K17r7O2l2l26K23p4J67k21
5796a25k2J51J11m3OP3J1k40L4R2q7k3L04j43oq7L3j47J03%l3l6J40j84j00M31
5822B13j05L4k14K46n3l31K43k01K65J25M2N7j79l59J07K1K00m92M88K33m2r6
5844B02k88L52K20l86L63m28J16k71O3J60j03k31M7Q5J81R0j35o5P4J28j17j24
5866f7j24N76p71O08j65K16n20J85oJ06Pn4k29K98J33j18kjl8l1j84M10m05J82
$$ plain form
5890 6 43 73 11 -276 131 157 -122 76 -103 -142 -89 -213 18 -11 118 92 -9 99 -2 -27 -25 -42 341 166 -61
5915 -61 -41 74 23 -25 -14 -19 -24 192 112 15 197 -124 101 68 136 323 -15 185 271 66 -150 -22 -16 1 102 -265
5941 -265 190 187 166 -168 -215 37 -209 114 10 -114 48 -58 87 43 48 46 -32 231 -83 -216 -60 156 257
5964 257 41 -147 15 -69 9 191 -10 -48 208 64 -269 90 -120 38 -130 -133 -78 65 -207 -220 111 1
5986 1 -4 55 163 183 192 -99 -81 217 -8 -144 75 -18 -124 196 -5 102 87 234 88 179 108 136 96 -235 86
6011 86 -71 -3 -53 -25 -120 -23 221 -179 -149 239 -51 -258 11 110 104 -49 143 -211 31 24 108 9 -95 92 11
6036 11 186 -122 -31 -144 -30 -26 -133 -190 154 -620 349 52 -1080 -483 107 202 -384 282 684 -518 -231
6057 -231 320 133 -393 459 76 40 39 359 -370 -310 50 44 273 85 191 234 706 222 17 -16 -238 -165 71
$$ packed form
5890FL7L0o2k87M07K6k79J98j79l9N3j24K31k9J29k6j01J08j01k5Kj7L83j75k27
5915f1K0J15n1m8J1nnK16q0r7J82l21K25l3O8J87l38K00Q6k05k16J28OJ7J01l67
5941b65M55lk1l34m7K52k46L23j04j24J62j06J45m4Nkp8K63l14j33J56K16J01
5964B57k16j88J62q4P8J82k01l8K56j44l33L59k10J58j68lN5J43k72j3L31j10
5986AnN9J08K0Rk91J8K98k25j36K19r3j06L20k01J07j5J47j46R1p1K8m0l31L21
6011H6j57O8n0K8r5R7K44m00L0L88k90k07K69R9oj53J92l54K42pQ4r9j04J87q1
6036A1J75l08R1j13J14Mj07n7L44p74R69k97j132N97N90R5n86O66M02j202K87
6057b31N51j87n26Q52l83l6jL20p29O0L60oK29j88J06M3M72m84k05l3k22P3K36
$$ plain form
6080 71 445 9 -303 -247 -338 -1047 -109 -42 40 310 -203 -56 221 -80 11 143 55 119 33 -147 41 94 -8
6103 -8 -112 44 -220 -78 -82 143 -46 -213 -109 153 9 19 -150 5 159 -53 -50 171 28 -169 0 -117
6125 -117 -19 -61 -76 118 96 -85 54 8 54 -70 60 -202 281 -68 -41 -226 -277 -1 149 -74 -208 -53 180
6148 180 -6 52 -103 343 48 -71 73 -104 35 147 209 238 -172 -57 -101 -13 105 -37 -133 -165 15 104 -39
6171 -39 94 11 78 -1 -58 -131 -40 16 -49 104 23 -206 -211 -95 157 -34 77 -39 -65 139 -254 0 145 123 42
6196 42 -10 -39 14 0 -118 -74 -104 -104 -131 123 220 -68 111 43 54 317 -123 40 178 -48 -30 135 -133 36 -72
6221 -72 -39 -194 6 -23 81 -274 37 -58 316 -243 327 -545 -345 -427 -144 195 -57 14 65 108 -179 -12 -48
6244 -48 1 -218 5 -194 14 130 -201 146 96 258 -154 -57 -83 -175 -40 -20 -47 -109 160 -44 -117 -44 -66 299
$$ packed form
6080G1L74m36l12N6r1p09R38O7Q2K70n13J47K77l01R1J32q8O4q6j80J88N3j02
6103hj04J56k64J42mK25j89j67J04K62j44J0j69J55J54k12LK21j43j97J69j17
6125a17R8m2j5J94k2j81J39m6M6j24J30k62M83l49K7j85n1K76J50k23j34J55K33
6148A80j86N8j55M46k95j19J44j77J39J12O2K9m10J15m4Q8J18j42r6l2J80Q9j43
6171c9J33q3O7p9n7p3R1N6o5J53q1k29nJ16K52j91J11j16k6K04l93K54J45k2q1
6196D2n2k9N3j4j18M4l0%k7K54R7k88J79o8J1K63m40J63J38k26J8J65k68J69j08
6221g2L3j55K00k9J04l55L11r5L74n59N70q72K00q2K83L39k52P1N1M3k87J67l6
6244d8M9k19K23j99K08J16l31L47n0J62m12R7k6r2J35K0k7o2K69k04p3P3k2L65
$$ plain form
6268 299 -62 -140 103 27 80 120 47 210 -62 47 -74 -15 -112 -23 -13 92 155 4 2 -34 74 72 -41 134 -241
6293 -241 29 44 -106 -104 21 143 134 59 -56 137 60 13 -68 -175 155 90 -53 -80 87 19 96 -56 -227 -274 -20
6318 -20 -26 -83 371 107 -208 69 120 -130 -77 49 170 -76 60 147 -30 -274 -71 8 57 88 -72 56 296
6341 296 61 -111 -206 68 34 -19 55 -414 45 148 204 -156 29 38 -162 78 -89 -132 111 -20 -35 -173 57
6364 57 -58 -24 81 -220 -187 -44 -20 -57 3 52 -53 -77 56 187 82 181 35 142 63 208 135 36 118 -246
6388 -246 95 62 -51 56 289 -24 25 95 -52 -26 19 80 91 -21 -64 -308 26 41 -215 65 -33 46 -17 -36
6412 -36 -158 -119 -48 101 -15 -126 122 -150 -22 59 -198 -113 -11 -206 -284 240 17 66 152 34 -20 138 -169
6435 -169 -172 -34 -94 -128 48 37 -171 235 47 -135 100 -112 -275 123 -32 -123 -87 121 307 -54 154 -131
$$ packed form
6268B99l61p8K43p6N3M0p3J63k72J09j21N9r7Q9J0J05O3j51kl6J08kj13J75l75
6293b41K70J5j50KJ25J22rp5j15J93p7m7q1j07L30o5j43k7J67o8P7j52j71m7K54
6318b0on7M54k64l15K77N1k50N3J26J21k46J36Q7j77k44K03P9M9L1j60J28K40
6341B96k35j72r5K74l4n3P4m69M59J03N6l60J85Rk00K40j67m3K43j31j5j38K30
6364E7j15L4J05l01L3J43K4l7O0M9j05k4J33J31j05R9j46J07p9J45p3r9Q2l64
6388b46L41l3j13J07K33l13M9P0j47K6M5O1J1j12m3k44L34J5k56K80r8P9o3j9
6412c6j22L9P1J49j16j11K48k72J28Q1k57Q5J02j95p8N24k23M9Q6j18n4J58l07
6435a69lJ38o0l4J76j1k08M06j88j82K35k12j63L98j55r1L6K08J86l61K08k85
$$ plain form
6457 -131 31 58 -32 28 -200 -13 -203 9 15 197 147 130 96 238 -57 257 57 -7 -204 -72 0 -199 -65
6480 -65 21 -23 -129 -22 -156 103 -244 -119 -5 31 0 -38 -143 123 -216 -21 -39 93 -47 12 -114 -213 -147
6503 -147 74 -23 200 -66 -106 -6 187 -35 136 57 -82 -18 15 15 40 -2 -29 17 178 335 -283 9 24 144
6527 144 107 20 19 55 165 -60 149 176 -4 68 55 -204 112 -38 -203 -76 54 198 167 -95 -60 22 -137 125
6551 125 94 79 12 -163 -143 185 -272 -53 166 -148 -125 -90 95 188 167 -83 -203 24 -1 -67 28 103 24 -13 -151
6576 -151 126 -228 -147 283 -257 40 -225 62 127 8 -21 -193 165 48 -169 390 27 100 6 112 83 160
6598 160 -109 22 -137 30 -13 166 -15 142 74 2 28 -50 97 -106 -77 60 -96 -37 -4 -9 212 290 164 76
6622 76 108 -108 52 10 150 32 -20 -40 28 -43 -289 -216 118 217 -186 114 119 -142 51 -259 -175 69 -67 -139
$$ packed form
6457a31J62K7r0O0k28J87j90K12OJ82n0j7l4J42k95L14k00o4j97J32P2j99J34
6480f5Q6m4j06J07j34K59l47J25J14L6l1l8j05K66l39J95j8J32j40N9j26r9O6
6503a47K21r7K23k66m0J00J93k22J71p9j39O4L3%K5m2k7M6J61J57o18K92J5J20
6527A44l7q7jL6J10k25K09K7j80P2j3k59L16j50j65J27J30J44l1k62L5Q2j59K62
6551A25l1j5o7j75K0L28m57K19K19l14K3L5J85R3k1k50j20K27k5o6R5P5p9l7j38
6576a51K77l54Q1M30n40K97k65K87O5j19k9j72L58j17k17N59l63P3r4J06k9P7
6598A60k69J31j59J67m3J79j81J57o8p2K6p8J47k03K9J37j56N9L3nK21P8j26q8
6622G6L2k16J60m2J40j18n2k0O8p1k46P3L34R9m03L00Nk61J93l10Q4K44j36p2
$$ plain form
6646 -139 -291 -68 -39 -10 -93 75 122 141 70 152 153 93 -125 -85 12 106 -11 77 -33 139 -36 20 117 124 2 94
6672 94 84 -104 -180 156 228 -75 -132 137 55 175 -57 -141 71 71 70 57 143 75 138 -106 45 -85 -71 55 -54
6697 -54 91 -54 -365 -78 315 -80 96 95 -199 -127 -49 36 0 73 -131 47 84 -33 -64 -259 -62 -118 -117 -13
6721 -13 33 105 173 177 -52 -10 113 87 -14 203 -91 25 115 -108 -195 69 220 -16 -35 -115 186 237 96 -343
6745 -343 413 140 -331 14 -280 -41 44 338 336 200 154 -51 -56 -465 85 -12 486 595 922 32 -575 -299
6767 -299 -99 -9 298 -33 91 -251 75 46 23 -187 -124 75 43 -190 -44 -211 146 -88 -47 37 333 -13
6789 -13 -115 33 53 166 123 197 27 -72 -79 -52 101 108 1 15 -153 88 -90 -122 113 -74 -69 -40 3 64 -172 231
6815 231 173 -1 -49 154 -79 -38 -184 -13 32 78 -1 -165 308 140 118 275 1 117 -157 306 135 87 145
$$ packed form
6646a39j52K23K9K9q3J68M7J9p1Q2Jo0k18M0R7R4j17Q8j10J72j75N6R7Pj22R2
6672I4j0j88p6L36P2l03n7K69q2J20k32q4K12%jj3Q6o8O3k44J51j30J4J26j09
6697e4J45j45l11K87L93l95J76jk94P2P8Q5l6P3k04J78L7j17l1j95J97n6JJ04
6721a3M6P2O8Mk29M2J23k6j01K17k94J16R0k23q7K64J51k36j9q0L01N1j41m39
6745c43P56k73m71L45k94K39Q5K94kj36m6k05nm09N50r7M98J09L27q90o07K76
6767b99K00R0L07l31J24l42L26k9k3k10O3J99l2k33J46j67L57k34M1Q4K96l46
6789a3j02J48K0J13m3P4j70r9pK7J53Pj07J4j68K41j78l2K35j87NK9M3O1k36M03
6815B31n8j74m8K03k33M1j46J71M5M6p9j64M73j68k2J57k74J16k74M63j71m8N8
$$ plain form
6838 145 168 50 -178 -16 -41 102 298 -39 -5 45 -224 -237 -181 -47 244 9 -218 135 -55 -20 -42 44 33
6861 33 269 -253 -140 -38 78 90 -75 111 40 -260 -98 -209 -42 -144 242 -85 -4 -213 413 -159 -169 766
6883 766 264 126 -236 -749 -311 217 421 96 -269 135 96 -97 -123 -15 45 31 -78 191 17 -12 115 222
6905 222 -108 104 42 85 -137 250 5 -257 141 -66 -114 125 -147 -114 261 68 142 36 -3 -50 106 13 -121
6928 -121 52 -167 -85 -19 116 -99 4 -29 -87 54 -95 96 -268 188 -218 110 76 14 -145 157 -77 -215
6950 -215 -115 71 84 33 -221 -81 149 -7 -58 74 30 -186 -117 29 -61 -162 62 -280 155 -49 151 -146
6972 -146 -93 150 88 39 -124 230 -93 -54 4 139 371 80 146 80 -6 259 -34 -163 198 -115 -34 66 13
6995 13 -67 -247 -2 -61 345 166 -125 -161 116 209 -72 93 -81 27 117 135 -309 -170 -48 -219 -20 24 38
$$ packed form
6838A45K3j18k28J62k5J43J96l37L4N0k69j3N6J34K91k35k27L53j90L5k2Q6j1
6861C3K36n22J13J02J16J2j65J86p1l00J62j11J67j02L86l27Q1k09O26n72j0R35
6883G66n02j38l62n13M38N28K04l25l65M04l9j93k6J08O0j4j09K69j74k9J27J07
6905B22l30K12o2M3k22L87k45k62L98k07m8K39k72L3L75j93P4j06l9m7J56r3j34
6928a21J73k19Q2O6J35k15J03l3n8J41j49J91l64M56m06L28l4o2j59L02k34j38
6950b15J00J86J3n1k54J40K30j56n1J32m4k16O9J46r0j01K24l42M35k04K00k97
6972a46N3K43o2m9j63L54l23L9N8J35K32k91O6o6q6K65k93j29L61l13Q1J00n3
6995A3q0j80K45n9M06j79k91l6K77R3k81J65j74J08R0J8m44J39J22j71J99M4J4
$$ plain form
7018 38 219 -25 -17 141 -25 -74 220 58 23 345 -18 -68 42 174 104 -20 -61 -28 -113 -140 -31 -64 47 164
7042 164 43 300 90 149 39 -118 -6 157 272 68 97 -99 144 205 86 -76 118 219 49 137 114 -54
7064 -54 -125 101 -201 -94 112 66 -9 -17 -110 -169 114 -32 -201 -144 148 1 -200 78 -315 59 125 26 -185 -2
7088 -2 55 -94 -128 192 125 -27 -207 199 -217 -141 -89 -12 -36 -107 -150 -134 149 -248 3 -95 120 34 240 69 203
7113 203 20 92 41 18 -45 -9 28 123 -51 -132 138 9 -77 -159 -36 -152 102 -25 30 205 -10 -45 -97 -177 80
7138 80 -62 77 183 -28 29 -34 113 -139 270 207 141 -33 -256 -9 134 45 -98 -253 46 -34 61 187 -204
7161 -204 -70 259 116 200 147 182 164 -236 -60 111 118 62 -165 144 -10 -201 54 85 -63 97 2 -131 -42
7184 -42 249 -411 105 20 139 62 -114 -37 7 -40 -143 131 4 142 -7 -290 -150 16 -144 224 115 -134
$$ packed form
7018C8J81k44QJ58j66m9K94j62l5L22l63n0J10J32p0j24m1L3q5k7J09l3J11J17
7042A64j21K57k10N9j10j57J12J63J15k04K9j96K43O1j19j62J94J01j70Q8k3j68
7064e4p1K26l02J07K06m6p5qr3n9K83j46j69N7K92j47k01K78l93L74O6r9k11J83
7088bN7j49l4L20o7j52j80M06m16P6N2P7k4p1m3J6K83l97K51r8K15q6K06j71J34
7113B03j83P2n1k3o3L6L7R5j74q1K70j29q6q2J23j16K54j27N5J75k15l5n2q0K57
7138H0j42J39J06k11N7o3J47k52M09o3o6j74k23K47J43q9j43j55K99q0R5J26l91
7161b04J34L29j43Q4n3L5j8m00J76J71Pn6k27L09j54j91K55L1j48J60r5j33Q9
7184d2K91o60N16q5J19p7j76P7M4m7j03K74j27J38j49k83J40J66j60L68j09k49
$$ plain form
7206 -134 -8 50 29 58 -199 -23 -202 198 -152 -153 152 -213 42 113 227 176 66 192 -104 -39 -227 -100 261
7229 261 -6 101 17 -79 -14 -68 -93 4 306 31 79 -8 -245 206 245 108 131 172 -20 159 -11 12 -270 -228
7253 -228 104 -89 234 -91 37 0 99 -15 -223 -179 18 -107 -103 -67 167 -60 47 -319 -11 128 -60 50
7275 50 152 -82 68 -58 -109 190 -139 -6 -290 -184 -251 -22 -125 -83 267 151 73 11 -140 35 131 176 74
7298 74 1 174 -115 30 -37 63 16 117 133 -25 -144 -50 -14 -33 -82 195 -111 248 -30 -328 -33 195 -102
7321 -102 -123 -305 -19 7 -121 81 -129 -93 83 -148 48 -98 -48 55 -57 104 199 -56 317 -65 -58 51
7343 51 -19 190 80 70 -138 -70 -93 115 -85 332 61 31 93 -100 -136 -147 183 -139 -167 232 460 214 54
7366 54 -112 -147 296 -117 -169 -48 -106 152 131 -3 -52 -105 100 117 224 89 -60 14 133 118 -68 177 -114
$$ packed form
7206a34J26N8k1K9k57J76j79M00l50jL05l65K55P1J14n1j10J26k96O5j88J27L61
7229B61k67J07q4r6O5n4k5R7L02k75M8q7k37M51L9j37K3M1j92J79j70K3k82M2
7253b28L32j93L23l25J28l7R9j14k08M4J97j25ML6K34k27J07l66L08J39j88J10
7275E0J02k34J50j26n1K99l29J33k84J06o7K29j03M2L50j16p8o2j51J75R6M5j02
7298G4p3J73k89J45o7J00m7J01J6j58j19R4L6j9m9K77l06L59k78k98K95K28k97
7321a02k1j82K86K6j28K02k10L6J76k31J96j46N0J03j12J61R5k55L73l82PJ09
7343E1p0K09j10j0k08O8k3K08k00M17k71l0O2j93l6j1L30l22k8L99K28k46j60
7366E4j66l5M43m13n2J21n8K58k1j34m9n3K05J7J07j35j49P4J19j5j86K45k91
$$ plain form
7389 -114 129 122 -85 77 25 76 -72 49 -114 182 -47 305 73 -310 342 -26 111 118 -66 35 94 200
7411 200 100 9 -205 -2 91 20 -75 -1 -279 -169 42 -6 32 124 -97 153 -59 40 34 -136 129 -217 -151 -167
7435 -167 -54 62 -100 74 5 72 -137 125 41 208 -149 163 10 4 -145 198 390 230 -16 -18 -296 -17
7457 -17 -44 74 203 -118 -33 115 -75 -35 131 -45 -139 91 -2 -230 137 29 4 17 -44 -14 -100 -22 48 -84
7481 -84 149 360 190 -142 56 76 -204 6 -137 201 60 -205 225 -25 102 127 -126 67 -71 194 -37
7502 -37 -19 -257 -21 -158 121 50 74 -109 90 100 -167 53 153 83 22 -29 224 -160 16 140 -105 116 -24
7525 -24 -42 -249 129 52 222 180 176 33 37 -152 -66 -115 -203 281 487 178 107 26 50 147 17 -87 -100 11 37 48
7551 48 9 -231 159 36 164 115 78 -135 201 -20 80 141 119 -28 10 -26 -96 -114 -35 -44 -98 39 -80 -118 -66
$$ packed form
7389a14K43pk07J62n2N1j48J21j63K96k29L52k32l83O52l68J37Pj84J01N9J06
7411B00j00r1k14K03R3p1r5P4k78J10K11m8L8R2k21K50k12R9oj70K65l46O6j6
7435a67J13J16j62J74o9O7k09K62q4J67l57L12j53oj49L43J92j60k46kk78K79
7457a7k7J18J29l21Q5J48j90M0J66j76r4K30r3k28L67j08k5J3o1L0q6P8P0j32
7481h4K33K11j70l32J98K0k80K10j43L38j41k65M30k50J27K5k53J93j38K65k31
7502c7J8k38K36j37K79p1K4j83J99J0k67K20J00p0o1n1K53l84J76J24k45K21j40
7525b4j8k07L78p7J70m2mj43Mj89Q6m9q8M84K06l09p1q1K4R7j30j04j3J11K6J1
7551D8l9k40L90j23J28m9l7k13L36k21J00O1k2j47L8l6p0j8P9rn4J37j19l8N2
$$ plain form
7576 -66 29 -80 -106 49 -142 127 304 -97 48 -12 -66 -247 182 37 26 131 113 -19 33 99 89 -98 127
7599 127 82 -72 1 150 131 -91 -64 58 -145 102 -13 -91 136 264 172 89 160 211 0 91 140 -88 39 -111
7623 -111 -16 -43 -155 110 155 -6 -283 26 -127 -60 -124 -100 89 238 -118 -201 153 198 6 87 21 -66 270 -61
7647 -61 -8 162 180 -20 66 53 -188 -49 -111 -148 290 57 5 -157 -25 208 55 -259 167 -32 136 -87 -81
7670 -81 89 -29 -62 190 59 137 137 -186 42 188 9 -26 -30 70 -83 3 -164 3 -13 155 113 -11 -309 -99
7694 -99 -39 -3 6 72 48 64 65 139 57 320 -185 114 -213 -77 -85 -92 211 282 80 -82 -26 -9 170 -11 -92 55 -190
7721 -190 -191 -66 -22 -224 -210 164 -34 251 -205 -77 124 -8 -157 29 -109 -125 -85 -153 -12 48 -44 219 87
7744 87 -32 10 18 -221 118 -185 -85 -34 91 243 -8 156 -180 2 112 148 -45 42 154 2 68 -34 125
$$ packed form
7576f6R5j09k6J55j91K69J77m01J45o0n4j81M29j45j1J05j8j32N2O6j0j87K25
7599A27m5j54P3J49j9k22K7J22k03K47j15p8K27J28r2q3P1N1k11R1M9k28J27j50
7623a11R5k7j12K65M5j61k77L09j53O7o4K4J89J49l56q3L54M5j92Q1o6q7L36l31
7647f1N3J70J8k00Q6j3k41J39o2l7M38k33n2j62J32K33j53l14M26j99J68k23O
7670h1J70j18l3K52j31P8%l23K28J46j79l5mJ00j53Q6j67J67j6J68m2j24k98K10
7694i9O0L6RO6k4J6JP4q2K63n05K99l27J36qpL03P1k02j62N6J7J79j81q1J47k45
7721a90jJ25M4k02J4L74j98K85m56J28K01j32j49J86j38j6M0o8J41O0r2K63j32
7744H7j19M2Qk39L39l03J00N1J25J52k51J64l36J82J10L6j93Q7J12j52O6j02J59
$$ plain form
7767 125 77 8 198 117 127 -52 -44 60 -103 -79 -126 -129 97 -195 119 53 -93 -113 356 -129 61 -110 -9 93
7791 93 -70 -47 -107 11 -150 4 43 25 17 -73 64 97 -140 43 -75 -152 -13 55 -160 5 76 298 20 -131
7815 -131 -250 -102 -86 -6 10 11 87 12 160 -164 116 -168 -132 -88 -82 97 82 -12 -139 132 17 -26 -64 89 -46
7840 -46 -69 123 126 151 -60 10 -22 75 -2 81 -29 -108 -85 -273 -41 82 -75 -98 70 -96 -4 -112 128 -107 -133
7865 -133 -13 -92 142 -88 -106 -51 -41 -41 72 -216 27 16 120 -212 105 -27 -133 -83 -12 4 -180 79 196
7888 196 17 -156 246 62 29 181 -69 -144 66 -59 154 15 31 -79 -132 10 -31 157 50 60 -123 -108
7910 -108 -89 -102 97 -144 93 4 112 -4 -105 30 -250 -86 54 -119 -131 7 82 -43 -280 63 -42 -175
7932 -175 225 -74 -93 40 -386 95 -164 -236 -83 167 -112 -309 219 148 9 -69 0 59 159 134 -104 -181 -72
$$ packed form
7767A25m8o9J90q1J0j79QJ04j63K4m7lK26k92L14o6j46k0M69m85J90j71J01J02
7791I3j63K3o0J18j61J54L9j8qr0J37L3k37J83j18p7J39O8k15J65P1K22k78j51
7815a31j19J48J6Q0J6JP6p5J48l24K80k84L6M4OJ79j5r4j27K71j15m3l8J53j35
7840d6k3J92LK5k11P0l2R7p7Q3j10p9K3j88K32J23j57k3J68j66R2j08K40k35k6
7865a33J20p9K34k30j8N5J0%J13k88K43j1J04l32L17j32j06N0P1J6j84K59J17
7888A96j79j73M02j84l3J52k50p5K10j25K13j39J6j10n3J42m1J88j07J0j83J5
7910a08J9j3J99k41K37q9J08j16j01J35k80J64J40j73j2J38P5j25k37L43j05j33
7932a75M00k99j9J33m26M81k59p2J53K50k79j97N28p1j39p8O9N9J00k5k38p7J09
$$ plain form
7955 -72 63 -44 175 40 -62 205 102 226 -272 92 6 -133 -170 -69 35 65 -132 -168 160 -61 12 41
7977 41 -16 30 79 -287 80 203 -217 22 -65 -137 -118 -255 14 -53 -66 -89 49 -46 -66 85 38 -3 -132 -29 27
8002 27 42 -92 -142 210 -72 250 84 -23 80 -54 28 9 -172 4 343 14 52 6 186 -24 -73 -4 -54
8025 -54 79 3 -31 105 -177 -60 24 166 37 190 56 145 -75 85 166 16 37 75 26 141 96 60 178 86
8049 86 152 1 -96 -21 51 13 -180 -220 -156 83 -2 117 -3 34 -119 23 21 -113 13 23 29 -50 -145 101 -20 138
8075 138 47 -155 30 -61 143 -56 283 -156 67 86 212 96 -158 -92 32 -11 -140 -90 239 164 -99 18
8097 18 7 -105 -58 49 229 -28 38 28 -27 -39 53 -137 -154 19 -153 103 -16 39 -347 50 91 -60 -122 90
8121 90 308 -242 -23 252 -60 -91 193 -24 -35 30 126 78 -210 7 231 -209 99 90 -182 170 4 -225 465
$$ packed form
7955g2J35j07K19j35j02K67j03J24m98L64q6j39l7J01J04L0j97l6L28k21P3K9
7977D1n7M6M9l66L67J23m20K39q7p2J9j37K69o7j3k3J38r5k0J51m7m1j29J03N6
8002B7J5j34n0L52k82L22j66j07J03j34Q2j9j81J76L39l29L8m6J80k10m9O9n0
8025e4J33p6l4J36k82J17Q4J42j29J53j34Q9k20J60Q1j50K1L8m9J15m5l6J18r2
8049H6O6j51r7P5P2l8j93m0O4K39q5J19j20L7j53J42kj34J26J0Op9r5K46j21J58
8075A38r1k02J85r1K04j99L39m39K23J9J26j16k54O6J24m3j29N0L29p5k63J17
8097A8j1j12M7J07J80k57O6j0n5j2R2j90j7J73j72K56j19N5l86L97M1j51o2K12
8121I0K18n50K19K75l12l1K84k17j1O5R6m8k88K17K24m40L08rk72L52j66k29O90
$$ plain form
8144 465 -135 -3 9 88 -224 8 15 1 -13 80 46 66 0 -251 106 -135 -110 -19 206 70 -17 -98 -81 -148 -90 239
8170 239 -55 60 5 -192 -11 17 -101 43 -129 20 -409 124 -56 -191 -160 -59 -145 -150 49 -9 -57
$$ packed form
8144D65o00J32J2P9l12K32Pj4j4R3l4K0o6k51L57k41K5R1K25j36q7q1J7o7N8L29
8170B39k94J15n5j97J81K8j18J44j72J49m29N33j80j35L1J01q6nJ99n8m8
8191e7
$$ Imaginary data points
##PAGE= N=2
##DATA TABLE= (X++(I..I)), XYDATA
$$ plain form
0 0 0 0 0 0 0 0 0 0 0 0 0 0 0 0 0 0 -8 8 -8 8 -8 9 -16 16 -17 24 -24 32 -33 40 -48 56 -62 71 -80 88 -97 112
38 112 -125 137 -153 172 -192 211 -234 260 -287 317 -349 384 -423 465 -513 565 -625 690 -764
57 -764 851 -950 1064 -1200 1366 -1568 1828 -2176 2663 -3392 4646 -7417 31808 -28356 -2337
72 -2337 44897 -17292 28135 5617 -10992 29281 -6805 -14493 16187 -11353 -3385 -2341 -4208
85 -4208 -1160 -20882 -3444 7913 -20938 -11839 -3937 3299 3576 -20364 -6205 7476 -8734 -3453
99 -3453 1307 7238 -2552 -14864 9232 1488 -10743 10401 -5421 -2448 8123 -16401 4432
112 4432 8693 -20895 6173 7842 -10909 6706 -4373 -6234 9823 -8412 -2073 17291 -805
125 -805 -7581 3824 2506 1011 6376 4833 -222 1908 2472 -497 2292 1826 209 2698 1418 -1999
$$ packed form
0@%%%%%%%%%%%%%%%%qJ6j6J6j6J7k5L2l3M1m8N6o5P3q8J04j18J33j51J68j85K09
38A12k37K62k90L25l64M03m45M94n47O04o66P33q07Q88r78J078j190J315j454
57g64J615j801K014k264K566k934L396m004M839o055Q038j2063L9225o0164K6019
72b337M7234o2189M5427k2518j6609M0273l6086p688L0680k7540P968J044j867
85d208L048j9722J7438J1357k8851R099P902P236K77k3940J4159J3681j6210N281
99c453M760N931r790j2312K4096p744j2231K1144j5822K973J0571k4524K0833
112D432M261k9588K7068J669j8751J7615j1079j861J6057j8235O339J9364j8096
125h05o776J1405j318j495N365j543n055K130N64k969K789m66j617K489j280l417
$$ plain form
141 -1999 -2217 1814 770 -4787 -571 966 -686 1792 -5803 -6552 1841 -3208 -1596 2669 -5248 -4880
157 -4880 -1480 -4117 -3899 -850 187 -5829 -2598 175 -10040 -205 3412 -10709 2287 2013 -9653
172 -9653 6011 -3091 -10976 8213 -1803 -4499 7578 -4965 -4325 904 -5224 2123 985 -2927
186 -2927 -1554 -5196 205 -3737 -5155 6778 -5387 -7109 7084 -5406 -3560 5212 -5622 1725
200 1725 4617 -3493 4983 3453 -2758 2183 4674 6182 2986 3727 6695 -1508 3645 6900 295
215 295 9482 3050 -4168 9836 638 -4176 9405 -604 -959 6760 -2425 789 2507 -4068 1725
230 1725 2411 -114 684 -847 1454 -3704 -3165 6248 -1242 -1469 3562 -5748 -755 3626 -6034 1738
246 1738 3736 -6806 226 2443 -5383 -1811 -522 -2867 -195 -957 -2849 -2628 -1529 -3934 -3382 1210
$$ packed form
141a999k18M031j044n557M216J537j652K478p595p49Q393n049J612M265p917L68
157d880L400k637K18L049J037o016L231K773j0215R835L617j4121J2996k74j1666
172i653J5664r102p885J9189j0016k696J2077j2543O40N229o128P347j138l912
186b927J373l642N401l942j418J1933j2165j722J4193j2490J846Q772j0834P347
200A725K892q110Q476j530o211M941K491J508l196P41K968q203N153L255o605
215B95R187o432p218J4004r198m814J3581j0009l55P719r185L214J718o575N793
230A725O86k525P98j531K301n158N39R413p490k27N031r310M993M381r660P772
246A738J998j0542P032K217p826L572J289k345K672p62j892K21J099k405N52M592
$$ plain form
262 1210 -900 -4088 -42 -2127 -4920 450 -375 -641 2135 -2904 -1322 4166 -2764 -854 3885 -18
278 -18 2689 2350 -791 2899 2527 943 4162 3334 2242 1431 2227 3414 -1375 3117 5937 -1314 3328
295 3328 2010 -4274 5459 1452 -4570 6348 623 -3798 4511 -197 -1929 1718 570 1187 44
310 44 773 -567 -1533 3338 -1997 -2906 6467 -1680 -3858 4669 -4720 -2389 4796 -4082 -311 1989
326 1989 -6150 -543 839 -4522 -639 -446 -1452 -1879 -2945 -736 -1976 -1477 221 -2374 213 716
342 716 -4154 1166 972 -4051 2609 2541 -2712 2203 -61 -1570 4302 647 -979 4002 1262 -612
358 -612 1964 1491 177 861 3086 553 -420 2560 -1265 109 3763 -2855 1027 5127 -3826 46
374 46 3038 -3326 2672 1614 -2297 3299 -744 -2008 1981 -919 880 615 -351 2212 -3082 -700
$$ packed form
262A210k110l188M046k085k793N370q25k66K776n039J582N488o930J910M739l903
278a8K707l39l141L690l72j584L219q28j092q11P96J187m789M492K820p251M642
295C328j318o284R733m007o022J0918n725m421Q309m708j732L647j148O17j143
310D4P29j340r66M871n335r09R373q147k178Q527r389K331P185q878L771K300
326A989q139N607J382n361L883J93j006m27j066K209j240M99J698k595K587N03
342G16m870N320j94n023O660o8n253M915k264j509N872l655j626M981k740j874
358f12K576m73j314O84K225k533r73K980l825J374L654o618L882M100q953L872
374D6K992o364N998j058l911N596m043j264L989k900J799k65r66K563n294K382
$$ plain form
390 -700 2248 -3782 1537 545 -4485 2888 -2669 -5101 3070 -4191 -3316 2053 -5188 -2130 -818 -5681
406 -5681 -1127 -1935 -3307 -1455 -3315 -1065 -3098 -3348 942 -4656 -1034 2537 -5609 456 953 -5599
422 -5599 2999 512 -3645 3766 -444 -1810 2222 -1346 896 1882 316 1775 -528 1809 1989 -1636
438 -1636 4003 1457 -929 4917 -554 -279 4734 -822 1998 4682 -947 2531 3208 -266 1911 2254
454 2254 1775 2465 1189 1898 698 2012 1449 -1583 3344 1694 -2207 2645 -19 -2571 2121 -976
470 -976 -1795 1758 -1754 -2651 457 -1689 -2986 67 -223 -3187 -1296 -45 -3013 -1099 -437 -2261
486 -2261 339 147 -2458 169 1400 -1412 -575 2563 208 -1215 2712 187 -456 3451 -371 814
502 814 4112 -1376 1382 3604 -1393 2223 2381 -267 2259 378 723 1567 -549 1603 735 797 1848
$$ packed form
390g00K948o030N319r92n030P373n557k432Q171p261Q75N369p241L058J312m863
406e681M554q08j372J852j860K250k033k50M290n598L622L571q146O065M97o552
422e599Q598k487m157P411m210j366M032l568K242R86j566J459k303K337J80l625
438a636N639k546k386N846n471K75N013n556K820K684n629L478O77l474K177L43
454B254m79O90j276P09j200J314n63l032M927j650l901M852k664k552M692l097
470i76q19L553l512q97L108k146j297L053k90k964J891J251k968J914O62j824
486b261K600j92k605K627J231k812Q37L138k355j423L927k525o43L907l822J185
502H14L298n488K758K222m997L616J58k648K526j881L45Q44k116K152q68O2J051
$$ plain form
519 1848 -2167 1637 1859 -2767 2417 328 -1710 3933 -1937 -1822 3082 -1860 196 1388 -2069 857
535 857 9 -633 -599 -1889 1793 -986 -2206 1667 -3630 -314 2079 -5647 287 1881 -4440 699
551 699 -921 -3471 1702 -2072 -1797 208 -1861 10 -1336 -1947 -73 -2433 900 -180 -3942 1406
567 1406 -711 -2248 1415 -2317 -770 2067 -2993 -671 1207 -1705 -261 347 -984 -2 14 -258
583 -258 -588 34 410 -869 1494 257 -1985 2105 1081 -1786 1908 1372 -579 1875 496 60 2700
600 2700 1083 -504 2410 2112 -710 1396 1917 -126 1389 1861 -153 629 997 -45 524 696 -522
617 -522 -258 1567 -809 -1810 1337 -1074 -1602 737 -1576 -890 768 -2679 -954 967 -2553 -427
633 -427 147 -1895 -407 -396 -1123 -366 -838 -179 -558 -358 16 -2243 601 801 -2326 1403 333 -2186
$$ packed form
519A848m015L804K22m626N184k089k038N643n870J15M904m942K056J192l457K926
535H57q48o42L4j290L682k779j220L873n297L316K393p726N934J594o321N139
551F99j620k550N173l774K75K005k069J871j346o11J874k360L333j080l762N348
567A406k117j537L663l732J547K837n060K322J878k912J444O08j331R82J6k72
583b58l30O22L76j279K363j237k242M090j024k867L694n36j951K454j379m36K640
600B700j617j587K914k98k822K106N21k043J515M72k014P82L68j042N69J72j218
617e22K64J825k376j001L147k411n28K339k313O86J658l447J725J921l520K126
633d27N74k042J488J1p27P57m72O59l79K00L74k259K844K00l127L729j070k519
$$ plain form
651 -2186 2034 -740 -1583 2332 -818 -606 1700 -753 227 797 534 462 44 1476 541 -252 2283 -304
669 -304 -50 2992 -1071 811 3359 -1169 1477 2478 -1174 1819 1110 -787 1962 378 260 852
685 852 327 763 -135 29 860 -797 1026 215 -1813 1353 -519 -1565 1682 -1681 -1789 1650 -1874
702 -1874 -826 649 -1960 -295 59 -1749 -632 -393 -879 -1109 -1072 65 -1441 -650 168 -2341 -445
719 -445 269 -2204 99 259 -2287 1021 185 -1861 761 270 -980 593 -97 -396 482 -47 292 411
737 411 916 424 61 1581 297 -180 1996 372 220 2013 -406 804 2021 -939 817 2008 -855
754 -855 1018 1420 -149 941 879 8 871 420 106 12 722 380 -1169 1265 577 -1717 928 175 -1616
773 -1616 1238 -338 -1409 1043 -948 -1604 208 -819 -1394 -223 -402 -999 -1160 -70 -1203 -1188 49
$$ packed form
651b186M220k774q43L915l150K12K306k453R80N70k63p2m18J432r35p93K535k587
669c04K54L042m063J882K548m528K646J001l652K993p09j897K749j584j18N92
685H52n25M36q98J64Q31j657J823q11k028L166j872j046L247l363j08L439l524
702a874J048J475k609J665L54j808J117K39m86k30L7J137j506P91Q18k509J896
719d45P14k473K303J60k546L308q36k046K622m91j250J573o90k99Q78n29L39J19
737D11N05m92l63J520j284m77K176j624j52J793k419J210J217k960J756J191k863
754h55J873M02j569J090o2q71Q63m51l14r4P10l42j549K434o88k294K645p53j791
773a616K854j576j071K452j991o56J812j027n75J171j79n97j61J090j133J5J237
$$ plain form
790 49 -1703 -867 334 -2099 -1102 685 -1743 -335 370 -1170 -207 241 -935 -6 -88 -693 51 389
808 389 -319 -492 611 66 84 604 -183 286 923 111 206 1052 398 33 1786 594 -372 1136 951 97
828 97 1658 362 -126 1895 216 -338 1625 368 -253 1414 217 146 607 310 -71 278 437 -671
846 -671 122 930 -1486 -403 1059 -1437 250 155 -1852 482 -271 -1635 330 -669 -993 -193 -988 -529
864 -529 -787 -557 -86 -1191 -311 -24 -1226 618 -840 -1299 1137 -1104 -837 1459 -878 -56 675 -1240
882 -1240 535 367 -678 710 273 142 185 222 818 -206 893 1399 -791 1350 1395 -907 1658 687
900 687 -427 2174 352 -474 1819 553 606 908 350 824 327 592 503 -42 663 69 -58 1083 -852
919 -852 -535 1168 -705 -506 588 -822 -119 -263 -1309 -105 -96 -815 -530 -405 -704 -942 8 -769 -1096
$$ packed form
790D9j752Q36J201k433R97J787k428J408P05j540R63M48j176R29q2o05P44L38
808C89p08j73J103n45J8N20p87M69O37q12R5Q46o54l65J753j192r66J508j85q54
828I7J561j296m88K021j679n54J963j257o21J667j197p1M61k97l81L49J59j108
846f71P93Q08k416J083J462k496J687r5k007K334p53j364J965r99l24Q00p95M59
864e29k58K30M71j105Q80K87j202J844j458m59K436k241K67K296k337Q22P31j915
882a240J775j68j045J388m37j31M3L7N96j024J099N06k190K141M5k302K565r71
900F87j114K601j822q26K293j266N3L02n58M74m97K65q9n45P05n94j27J141j935
919h52L17J703j873J99J094j410P03j44j046J204Rp19K85J25k99k38R50p77l27
$$ plain form
938 -1096 0 -468 -955 171 -1080 -1024 162 -1106 -1011 365 -475 -860 147 -339 -532 389 -60 -931
956 -931 244 -138 -674 525 7 -515 360 -367 -378 404 19 -53 481 89 -74 67 674 126 140 1140
976 1140 -195 398 1444 -327 945 1315 -698 1111 1071 -314 1137 266 264 807 86 804 383 397 -8
995 -8 -586 1084 -303 -728 963 -581 -861 858 -1210 -567 700 -1631 -118 476 -1579 -135 -162 -854
1013 -854 -617 -757 244 -566 -1123 431 -1104 -294 384 -1751 410 232 -1923 721 52 -1329 540
1030 540 -560 -767 462 -533 8 346 -197 181 -387 602 -285 -247 1145 -44 -76 1063 -76 674 852
1049 852 -532 968 897 55 1022 416 287 900 226 388 418 607 660 -129 585 283 -273 851 23 -340
1069 -340 756 7 -697 642 -215 -458 647 -301 -717 293 -314 -717 -95 -330 -633 89 -279 -776 -343
$$ packed form
938a096J096m68m87J126j251N6J186j268R5J376q40l85J007m86j93R21m49q71
956i31J175l82n36J199n18n22Q75p27j1P82l85p2N34l92j63J41O07n48J4J000
976A140j335N93J046j771J272L70k013J809m0j385J451q71kN43p21P18m21J4m05
995hn78J670j387m25J691j544k80J719k068O43J267k331J513N94k055J444k7o92
1013h54K37j40J001q10n57J554j535Q10O78k135K161j78k155K644o69j381J869
1030E40j100k07J229r95N41L38n43L78n68R89q87L8J392j189l2J139j139P50J78
1049H52j384J500p1q42R67o06j29O13o74J62L0J89N3p89P14l02n56J124q28l63
1069c40J096p49p04J339q57k43J105r48m16J010o07m03O22k35l03P22l68m97M33
$$ plain form
1088 -343 -623 -944 -263 -391 -891 -234 -61 -742 -372 -357 -707 -533 -198 -1036 -331 -161 -1038 47 163 -680
1108 -680 289 110 -403 22 90 -13 564 300 -237 177 684 244 45 831 268 -197 1141 508 218 1326
1128 1326 215 388 1520 219 188 1312 104 88 1075 38 264 789 179 125 212 350 -11 425 281
1147 281 -290 316 578 -546 262 200 -602 150 -122 -633 52 -337 -639 -136 -286 -464 -407 -94 -368 -696
1167 -696 -110 -952 -692 -39 -928 -716 324 -988 -428 399 -1037 -412 445 -691 -173 58 -551 31 434
1186 434 -139 94 411 233 -52 495 180 182 635 236 -329 743 832 -250 839 698 176 947 637 34
1206 34 974 292 293 550 367 179 459 407 -25 251 356 485 314 101 -21 102 192 -306 338 627 -527
1227 -527 103 188 -633 350 135 -499 350 -305 -691 111 -45 -603 -124 -15 -434 -500 -67 -698 -625 -76 -712
$$ packed form
1088c43k80l21O81j28n00O57J73o81L70J5l50J74L35q38P05J70q77J085J16q43
1108f80R69j79n13M25O8j03N77k64n37M14N07m40j99P86n63m65J338o33k90J108
1128A326j111J73J132j301l1J124j208j6R87j037K26N25o10n4Q7J38l61M36j44
1147B81n71O06K62j124Q08o2q02P52k72n11O85l89l02N03j50j78N7L13k74l28
1167f96N86q42K60O53q89K12J040j312N60Q27j436O25Q57j136N18K31o09N82M03
1186D34n73K33L17j78k85N47l15KM53l99n65J072Q9j082J089j41n22P71l10o03
1206C4R40o82JK57j83j88K80n2m32K76J05J29j71k13j22J23R0m98O44K89j154
1227e27O30Q5q21R83k15o34Q49o55l86Q02j56n58M79J09m19o6M33o31P3N49o36
$$ plain form
1248 -712 -475 135 -1003 -706 569 -589 -450 114 -391 -488 -23 -297 -421 339 94 -163 36 376 -363
1267 -363 258 473 -621 477 703 -198 603 385 -162 686 290 29 665 554 84 440 707 390 285
1286 285 412 -24 503 314 60 279 325 -98 146 482 -75 -8 166 -82 -77 314 -497 -303 175 -225 -244 277
1308 277 -399 -187 202 -490 -352 22 -461 -327 -247 -655 -534 -463 -310 -758 -112 -169 -817 -347 -300 -697 -50
1329 -50 -146 -747 276 80 -719 527 -258 -280 144 -115 -256 -26 96 99 129 236 106 31 623 8 22 792
1351 792 -87 176 855 -136 732 604 -84 688 492 73 742 344 332 548 439 257 -150 474 478 -411 550
1372 550 -34 -390 824 -206 -458 689 -269 -183 277 -411 -222 -100 -158 -283 -278 -277 -389 -190 -35 -411 -198
1393 -198 42 -734 30 -57 -706 103 -162 -424 326 -404 -577 164 -217 -96 -64 -124 -127 65 -149 -340 16 347
$$ packed form
1248g12K37O10j138K97J275j158J39N64n05r7M65k74j24P60k45k57J99L40p39
1267c63O21K15j094J098K26r01Q01k18n47Q48l96k61O36j11m70L56K67l17j05
1286B85J27m36N27j89k54K19M6m23K44L36n57O7J74k48NL91q11J94M78m00j9N21
1308B77o76K12L89o92J38L74m83J34Q0m08J21P1J53m48O46n7o48M70M7l97O47
1329e0r6o01J023j96p99J246p85k2M24k59j41K30J22LL0J07j30p5N92o15J4P70
1351G92q79K63O79r91Q68j28o88P72j96m19O69l98j2K16j09j82m07O24Mq89R61
1372E50n84l56J214j030k52J147r58Q6M60o88J89J22n8j25NJj12J99J55l76K13
1393a98K40p76P64q7o49Q09k65k62P50p30j73P41l81J21L2o0lJ92k14j91L56L31
$$ plain form
1415 347 -240 66 482 -135 426 631 -460 574 489 -229 228 214 58 146 314 162 106 406 99 -139 496
1436 496 192 -186 701 222 201 526 78 95 427 -55 266 266 42 242 233 367 -366 201 77 -541 -45 190
1458 190 -233 133 -109 -601 128 -447 -440 45 -250 -330 -214 -291 -305 -380 -179 -539 -568 -10 -297 -506 19 -582
1480 -582 -60 250 -559 138 182 -367 18 85 -210 1 -84 -24 89 106 109 -19 308 86 -398 435 133 -380
1502 -380 229 233 -185 767 46 13 357 122 179 296 23 314 141 427 301 243 502 89 297 152 -37 215
1524 215 310 -323 372 -156 -418 364 58 -88 -201 -62 -375 -192 25 -348 -318 -153 -514 -441 61 -480 -345
1545 -345 225 -157 -248 -174 -346 -166 -160 -349 -92 -59 -374 -85 163 -263 -170 18 -1 -233 225 -150 41 413
1567 413 46 -225 165 265 36 147 385 171 264 59 116 396 396 47 377 427 -8 485 224 71 590 191
$$ packed form
1415C47n87L06M16o17N61K05j091J034q5p18M57j4j56Q8J68j52n6L00l07k38O35
1436D96l04l78Q87m79k1L25m48J7L32m82L21%k24K00rJ34p33N67j24o18M96K35
1458A90m23L66k42m92P29n75PM85k95q0J16p7j4p5K01l60k9N58k87k09N25o01
1480e82N22L10q09O97M4n49L85O7k95K11q5O0J13J7Lj28L27k22m84Q33l02n13
1502c80O09Mm18R52p21l3L44k35N7J17k73K91j73K86j26n8K59m13K08j45j89K52
1524B15R5o33O95n28k62P82l06j46j13J39l13J83K17l73L0J65l61P3N02n41J35
1545c45N70l82r1P4j72J80Oj89K57L3l15K89K48m26R3J88j9k32M58l75J91L72
1567D13l67k71L90J00k29J11K38k14R3k05N7K80%l49L30N0m35M93k61j53N19l99
$$ plain form
1589 191 -82 457 189 -32 399 201 -120 365 194 177 177 512 -30 149 24 -56 60 223 -362 -21 83
1610 83 -710 29 -129 -220 -335 -130 -276 -245 -54 168 -457 -160 -262 -620 105 -373 -309 -135 -220 -285 -192 -373
1632 -373 -407 -317 58 -323 80 -195 -186 83 -77 -19 68 -3 13 328 -31 80 292 244 84 254 364 259 253 356
1656 356 -290 269 314 -190 328 245 44 236 343 -84 112 305 128 130 139 91 193 161 116 -52 298 4 -335
1679 -335 114 -52 -87 -78 -310 -119 103 -211 -337 -56 -337 -231 -194 -280 -36 -213 -286 -323 -160 -684 -522 -104
1701 -104 -406 -343 -41 -297 -309 97 -130 -298 62 -193 -181 -144 -24 25 10 142 -47 33 49 -51 121 18 -171
1724 -171 -34 362 -65 93 530 -100 386 187 39 280 332 295 311 296 51 149 366 340 83 97 220 74
1746 74 16 -65 -65 264 -176 203 146 -81 -235 -35 -123 -145 -106 -259 -311 -45 -255 -435 -12 -157 -206 80 -230 -437
$$ packed form
1589A91k73N39k68k21M31j98l21M85j71j7%L35n42J79j25q0J16J63n85L41J04
1610H3p93P39j58r1j15K05j46L1J91K22o25K97j02l58P25m78O4J74q5o5R3j81
1632c73l4R0L75l81M03k75RK69j60N8Q7p1J6L15l59J11K12m8j60J70J10j05oJ03
1656C56o46N59M5n04N18q3k01J92J07m27J96J93j77KRm8J02l2m5j68L50k94l39
1679c35M49j66l5Rk32J91K22l14j26K81k81J06L7q6K44j77p3l7J63n24J62M18
1701a04l02O3L02k56j2M06k27j68L60k55J2L7J20M9j5J32j89Q0J6j00J72j03j89
1724a71J37L96m27J58M37o30M86j99j48K41N2l7J6j5k45R8K17k6k57J4J23j46
1746G4n8q1%L29m40L79n7k27j54K00q8k2L9j53n2K66k10j80M23j45m9K86l10k07
$$ plain form
1770 -437 -31 -243 -262 48 -374 -102 -218 -278 -288 118 71 -442 -10 -80 -247 122 -90 -162 -75 221 -154 74
1792 74 251 62 145 26 229 40 476 83 64 360 64 474 167 223 -21 36 33 66 424 49 373 148 -171
1815 -171 403 345 -201 91 270 234 37 -52 334 169 487 157 101 410 -75 -279 97 221 -77 208 -286
1836 -286 54 -139 -20 -38 -154 -260 -267 125 -23 -205 -88 157 -253 -184 -82 -144 -228 -189 -531 -366 -224 -310 -71
1859 -71 -21 -208 -10 -145 -375 -273 -273 47 -115 -16 -203 -68 228 -106 -109 133 61 -22 124 -49 203 216 325
1882 325 123 556 236 94 49 267 133 -35 244 -17 289 233 70 516 366 177 95 66 240 -55 187
1903 187 181 249 100 127 -187 55 -157 -49 -14 -71 -243 95 -256 -180 207 -512 -126 -246 -345 -116 -329 -245 -156
1926 -156 -227 -205 -207 -277 106 -201 -187 -210 -254 -259 -337 -124 156 -337 -16 193 -229 194 384 -145 1 204 119 -37
$$ packed form
1770d37M06k12j9L10m22K72j16o0j0M06m7n13M32p0j67L69k12p2Q7K96l75K28
1792G4J77j89Q3j19K03j89M36l93j9K96k96M10l07N6k44N7lL3L58l75L24k25l19
1815a71N74n8n46K92J79l6j97q9L86j65L18l30n6L09m85k04L76J24k98K85m94
1836b86L40j93J19j8j16j06pL92j48j82J17K45m10O9J02o2q4L9l42J65J42q6K39
1859g1N0j87J98j35k30J02%L20j62R9j87J35K96l34lK42p2q3J46j73K52J3J09
1882C25k02M33l20j42m5K18j34j68K79k61L06n6j63M46j50j89q2k9J74k95K42
1903A87oO8j49K7l14K42k12J08L5n7j72L38l51P6L87p19L86j20r9K29k13Q4Q9
1926a56p1K2kp0L83l07J4k3m4np8K13K80m93L21K09m22M23J90n29J46K03q5j56
$$ plain form
1950 -37 215 203 44 108 572 -171 107 368 159 387 97 -12 291 -111 81 48 98 72 246 206 144 281 -3
1973 -3 -37 5 -73 62 -106 117 18 63 76 -54 -59 -172 113 -74 -173 81 -85 -85 -137 -263 -20 -87 1 -307 -280 -431
1999 -431 -289 -229 -407 -174 228 -509 206 202 198 -474 -121 -273 -347 101 -246 -133 -404 148 563 53 -237 -474
2021 -474 803 -371 -414 519 -698 268 152 100 -352 87 -394 39 713 488 17 540 221 658 -735
2040 -735 468 609 237 -19 -33 142 -335 -170 -283 30 435 42 214 -169 205 133 -687 417 -9 -247
2060 -247 -489 -274 -170 -90 17 -339 -311 963 -591 -438 -107 122 -106 99 -554 -313 -505 -553 -275 -145
2080 -145 -39 -54 -17 -527 126 -188 -5 381 -727 -429 377 217 271 311 132 102 -227 256 -167 5 -259
2101 -259 185 -173 204 -172 190 224 -50 186 315 347 -29 387 191 391 119 146 124 155 139 109 106 98 95 391
$$ packed form
1950c7K52j2j59O4M64p43K78K61k09K28k90j09L03m02J92l3N0k6J74m0o2J37k84
1973cl4M2p8J35j68K23r9M5J3j30nj13K85j87r9K54j66%n2j26K43o7Q8l08K7j51
1999d31J42O0j78K33M02p37P15mmo72L53j52p4M48l47J13k71N52M15n10k90k37
2021d74J277j174m3R33j217R66j16n2m52M39m81M33O74k25m71N23l19M37j393
2040g35J203J41l72k56j4J75m77J65j13L13M05l93J72l83L74p2q20J104m26k38
2060b47k42K15J04Q0J07l56K8J274j554J53L31K29k28K05o53K41j92m8K78J30
2080a45J06j5L7n10O53l14J83L86j108K98Q06j60N4M0j79l0l29M83m23J72k64
2101b59M44l58L77l76L62L4k74K36J29L2l76M16j96K00k72K7k2L1j6l0lqlK96
$$ plain form
2125 391 199 -6 93 -56 -53 -62 -46 4 55 -69 -230 5 -172 299 -294 -149 -179 -342 -291 -515 -376 -312 -87 -29
2149 -29 121 -474 -21 -320 30 -133 -229 -142 -343 -159 70 -114 196 -285 47 -81 -154 -53 85 105 -14 -65
2171 -65 73 80 11 131 172 50 -31 13 90 -45 80 221 76 133 125 113 399 198 43 42 242 137 53 203 168
2196 168 40 201 165 83 229 10 44 135 -55 -44 -351 197 -120 110 -58 206 11 -73 13 -87 140 -148
2218 -148 107 -218 -54 -233 -441 -28 -114 -51 -433 -44 -214 -279 -196 -29 -172 -158 -173 -136 -58 65 -61 8 -9
2241 -9 -208 73 93 181 9 65 -116 -223 36 12 61 156 247 -107 81 -71 23 59 12 -98 165 77 -32 -34 137
2266 137 205 292 207 -66 106 -17 274 320 -142 30 183 33 98 -93 158 85 310 -37 16 -36 122 -315 -62
2289 -62 135 -288 -51 27 -55 -358 -108 -254 -186 -374 -483 -19 -85 -216 -74 -178 -225 -103 14 -27 -313 215
$$ packed form
2125C91j92k05R9j49LrJ6N0N1j24j61K35j77M71n93J45l0j63N1k24J39O4K25N8
2149b9J50n95M53k99L50j63r6Q7k01J84K29j84L10m81L32j28p3J01J38K0j19n1
2171f5J38Po9J20M1j22q1M4P7j35J25J41j45N7qj2K86k01j55jK00j05q4J50l5
2196A68j28J61l6q2J46k19L4R1j90J1l07N48l17K30j68K64j95q4Q6j00K27k88
2218a48K55l25J64j79k08M13q6O3l82L89j70o5Q3J67j43J4j5L7P8J23j26O9j7
2241ij99K81K0Q8j72N6j81j07K59k4M9R5R1l54J88j52R4L6m7j10K63q8j09kJ71
2266A37O8Q7q5k73J72j23K91M6m62J72J53j50O5j91K51p3K25l47N3n2J58m37K53
2289f2J97m23K37P8q2l03K50j46O8j88j09M64o6j31J42j04m7J22J17m1k86N28
$$ plain form
2311 215 -305 -55 -107 -87 -86 7 -165 25 465 95 42 263 133 -108 192 -237 162 270 -63 -152 -58 149 35
2334 35 77 30 -105 106 -113 240 262 454 -80 82 154 148 55 137 110 -229 268 3 -67 104 -113 79 108 -166
2358 -166 374 -135 -86 36 -150 36 -360 -87 -30 7 125 106 -222 -10 268 -472 -34 -117 -170 98 -306 61
2380 61 -219 -130 -268 -115 70 -35 -214 136 -83 -59 175 -202 -43 -79 -15 -109 -108 16 234 -81 -6 -28 -108 139
2404 139 119 179 -216 63 32 96 131 199 -1 110 27 -40 6 268 86 79 173 32 72 218 137 164 317 146 -33
2429 -33 -192 288 -99 21 31 -160 42 250 -70 -44 -140 -329 97 -208 168 -46 -170 -93 -185 -183 -147 -178 -67
2452 -67 -111 174 -76 -203 317 -216 -189 139 -215 132 54 36 -178 -15 -275 -190 101 -70 -66 118 197 -127 23
2475 23 53 -28 313 69 -101 287 108 -6 -32 138 -83 10 221 255 151 272 265 265 397 39 267 61 -196
$$ packed form
2311B15n20K50n2K0JR3j72J90M40l70n3K21j30k41L00m29L99J08l33q9R4K07j14
2334C5M2m7j35K11k19L53K2J92n34J62P2or3Q2k7l39M97k65p0J71k17J92K9k74
2358a66N40n09M9J22j86J86l96K73N7L7J18j9l28K12K78p40M38q3n3K68m04L67
2380F1k80Q9j38J53J85j05j79L50k19K4K34l77J59l6O4r4JJ24K18l15P5k2q0K47
2404A39k0O0l95K79l1O4L5O8k00J11q3o7M6K62j82pR4j41M0J46q1K7J53j71j79
2429c3j59M80l87J20J0j91K02K08l20K6r6j89M26l05L76k14j24P7r2KL6l1J11
2452f7m4K85k50j27N20n33K7L28l54L47p8j8k14J63k60Q5K91j71MJ84P9l24J50
2475B3L0q1L41k44j70L88j79j14k6J70k21R3K11L4j04J21p%J32l58K28k06k57
$$ plain form
2498 -196 307 127 -62 51 -49 -50 -3 28 29 134 -2 -60 129 15 30 -21 111 -7 -139 273 -135 35 -122
2521 -122 -5 -59 -31 -144 -45 -59 46 -261 -169 263 61 -234 40 -183 -46 -67 86 -194 -205 -9 -141 30
2543 30 -155 193 -61 -67 -236 -98 -313 -150 -10 124 -66 320 14 -206 112 107 293 252 -87 -15 209 -21
2565 -21 190 156 299 -40 28 187 -30 73 84 42 237 113 301 -30 -98 -64 38 -30 37 -2 139 104 33 360
2589 360 -9 -3 176 -253 -267 114 -89 -137 -315 -126 37 177 86 -49 161 29 -100 185 -211 -88 -1 10
2611 10 -87 -17 -150 16 -121 69 85 -35 -207 16 17 -174 99 -218 -77 -32 -87 160 52 118 -148 -94 41
2634 41 45 206 66 -72 220 132 84 297 238 195 -51 127 -59 -21 119 239 -42 55 -52 -101 -7 153 -33 -100
2658 -100 45 139 -50 68 164 -33 -47 -250 -17 -115 -97 11 40 27 -136 -228 -49 -81 -65 90 6 -20 -202 -110
$$ packed form
2498a96N03j80j89J13j00jM7L1JJ05j36n8J89j14J5n1J32j18j32M12m08J70j57
2521a22J17n4K8j13R9j4J05l07R2M32k02k95K74k23J37k1J53k80j1J96j32J71
2543C0j85L48k54oj69J38k15J63J40J34j90L86l06k20L18nJ86m1l39P2K24k30
2565b1K11l4J43l39O8J59k17J03J1m2J95j24J88l31o8L4J02o8O7l9J41l5p1L27
2589C60l69OJ79m29j4L81k03m8j78J89J63J40r1j35K10j32j29K85l96J23Q7J1
2611A0r7P0j33J66j37J90J6j20j72K23Jj91K73l17J41M5n5K47j08O6k66N4J35
2634D1MJ61j40j38K92q8m8K13n9m3k46J78j86L8J40J20k81R7j07m9R4J60j86o7
2658a00J45R4j89J18R6j97j4k03K33r8J8J08K9j3j63r2J79l2J6J55q4k6j82R2
$$ plain form
2682 -110 202 -73 -157 51 110 -283 -93 -219 7 -78 -74 124 -147 155 -36 181 9 -230 127 13 -28 33
2704 33 236 -114 -23 183 306 129 -209 147 -6 100 -94 230 151 234 -31 68 -73 165 -159 39 346 140
2726 140 41 67 184 -84 -21 -64 125 235 56 -107 -61 -87 -109 -2 285 -250 -109 -34 -223 -284 -84 -191 -109
2749 -109 -227 -230 -172 -77 42 -257 42 -211 9 67 -37 180 -99 5 -159 6 -33 349 -43 -199 -98 126
2771 126 211 -239 -67 113 83 -4 157 28 248 -187 173 332 34 -193 0 -287 144 230 421 182 -88
2792 -88 -153 41 39 -92 51 -39 2 164 134 -36 -70 -67 -116 -254 101 -343 33 -10 99 73 -106 -73 -35 -12 -155
2817 -155 -49 70 -6 -384 -99 -35 69 -171 -135 70 70 185 -95 -32 -127 -67 -128 155 -127 58 -76 -275 -30
2840 -30 38 -41 -127 -126 -95 -17 10 -35 -85 174 -135 -48 301 104 26 140 313 -63 238 -61 -81 53 -94 103 324
$$ packed form
2682a10L12k75q4K08N9l93J90j26K26q5MJ98k71L02j91K17j72k39L57j14m1O1
2704C3K03l50R1K06J23j77l38L56j53J06j94L24p9Q3k65R9j41K38l24J98L07k06
2726A40r9K6J17k68O3m3J89J10j79j63M6k6k2J07K87n35J41P5j89o1K00j07Q2
2749a09j18lN8R5J19k99K99k53K20N8j04K17k79J04j64J65l9L82l92j56J01K24
2771A26Q5m50J72J80l0q7J61j29K20m35L60J59k98k27J93k87M31Q6J91k39k70
2792h8o5J94kj31J43r0M1J62l0j70l4Lm9j38L55m44L76m3J09k6j79L3L8K3j43
2817a55J06J19p6l78K85O4J04k40L6K05%J15k80O3r5O0o1K83k82J85j34j99K45
2840c0O8p9q6JL1P8K7m5n0K59l09Q7L49j97p8J14J73l76L01k99k0J34j47J97K21
$$ plain form
2865 324 188 -38 57 101 -258 189 180 -1 -111 101 204 194 -89 -79 161 88 252 -124 115 -132 23 10 91
2888 91 -196 -69 -25 206 -12 -29 -211 -30 -42 14 -47 -198 110 -43 -44 -159 -237 -157 19 -118 -223 -316 56 -177
2912 -177 -120 -60 -133 -99 80 179 -385 107 -337 -120 163 189 -153 26 48 76 -47 150 208 6 340 -133 28
2935 28 75 59 -190 -101 -59 267 183 56 227 213 321 110 11 59 91 161 52 107 197 -92 24 -123 -12 133
2959 133 115 4 53 -190 -49 -1 -53 75 -91 -190 -141 -99 67 82 18 -59 68 -48 -22 -70 114 -96 -103 -298 -135
2984 -135 -74 -184 -167 -225 -121 -179 -89 -18 -201 123 107 20 103 -124 51 68 -114 -172 132 162 83 67 48 46 83 -36
3010 -36 100 -131 56 -156 -58 219 81 -149 -302 28 -119 -98 117 173 -89 131 114 -47 -85 -5 -99 318 27
3033 27 80 160 -65 11 -30 221 148 -194 -124 16 -30 330 48 -254 105 41 -184 -148 185 34 -96 97 -98
$$ packed form
2865C24j36k26R5M4l59M47rj81j10K12J03j0k83J0K40p3J64l76K39k47J55j3Q1
2888I1k87J27M4K31k18j7j82J81j2N6o1j51L08j53jj15p8Q0J76j37j05r3L72k33
2912a77N7O0p3L4J79R9n64M92m44K17K83K6l42J79K2K8j23J97N8k02L34m73J61
2935B8M7j6k49Q9M2L26q4j27J71j4J08k11r9M8L2P0j09N5R0k89J16j47J11J45
2959A33j8j11M9k43J41M8n2J28j66r9M9M2J66J5o4p7J27j16K6m8J84k10pj95J63
2984a35O1j10J7n8J04n8R0P1j83L24j6q7Q3k27J75J7j82n8L04L0p9j6j9kL7j19
3010c6J36k31J87k12R8K77j38k30j53L30j47K1K15N6k62K20j7j61l8Q0r4M17k91
3033B7N3Q0k25P6m1K51p3l42P0J40m6L60k82l02L59o4k25L6L33j51j30J93j95
$$ plain form
3056 -98 88 -22 -54 -147 -357 16 -165 -24 -121 5 -173 -243 -140 81 -120 -76 190 75 205 145 -258 158
3078 158 -180 -169 -46 240 5 143 14 -20 154 84 268 23 46 53 185 -1 28 -327 -173 38 140 87 126
3101 126 117 223 84 56 19 137 -43 -39 188 -12 42 216 5 -42 -26 -104 66 100 121 91 142 30 5 -236 -129
3126 -129 -92 -247 -61 1 -224 -80 111 161 212 -198 21 -70 -186 -119 105 -143 8 65 278 12 -299 -79
3148 -79 259 -248 82 -104 64 201 -121 35 -21 -6 -62 306 52 179 -83 137 -91 147 145 30 161 206
3170 206 1 148 234 20 117 193 -76 206 -213 -57 -4 62 144 -116 -111 211 -39 259 -96 -84 211 -142 -41
3193 -41 285 -104 -11 1 -15 -197 -66 -98 -23 -179 -202 164 -2 -124 -309 -126 117 -129 267 -22 -214 31
3215 31 119 -85 14 86 220 -30 -107 10 89 -61 198 47 -79 65 109 -40 -3 -19 15 -22 79 124 362 -43
$$ packed form
3056i8J86j10l2r3k10L73j81J41r7J26j78p0J03K21k01M4K66j15J30o0m03M16
3078A58l38J1J23K86k35J38j29l4J74p0J84k45K3PJ32j86K9l55J54K11J02n3L9
3101A26rJ06j39k8l7J18j80MK27k00N4J74k11m7J6p8J70L4K1l0N1j12k5k41J07
3126a29L7j55J86O2k25J44J91N0N1m10K19r1j16O7K24k48J51N7K13k66l11K20
3148g9L38n07L30j86J68J37l22J56n6J5n6L68k54J27k62K20k28K38kj15J31M5
3170B06k05J47Q6k14R7P6k69K82m19J56N3O6Q2k60NL22k50K98l55J2K95l53J01
3193d1L26l89R3J2j6j82J31l2P5j56k3L66j66j22j85J83K43k46L96k89j92K45
3215C1Q8k04R9P2J34k50p7J17P9j50K59j51j26J44M4j49L7j6L4l7J01M5K38m05
$$ plain form
3239 -43 -2 30 -76 392 39 -22 147 21 86 -57 -26 163 -114 211 -109 93 43 -74 -39 54 183 -49 21
3262 21 8 135 -22 -69 308 272 96 -136 -19 3 84 -85 -101 -220 -35 118 9 -75 -106 -218 -46 45 165
3285 165 -87 86 -115 -93 13 -145 -28 19 103 53 -113 24 -80 -184 227 57 95 42 -2 -137 188 -9
3307 -9 129 153 -57 -43 -21 -62 41 -77 68 77 -34 219 205 172 120 68 -163 75 -46 -107 -98 -56 211 16 232
3332 232 41 -208 -183 68 -147 -52 181 118 -141 -113 187 42 -20 7 50 176 -9 22 37 -113 -92 -151 -13 55
3356 55 -228 -301 -27 1 67 -88 32 -32 85 90 -40 -88 -124 -9 165 -95 -203 -86 230 -298 -214 137 99 -46
3380 -46 76 -137 -20 -70 176 6 59 184 126 104 73 177 39 278 96 30 -128 92 131 66 -123 232 -65
3403 -65 -187 121 -74 133 187 -50 394 186 -72 136 99 -44 39 11 22 76 125 144 224 -199 -34 7 -239 222
$$ packed form
3239d3M1L2j06M68l53o1J69j26O5j43L1J89k77L25l20K02n0j17L5R3J29k32P0
3262B1j3J27j57m7L77l6j76k32J17K2Q1j69j6j19J85J53j09q4l1j12J72R1J20
3285A65k52J73k01K2J06j58J17M7Q4n0j66J37j04j04M11j70L8n3m4j35L25j97
3307iJ38K4k10J4K2m1J03j18J45Rj11K53j4l3n2n2k31K38j21o1RM2K67j95K16
3332B32j91k49K5K51k15R5K33o3k59K8L00j45o2K7M3J26j85L1J5j50K1n9J38O8
3356E5k83p3K74K8O6j55J20o4J17Nj30m8l6J15J74k60j08J17L16n28Q4L51l8j45
3380d6J22k13J17n0K46j70N3J25n8k2l1J04j38K39j82o6j58K20L9o5j89L55k97
3403f5j22L08j95K07N4k37M44k08k58K08l7j43Q3k8J1N4M9J9Q0m23J65M1k46M61
$$ plain form
3427 222 6 33 -275 87 8 -89 105 -182 -103 -10 127 -55 -75 -140 -37 25 -17 -70 -114 -102 88 -13 0 -111
3451 -111 32 90 228 -22 -188 22 90 -4 -122 50 32 184 36 -329 129 74 146 22 86 208 65 -4 -79
3474 -79 3 108 31 219 -16 -274 3 -20 89 -4 157 88 -294 -22 -31 -87 -105 -11 199 32 -3 -107 -193 -92
3498 -92 -10 -118 -97 -162 17 -10 51 313 -148 -16 108 -186 -7 -333 -364 -164 -43 -23 -42 -20 45 -166 122 300
3522 300 37 27 45 12 -121 -298 -19 -106 -152 -10 -179 -343 263 -336 177 183 -116 25 13 219 273 296 -226
3545 -226 -201 98 94 50 -159 92 -150 63 110 35 -143 -103 -66 120 173 114 94 24 249 -108 -279 12 124 23
3569 23 -15 -169 -5 18 109 -44 3 -97 13 -84 -203 20 36 -23 33 14 -285 138 -59 122 -238 -162 196 -25
3593 -25 -88 21 58 141 90 110 175 -49 166 134 12 146 -123 131 -92 31 14 70 -146 67 -218 -71 213
$$ packed form
3427B22k16K7l08L62p9r7J94k87P9R3J37j82k0o5J03O2m2n3m4J2J90j01J3j11
3451a11J43N8J38k50j66K10O8r4j18J72j8J52j48l65M58n5P2j24O4J22j43o9p5
3474g9Q2J05p7J88k35k58K77k3J09r3J61o9l82K72rn6j8R4K10j67l5j04q6J01
3498i2Q2j08K1o5J79k7O1K62m61J32J24k94J79l26l1K00J21K0j9K2O5k11K88J78
3522C00k63j0J8l3j33j77K79q7m6J42j69j64O06n99N13Ok99J41j2K06N4K3n22
3545b26K5K99mm4k09K51k42K13M7p5j78M0L7J86N3n9k0p0K25l57j71K91J12j01
3569B3l8j54J64K3R1j53M7j00J10r7j19K23J6n9N6j9k99M23j97J81l60P6L58k21
3593b5o3J09L7Q3n1K0O5k24K15l2j22J34k69K54k23J23j7N6k16K13k85J47K84
$$ plain form
3616 213 -137 155 -205 102 100 177 131 -64 31 15 -59 -209 43 43 222 53 10 411 -123 254 91 -171 164
3639 164 -238 -7 -151 -41 208 104 183 -87 -211 -5 -210 -145 -67 59 -190 -10 31 134 -12 -58 -225 -49
3661 -49 -90 -95 -70 -217 37 -92 74 48 26 99 -96 -4 52 -64 -113 -45 37 -64 -94 120 -105 -204 17 72 -50
3686 -50 -105 34 -118 -86 -229 -104 151 -98 -42 40 129 90 -3 35 -84 149 18 268 -46 -101 -91 103 279 -10
3710 -10 77 -47 152 -37 -9 71 37 173 47 46 63 -39 11 159 1 -63 6 151 78 32 -9 44 -70 -56 -48 94
3736 94 108 179 70 -165 -151 -121 -65 -116 -159 -79 -306 -325 -17 -100 74 -207 105 -85 -105 32 -114 -23 -2 46 -36
3761 -36 28 104 -22 197 -46 -108 201 -98 -124 90 94 -88 -69 -1 45 202 252 -123 164 339 80 43 45 -27 -78
3786 -78 -120 -124 27 95 157 -45 -132 -76 38 -6 62 14 84 30 66 77 -115 159 145 -129 -47 216 -97 120 -4 37
$$ packed form
3616B13l50K92l60L07kP7m6j95R5j6p4j50K52%J79j69m3M01n34L77j63k62L35
3639A64m02K31j44J10K49j04P9k70j24K06k05O5P8J26k49J80M1J03j46m6j67J76
3661d9m1nK5j47K54j29J66k6k2P3j95R2N6j16m9O8Q2j01l0K14k25r9K21N5j22
3686e0n5J39j52L2j43J25K55k49N6Q2Q9l9r3L8j19K33j31K50l14n5J0J94J76k89
3710a0Q7j24J99j89K8Q0l4J36j26jJ7j02N0J48j58o4O9J45p3m6m1N3j14J4QJ42
3736I4J4P1j09k35J4L0N6n1m3Q0k27j9L08q3J74k81L12j90k0J37j46R1K1M8q2
3761c6O4P6j26K19k43o2L09k99k6K14Mj82J9O8M6J57N0l75K87J75k59l7Kp2n1
3786g8m2mJ51O8O2k02q7N6J14m4O8m8P0n4L6J1j92K74j4k74Q2K63l13K17j24M1
$$ plain form
3812 37 155 122 123 -115 177 -28 -173 24 -11 -81 -61 -33 -41 174 58 -45 -16 94 64 -108 107 32 -274 19
3836 19 1 19 -161 -352 -51 -209 -329 75 -103 -29 114 126 133 24 145 3 173 -141 -163 27 199 -25 165
3859 165 186 216 121 -235 202 -88 -210 129 7 -229 -82 120 -77 -91 -60 -69 43 88 -30 -49 4 42 -113 -60
3883 -60 162 6 85 -11 49 -290 -69 107 19 128 37 -23 -39 -97 42 18 -167 -190 -93 -84 -81 28 96 -34 172 -51
3909 -51 29 211 -301 106 -181 54 56 59 112 -49 0 148 116 155 -5 -202 121 31 6 -202 17 80 193 18
3933 18 90 100 247 -7 136 -80 137 155 -180 -36 -313 -16 32 -26 63 61 -33 33 -57 5 -247 -9 3 9 277
3958 277 -41 246 107 -161 -202 74 -254 175 54 225 -166 -115 -51 72 -119 -171 24 -205 -90 -44 -84 20
3980 20 -204 -341 114 218 -227 -102 99 -57 315 -112 228 -77 215 127 15 221 174 121 -174 -40 190
$$ packed form
3812C7J18l3Jk38K92k05j45J97l5p0K0K8qK15j16j03K9J10l0j72K15p5l06K93
3836A9j8J8j80j91L01j58j20M04j78P4J43J2Pj09J21j42J70l14k2J90J72k24J90
3859A65K1L0r5l56M37k90j22L39j22k36J47K02j97j4L1rJ12M5j18j9N3L8j55N3
3883f0K22j56P9r6O0l39K21J76q8J09r1o0j6n8J39k4j85k3R7RLJ09O8j30K06k23
3909e1Q0J82n12M07k87K35KLN3j61M9J48l2L9j60j97L23r0k5k08K19O3J13j75
3933A8P2J0J47k54J43k16K17J8l35J44k77K97M8n8Q9kr4O6r0O2k52K38J2OK68
3958B77l18K87j39k68m1K76l28M29j21J71l91N1O4J23j91n2J95k29J15M6m0J04
3980B0k24j37M55J04m45J25K01j56L72m27L40l05K92q8j12K06m7n3k95J34K30
$$ plain form
4001 190 222 267 195 33 -105 109 246 75 72 101 58 -113 90 99 244 -249 39 -169 68 57 38 -97 131 -247
4025 -247 -61 60 -50 163 -127 -55 -112 -140 37 -277 -44 44 95 -14 -99 33 -31 62 157 -88 -85 -200 -13 22
$$ packed form
4001A90L2M5p2j62j38K14J37j71lK9m3j71K03RJ45m93K88k08K37j1j9j35K28l78
4025b47J86J21j10K13k90P2n7k8J77l14K33Q8N1j09q5J32o4R3R5k45Lj15J87L5
$$ [...]
8191A44
##END NTUPLES=NMR FID
##END=
