##TITLE=1H_LO2-5488
 CDCl3,8 sc, 
 30.03.2021
##JCAMPDX= 6.0         $$ Bruker NMR JCAMP-DX V2.0
##DATA TYPE= NMR FID
##DATA CLASS= NTUPLES
##ORIGIN= UXNMR, Bruker Analytische Messtechnik GmbH
##OWNER= root
$$ XWIN-NMR		Version 3.5
$$ Tue Mar 30 12:36:59 2021 Russian Standard Time (UT+4h)  she@DPX200
##.OBSERVE FREQUENCY= 200.131506
##.OBSERVE NUCLEUS= ^1H
##.DELAY= (6, 6)
##.ACQUISITION MODE= SIMULTANEOUS
##.ACQUISITION SCHEME= undefined
##.AVERAGES= 8
##.DIGITISER RES= 18
##SPECTROMETER/DATA SYSTEM= spect
##.PULSE SEQUENCE= zg30
##.SOLVENT NAME= CDCl3
##.SHIFT REFERENCE= (INTERNAL, CDCl3, 0, 15.7039)
##AUDIT TRAIL= $$ (NUMBER, WHEN, WHO, WHERE, WHAT)
$$ ##TITLE= Audit trail, XWIN-NMR		Version 3.5
$$ ##JCAMPDX= 5.01
$$ ##ORIGIN= Bruker BioSpin GmbH
$$ ##OWNER= she
$$ F:/spectra/data/she/nmr/H-F/1/audita.txt
$$ ##AUDIT TRAIL=  $$ (NUMBER, WHEN, WHO, WHERE, WHAT)
(   1,<2021-03-30 12:35:08.95 +0400>,<she>,<DPX200>,
      <created by zg, POWCHK disabled, PULCHK disabled
       configuration hash MD5:
       00 E9 B6 7A A2 85 ED C7 34 08 36 98 17 FE 4E 26
       data hash MD5: 16K
       04 19 D2 94 55 09 89 70 EB E0 A8 4A AA 7A 58 1C>)
$$ ##END=
$$ 
$$ hash MD5
$$ 66 41 56 ED 71 6D 58 7F 61 7C 0C 10 8A 86 9D 56
##$RELAX= 
##$RELAX= 
##$RELAX= 
##$RELAX= 
##$RELAX= 
##$RELAX= 
$$ Bruker specific parameters
$$ --------------------------
##$DU= <F:/spectra>
##$EXPNO= 1
##$NAME= <H-F>
##$PROCNO= 1
##$TYPE= <nmr>
##$USER= <she>
##$AMP= (0..31)
100 100 100 100 100 100 100 100 100 100 100 100 100 100 100 100 100 100 
100 100 100 100 100 100 100 100 100 100 100 100 100 100 
##$AQSEQ= 0
##$AQ_mod= 1
##$AUNM= <au_zg>
##$AUTOPOS= <>
##$BF1= 200.13
##$BF2= 200.13
##$BF3= 200.13
##$BF4= 200.13
##$BF5= 200.13
##$BF6= 200.13
##$BF7= 200.13
##$BF8= 200.13
##$BYTORDA= 1
##$CFDGTYP= 0
##$CFRGTYP= 5
##$CHEMSTR= <none>
##$CNST= (0..31)
1 1 145 1 1 1 1 1 1 1 1 1 1 1 1 1 1 1 1 1 1 1 1 1 1 1 1 1 1 1 1 1 
##$CPDPRG= <>
##$CPDPRG1= <>
##$CPDPRG2= <>
##$CPDPRG3= <>
##$CPDPRG4= <mlev>
##$CPDPRG5= <mlev>
##$CPDPRG6= <mlev>
##$CPDPRG7= <mlev>
##$CPDPRG8= <mlev>
##$CPDPRGB= <>
##$CPDPRGT= <>
##$D= (0..31)
0 1.2 0 0 0 0 0 0 0 0.06 0 0.03 0 0 0 0 0.0002 0 0 0 0 0 0 0 0 0 0 0 0 
0 0 0 
##$DATE= 1617093308
##$DBL= (0..7)
120 120 120 120 120 120 120 120 
##$DBP= (0..7)
150 150 150 150 150 150 150 150 
##$DBP07= 0
##$DBPNAM0= <>
##$DBPNAM1= <>
##$DBPNAM2= <>
##$DBPNAM3= <>
##$DBPNAM4= <>
##$DBPNAM5= <>
##$DBPNAM6= <>
##$DBPNAM7= <>
##$DBPOAL= (0..7)
0.5 0.5 0.5 0.5 0.5 0.5 0.5 0.5 
##$DBPOFFS= (0..7)
0 0 0 0 0 0 0 0 
##$DE= 6
##$DECBNUC= <off>
##$DECIM= 32
##$DECNUC= <off>
##$DECSTAT= 4
##$DIGMOD= 1
##$DIGTYP= 9
##$DL= (0..7)
0 120 120 120 120 120 120 120 
##$DP= (0..7)
150 150 150 150 150 150 150 150 
##$DP07= 0
##$DPNAME0= <>
##$DPNAME1= <>
##$DPNAME2= <>
##$DPNAME3= <>
##$DPNAME4= <>
##$DPNAME5= <>
##$DPNAME6= <>
##$DPNAME7= <>
##$DPOAL= (0..7)
0.5 0.5 0.5 0.5 0.5 0.5 0.5 0.5 
##$DPOFFS= (0..7)
0 0 0 0 0 0 0 0 
##$DQDMODE= 0
##$DR= 18
##$DS= 0
##$DSLIST= <SSSSSSSSSSSSSSS>
$$ [...]
##$SUBNAM2= <"">
##$SUBNAM3= <"">
##$SUBNAM4= <"">
##$SUBNAM5= <"">
##$SUBNAM6= <"">
##$SUBNAM7= <"">
##$SUBNAM8= <"">
##$SUBNAM9= <"">
##$SW= 16.9725357007746
##$SWIBOX= (0..15)
0 0 2 0 0 0 0 0 0 0 0 0 0 0 0 0 
##$SW_h= 3396.73913043478
##$TD= 16384
##$TD0= 1
##$TE= 0
##$TE2= 300
##$TE3= 300
##$TEG= 300
##$TL= (0..7)
0 120 120 120 120 120 120 120 
##$TP= (0..7)
150 150 150 150 150 150 150 150 
##$TP07= 0
##$TPNAME0= <>
##$TPNAME1= <>
##$TPNAME2= <>
##$TPNAME3= <>
##$TPNAME4= <>
##$TPNAME5= <>
##$TPNAME6= <>
##$TPNAME7= <>
##$TPOAL= (0..7)
0.5 0.5 0.5 0.5 0.5 0.5 0.5 0.5 
##$TPOFFS= (0..7)
0 0 0 0 0 0 0 0 
##$TUNHIN= 0
##$TUNHOUT= 0
##$TUNXOUT= 0
##$USERA1= <user>
##$USERA2= <user>
##$USERA3= <user>
##$USERA4= <user>
##$USERA5= <user>
##$V9= 5
##$VALIST= <valist>
##$VCLIST= <CCCCCCCCCCCCCCC>
##$VD= 0
##$VDLIST= <DDDDDDDDDDDDDDD>
##$VPLIST= <PPPPPPPPPPPPPPP>
##$VTLIST= <TTTTTTTTTTTTTTT>
##$WBST= 1024
##$WBSW= 4
##$XGAIN= (0..3)
0 0 0 0 
##$XL= 0
##$YL= 0
##$YMAX_a= 54040
##$YMIN_a= -42067
##$ZGOPTNS= <>
##$ZL1= 120
##$ZL2= 120
##$ZL3= 120
##$ZL4= 120
##$ABSF1= 10
##$ABSF2= 0
##$ABSG= 5
##$ABSL= 3
##$ALPHA= 0
##$AQORDER= 0
##$ASSFAC= 0
##$ASSFACI= 0
##$ASSFACX= 0
##$ASSWID= 0
##$AUNMP= <proc_1d>
##$AZFE= 0.1
##$AZFW= 0.1
##$BCFW= 1
##$BC_mod= 2
##$BYTORDP= 1
##$COROFFS= 0
##$CY= 11.3945322036743
##$DATMOD= 1
##$DC= 2
##$DFILT= <>
##$DTYPP= 0
##$F1P= 15.9154993809931
##$F2P= -4.1035820241983
##$FCOR= 0.5
##$FTSIZE= 0
##$FT_mod= 4
##$GAMMA= 1
##$GB= 0.15
##$INTBC= 1
##$INTSCL= 1
##$ISEN= 128
##$LB= 0.24
##$LEV0= 0
##$LPBIN= 0
##$MAXI= 10000
##$MC2= 0
##$MEAN= 0
##$ME_mod= 0
##$MI= 1.114404
##$NCOEF= 0
##$NC_proc= 0
##$NLEV= 6
##$NOISF1= 3.799351
##$NOISF2= 2.8
##$NSP= 1
##$NTH_PI= 0
##$NZP= 0
##$OFFSET= 15.70392
##$PC= 1
##$PHC0= -11102.02
##$PHC1= -13.79906
##$PH_mod= 1
##$PKNL= yes
##$PPARMOD= 0
##$PSCAL= 0
##$PSIGN= 0
##$REVERSE= no
##$SF= 200.130013532006
##$SI= 16384
##$SIGF1= 3
##$SIGF2= 2
##$SINO= 400
##$SIOLD= 16384
##$SREGLST= <1H.CDCl3>
##$SSB= 0
##$STSI= 0
##$STSR= 0
##$SW_p= 3612.71676300578
##$SYMM= 0
##$S_DEV= 0
##$TDeff= 0
##$TDoff= 0
##$TI= <>
##$TILT= no
##$TM1= 0
##$TM2= 0
##$TOPLEV= 0
##$USERP1= <user>
##$USERP2= <user>
##$USERP3= <user>
##$USERP4= <user>
##$USERP5= <user>
##$WDW= 1
##$XDIM= 8192
##$YMAX_p= 0
##$YMIN_p= 0
$$ End of Bruker specific parameters
$$ ---------------------------------
##NTUPLES= NMR FID
##VAR_NAME=  TIME,          FID/REAL,        FID/IMAG
##SYMBOL=    X,             R,               I
##VAR_TYPE=  INDEPENDENT,   DEPENDENT,       DEPENDENT
##VAR_FORM=  AFFN,          ASDF,            ASDF
##VAR_DIM=   8192,          8192,            8192
##UNITS=     SECONDS,       ARBITRARY UNITS, ARBITRARY UNITS
##FACTOR=    0.0002944,     1,               1
##FIRST=     0,             0,               0
##LAST=      2.4114304,     0,               0
##MIN=       0,             -42067,          0
##MAX=       2.4114304,     54040,           0
$$ Real data points
##PAGE= N=1
##DATA TABLE= (X++(R..R)), XYDATA
0@%%%%%%%%%%%%%%%%qJ6j6J6j6J7k5L2l2M0m8N6o4P2q4R3j05J20j36J53j70J90
38A01k14K39k66K96l29L63m00M41m87N38n90O48p15P89q71R60j060J175j304J454
58G68j628J830k076K378k754L245l916M884o395R089j5277N3776J0116r6107P2060
73B9993k7645n595L9497n4820K7793K8501n0791K5898p448l511K3596k8996M548
86A020Q557j5986J4659o596K503j599j0770K0696j1835m629J3322j7672K0328
99A1998n098k3368K6134j5655N47J8064l4734K6526J1957l6321K5376o446j3972
112a4992K5408k1856L311J1964j7600K0547q662j5959K3459r263P03R336j7080
125a0684Q500N799p627M11j965O932j416n338M725m248R824J555j5204O778k75
$$ plain form
0 0 0 0 0 0 0 0 0 0 0 0 0 0 0 0 0 0 -8 8 -8 8 -8 9 -16 16 -16 24 -24 32 -32 40 -44 49 -56 64 -72 81 -89 101
38 101 -113 126 -140 156 -173 190 -210 231 -256 282 -308 340 -375 414 -457 503 -557 618 -686 768
58 768 -860 970 -1106 1272 -1482 1763 -2153 2731 -3664 5425 -9852 43924 54040 -42067 29993
73 29993 2348 -3247 36250 -18570 9223 37724 -13067 12831 5383 1872 25468 -3528 1020
86 1020 9577 -6409 8250 1654 4157 2558 -8212 12484 649 -3980 9342 -8330 11998
99 11998 6900 -16468 9666 -5989 -5442 12622 -22112 4414 16371 -19950 5426 -1020 -14992
112 -14992 10416 -11440 -8129 3835 -13765 6782 -1880 -17839 5620 -3643 -2940 6396 -10684
125 -10684 -2184 3615 -4012 -3601 -5566 1366 -50 -5388 -663 -4911 4913 6468 -8736 -1958 -2233
140b233J029P723j4899P001J0964j1935N678j671n239J1790l817j968K525l050
154A898M993m889l923O096K52L288m886n516N546q47M063l698q788Q165l835j726
170c807Q429q803M847L502j1805O345j937K29J0079j1302o80N461n775P708m172
185a681o343J0982k888j023N23n990Q833r03p019L789l323M989K697p829M950
200b36n16m08L480q253M390N310n883M128m621j744J0128o494j319K539l853P443
216D091j284m957N024m245J919J444o469P489J433l628L541o931K712P158n804
231A493Q73j437q22O006m755p68K681k772M847m469m237Q601l175Q8K048q921
247d719N326K444o933M021j159Q48N120p716p06K590j466N016m972k255O578m286
$$ plain form
140 -2233 -1204 6519 -8380 -1379 9585 -2350 3328 1657 -3582 8208 4391 2423 4948 1898
154 1898 6891 2002 -1921 4175 4427 7715 2829 -2687 2859 2012 6075 2377 -6411 1754 -2081 -3807
170 -3807 4622 -4181 666 4168 -7637 -1292 -3229 -3000 7079 -4223 -4903 558 -5217 2491 -1681
185 -1681 -8024 2958 70 -953 -430 -6420 2413 1510 -5509 -1720 -5043 -54 2643 -5186 -236
200 -236 -752 -1160 2320 -5933 -1543 3767 -2116 2012 -2609 -4353 5775 -719 -2038 501 -3352 4091
216 4091 2807 -2150 2874 -1371 548 1992 -4477 3012 4445 817 4358 -2573 139 7297 1493
231 1493 2366 929 107 6113 1358 590 3271 499 5346 877 -3360 5241 2066 2154 4202 -4719
247 -4719 607 3051 -3882 139 -1020 -172 4948 -2768 -3474 -884 -2350 2666 -2306 -4561 2017 -2269
263b269K53J595m555N587N94n423K904l96J805J664m393P24o06J493K096n092
279d019K562L601l202J899l110j812O025k349j458J527k030L928p07l939K846
294b38p10K231J259m881L214K237k581J172k876L83N199k262o65J66j79K783j360
311B892k563J562K3J546j752k407L375N51j589j67k762J767K684j954p34l37k32
328i7J339k206j869K223J096K54j271k201J516J517j888n16p01N28J965j320k198
345c829J746R01O51j569k317K430K059j167m18r76Q27J360j793k38J098J371J147
362A283j483j557J317Q98M88k044j228L056J37n49j4j540K679M62k756J418m86
379H1J360K152l636p3K067n83J451j647p38L880j655o90L02j664J835J59k940
$$ plain form
263 -2269 -2016 -421 -4976 611 1205 -4218 -1314 -1710 95 1759 -2634 -1910 -2516 -1023 1073 -4019
279 -4019 -1457 2144 -1058 841 -2269 -4081 1944 -405 -1863 -336 -2366 1562 855 -3084 -238
294 -238 -948 1283 2542 -2339 875 3112 531 1703 -1173 -790 4409 2147 1482 1648 1469 4252 2892
311 2892 329 1891 1914 3460 1708 -699 2676 3227 1638 1471 -1291 476 3160 1206 472 135 -97
328 -97 1242 -964 -2833 -610 486 740 -531 -2732 -1216 301 -1587 -2103 -2804 -2276 -311 -1631 -3829
345 -3829 -2083 -1182 -531 -2100 -4417 -1987 72 -1095 -1513 -2489 -1662 -302 -2095 -2333 -1235 136 1283
362 1283 -200 -1757 -440 458 946 -1098 -2326 730 867 318 304 -1236 1443 1905 -851 567 81
379 81 1441 3593 -43 -116 1951 1368 2819 1172 434 4314 2659 1969 2271 607 2442 2601 -339
396c39J143N00Q92Q92l593r8J525m74J38j572J29K006j303p49m74n51K708j181
414d01j597R43k3J304p3l338J653J000j421J129j522O96K848k166n62J83q28K649
432D74p05k007J939l78O81N37l026K488J631j725R26r60N40K518l017J62K01o08
450c29K691j719j015K243j289J437q98k938L700q13j083K017l091K165J457l196
466f61J784q54K02L042l914M21J561j913K371k452j772M009j966K06Q69l066L051
483I18o38k805K357k027J543J154l905K497l97m69K464l677O45K756k455J919
499a20j587j064L787k146n81J029j618L668j349k123K591j805J309N36l341L036
515B22M52j036J433k220J342J257j604J188j049J78K572k255k26O31r67K108j630
$$ plain form
396 -339 804 1304 2196 3088 -505 -603 922 448 586 -986 -857 1149 -154 -903 -1377 -1928 780 -401
414 -401 -1998 -1055 -1078 226 153 -3185 -1532 -532 -1953 -824 -2346 -1650 1198 -968 -1530 -1347 -2175 474
432 474 -231 -2238 -299 -677 4 541 -2485 3 1634 -91 835 -125 415 2933 -84 78 279 -329
450 -329 2362 643 -372 1871 582 2019 1121 -1817 1883 1070 -13 2004 -1087 1078 2535 -661
466 -661 1123 269 471 3513 -401 20 1581 -332 2039 -413 -2185 1824 -142 64 933 -2133 918
483 918 280 -2525 -168 -2195 -652 502 -3403 -906 -1303 -1772 692 -2985 -2340 416 -2039 -120
499 -120 -1707 -2771 1016 -1130 -1711 -682 -2300 1368 19 -2104 487 -1318 -9 527 -2814 222
515 222 674 -362 1071 -1149 193 1450 -154 1034 -15 163 2735 480 254 885 -82 2026 396
532C96n51K020m90M78r45j478K301n54o36O0j220J969M61j678Q93n73Q02M98k041
551b88Q29J39N09J89k274Q15N46n93Q83j316J35J613j255k49q45l61K003j360
569h80k89J99l40J775j374j038J796r80Q07l09j768K130J13o37M76j608J934L50
587C57j887J963j417O13J845l108R98N34p97K259j604o82K322j301P66m79j635
604a253L111j142o47J247j954K073J15k290K229j277O75J022k461J402N23j266
620A07J566k338K85K447k326J527n09j539K759k208m69J641j623J665k64k212
636a491K055q33m6R60k164J395P39j474J143j364RJ628k053M35M87q19J825j360
654i28o85J387r41J105o75j262J809J98o74O26j457J447L29j258O86k3P6J212
$$ plain form
532 396 -155 1865 1375 1853 908 -570 1731 1177 541 601 -619 1350 1811 133 1026 453 1255 1753 -288
551 -288 541 680 1189 1378 -896 -81 465 -128 755 -561 -426 1187 -68 -317 -1162 -1523 480 -880
569 -880 -1169 -970 -1310 465 -909 -1947 -151 -1131 -324 -633 -2401 -271 -158 -795 -319 -1927 7 357
587 357 -1530 433 -984 -371 1474 -1634 -636 -102 -899 1360 -244 -926 1396 95 861 382 -1253
604 -1253 1858 716 69 1316 -638 1435 1550 -740 1489 212 887 1909 -552 850 1373 107
620 107 1673 -665 -380 2067 -259 1268 759 -780 1979 -229 -698 943 -680 985 721 -1491
636 -1491 564 -269 -315 645 -1519 -124 615 -859 284 -1080 -1071 557 -1496 -1061 -574 -1393 432 -928
654 -928 -1613 -226 -1167 -62 -737 -1999 -190 8 -666 -40 -1497 -50 279 -979 -293 -316 -240 972
672I72j276l5O00o8M65o32M6R80k68q6k90l27Q74Np29r4P2P85J72q45Q2J46M24
695I73n29k63NP04j30o9q18J70J04M75m80j57M94j58j18l82l41O23J04n78O6k30
717e35N63M03j358L09L68q0N3o06J15N62J07m07j65l08R27j22n17K26k17O41k
738d3j205O31K57K37K03o71M83O43o85M10q87M45R40q01J22J27n02J187m60m67
758c6Q29l27j4L87q60J027j1p25N14j235O28J084r41L68j49j91P92q18o58P01
778C65j29M94k60j038R73l28K2L47j041P53J00o74K37l59J30P41j150J19M03l60
798f55O61m85m23P77n50O6K8l90N05K63m04L5n17O77K88q11K71K78O3M20q85J18
820f70O64j37m2j57J95N46m04k1K87n30P10K55o92J62l3L21J83l62P5K02k6j20
$$ plain form
672 972 -304 -339 261 193 658 26 72 1052 784 698 408 81 955 960 231 137 209 994 1166 321 403 549 973
695 973 444 181 186 890 760 691 -127 43 147 622 142 -15 479 321 203 -179 -520 103 207 -371 -305 -535
717 -535 28 431 -927 -618 -250 -330 -277 -883 -768 -206 -99 -506 -671 -979 -52 -174 -691 -465 -682 -41 -43
738 -43 -1248 -617 -360 -123 80 -591 -108 535 -150 260 -627 -182 758 -43 79 206 -296 891 431 -36
758 -36 793 466 452 839 -21 1006 995 270 784 -451 177 1261 320 688 539 348 1140 322 -336 365
778 365 236 730 470 -568 405 77 99 446 -595 158 258 -416 -179 -538 -408 333 -817 -698 -295 -655
798 -655 6 -479 -902 -125 -675 -609 -581 -971 -466 -203 -607 -572 -1089 -412 -124 -935 -664 -386 -323 97 -788 -670
820 -670 -6 -143 -185 -342 -147 399 -5 -26 261 -269 441 696 4 166 133 454 637 275 350 552 526 406
842D06n10M97L34j00k54j99k40O06l27LQM54jo21k6J73J48K54o36J9L4M90k39
865B73o45J96L82J8k52n29K42P08l75R0m40j38L23K2l44L75k75J48J35p38P08
886a16k93N50k49o11O75M0l48L27m46K45N86p98K18p6P6N52k00l78N32j82N12
907F16o34l31P15j31M9r6m53R10Q4o57N01m91M70K39j046Q94j16j84N40r44K01
928A36P26j061M93j35m29Q68k29m19K26o34Q79P5o29J8j93M19q6m82L73P1l48
949c61L39n81K38L34k98J50l50j4M84n65N1M24k75L47k65k60M11k01J34K36n67
970e89L89K21N8j83o6M55k1n19K00N8N6K66j66o5p0k4K02k90K25P6L18J9n98j41
994a89Q20n37J15m6p1O76m83J12m03K62K7j79pK32O1j24j60k20L80k20K92l78
$$ plain form
842 406 -104 393 727 627 373 174 -66 540 213 216 224 678 677 56 30 203 351 605 -31 -12 22 512 273
865 273 -372 -176 206 224 -28 -557 -315 393 18 108 -332 -470 -147 -125 -469 -94 -369 -221 -86 -824 -116
886 -116 -409 141 -108 -719 -44 -4 -352 -25 -471 -226 360 -438 -220 -296 -220 332 132 -246 286 104 616
907 616 -18 -349 366 235 284 188 -265 645 729 72 573 82 552 791 -255 639 523 339 879 -65 136
928 136 862 -199 294 159 -270 598 369 -50 176 -458 421 496 -133 -115 -308 111 25 -457 -84 -13 -361
949 -361 -22 -603 -365 -31 -329 -179 -529 -543 -59 -624 -573 -149 -424 -77 -342 -602 -191 -392 -258 -22 -589
970 -589 -200 21 79 -104 -170 285 264 -255 -55 3 59 325 159 94 24 0 202 -88 137 213 531 550 -48 -189
994 -189 631 94 209 163 92 768 285 397 -6 256 283 104 97 329 390 266 106 -114 266 46 338 -40
1016d0k97L75J05r4p1j88K69M1n41J75oR1M30n63q3M01k05K74R0l19O6n7k73L17
1040a03l67N55J35o80L68l81J13K55l44J41Q8J79J71k69k07N11k61J39J50n68
1060c75P28l34k1Q2j85K94L43o60L99j0J38r2n16K72L18k84L33j17j99J28m9K16
1082D09m86J73J08L28l72j07n5J83Ok05J10k2rL35n58K17K96l35k09J98k09M47
1104B43m19k22L84r7N3k30K8j54M08m0j23r9N2P6K26o30J39J86O0q6j09j32L34
1127a52J58l37J94k21O89l00l10L12J01r4j4Q0o4j30J91o9j13R6Q1K61J5l60L39
1150C53K06l05j16k35L32L50o07K26k31K56J22l14j37M91k34j19O6j75J42N5k4
1171A02j91J91L3P0k78N5L1M8K00l48J0J24l06J77k48J18Q3M1o6P5l67O32n05
$$ plain form
1016 -40 -337 38 143 49 -22 -210 59 100 -441 -266 -272 -181 249 -314 -397 4 -201 73 163 -156 -90 -147 -420 -103
1040 -103 -470 85 220 -460 -92 -473 -360 -105 -449 -308 -220 -41 130 -139 -346 165 -96 43 193 -375
1060 -375 353 19 -2 80 -105 189 532 -128 271 261 399 307 -209 63 381 97 430 313 114 242 193 409
1082 409 -77 96 204 532 160 53 -2 181 187 -18 92 70 61 396 -162 55 351 16 -193 5 -204 243
1104 243 -176 -398 -14 -111 -58 -288 -260 -414 -6 -46 -169 -268 -216 -140 86 -544 -405 -219 -159 -245 -354 -486 -152
1127 -152 6 -331 -137 -358 331 31 -279 33 134 40 26 106 42 -88 103 34 -79 17 98 359 374 14 353
1150 353 559 254 138 -97 235 585 -22 204 -27 229 351 37 -100 391 157 38 104 -71 71 126 102
1171 102 -89 102 135 205 -73 -18 13 61 261 -87 -77 47 -259 -82 -330 -212 -129 -88 -154 -79 -446 186 -319
1194c19l4M1j88L10K65l26Q7L3j97K50l04M55R6j50j41j60K06M0J01m03K01K8
1216a09J03J14k68J47J10L8j83J8K85J24p6n7p1K0J93k98k5J47pj0O4m35L80K25
1240D29k41k02J03N0R4J30l52m6O6M2m2m65N12j58J65j28j22J3M01m14j82K78
1262f9k07L72k7j91j2j10K5O4k85L50J26l95rP5m3L03l58R3LJ91o0J2j7J6K07
1287E4qk43o9K19n0j70M73k68L06j53L2m1j16J30N83p89K28K59k75J10R3k69M72
1310E08l96k79L53k72M12j68q6M34k04n0J77p97N14O5K8rk35n8P3k15L50k90L6
1333a09M69k51l14J85k28L32k88j60N4J55J79k30R4l3J01k30M01m32J68K92o51
1354d96L38J35j6K04l81n5K46k70K14K2l47L32lL6J1k86K50K36k73O4J75J46j13
$$ plain form
1194 -319 -353 -312 -500 -190 75 -251 -164 -131 -328 -78 -382 73 169 19 -122 -282 -76 -36 65 -338 -137 -109
1216 -109 -6 108 -160 -13 97 135 -48 -30 255 379 303 246 175 195 388 90 65 212 205 195 259 -176 204 429
1240 429 188 -14 89 139 233 363 11 -35 31 73 31 -434 78 -80 85 -43 -165 -152 249 -165 -347 -69
1262 -69 -276 96 69 -122 -134 -244 -219 -155 -440 -90 36 -359 -368 -293 -336 -33 -391 -298 -295 -104 -164 -152 -169 -153 54
1287 54 46 -197 -266 -47 -97 -267 206 -62 244 91 123 82 -34 96 679 -110 118 377 102 212 305 36 508
1310 508 112 -167 186 -86 326 158 72 506 302 252 429 -368 146 211 239 230 -5 -63 10 -205 145 -145 -109
1333 -109 360 109 -205 -20 -248 84 -204 -364 -310 -155 24 -206 -112 -145 -44 -274 127 -305 -137 155 -496
1354 -496 -158 -23 -39 165 -216 -271 -25 -295 -81 -59 -406 -74 -77 -41 -30 -316 -66 170 -103 -39 136 282 169
1377A69o2Q5l44K42K29l37j61Q9J36K52j12qJ23P2j79j74K23J76n4j19q7p8J06
1400A87j58j95M02j80q6J98l25J78L3j36J16k98L74r5J08p0k83J05K58k85j04
1421b56J97j6J18k76q2K63J27k31J05j56O2j50R4J35l41M27j36k53M34l17K53
1442An6n3R7o3Nq3k97M17J29j40Qj7j51N56j34n7K6K3J76k72k69K78m4L63n0m58
1468f5K79J11J34j01l67L7K44m59N11m25J56L37l91L78k08l27L39n27K74J67p7
1489B0p1Nj39K32R2m31K22q7L82j76l59J48L7J7J11k59K1L22k09j36Lo0L83k32
1513a64j08L98l22L67n49q3M05L07m00L31m05K97K72j40J09m61j06J28J31l3P9
1534E3k96P46l59j8k62L58J1k72R4K93j82J32mj19k18K02P1K4r3J48J02l31R2
$$ plain form
1377 169 107 192 -152 90 319 -18 -179 -90 46 298 186 178 301 373 194 20 243 419 365 246 159 81 187
1400 187 29 -166 236 56 -30 168 -157 21 54 -82 34 -264 110 15 123 53 -230 -125 133 -152 -256
1421 -256 -59 -75 43 -233 -315 -52 75 -156 -51 -207 -145 -295 -201 -66 -407 20 -116 -369 65 -252 1
1442 1 -55 -108 -11 -74 -69 -152 -449 -32 97 -43 -35 -52 -203 353 219 162 188 211 387 115 -154 124 80 443 393 -65
1468 -65 214 325 459 358 -9 28 272 -187 324 -101 55 392 1 379 171 -156 183 -344 -70 97 20
1489 20 -51 -46 -185 47 139 -292 -70 -157 225 49 -310 -162 -125 -108 3 -256 -235 87 -122 -258 -255 -315 68 -164
1513 -164 -272 126 -196 171 -378 -461 -56 251 -149 182 -223 74 346 206 315 -146 -252 -124 7 -26 53
1534 53 -243 503 144 126 -136 222 233 -39 55 348 166 298 294 175 -43 159 230 254 161 309 411 80 172
1557A72rj59J92n9k51J02K07k56r3P0O3k62J36q5K2n5J85O5j21%k3p4j33NK63
1582i8jj24r5J97j2K60r3l55K47j33o0K50k33J97K05k09K3j21J04J26j40j00M17
1605B52k06J67m42J13K61N3K5l63P0L67Jj72J21l67N36k83P6j04P3J04K04o72
1627a86L60qN5j00o2k6J60N2%l18j9L22p7k29K04j29J16q6r9k70J69m4J17j39
1651b37J28o4L84l60j37Q4N2Q9j74J90p1K71P9m94J33k7K8J27k46L78R4n5l42
1674a70Q8P8K02k06j01Kk7J40k12Q3L15j39j32J28PJ16J22k12k05L94k45J76K
1697B04l49M09J27k61J06m90N34l1k18K25j07J70r2n13O61j3l16O7n6N2O6k56
1719h1m6M96p33L30j30K12l43J84l5J62j80jN6m0M54o76K83j30K65k29k09L09
$$ plain form
1557 172 163 4 196 137 -114 -12 195 -61 -154 -84 -21 -283 -147 -232 -210 -265 -80 -15 -136 -136 -159 -233 -366 -361 -98
1582 -98 -99 -223 -318 -121 -133 127 34 -321 -74 -207 -267 -17 -250 -53 152 -57 -34 -155 -51 75 -65 -165 252
1605 252 46 213 -229 -116 145 198 223 -140 -70 297 298 126 247 -120 416 133 209 105 178 282 486 -186
1627 -186 174 166 221 121 59 33 193 245 245 -73 -92 230 153 -76 128 -1 115 29 -70 -340 -171 -215 -98 -237
1651 -237 -109 -173 211 -149 -286 -202 -150 -61 -235 -45 -116 155 234 -260 -127 -154 -126 1 -245 133 227 172 -170
1674 -170 -82 -4 198 -8 -109 -107 -134 6 -206 -123 192 53 -79 49 56 172 294 82 -123 271 26 202 204
1697 204 -145 264 391 130 236 -254 280 249 31 256 149 319 227 -286 375 362 46 113 57 109 175 -81
1719 -81 -127 369 -364 -34 -164 48 -295 -111 -146 16 -164 -165 -109 -149 305 -371 -88 -218 47 -182 -391 -82
1741h2J44l74M55l56J60N1m25L07j03J22K03Q3m31L46l36Q5J66M5r2J67p1j15
1763e1L07q2J20l18K48k83J29lJ30m7j1l2J07k75j2K60k21L38j06m61N90j53j06
1786F8J46p7K3j41K19k40J92k11o5k16K76P4r2L6j47j29M02j63J8k54N75m06K7
1809h5n6j66m3L68j46k07R6L75l19R7j08j25L18r2j35L4K67M4k32J11j5j87M65
1832B59m04M4K53Q8k00J76n89O34k85K29j04k32K07Oj9l7j83K81J57l11K05l1
1854A44j33L03l46M07k35j24N5NK13j19j83L21k46j08K36k21n5K58k05K25m81
1875b89J1J84k77K27J6j50R9Kj06J36j55J52K64l72J40l6oJ24l9P3k73J76J78
1898G9j98m9J40J61j57rn3oJ82m04L23o0R6j93K37k50L09m3Q9m1J39j36OK2k41
$$ plain form
1741 -82 62 -312 143 -213 -53 -2 -427 -120 -223 -101 102 185 -246 100 -236 -151 15 60 -32 135 64 -51
1763 -51 256 174 294 -24 224 -59 70 67 197 150 139 107 214 -61 -73 187 -34 304 198 -263 327 174 68
1786 68 214 137 160 19 238 -2 190 -21 -86 -302 -26 48 -44 -8 -155 -284 118 -45 -27 -281 294 -112 -85
1809 -85 -141 -307 -350 18 -128 -335 -239 136 -183 -86 -194 -319 -1 -93 -228 -194 73 117 -115 -4 -19 -206 259
1832 259 -145 -101 152 240 40 216 -373 261 -24 205 101 -131 76 82 63 26 -157 124 281 -30 175 144
1854 144 11 314 -32 375 140 16 71 76 289 170 -13 308 62 -46 190 -31 -86 172 -33 192 -289
1875 -289 -278 -94 -371 -144 -128 -278 -179 -177 -283 -147 -302 -150 114 -258 -118 -154 -160 -36 -75 -2 -275 -99 79
1898 79 -119 -168 -28 133 -24 -33 -86 -92 90 -314 9 -51 45 -148 89 -161 148 105 194 153 292 156 162 184 -57
1923e7l6M89j78R9k19l1kq3K79k35L79K8j73k98k14J34j54O31m54J12l8Q5j51
1946h7k08R8L82m24K27J0p9J43K4l85J85M6n2K3m0J57k40QJ37j37nRn5K47K1L3
1972C8l1m29L16o5lJ50oJ25p5J34l72r7L69K2l8j02K63K1j08j70J73j74k0K53
1996A74p6j5J80l4K48l46p9LP7kp0j95p6M98j26j43P1J00k27N3k95L42J85l56
2020a09J01j56L76L3l20J43j73J3j56L56l21J7J24J62J5j24o0q0l7L5%K73k59
2043a47J85j05j8n2q4l1L84k38J64O6k65M8N6R4j80k7J50R3r2Q4J0n7L29k36R6
2068B27q1m4k7J30j28L50k36K77l67j03J7K17L2r2j90P9J77l39J43J59k61R5J66
2091B01k37M7R2k6j59l8M0K50k35P4P7k00L28m36J66j1K43j85j14N0k27M83k84
$$ plain form
1923 -57 -93 396 218 317 98 67 65 -18 261 26 405 433 260 -38 -252 -118 -272 359 -95 17 -21 64 -87
1946 -87 -295 -197 185 -239 -12 -2 -81 62 86 -299 -114 -68 -120 -97 -137 20 -220 -212 -75 -212 -217 -208 -263 -16 5 38
1972 38 7 -422 -106 -171 -174 -24 -30 95 20 154 -218 -315 54 76 38 -64 199 220 112 -58 115 -59 -79 174
1996 174 98 83 263 229 477 131 52 55 132 130 60 -135 -211 287 161 18 89 189 -38 15 -280 62 247 -109
2020 -109 -8 -164 212 245 -75 68 -105 -92 -248 108 -213 -196 -72 90 105 -19 -79 -159 -196 -161 -161 112 -147
2043 -147 38 -67 -85 -137 -221 -252 132 -106 58 124 -141 -93 -37 57 -123 -150 0 93 1 85 95 38 367 131 227
2068 227 146 102 75 205 77 427 191 468 101 -2 15 232 264 172 -18 61 238 -101 42 201 -60 35 201
2091 201 -36 11 103 77 -82 -120 -80 170 -65 9 86 -114 214 -222 -56 -67 176 -9 -123 -73 -300 183 -101
2114a01j09kK74k4k57K93j4K7k64J85k48K21k1J48l03J36J0j33L32j10J28k02
2136c4J80j83L2j18Q0K43l9m2k52L07k48L10m22J62M6K50j32j34K56j82R4J31
2158C05k89PRR2j90J29J15j14K5J52l45R7J65j64J35m34K38K06j27j9p2K05J38
2181B64j37j34P1j21j08n9J19k0l7J79k54K76j15K8%K6j39JK53k91K89K9k08R
2205g9j84K58k51J11O2K54Rk64R6j61K22p7k1J65p7j4J29j54o5R8MN9k14L14k5
2230A95k33j31R2K12N7J16j76j35J61j17j43K01M3k16N1M2J72l89M09k33p8j72
2252b72L74k24K27j93m5k5L35j98k59L11K5j7j78J74M7l16K10j49R9R6j67K33
2274H8j15j02J26j64J72r3K6mK22j27jL1Q3K12l67J41j13L3J96k48K1MPj99M4
$$ plain form
2114 -101 -210 -212 62 38 -219 74 60 87 -177 8 -240 -19 -40 108 -195 -59 -49 -182 150 40 168 -34
2136 -34 146 -37 -5 -123 -43 200 161 119 -133 174 -74 236 -186 -24 22 272 140 6 262 80 174 305
2158 305 16 23 32 124 -66 63 178 64 89 241 -104 -7 158 -6 129 -305 -67 139 12 -7 -79 126 264
2181 264 127 -7 64 -57 -165 -224 -105 -125 -162 17 -237 39 -76 -48 -48 -22 -161 -160 93 -198 91 120 -88 -79
2205 -79 -263 -5 -256 -145 -83 171 180 -84 12 -149 73 -4 -25 140 63 49 178 24 -41 57 61 120 -94 220 195
2230 195 -38 -169 -77 135 192 308 132 -3 158 41 -102 99 142 -74 -23 19 191 -198 211 -22 -100 -272
2252 -272 102 -122 105 -88 -133 -158 177 -21 -280 31 56 39 -139 35 82 -234 -24 -173 -74 22 -145 88
2274 88 -27 -129 -3 -167 5 -88 -62 -66 156 29 28 59 142 354 -13 128 15 48 244 -4 17 21 28 -171 -127
2299a27M12L2k40K6j44m4L52l59L73k16J88k32m3J8K45L9j36n4M0j55j02J58j66
2322a35m7R8L05n09R9J2L86l05n3O5R9R3l46k74L42Mo9J12r3J20J3p6q9J13n0
2347a85L5M6m4j15L30j97L24l82L29k19JR9k00mJ15J85k27K27K06j34K8k38j55
2370a75J93K6PP8M1J7k25oJ92j02J84j36k4j47Q1K56m20K66J48L8k91J58j15N2
2394I6om3k1q1Q8J8L08n34J29Q1l8m7m1J82L4j52RJ55l67J26j47o7K31J34j26
2419g9J28kk37K64j39k5K07j02JK6l4q1o8J39m0o3J84J13p8j36P9l7J4J04n9k54
2445a75L20Q0k23p5J57K21j51rj04j82L08k27J2J31j46M1L4K35j06o9j8l37K92
2468IM0O5K89j40j88L7p7j89N3J63j2k20K72m74R5M04j30q6O2mJ1OM6j29k52K70
$$ plain form
2299 -127 285 317 77 103 -41 -85 267 -92 281 65 253 21 -22 -4 241 280 144 90 130 -25 -127 31 -135
2322 -135 -182 -84 221 -288 -189 -177 209 -96 -149 -84 15 108 -238 -512 -170 -166 -235 -123 -216 -96 -83 -159 -248 -135 -185
2347 -185 -150 -104 -148 -263 67 -130 194 -188 141 -78 -77 22 -178 -182 -67 118 -109 118 324 190 218 -20 -175
2370 -175 18 44 51 129 170 187 -38 -44 148 46 230 94 70 -77 4 260 -160 106 254 292 1 159 44 96
2394 96 90 47 26 -55 33 51 359 -175 -46 35 -3 -50 -91 91 125 -27 -18 137 -230 -104 -251 -318 -87 47 -79
2419 -79 49 47 -190 74 -65 -90 117 15 16 42 8 -73 -141 -2 -42 -105 79 192 114 -22 57 20 34 138 79 -175
2445 -175 145 225 2 -73 84 305 154 145 41 -141 167 -60 -48 83 -63 -22 12 247 141 72 54 -283 9
2468 9 49 114 403 263 75 112 35 -154 -101 62 50 -170 102 -372 -277 127 -3 -89 -27 -31 -20 -14 32 -97 -349 -79
2494g9Q1j22j74K95m7k62p3K24J18j93J35k4O6k04M05j88O5J4k25K45l8m0p3M5
2518d9K33m71L72R2k06J06J15O9k86N8l7m5m7K87m1n9M20m35r8M0Q7p3p7L17l38
2543f6J44j25J91j26j29M0pO4J88j85j00k8K40j62r4K73j25j46L8j38J95K26k94
2566a26J40l7j20J2j2j15R1K37k03r1LP2K61l86K47j2J23k14R9k20L00R3N9lm40
2591b42Q6MK68j08k0Nk19J07J84n6N0L8J4j62J33J2k17J93J06J64l68j05Q3J76
2615A26jo4kL3j95K54l1m49M57k39J44k29M16l12J98j59p1L06j63oj65j1kJ94
2639B9j36j76K21n8J20L4k22J28J28j77j9J78k31m0O1j64K48k30J73r1J21J76
2661G3j80J22r8L8J79q9K21l08J68k44J23O4P1k83M6P3J17k2Q2L3j06M0L8j82
$$ plain form
2494 -79 2 -120 -294 1 -46 -308 -381 -157 -39 -232 -97 -121 -55 -259 146 -42 23 37 -188 57 19 -21 -94 -49
2518 -49 184 -287 85 177 -29 77 192 261 -25 33 -4 -49 -96 191 150 91 511 76 -22 18 105 32 -45 272 -66
2543 -66 78 -47 144 18 -111 -71 -78 -14 174 -11 -111 -139 101 -61 -155 118 -7 -153 -115 -253 -58 168 -126
2566 -126 14 -23 -143 -131 -143 -258 -167 70 -133 -224 -221 -149 112 -274 -27 -39 84 -130 -31 -251 49 142 201 198 -242
2591 -242 -156 -152 116 8 -12 -7 -226 -119 65 9 59 97 111 -51 82 94 -123 70 176 340 -28 -133 -50 126
2615 126 125 61 59 92 -103 151 120 -329 128 -111 33 -196 220 -92 106 -53 -124 182 19 13 -152 -163 -165 29
2639 29 -107 -283 -62 -120 0 34 -188 -60 68 -109 -128 50 -181 -221 -160 -324 -76 -306 -133 -224 -103 73
2661 73 -107 15 -83 -45 134 45 266 -42 126 -118 5 69 140 -143 -97 -24 93 71 153 186 80 120 158 -24
2685b4J68r5M6K1j28J00k07j01J20J51j54J7J37J31j64j2r9O8K5j04k09p1L43
2708d1J84k57J51P2j80K5n8j34O6k3L22j20K6j35J50k7j31o0N0J63J04j79j23
2731a55N4m3K18N1l4j78J84o0j28K04J56J2m90l2J23K21k83L44P0l44J26Q3J0
2754A09j91L23oj43M9n3n7J97j50K00j68l4m2r8J24O9j34j20K02j31J27k27K01
2777D7nK1M7R0k36NP8q5K71k02k2K03j21j34j76q2J25J90j67lK17o5r7K14k32
2802a19k58L66j68K93j95k9J31J04k47J82j62Q2q9J21j55K96l55L20j68K16j58
2823Hj51L35k53J24k43J99K8J72m1J05r7j35M35m19rJ35j6k2j98j57J89J75j11
2846E3l6J18j91J79j59J63j19M4n1J33k21J32k92K53j32J85o2j59L31j07k15r4
$$ plain form
2685 -24 144 49 95 116 -12 88 -119 -220 -100 51 -103 -86 51 182 18 6 -93 -25 0 -104 -313 -384 -41
2708 -41 143 -114 37 109 -71 -46 -104 -238 -172 -195 127 7 33 -102 48 21 -110 -170 -120 43 147 -32 -155
2731 -155 -101 -144 74 125 91 -87 97 37 -91 113 269 281 -209 -241 -118 103 -180 164 234 -110 16 99 109
2754 109 -82 241 235 92 141 88 31 228 78 278 110 76 34 -64 60 129 -5 -125 77 -54 73 -154 47
2777 47 42 63 110 200 -36 -31 47 -38 233 31 9 212 91 -43 -219 -301 -176 14 -153 -156 61 -4 -101 113 -119
2802 -119 -377 -11 -179 114 -81 -110 21 125 -122 60 -102 -20 -109 12 -143 153 -202 118 -50 166 8
2823 8 -143 192 -61 63 -180 19 47 219 178 283 186 51 486 67 58 193 177 155 -43 -200 -11 164 53
2846 53 17 135 -56 123 -36 127 8 52 1 134 -87 45 -247 6 -126 59 -3 -162 169 62 -153 -247
2868b47J46Q7n6j86N01k55j15j77M18j01k18K84m7k23K33r7o5J54J24l11j9L2
2890a38J9q8J20L44j79n1r2K3Q6j9M0k8lP4j76J91J79n08K51J10l38L03j62J8
2914b4J56k60l4K76m54J83K05k35M74j17k39J06J10l01L51l72J96q6J02ok5n6
2936e0K49l17J68k17p9K31R9m1o5j24K30j97O1j47M83l40j18Q2K74j14j34N24
2958D58p70J32L2k02L80p8K7l4N1o2k36K42R5N2O0j68J38M6l05J07L77k17J23
2981B48j08k66K69j92O9L5j96L18j66K47l02LK66J16k03k72q6K15K30k74k58L20
3003A3l2Q2M4k34J61j26J5l7L6q6J24j5O3J40j71J77r5j88J81j1Q6l29L47l14
3027a69K23J29m07J53J99m7j55o5K26J97j64Mj75k10J34N0o8J34J48n9k70N8k9
$$ plain form
2868 -247 -101 -14 -70 -256 245 -10 -125 -302 116 15 -203 81 34 -189 44 -53 -118 36 160 -151 -170 -138
2890 -138 -119 -207 -87 257 78 27 -65 -42 44 25 65 37 34 108 -68 123 302 -206 45 155 -183 120 -42 -24
2914 -24 132 -128 -162 114 -340 -157 48 -187 287 170 -69 37 147 -154 197 -175 21 -65 37 31 6 -50
2936 -50 199 -118 50 -167 -246 -15 84 43 -22 -146 84 -113 -52 -199 284 -56 -174 -92 182 68 -66 458
2958 458 -312 -180 -148 -350 30 -48 -21 -55 -4 -66 -302 -60 35 87 147 -21 117 163 -142 -35 342 125 248
2981 248 140 -126 143 -49 20 55 -141 177 11 258 -44 -41 225 341 138 -134 -220 -5 225 -49 -307 13
3003 13 -19 63 107 -127 34 -92 -77 -114 -78 -164 -40 -55 8 148 -23 154 59 -129 52 41 127 -202 145 -169
3027 -169 54 183 -224 -71 128 81 -74 -139 87 284 120 124 -51 -261 -127 -77 -145 -11 137 78 -192 -134 -163
3050a63K07R8j09J67k35P1jQ1on7J91p6J86m91K94J18l53r8L84k30n6l0K87j17
3074F2l5O1j20J6J31m9p9J5j99M5K52j00j9m2K9Q4j53P0l89L32J90m10P6J36J42
3099D6j51o9k5L2J50P6j31K28m3l20j33K71K21j47m5k3K03k40K37k6j66j86K02
3122c9R5n0j41J00j26o3m7K39R8Q9k06oJ47o8l3P8r2m9L30p5r1k17K47j4j57R8
3148D7k6K15m0k68K88k68J55k24J74l8p3N9J70k42O0M9rk12J44rK71j49m5j39
3172a10K7J09j79P6k4q4J57j10mL4k5O1J57o5j78K31j97O2J10j42L45k49m2on6
3197a02K28n8m1p7K41j70K37l39m3L6M1J17j85Q8O9r6o1K9kJ53kj38M4L8j52k6
3223a71J18p1M74k77P6j20J15l33K7K56K7j11k9L0q0R9n6n4J3J74j89R6q4j25
$$ plain form
3050 -163 44 142 33 200 -35 36 35 116 110 53 244 168 354 -137 157 275 -78 -176 208 -22 -78 -108 179 62
3074 62 27 88 -32 -16 115 66 -13 2 -197 -152 100 0 -19 -61 -32 52 -101 -31 -420 -88 102 -308 -232 -96 46
3099 46 -105 -174 -199 -167 -17 59 -72 156 113 -207 -340 -69 152 5 -40 -63 140 -100 137 111 -55 -241 -39
3122 -39 56 6 -135 -35 -161 -224 -271 -32 66 155 -51 -57 90 22 -11 67 -25 -74 256 181 90 -127 120 106 -51 47
3148 47 21 236 196 -72 216 -52 103 -121 53 15 -58 1 171 -71 -11 38 29 -183 -39 -48 223 74 29 -110
3172 -110 -83 26 -153 -77 -101 -185 -28 -138 -142 -108 -133 -72 85 20 -158 73 -124 -62 48 -94 251 2 -40 -46 -102
3197 -102 126 68 27 -50 191 21 258 -81 -124 -88 -47 70 -115 -27 42 -54 -115 -86 -88 65 63 -75 -31 7 -145 -171
3223 -171 -53 -124 350 73 149 29 144 -189 -162 94 121 10 -19 11 -69 30 -26 -80 -67 107 -82 14 -70 -195
3247a95K40L0l51K50Mj83lK47ok4K6P0R3l0j12m3J08j64k8O4J2j31rJ44k49K84
3273D4J7k6Q2K3l36L14R7P5l13J62j89J95j88j22J59J40j06P1m2j00J1MnJ25l6
3298E6L8o1J86l29P1J32p5k1m7J88k3j70l4K01l80L8K94l29L83j59j07K6K61k00
3322f1J3J93L0k26J39j35p6K69k27J2P7J37k46O0N4l7o3q2P7K03l3p8J19j78K14
3347A55j00p8j75M47j98N4r7j74L96p7j09J12o8k44L16l20k7J11J00j61J37L6
3369C6j6J44l43J94K1J67k84o1j03J78j41r3K06N0k3J12j91K11q8k0J68j41k14
3392b31J56L41l22K74k96KJ23j83K74k29k84L95j43J49k0j31M09l94K0m0J13K2
3414EJ96j33Qj85J8j30K31j91K44J29L5j80N8n70q1L64J00j14L4M56k22j98j4
$$ plain form
3247 -195 45 75 -276 -26 -22 -205 -208 39 33 9 35 105 198 168 56 13 121 -43 -71 -7 5 -126 -135 9 -240 44
3273 44 61 35 117 140 -196 118 215 290 -23 139 -50 145 -43 -165 -6 134 28 99 57 -43 -32 -28 -33 92 56
3298 56 94 33 219 -110 -39 93 18 -3 -50 138 115 -55 -89 112 -268 -230 64 -265 118 -41 -148 -122 139 -61
3322 -61 -48 145 175 -51 88 -47 -123 146 -81 -69 8 145 -101 -41 13 -24 -87 -169 -92 111 78 0 119 -59 155
3347 155 55 -23 -198 249 51 105 8 -166 230 153 44 156 88 -156 160 -160 -187 -76 24 -137 0 36
3369 36 20 164 -179 15 36 203 -81 -142 -245 -67 -208 -301 -95 -45 -68 44 -147 64 -24 -44 124 -17 -231
3392 -231 -75 266 -56 218 -78 -76 47 -136 138 -91 -375 20 -123 26 6 -125 284 -110 -90 -130 -17 5
3414 5 201 68 76 -109 -91 -221 10 -181 63 192 227 47 105 -465 -546 -182 -82 -196 -162 294 72 -126 -140
3437a40K49k15K84j78K50p1k66J9l9K94j97j13J29L0l90J64J12R9J11j14J10j33
3459ej74j6L57k84J77j53KJ40r6K76k80oK8k8j3M9J7Lj02O2K94l43J14l1J42j65
3485c5K1j4o7j50M80o93j3R96j364O97m20O80j09j62L46J26j81l17Q7k02K36M9
3507iO6O7P6k61K34k40p8J79k15J70p7J84l6j38m2J79j01L5p0P2K7O6p5j14J48
3532D7j46L32k25j11K83k89KK96j97o5Jr1M21j77j52r8J78KJ38kn5k62K46O5l75
3557b34M5K11j36K54k42J45L3J59m4l24J032j67n51k54J24j08K40j13k7P9k41
3578a19k2L0Q5j53N9K16q7j1J20L0j52l5K38k95P0J10k04j11K97o7L9o4o6l3N8
3603f7K11j98n8J37j79L08l42L3K61j61p1J69j36p0K8J13L7j9m5j56K60n8K7O8
$$ plain form
3437 -140 109 -106 178 0 250 179 -87 -68 -107 187 -10 -123 6 36 -354 -190 -78 21 132 18 128 -5
3459 -5 -179 -195 162 -122 55 -98 -96 44 -52 224 -56 -62 -34 -62 -75 -26 -9 -6 -108 -46 248 -95 19 -12 130 -35
3485 -35 -14 -28 -95 -245 235 -458 -471 525 -839 -142 -562 118 9 -153 193 319 138 -179 -92 -294 -58 -9
3507 -9 57 124 200 -61 173 -67 -145 34 -181 -11 -88 96 60 -78 -120 59 -42 -7 -77 -5 22 88 13 -101 47
3532 47 -99 233 8 -103 180 -109 -107 189 -8 -73 -72 -163 258 81 -71 -169 9 11 149 147 92 -170 76 141 -234
3557 -234 -189 22 -114 140 -102 43 76 235 191 -133 899 732 181 -73 51 -57 183 70 43 122 -119
3578 -119 -141 -111 -26 -179 -120 96 9 -2 118 148 -4 -39 199 -96 -26 84 -120 -231 66 -1 38 -26 -92 -125 -67
3603 -67 144 -54 -112 25 -154 154 -188 -155 106 -55 -126 43 -93 -163 -135 -22 15 -4 -49 -205 55 -3 24 92
3627I2m5N4l01J54j60K01J18j3K2j08o6k6K14j2j76J34K5l15J39J00r0K21j49
3650A3j4l3J53j74l1R3j14K21q1k8K60k48J51k32j03K68l0M1k55J62J25R1k72
3673c7J07j08j15K54j97L20l04r8J88j47J28K11k52k62L26j73q4J39J65j99L45
3694B07J75m5l15PJ26n3k13o4K54O0k52J81J05k47L34r1k52K06k5k65L6J56j37
3717a12J68l83J51k50K29K53r3J45r5J40j40j78K42j52J18J6p8j5k1j9P6k49L71
3740A24K6j51k4J03R2k67j06J49l5N1R0k65L91k95Q2l3k58M57l42L3R7M02k82
3763C9R3n91N05K98k59j41K26j83n5Q8j04j95J98K46j27R3q6%k58K41M6R9k12
3786c9k2N9k13K11J17j50j02K71j66l4L6Lp8o1L10k8j75N9M0k4k32k6J14J92k02
$$ plain form
3627 92 47 101 -200 -46 -206 -5 113 100 122 14 -52 -78 136 124 -52 82 107 -208 -69 31 -59 162 13
3650 13 -1 -34 119 -55 -86 7 -107 114 33 5 265 17 168 -64 -167 101 71 112 -143 19 144 235 -37
3673 -37 70 -38 -153 101 -96 224 -80 -178 10 -137 -9 202 -50 -312 14 -159 -243 -104 61 -138 207
3694 207 382 337 22 29 155 102 -111 -175 79 139 -113 68 173 -74 260 169 -83 123 98 -167 -131 25 -112
3717 -112 56 -327 -176 -426 -197 56 -37 108 13 153 13 -165 77 -75 43 59 -19 -34 -55 -74 2 -247 124
3740 124 150 -1 -25 78 170 -97 -203 -54 -89 -38 52 -213 178 -117 -35 -68 -326 131 -211 -178 -81 321 39
3763 39 132 -459 46 344 85 -56 170 -13 -68 20 -84 -279 -81 165 38 131 45 45 -213 28 74 173 -39
3786 -39 -61 -2 -215 -4 113 -37 -139 132 -34 -68 -32 -29 -107 -168 142 114 -61 -2 38 14 -218 -244 -130 62 -140
3811a40K15n01K98J16Q3rL2j73J17ro2r0J49o4r8K04rJ2J75m26K33k95L04J52
3835B14l40K10k58N7Q4L66k65k68L52j48j59p6N38j87j59L29o7m02J71k8K62k20
3857Fo5M40m61J89K19j32n41L52k98K05L51j09o7j98Rk9J43Q0L4J40j14Kl37L7
3881a44Q8K07j63J52J21j12j69R6j79n0K81j63j43L56n3j02j45Q0J30j6j99J79
3903E2o4J62k60J07O7K41k32n9M5l02J20J98l91k87P62j77k57L18l7k8K73r8l42
3926a89R9J98l10M33l65N7j39K29K19j60L5r6M3j28Q6J42j95k1J76q1oN2j4n2
3950A3l0o1K41j92j68J27J49j45l8J48q0j71J85P6l6j98M5K1J35J5J11l68L26
3973A05k47l7R0k7K81k36K1k8P5K44l42O8k6j6J21n7KJ03l3K0j28N7p1M8J28j99
$$ plain form
3811 -140 75 -426 -128 -12 71 62 94 -79 38 29 -33 -123 26 -38 -136 68 59 71 246 -180 53 -242 62 214
3835 214 -126 84 -174 -117 -33 333 68 -200 152 4 -155 -231 307 120 -39 290 223 -179 -8 -36 226 6
3857 6 -59 381 -80 109 328 196 -345 7 -291 -86 265 156 89 -109 -100 -129 14 94 128 268 154 156 -181 -144
3881 -144 -56 151 -12 140 261 149 -20 76 -103 -153 128 -35 -178 178 125 23 -122 -42 88 72 -127 52
3903 52 -12 150 -110 -3 64 305 73 14 59 -243 -123 75 -316 -603 159 -18 -275 43 6 -22 251 153 -189
3926 -189 -90 108 -202 231 -134 -77 -216 13 232 72 107 11 54 -74 12 154 -41 -62 114 33 27 79 65 13
3950 13 -17 -78 163 -29 -197 -70 79 -66 -104 44 -36 -207 -22 54 18 -180 -135 -114 21 36 147 -221 105
3973 105 -142 -179 -89 -116 165 -71 -50 -78 -3 241 -101 -33 -59 -75 46 -11 -9 94 61 81 -47 10 -61 -13 115 -84
3999h4q0K90q3J5m9R9j50R0P9O8k40M0J31j97j79N00l76J71l78K23K28p1o9Q6
4023F4l29K72rj80K07j34L50k47J31r0jj01K7k9P9Kj01M43l8m29K01k8j06K4R2
4048G0j90k02J46J26ML45l72q1r4NM8K08m4o6J90O4j73Q1M9n4k36K10m5m9j1K9
4074d2j30K95K5l34P8P7J61k34l8J80m4J36j64O8j12q0M12l92K01p8j17J82l24
4097b74K65j33J44r6K54l21J31j33J1P0j18K19j60j58J02L78jl09O7k0K79m43
4119b46J70R8n6o0R1j65J43r4K4P3N4j40Q2K86l45O9j15J69k71Q8K64J5m5J6o
4144I9j90L79j85Q5l38M08l14L39j12k01K98j44n4m0j56R4J00k17K75k93K17j53
4166a03m5N7J5n1J18k7pJ25J08j15j7l4k36K44n9p0J38M5p0j86M0J50j12J71j71
$$ plain form
3999 -84 -164 126 43 58 9 108 -42 48 127 195 -45 -5 126 -71 -250 250 -126 45 -333 -110 118 47 -22 64
4023 64 -265 7 -2 -182 25 -109 241 -6 125 35 34 -67 -40 -69 10 12 -89 354 316 -113 88 60 -46 -22 70
4048 70 -120 -322 -176 -50 -46 299 -73 -154 -248 -243 -195 13 -31 -97 93 157 -16 65 114 60 -176 34 -11 -60 -71 -42
4074 -42 -172 123 148 -186 -108 -31 130 -104 -142 38 -6 130 -34 34 -78 -158 254 -138 63 -15 -132 50 -274
4097 -274 -9 -142 2 -94 160 -161 -30 -163 -152 -82 -200 19 -141 -299 -197 181 180 -129 -62 -82 197 -246
4119 -246 -76 22 -34 -94 -3 -168 -25 -119 -95 -22 32 -108 -26 260 -85 -16 -131 38 -233 -145 119 134 89 105 99
4144 99 -91 288 103 188 -150 258 -56 283 171 -30 268 124 70 30 -126 -32 68 -149 126 -167 50 -103
4166 -103 -148 -91 -76 -127 -9 -36 -43 82 190 75 58 24 -212 32 -27 -97 41 86 16 -170 -130 20 -92 79 -92
4191i2j51M36j11r3k16K95J25l4j51J38j05L6j02K54l50k9K00M5j6k39J45P1j6
4214D0j55J37j45J05NP8j47K08k1k06r1L87j48j17J57J34k91J61j77j39J66J75
4236A16n8l70L77K9r4j32o8L58p8J4j03J23P6r8r3j57K45L6k68P7p6J50k2r5Q5
4261b6p5MpJ31J61m0j6q7p8JJ6j6Q8M4R2l13K74l22L77k48j23P6K32j09o7j17
4287a48N00l66L8l9P6o6j62J38p9J73Q7r2j60J86n5r2J50L12m64N7J21j52j94
4310b31K06J26O0j82J34j91nK68n5o3l0j35J61n3j87J38J71l87K78O9l60L01r2
4333e9L14o8j72J81j62k73K86j54K50o1l42K32j52K0J29P9K21J0n94N84l38J50
4355H1j37L17l12mJ50r3J57j64K16l68J30j09J40j47J12K60j09l14P6J09J2R4
$$ plain form
4191 -92 -243 193 82 -11 -227 68 193 159 8 146 41 77 -25 229 -121 -150 50 95 79 -160 -15 56 40
4214 40 -115 22 -123 -18 -13 65 -82 126 105 -101 -192 195 47 -70 87 221 -70 91 -86 -225 -59 116
4236 116 58 -312 65 94 0 -132 -200 158 80 94 -9 114 190 92 -1 -158 87 123 -145 -68 -144 6 -16 -111 -26
4261 -26 -101 -97 -104 27 188 148 132 45 -33 -32 -16 -32 56 100 192 -121 153 -169 208 -40 -163 -87 145 36 -31 -148
4287 -148 352 -14 24 -15 61 -5 -167 -29 -108 65 152 60 -100 86 31 -61 89 401 -63 -6 115 -37 -231
4310 -231 -25 101 161 -21 113 -78 -83 185 130 67 37 -98 63 10 -177 -39 132 -255 23 92 -268 33 -59
4333 -59 255 187 15 196 34 -239 47 -107 143 82 -260 -28 -180 -160 -31 48 269 279 -315 269 -69 81
4355 81 -56 261 -51 -55 95 2 159 -5 211 -157 -27 -136 4 -143 -31 229 120 -194 -118 -9 3 97
4377I7K5j84J91k93L21j42J36j95J25l19K93K26j34j74j26K0K27O9j91R6p8O2
4399E2k9k8m7K44k02r0J46o6j06J33j44J76J70m32K68j10M2J36l9L5k21R8r3k1
4423a28J53q1J32k4J6k7M9j35l6o0l7R4JK50l72K55k02J37L1o1J60j48J34Lj27
4448b3L1LJ62l21O5M65l17K53m34M4L14j53l5o5J90j17j2j18m8r1K47r6J7J46
4472A07Q6j75l4K1o7j4P1N2k92K23j7M4j21J5J48P1j82J83j15j06J48Q9j0J07
4496B32k49R0Lo1j43J32Q0M1j51j56N1L74k94J07J1j10L07k43j6k28J70L18m34
4519a69NK30j25P7q0L24k14J1j55K05J1l49J54L45m12J45k09K29P8k83J76K4o5
4542d7k7PQK55l04Q7m7L29j98m9J02j39N0J18m86L91J01j49O7j27k9JQ5L6j79
$$ plain form
4377 97 122 -62 129 -164 157 15 151 -44 81 -238 55 281 147 -27 -153 -133 94 163 -28 68 -10 52
4399 52 23 -5 -52 192 -10 -100 46 -20 -126 7 -137 39 209 -223 45 -65 -23 113 74 109 -112 -14 -107 -128
4423 -128 25 -56 76 52 68 41 90 -45 -81 -141 -178 -84 -83 167 -205 50 -152 -15 16 -45 115 -33 101 104 -23
4448 -23 8 11 173 -148 -83 382 65 318 -116 -72 242 89 54 -11 179 62 50 -68 -116 -207 40 -56 -39 107
4472 107 193 18 -16 5 -62 -76 -5 47 -245 -22 -39 5 -116 -101 47 118 -64 119 4 -102 46 135 125 232
4496 232 -17 73 76 15 -128 4 84 125 -26 -182 -131 243 -51 56 67 -43 264 21 5 -223 -53 265 -169
4519 -169 -164 66 -59 18 -62 262 48 59 -96 109 120 -229 -75 270 -142 3 -206 23 101 -182 -6 18 -47
4542 -47 -74 -67 -59 196 -108 -21 -68 261 63 14 116 -23 27 145 -341 50 151 2 69 -58 -87 -86 -1 35 -144
4567a44J69l6K1k4o7J39j06KK18j42L1p2k05K21j12o0P1O8K67n47M91k92K5K34
4591A50mM4j56k28R6M8n6J68K0n4K21j12j28pN4j96K24J12k79K3K50K62n33L48
4615B67k13M6M3l97L45M1n4q8k9J87m3k32J21R9m1q4m5j26J34j05p0K16j66J27
4639f7p2K73k64J96L4j05o3j77J57J52k02K31L0p0P4j85J17O4q0K51l26P8%O1
4663A07j28J1K0p7J02k28N8L9N5k14M44j99j32J5q4J03J55N9k05l6j22M26K6n09
4687c14J95M40k06j45J27k28j5O4J07qm0K20l57O8K1J74n6L1m7k01P7J77j29K2
4711b3l7l0J04M1n3M3n2k85L75J42m19J13J3k10J71k7m8J0p7J01n2K10J84k76
4735h2PK42j55k16L2l2M0K32j5L9j3j14j20k3K02r2K59r2j30p9j8L00m2km0J64
$$ plain form
4567 -144 25 -11 10 -14 -81 58 -48 -46 172 30 61 -11 -216 5 -107 -167 -96 -28 239 -308 183 -109 -84 150
4591 150 146 190 34 -194 -98 -50 -106 62 82 28 249 137 9 2 56 -140 84 196 -83 -60 190 452 -81 267
4615 267 54 100 143 -254 91 132 78 -10 -39 148 105 -127 -6 93 52 -32 -77 -203 -69 -174 -244 -28 -194 -67
4639 -67 -139 134 -130 66 100 -5 -68 -245 -88 64 -138 93 123 53 127 -58 59 123 43 294 -32 46 46 107
4663 107 -21 -10 10 -67 35 -193 -135 -96 -41 -255 189 -10 -142 -127 -211 -108 47 106 -99 -135 -257 169 195 -314
4687 -314 -119 321 115 -30 97 -131 -146 -82 25 17 -23 197 -160 -92 -71 103 47 78 31 -170 -93 84 -45 -23
4711 -23 -60 -90 14 55 2 45 -7 -292 83 225 -194 -81 -68 -278 -107 -134 -182 -172 -249 -148 -200 10 194 -82
4735 -82 -75 167 12 -204 -172 -204 -164 68 53 92 79 -35 -155 -178 24 -68 191 99 -31 -110 -128 172 130 128 88 252
4761B52j55M4j98R7j03KQ1j28J11P1q6J13j11J85l52K83k58lJ11j33N45l93m3
4784f8J67r9L2k68K98p3L3m7o9J96P4k80J97j37k44L19k14J02J5J16l45K26n3
4807a22J51R0k80RL23l03j33L47Q1j13J2j46K2K13j57J23j59mJ54q8r8J43j69
4830a04M68l19k35J01O3p0J01J0P0M0q9Q0N4l06L43k14j28N3O2J66k15K20l75
4853b24J04J20m0J24K0J14l10l32L59LJ92k24J54q2J06j69J47k13R0L02k90m7
4875i6J50k07K74p9n5o2L3K4J07k07j06K72k08L64k76J36j55K29p5l11L64L4k21
4898g1J64K5n5k40L08j70J28O6M9k02o1o3K02K18k76J48j41J21k01j19K83j2L5
4921A36k9J58m05P2M3Q8P0m2o6j43Q7J32P2l83M2J11q9M33k09Q5o7j61k38M94
$$ plain form
4761 252 97 141 -57 40 -63 -61 20 -108 3 74 -12 101 -10 175 -177 106 -152 -155 -44 -177 368 -25 -68
4784 -68 99 0 32 -236 62 -11 22 -25 -94 102 176 -104 93 -44 -288 31 -183 -81 -66 50 -295 -69 -122
4807 -122 29 119 -161 -152 171 -132 -265 82 163 50 62 -84 -62 151 -6 117 -42 -46 108 20 -78 65 -104
4830 -104 364 45 -190 -89 -26 -96 5 15 85 125 36 116 170 -136 207 -7 -135 -82 -20 146 -69 151 -224
4853 -224 -120 0 -40 84 104 218 -92 -424 -65 -62 130 -94 60 -22 84 -85 62 -151 -61 241 -49 -96
4875 -96 54 -153 121 42 -13 -75 -42 -18 89 -118 -224 48 -160 204 -72 64 -91 138 63 -248 116 150 -71
4898 -71 93 118 63 -177 131 -39 89 155 204 2 -59 -122 80 298 22 170 29 150 -51 -170 113 101 136
4921 136 107 265 -140 -68 -25 63 133 91 25 -118 -31 101 173 -210 -168 -57 -146 287 78 163 96 -65 -303 191
4945A91l07N2J06O1L4k77L12k12L4Q9j72R5P7k47J10R2oL8o9L9l02K56P9kj41
4970g0P9N6j20M7K09j58O8j99J12q5j01K4K46j27J2J41j02N3j90K32p2r5L1L2
4994B3j38R9j41P1K00j69K92m20K69r1LQ7j49k8R3K64k42rO1M5j15r8Q6j22J96
5019F7k21K57k35R2N9j4O9J8j87L47m27K09J73k28j76K53l2l9J31j41n1J98j35
5042a3j35L62k25Q5l4j24J44m10O51k23r7r3K74k75J42j71n3K40k78L90m3m7j05
5065c8J71o9j38j39K40n3J71q3j82J71k32l2J92j07P8K00k19M3K03n11M61j74
5087d7O7k19L34j14q9R5k35L38k21L2Q8n1J32j67J9L4Q0J37k19q3j65K17K43M6
5111B52l01N0m7j5O3J9J14m4n4j83J24j28O9P2L1J22k07n0K58P3j17m00L27j50
$$ plain form
4945 191 -116 -64 42 103 137 -140 172 -40 -6 83 -89 6 83 -164 -54 38 32 70 1 40 -262 -6 73 71 -70
4970 -70 9 65 -55 -8 201 43 111 -88 24 -61 -162 -138 108 -19 -7 134 32 85 -105 127 55 -40 -9 23
4994 23 -115 -16 -157 -86 114 -55 237 -183 86 -5 -2 85 -64 -92 1 265 23 14 75 120 5 -93 -7 -129 67
5019 67 -154 103 -132 -40 19 5 74 92 -95 252 -175 34 207 -21 -197 56 24 -15 116 -25 -76 122 -13
5042 -13 -148 214 -11 74 40 -84 60 -350 301 78 -19 -112 162 -113 29 -142 -195 45 -233 157 114 67 -38
5065 -38 133 64 -74 -213 27 -26 145 62 -120 51 -181 -213 -21 -128 -50 150 -69 -26 177 -334 127 -47
5087 -47 20 -199 135 21 -68 27 -208 130 -91 -59 29 -22 110 -57 -38 -4 76 213 -6 -89 -254 -37 206 252
5111 252 -49 1 -46 -61 2 21 135 91 37 -146 -22 -150 -81 -9 22 144 -63 -113 145 218 101 -299 28 -122
5135a22P8n2J63j48K41l90K79kn4L0K00j55l88N09j09L6j55N3J18J25l42mk5M36
5159C22l87K31k27q5L26r3j60k7j12Q9r1K46l3j52J67l6N0L6k16mJ08M33l29K4
5183H0j06N4j13R5k5KJ98j88J86j10qJ22j71J42k88m4L26p6j77R7Q1L8J6J78l67
5208e8K22l16J5L36j74j34K29M5k37R5J95j83L4J43k45P6j92J91k28o3L06J04
5230A61k8o6k13L16k28j6L25k67Q2j45J38j16O4j6K4J33j74R6j32Nj77K23j61
5253a72K04p4j56L38k36K09k51j37L99m9J3k15p4K84J55k52Oq4K0O9j48L10r1
5276F8K09l9k78K20n0l12J70j08R4kK5J01k20K5o7K47J06j42r0Q3r8j27J06j68
5300b47M68N1k91J12k82K35Q0J29k87O4l5m4K89k76K41j86mK3j96K75j74r6P9
$$ plain form
5135 -122 -44 -96 67 -81 160 -230 49 47 -7 23 223 68 -320 189 80 116 -39 14 132 257 -85 -89 -114 322
5159 322 -65 166 -61 -146 180 87 -73 -100 -212 -123 -214 32 -1 -153 14 -22 28 64 -152 -156 -48 385 56 80
5183 80 -26 28 -85 10 -15 -13 185 -3 183 73 65 187 16 158 -130 -174 152 76 -101 -4 77 115 131 309 -58
5208 -58 164 -152 -137 199 25 -109 120 165 -72 23 218 35 69 212 -33 43 -149 42 -186 -249 57 161
5230 161 133 67 -146 170 -58 -74 251 -16 66 -79 59 -57 7 -9 15 148 -26 70 -62 -57 -234 -11 -172
5253 -172 32 -42 -198 140 -96 113 -138 -275 124 75 88 -127 -201 83 238 -14 -8 -92 -72 -3 -151 159 68
5276 68 277 238 -40 180 130 -182 -12 -120 -26 -28 -3 98 -122 -97 -164 83 189 47 -43 40 -58 -185 -79 -247
5300 -247 221 272 -19 93 -189 46 126 255 -32 32 -3 -47 242 -34 207 21 17 40 -156 119 -55 -151 -72
5323g2K26j88J43r9k99L2M07m06J47J41l1p0K68n5k86M4q4J67K7m3K56j86j01
5346f2RLK01k26L0P9j85J16P6J54k36J74R5k58k4j8K61j97L8o5n2j9J97q7k83
5371b79L94j41j36L90l06J24J50L2m63K87J76l04J29k18J40Q3%M5k59J41m5R9
5393C9Q3k17J43j25L36j94J53o7j18j24mm8R7J1l9J4k80L14j32N3J43Q3j54J37
5417A04M4k50j1j53K41J61k23J70k30k8K74j13j84K40K19m75M9k4L59q4Ln9j73
5440a43lm0J48Q5l96N78k49j31K51j50Q0p5nj50J47p6J68J15k94N6k24K76L03
5463B71l14J09K9M3k8l13K89j75r2K52R7p7k37k1K91N0o09K30J31K15k66J26n9
5486e8K42m34Q9K69j96q1J08J12J7j83j14K45p5r7J94K10k82J89l20N4j1J79j27
$$ plain form
5323 -72 154 -34 109 10 -289 -257 150 -256 -109 32 1 -69 199 144 -142 -98 -182 -15 12 -31 225 39 -62
5346 -62 -53 -50 151 -75 -45 34 -151 -35 41 195 -41 133 228 -30 -54 -72 189 -8 30 -35 -87 -106 91 4 -279
5371 -279 115 -26 -162 228 -78 46 196 228 -235 52 228 -76 53 -165 -25 58 58 103 -156 -15 -60 39
5393 39 122 -95 48 -77 259 65 218 151 33 -91 -95 -143 -46 -35 -74 -60 -340 -26 -158 -105 38 121 -33 104
5417 104 148 -102 -113 -266 -25 136 -87 83 -147 -175 99 -14 -198 42 261 -214 -165 -189 170 86 89 30 -143
5440 -143 -146 -186 -38 47 -349 229 -20 -151 100 -50 30 -45 -50 -200 -53 -129 39 154 -140 -84 -308 -32 271
5463 271 -43 66 95 138 110 -203 86 -89 -181 71 168 91 -146 -167 124 174 -435 -205 -74 141 -125 1 -58
5486 -58 184 -250 -161 108 -88 -169 -61 51 68 -115 -229 16 -59 -156 38 248 -34 155 -165 -111 -122 57 -70
5509g0j76K31J71j53j29or2K18J91k62N9Nm2J54k91J20RJ64k10k3M9K9n4J24j26
5534a10k2K61j87J9p8J03K15r3j64J02j45Q8oJ67j17J4j15J38r0Q2m6K65l79N3
5558d5L0j49K51k09K50k80r2L17J23o4j50j19K30M1j9J05m75r3N07Nr2j99l4L31
5582A70j06j75J50j95J28l4L66k39J52j77j01J50n1Pj50p8J43r7P8L3J2m1p7R6
5606c6j36M7K07j59O6N7l54L77j33J79L2j35o3J80o8j85K78k4O8j40l18J94K2
5629d4L8N6%j7q4J33r1n6J03pM7p1Q9po1J64j51j27p5N7j34K19q6K3J60j09J04
5656G3j10j8j58L43k02M7p9K1J31k18J73o2J55k55L0J82k19L3J00j9L6O0O4j00
5680HM3k36J51J12p5o8N29n52J40j45q4M92m52qJ66J49k72J25l0Q9k79K6J55K82
$$ plain form
5509 -70 -246 -15 156 3 -126 -132 -224 -6 185 -77 -18 -13 -55 99 -192 -72 -63 101 -109 -132 -83 -54 -108 16 -110
5534 -110 -132 129 -58 -39 -117 -14 201 108 -56 46 -99 -11 -17 150 33 47 -68 70 -20 62 16 281 -98 -45
5558 -45 -15 -164 87 -122 128 -152 -244 73 196 132 -18 -137 93 134 115 220 -255 -348 159 164 72 -127 -161 170
5582 170 64 -111 39 -156 -28 -62 304 65 217 40 -61 89 38 45 -105 -183 -40 -137 -59 -26 -14 -55 -132 -36
5606 -36 -172 -125 82 -77 -11 46 -308 69 -64 115 147 12 -51 129 61 -124 154 130 198 58 -260 -66 -44
5629 -44 -6 50 50 33 -51 82 -9 -65 38 31 78 7 96 89 28 192 41 -86 -161 -104 -238 -19 -105 -82 78 -31 73
5656 73 -37 -55 -213 130 -72 -25 -104 -83 48 -170 3 -59 96 -159 -129 53 -166 -133 -33 -52 -16 44 108 8
5680 8 51 -185 -34 78 3 -65 464 -88 52 -93 -177 315 -137 -145 21 170 -102 23 -7 82 -197 -171 -16 266
5704B66k8J3j27j73J47J58j38j37r8LJ78j33l1l1J66L41l99J08j30l5j15L99k14
5727a0j98J51rj84Q7k3K92l00L35j46j12p2K37LJ13l85L19R3O8j91p0M4N5j78
5751h1J47j62R9k8k40L21L8lm48M01m5Q1l9k0J06r6j40L31j82n1J09j35j13K64
5775A14Kj13J05K2j20k51K50k8m9L04k43jN5l36K01K56j0j93K5L9q9J53j33L15
5799B75l12m3j09J46J48l42J29q3K42r0R%p6j18L18O8J64m24J75n6rM3j48L24
5823B31k93K00L5k00J03j50K68k70mo7J06K72l72n3L64r6l51K56m5P1q3K5j9J76
5847A04k78N3L19J2k49K1R4j03j5k5k11K66J65j79J05Q7l9r5P5J42k01Q2j74r9
5871a43K0j3L1l3J51J11o0o6J62n9p4R4j88J29j24K17k90Q9J93j85J52j93K45
$$ plain form
5704 266 238 251 124 -49 98 256 118 -19 -117 -114 64 -69 -100 -131 35 376 -23 85 -45 -80 -195 204 -10
5727 -10 -208 -57 -66 -250 -163 -186 106 -194 141 -5 -117 -189 48 51 164 -221 98 191 259 68 -2 42 97 -81
5751 -81 66 -96 3 -25 -265 56 94 91 -357 44 -1 80 41 21 127 31 -109 222 40 -11 98 -37 -150 114
5775 114 116 3 108 130 10 -241 9 -19 -68 236 -7 -8 47 -289 -88 168 158 -35 -10 29 -60 93 -40 275
5799 275 -37 -80 -189 -43 105 -237 -108 -191 51 -39 -30 -30 -106 -224 94 162 326 -98 77 21 12 55 -93 231
5823 231 -62 138 173 -27 76 -74 194 -76 -80 -147 -41 231 -141 -194 170 74 -277 -21 -66 5 -78 -53 -72 104
5847 104 -174 -121 198 210 -39 -18 76 -27 -42 -67 -278 -12 153 -26 79 166 127 32 107 249 48 130 -44 -143
5871 -143 -123 -136 -105 -138 13 124 64 -2 160 101 27 121 -67 62 -62 155 -135 -46 147 -38 114 -79 166
5894A66k02K13j34k73K71n3J59k2m18J79J9P3J93j72j58K1L18j04r3Lj9l21M86
5917A32j17J79J99k85k10q7K01j64p8J48l5L31j55LM2k21%M0N4J52j25J20J28
5940B52j32j28O9q1m6j01K20p2l9R1J11p8j59J37j11M5nj48L14k04L19k23p3j40
5964a82J61J63k37K30j22J12l37J88P3K18k67j53L64k16J9J2j16L18k90L0K6L3
5986B7j21K15j73j33J57l29N36l32J90J3k2j09j19k07K77p8K86j07R9k04J36p1
6008f9K13j01J50j58oJ88j83J7p9n9l8O3K53R9j79k99K24O6j68J18j07j2M34o54
6032b87K66m1j46K75Pp8j43K04m4j01J18j93J47L46k62n1j15K86l01L54L8m69
6054a90jK24r6o8K31m8j59Q6J60k42J65j25m9L10j24j02l8R6q7J93k18L07k31
$$ plain form
5894 166 -36 177 43 -230 41 -12 147 125 -293 -114 -95 -22 171 -1 -159 -138 180 76 -17 -14 -33 -354 132
5917 132 15 194 393 108 -102 -189 12 -152 -230 -82 -117 214 59 62 104 -117 -117 -77 -23 129 4 124 252
5940 252 120 -8 61 -20 -66 -167 53 -19 -58 33 144 66 -93 44 -67 -22 -27 -175 139 -65 254 31 -42 -182
5964 -182 -21 142 -95 135 13 125 -212 -24 49 267 0 -153 211 -5 14 26 -90 228 -62 -32 -6 27
5986 27 -94 121 -52 -185 -28 -357 179 -153 37 50 28 -81 -200 -407 -130 -208 78 -29 70 -134 2 -69
6008 -69 144 43 193 35 29 217 34 51 -28 -87 -125 -62 191 290 111 -188 36 102 -66 52 -55 -67 367 -287
6032 -287 -21 -62 -208 67 74 -4 -147 57 13 -88 30 -163 -16 330 68 17 -98 188 -113 241 279 -190
6054 -190 -191 33 -63 -131 100 52 -107 -21 139 -103 62 -63 -112 198 74 -28 -66 30 -57 136 -82 225 -6
6077fj34J57P0J47k09K7qL1k8o7J41j9k07OK4P8L6O6p0l4j61J21J40k39K03r9
6103c4J97Rk44J76j74O9n2OkM3J71n78M78J27o4j25K17p1l82M29j85P6o1J22q4
6128F4j55J05N7j88M0K9K8Rm6J13j18J14j83M6K03r9M8J33j61j6M9r2k46K47P9
6153F0k62R2J99k85P2L17j18p2J5RNk36J98j09O2K87j50r4qPO7j25K27N6m61K1
6179b26K82n4p8N0J94m6j16N4p9N6L30n36m4J55R5j72J53Q2l06L9J66n3P3R2J13
6204B24m52m9N67k79K4J68l89J5o9J73j13q2M51l40K39j38K50o9m13J37K53j97
6226h9J31j26M1q9j87N69j45J3k20q6P0K69k51J33m0J89j64j76L33j10J32l32
6248a35K99k13m6o8O8L17l38J05j91K72k8j27J75j63J6j6k8K14K0k19K07j51J00
$$ plain form
6077 -6 -140 17 87 234 25 52 44 75 47 -20 121 102 -105 -99 -75 3 39 105 35 1 -160 -39 101 -138 65 -34
6103 -34 163 172 -72 104 -70 -1 -53 -47 -49 -6 165 -413 65 192 128 3 220 149 -233 196 11 87 26 148 64
6128 64 -91 14 71 -117 -77 -48 -20 -11 -57 56 -62 52 -131 -85 118 19 67 200 39 23 72 -20 -266 -19 60
6153 60 -202 -110 89 -196 -124 193 75 3 18 27 32 -204 -6 -115 -53 234 84 -10 -18 -11 56 -69 158 214 -247 -226
6179 -226 56 2 -76 -26 168 122 6 60 -19 37 367 -169 -213 -58 37 -135 18 100 -206 -167 -1 -54 19 111 224
6204 224 -228 -277 290 11 35 203 -186 -171 -240 -67 -180 -262 189 -151 88 -50 200 131 -282 -145 108 -89
6226 -89 42 -84 -43 -132 -319 250 105 118 -102 -188 -118 151 -100 33 -7 182 18 -158 175 65 197 -135
6248 -135 164 -49 -95 -163 -95 222 -116 -11 -202 70 42 -85 90 -73 -57 -73 -101 113 133 -86 121 -30 70
6271G0m4n4K9n4L5j33P3P1L6P1k75K17k51K87p6j05J96P3r5k61J47o4J29j65N20
6296C77l40k7j3J3K59l97j29L10q6P2O9l6j79Q0j62K66J68l34j11K54Nm4j64m1
6320a90J40K9q7mP8j69K46l9j0J8N3o1m4j5J28K7j78J07N8L0l00J61J14l04K48
6345C6l8J55k65K57M9Mk17K43j61J6j67q0Q9J63k12M06k88m5J78k06J42k19m0
6368b00K61J5k85K39J07k77J63J79l14J59N4k70L07n8k19K46j28m8K7kK19m82
6390c07M07k80L77k71K5K10r8L8k84K66j14J78m02J84R8k73O3J27Q3k45M65j63
6412H4j99J03L2q1L5k31M66J2j52j7lk23L78j34j17J46J45j23k66L37k45N7N2
6435E6r0n8J56k65N60m88n1J96j38Q1L1J3qj82J41J63k42M00l43O2l6K72k68k1
$$ plain form
6271 70 26 -28 1 -53 -18 -151 -78 -7 29 100 -175 42 -209 78 2 -103 93 166 71 -190 -43 -107 22 -143 377
6296 377 37 10 -3 10 269 -128 -257 53 -33 39 108 72 -107 -27 -189 77 245 -89 -200 54 59 15 -149 -190
6320 -190 -50 -21 -108 -112 -34 -203 43 4 -6 12 65 4 -40 -55 73 100 -78 29 87 117 -183 -22 92 -212 36
6345 36 -2 153 -112 145 194 198 -19 224 63 79 -88 -168 -79 84 -128 278 -10 -55 123 -83 59 -160 -200
6368 -200 61 76 -209 30 137 -140 23 202 -112 47 101 -169 138 80 -139 107 -21 -69 -42 -44 175 -307
6390 -307 100 -180 197 -74 -49 161 63 101 -183 83 -31 147 -255 -71 27 -246 -183 -56 27 -218 247 84
6412 84 -115 -12 20 -61 -26 -257 209 221 69 52 49 -174 204 70 -47 99 244 121 -145 192 -53 4 56
6435 56 -34 -92 64 -201 359 -129 -180 16 -122 -41 -10 3 -5 -187 -46 117 -125 275 -68 -6 -42 230 -38 -59
6459e9J23j4p7KP6l3J00j56j43R6K91k34k91M18l89K62J33O8j47L6j78K05k43
6482a54K17j25o6K95q6O7l50J11K69k90P6k88M32l06J67J29m18L84j78m6n7K67
6504E0M9p5j72P2J47j97O4J87l41K07Q6M7j87L2R0J23o2k5j01P0L7j62N5o1P4
6529GKJ36j76j93K32P0m3mj27K7K4J07lRJ00q4j09j26P6N0J33k29j1J58l1L9j86
6556a52J31J06K15k96L5j79J10j8K73l86o2K71N1r3k2K25j66j18K7K09l27J83
6578A7j27Q8J04j05N5j58L73k86K06r7P1m85K77j23O36k22m19L04j27k24J15k5
6600a52K50J9o6N8l52J46K9j78J76J43L0J16m87L46O5k2j15r4J29L39m29p3J03
6623a9K16n7m0k47K36k36K82m8k96Q2Q8J7J87o1k68J36j7N9j47JJ21m7K1O3J03
$$ plain form
6459 -59 64 50 -27 -25 51 18 118 -38 -181 -85 206 -28 -319 99 -290 -28 105 173 26 62 -116 89 -154
6482 -154 63 -62 -128 167 81 148 -202 -91 178 -112 -36 -324 108 -198 -31 98 -320 64 -114 -160 -217 50
6504 50 99 24 -148 -76 71 -126 -62 125 -216 -9 77 124 -63 -31 59 182 120 95 -6 64 101 -61 -6 -67 7
6529 7 9 145 -31 -224 8 78 35 31 -96 -69 -45 62 59 68 168 84 -25 -151 -75 -25 108 -121 -132 26 -5 34 -152
6556 -152 -21 85 300 4 39 -140 -30 -48 225 -161 -223 48 99 6 -16 209 43 -75 -48 161 -166 17
6578 17 -110 -22 82 -23 32 -126 247 -39 167 70 141 -344 -67 -190 446 224 -195 109 -18 -242 -127 -152
6600 -152 98 117 51 109 -243 -97 -68 -246 -70 73 103 219 -268 78 143 121 6 -88 41 380 -49 -122 -19
6623 -19 197 140 100 -147 89 -147 135 87 -209 -127 -39 -22 165 104 -164 -28 -45 14 -133 -132 -11 -58 -37 26 129
6648A29k13J0J85Q0k94K13l7k13K76k07K52j97N4j70J63k03L10j20l20K51J41
6669I0J11k26K11j79k33OL75k41K82k35J89l7k05L5K71j63j38K68l30L41R9k44
6691D7r0J06M3k06M3qK37k23j3J12j39J58k70J03K54j65M2k7K26q5l25K79K5k5
6715I9J41j90q9N6j54K30o7J65mk61k14M94k78j24L48k11R4j81P9J35j34m4K34
6738A24r8K7J31l60K44J66j65J10k55J07m3L5L25l08k16rL15j19J11q2j96J49
6760gJ99j35O2j28M0k3ok05K95j4q8l9N3Nj04K97m57L06l85L35j16k7N8rP9l7
6786e1R3J69k98J08J10j83L8Kl7p1M16K1m72J43L00l02j50K07j74N9p4K47k87
6809a86KK59J86k87p4R6J2J40m2k56J07J59LK0j15ol4K9J09k25K45k34j6o4J25
$$ plain form
6648 129 -84 -74 111 191 -103 110 73 -140 136 -71 181 -16 38 -132 31 -172 138 18 -302 -51 90
6669 90 201 -25 186 7 -226 -220 155 -86 196 -39 150 113 -92 -57 214 51 -87 181 -149 192 291 47
6691 47 -43 63 106 -100 -57 -65 172 -51 -64 48 -91 67 -203 -100 154 -11 31 4 230 145 -180 99 124 99
6715 99 240 50 -39 17 -137 93 26 191 187 -74 -288 206 -72 -196 152 -59 35 -146 -67 68 -66 -110 124
6738 124 26 53 184 -176 68 234 69 179 -76 31 -12 23 348 40 -176 -185 130 11 122 40 -156 -7
6760 -7 192 57 119 -9 31 8 2 -203 92 78 -10 -49 4 9 -95 202 -255 51 -334 1 -115 -142 -84 -93 -14 -51
6786 -51 42 211 -87 21 131 -52 -14 -12 -49 -120 296 317 -155 -12 288 -14 -164 43 -131 -72 -146 101 -186
6809 -186 -184 75 261 -26 -100 -4 8 148 106 -150 -43 116 119 139 24 18 -16 13 122 -103 142 -92 -108 -172 -47
6834d7L57j61k7p1o6o0J73k83N9R7n0K7j14K32J27j51M2j25P4j42O5J83m22N45
6858B62j52M2r2j4j86J50K13q3k39J73j7P5j4j33N9q4q0j61K00j6J84J54j35j90
6882h4J53k12L56J6k15Q9J95j64k49M2L01j20j60K78m07K87k39m3J60q7O8qJ01
6905E8J84k84K2p6J26k19M05k46l2M29l46l4j91M31n97K67j07M48j57k79J87P9
6927F8m2q4m3J23j3R8j06O7Jnp6K11k40p1R7j25J48j56K32J15j16l5j88j01J21
6952a20J95N4j11L8j79J42j29L2j67P5L40l92J51J65j09l8K16j07j32j18L13r1
6974B8p6J45k7K05r6J53l54o5K60j70k60L74n4K2p7o1L7Qk8%K5q0O5j91n5mJ50
7001a26K08j91L19j78m9P6Rm2o8K97l69j10L75j98K3O7o2j33K91j94P1r9K16j28
$$ plain form
6834 -47 310 149 122 51 -15 -75 98 -185 -126 -29 -79 -52 -166 66 193 42 84 -41 33 -109 -44 139 -283 262
6858 262 110 152 60 46 -140 10 223 140 -99 74 57 132 118 -15 44 -40 -120 -281 -81 -97 87 241 106 -84
6882 -84 69 -143 213 229 14 103 298 134 -115 -73 228 108 -52 226 -181 106 -133 -176 -16 -103 -35 -43 58
6905 58 242 -42 -20 -96 30 -189 216 -30 -62 367 21 -13 -204 227 -370 -103 -210 238 81 -198 -11 68
6927 68 26 -58 -101 22 9 107 1 68 69 64 -12 199 -41 -112 -15 -140 8 -148 84 199 83 48 -140 -241 -120
6952 -120 75 129 18 56 -123 19 -110 -78 -245 -170 170 -222 -71 94 -15 -53 163 56 -76 -194 119 28
6974 28 -48 97 70 275 179 332 -22 -87 173 3 -257 117 63 85 8 -53 -16 -8 -36 -36 -11 -91 -26 -217 -272 -276 -126
7001 -126 82 -109 210 32 -17 59 68 26 -42 255 -114 -224 151 -47 -24 43 -19 -152 139 -55 16 -83 133 5
7025Ej34J12P5O9k71j1o3P1L0K28j53J31k07j38M7K96q3K13l46J54O5k47R7j08
7049a68Q8O9O4j02p7J07j64M41l06m4J34Jl17jL8J59J72j42K4L0l6j10R7K04l91
7074b30J06K85k48j27J51l8P7QL5k74J26mN1J51k53o5L09k1j34M2Q4J3j60J43
7098B7q1J95N8j93pR9k68K06K09m30K88J49l41K53k13J51j43j28K41K4k01L16
7120B11k66o1n5K47jj27L3m3m1L64r7j15n4L9k16N9J20k8l9J10n0J31n69L56J38
7145D6r2K25k37j05K06m6j38K40k49L23j71m1l0r9K11L7lj61J74J5o4O5l95L87
7169I8j38M7n8p2K66k45K85L8j59J43k72K8j2L2J28q1n3p3J8Nl02Q4K48K56j47
7194F4l09R5K39j15j14L0K08k66K43J0j16j60L36k62J07k88L01RN9r2P6j99M2
$$ plain form
7025 5 -129 -17 58 127 -144 -155 -218 -147 -117 111 -42 89 -118 -256 -209 87 4 217 -129 25 90 -157 -60 -168
7049 -168 -80 -11 53 -49 -126 -19 -183 258 -48 -92 42 43 -274 -275 -237 -78 94 -48 -24 6 -30 -140 -43 161 -230
7074 -230 -124 161 -87 -214 -63 -101 -24 -16 19 -255 -129 -133 -82 69 -184 -249 60 39 -95 -53 31 44 -116 27
7098 27 -54 141 199 6 -1 98 -170 36 245 -185 103 252 -89 164 -49 102 -41 -169 72 96 -105 211
7120 211 -55 -116 -171 76 75 -52 -19 -62 -103 261 164 49 -5 34 -182 -123 -3 -31 -70 40 -10 121 -448 -92 46
7145 46 -46 179 -58 -163 43 -3 -141 99 -150 173 2 -39 -69 -168 43 80 77 -84 90 105 41 106 -289 98
7169 98 -40 7 -51 -123 143 -102 183 221 62 205 -67 -39 -51 -19 109 28 -25 -98 -80 -75 -377 -293 -45 211 64
7194 64 -245 -150 89 -26 -140 -110 98 -168 75 85 -31 -191 145 -117 -10 -298 3 12 71 -21 55 -144 -102
7217a02K15LP4k04R4k53J90j31oj16K79j9r9J24k02J63J41P1j85j68r9J85k56
7240c01L48M8j85L19k71N5K7L2m9j34N42k05k22M2J1J68l64jj9J67k41K37J03
7263A07j71K75l07K87m06K24Mn2J83r4k18K81j68j12P4j07K36j23j32K78M0m4
7285E5j19k13L70j02J16j03O1j53K39l62J72n3K3j23l1K64J77j26m6k03L28m0
7307A31j05j62P5LJ43K8k3n8o3J41j03k08R4J12k5j99K22P9k37K97j87k7N4j60
7331a78J11J61m02J92K43l11J35K08k3k66J19p7k73L11j16J27K08l64K66k60K44
7352E5N5l4o4R6l11J98N9j24K06K4k62M8J82l73O3L6L3L6L91m93N40k51k32N5
7376f7J38k02M2J39M7k78O9O3OJ88j39J82m55L15p4M7j63N2J70j61J09r4M1K51
$$ plain form
7217 -102 113 116 190 -14 80 -173 17 -114 -120 -236 43 24 -75 49 -153 10 151 222 37 -131 -230 -45 -301
7240 -301 47 95 -90 229 -42 13 40 72 23 -111 431 226 4 46 57 225 -139 -140 -159 8 -233 4 107
7263 107 -64 211 -96 191 -215 9 13 -39 144 50 -168 113 -55 -167 -93 -200 36 -87 -219 59 99 55
7285 55 -64 -277 93 -9 107 4 65 -88 151 -211 -39 -92 -69 -192 -223 41 218 92 46 -157 171 131
7307 131 26 -136 -61 -58 85 113 90 32 -31 110 7 -201 -107 5 -20 -219 3 82 -155 142 -45 -72 -18 -178
7331 -178 -67 94 -308 -116 127 -184 -49 159 136 -130 -11 -88 -361 -50 -166 -39 169 -195 71 -189 55
7352 55 110 76 12 108 -203 -5 54 -70 136 160 -102 -54 128 -245 -182 -146 -113 -77 314 -179 361 110 -122 -67
7376 -67 71 -131 -89 50 97 -181 -112 -49 -43 145 6 188 -267 48 -26 21 -142 -90 80 -81 28 -66 -25 226
7400B26Ql45K15p2l31K34%L87l72p4J36p8mJ6k56N14l28K11J01p6l71j5K26l4
7424h2J31l6o4R4PM3j69K4j65L06q5Rj53K21j90r5M2L58l01J07J2j51K41j7o1
7449B6r8j37K57J02J51k06J31j51J2j74lO1kJ9oN1k59j00O43m18o0K31k8R5k56
7474a19J32o2r3k2J97m4J19k50L09k84rK79k79P7p6L8j42L54j25l2J36J01j6j95
7498fK93l80K66R1k69K07Oj29r1k9J86j18K48j59j38K93k89p7L24l76o8K25k0
7521a0n9j3J49M2L9l62K87j09L05j98k6J29k13K24j50M3qk27J48M7q2J3j17J38
7545a0L2J87q6j03%K8l44K55K1J18j22j06L7kL05l22J81j61L5J67k63L20k8j67
7569b8l6k3K9J9J25l5p7O2k8j7l3J06k45J84J14o7l15K32l0MjK06m17M87q8j6
$$ plain form
7400 226 234 -111 104 32 -299 -65 -65 322 -50 -124 12 -66 -70 -54 -310 204 -124 87 188 112 -259 -274 -48 -82
7424 -82 49 13 -51 43 50 93 -76 -52 -217 89 4 13 -140 81 -109 -204 -162 196 -105 2 14 -137 104 87 26
7449 26 -72 -209 48 150 301 95 226 75 87 -87 -90 -29 -31 -12 -18 33 -226 -326 317 -101 -161 70 42 137 -119
7474 -119 13 -49 -142 -164 33 -11 108 -142 167 -117 -126 153 -126 -49 -125 -87 -229 125 0 -32 104 205 189 -6
7498 -6 287 -93 173 264 -5 202 208 79 -12 -41 145 27 275 116 -22 271 -18 -95 229 -147 -215 10 -10
7521 -10 -69 -82 67 109 148 -214 73 -36 269 71 45 174 -39 185 35 78 70 -157 -9 38 -44 -31 -148 -10
7545 -10 22 209 123 20 20 48 -296 -41 -20 98 -24 -130 -93 -95 210 -112 69 -92 -57 110 -153 167 139 -28
7569 -28 -64 -87 -58 -39 86 51 -26 36 8 -9 -42 64 -181 3 117 50 -265 -33 -63 -59 -60 146 -271 216 128 112
7595A12j40r7j74R3K11j92L09j03m8N4P1l40R9J07J97l5q8l18J65P6j30J52oJ52
7619A27j25rj9L7n4M4M1R5j06m5n8r3L30N5m07K2l1K17j16J63J88k07O4k9j16
7644c2K4R3j58j41K95R0k42K9J24J35j45k20K22K19j76j26j30K58k63K6l9N05
7666C48k97M0q8kj80J00K33K0j11o8o4J04K01k77M0J75k07p4J53l6O3p0q6O6r3
7691a10J47j23rJ25j22K61j78J21k87L41k51R4p9j34K05K54l18N6k6K4q4n4K53
7714A06L0k00kJ17k03K46j77J74k02L27j31j2p0k05M00q1j97J15r8K93l31P6m4
7737f9q4M56p3n2j71L9P6J35j94J11j35l2L1j53K72q2j01K37k02J1j36J34r1l5
7761a08P7O9p8j59P1l6N2M8k6K9j83L35L9Q7k12N6l02K53Q4l57N7L85J35k64P6
$$ plain form
7595 112 -28 -125 -299 -206 5 -187 122 19 -29 25 96 -244 -145 -38 159 124 36 -282 -117 -41 -171 -19 -25 127
7619 127 2 -7 -26 11 -43 1 42 137 31 -14 -72 -165 165 220 -187 -165 -196 21 -95 68 256 49 113 84 -32
7644 -32 -8 85 -73 -214 81 171 -71 -42 82 217 72 -148 74 293 117 -9 -139 119 -144 -118 -157 348
7666 348 51 91 3 1 -179 -79 154 174 63 -5 -69 35 236 -41 -1 174 -33 -107 46 10 73 3 -83 -17 -110
7691 -110 37 -86 -95 30 -92 169 -9 112 -175 166 -85 9 -70 -204 1 255 -63 -7 -33 -9 -93 -147 106
7714 106 136 -64 -66 51 -152 94 -83 91 -111 216 85 73 3 -202 198 117 -80 35 -63 230 -101 -25 -69
7737 -69 -153 303 230 178 7 46 122 257 63 174 39 7 38 -115 157 75 -26 211 9 20 -116 18 -73 -108
7761 -108 -31 38 -40 -199 -128 -164 -112 -64 -90 -61 -244 91 130 217 5 61 -241 12 96 -261 -204 181 316 52 128
7786A28j40J15j17N7k49L03M9K6l03o8K09j18J66J30j49Q7k16K83k24NJ00j74
7808a00J38j76N9j22K12p1O8j65L1L54k0k90K87q4k29J42q4k33L50j72J96p5L11
7831C27j27m30M65K1k27k14K6L55j22Pj48k17K89P0J40k80j70M52l34pL6Q3P3
7854F8l32J94K0L7m4j45L9J78j66K61k00K18n6j04pO3r6J65Kk46J18M5j26J14
7878@J70m5P3m6m15nM36k44P3j64K47p0J06p7m0l3N3J79k37O6j89J47J16J37k75
7903c7J18k42J91n8r5N4R5j80P7K12k78M34l00J62j21m6M4r2K18j2J60n31o4M11
7927A20r2q2q9Q2J87k30K13j98K00k46L04k72K04k26M3Q8k7K5q6J75J8k20J57
7950D8n5Rk29J23J29j29j21J85J94j80j11M20k78j25L52l77K98j04k02L24k86
$$ plain form
7786 128 -12 103 -14 43 -206 97 146 172 -131 -199 10 -108 58 188 39 126 -90 193 -31 -26 74 -100
7808 -100 38 -138 -79 -201 11 -60 8 -157 -126 228 208 -82 205 121 -108 34 -50 -283 67 -105 91 16 327
7831 327 200 -230 235 256 29 -185 -159 196 74 81 -67 -284 5 75 215 -65 -235 217 -117 -124 -88 -5 68
7854 68 -264 -70 -50 -13 -57 -202 -163 15 -151 110 -90 128 72 -32 -39 24 -72 93 95 -151 -33 12 -114 0
7878 0 170 125 198 152 -263 -268 168 -76 -3 -167 80 10 116 39 -1 -34 19 198 -39 27 -162 -15 101 238 -37
7903 -37 81 -161 30 -28 -123 -69 26 -154 -77 135 -143 291 -9 153 32 -14 30 -62 156 144 304 -227 -291 120
7927 120 28 -54 -143 -61 126 -104 109 -89 111 -135 169 -103 101 -125 -82 6 -21 4 -82 93 111 -109 48
7950 48 -7 2 -227 -104 25 -104 -225 -40 154 -26 -137 283 5 -120 232 -145 153 49 -153 171 -115
7971a15K73P0k54J38j4J77q5j67K82l69N9L18l07K14l71O1l1n5K10l92O05k39
7993HLN3L9p9%M7Q5L2l02J39j07K36m13K62O8l27L57j50J12j04o2M9N7N7q3r5
8019a18JK02r3p5j12O3J7P8k54L53%k57J24K45l20J37J4R5J28k94K63M2k08j46
8043a15J45j59O2P7R2j28J11J26l64J58n8j35K28j33Q4r6K19n9J97k88Q8N2j40
8066c6K85l99K28j21K50j87l7J3j24J75mk52J50K60j67j5p3K20o4k13o7J59J95
8089A76k37K73k88O3M54m55j45J24K57l59J70k2k19K3N4J8J69Q1k24J51Q4j87
8111c9Q9k46J06R8k24K8J47J02k11J77M6Rj29j7J23R5l12k2L90r1mr5J7J52q4
8136A05J19j22k20K91K1r1J51m31K99k69P1M7J04j15j46L87r3j70J38qm41L36
$$ plain form
7971 -115 158 228 -26 112 98 275 190 23 305 -64 -5 313 6 220 -151 -90 -121 -176 34 -358 247 8
7993 8 11 64 103 24 24 71 156 188 -114 25 -82 154 -259 3 71 -256 101 -49 63 -41 -103 -54 3 60 -23 -118
8019 -118 -117 85 -8 -83 -195 -132 -115 -37 -291 62 62 -195 -71 174 -146 -9 5 100 228 -66 197 239 31 -115
8043 -115 30 -129 -67 10 102 -26 85 211 -153 5 -53 -188 40 -93 -9 -105 114 55 252 -36 52 104 -36
8066 -36 249 -150 78 -43 207 20 -17 -4 -128 47 43 -209 -59 201 34 19 -54 166 102 -111 -178 -19 176
8089 176 -61 212 -76 -13 441 -14 -159 -35 222 -137 33 11 -208 -185 -131 -113 56 137 -87 64 148 -39
8111 -39 50 -196 -90 8 -216 -188 -41 61 -150 27 73 82 -47 -64 59 154 -158 -180 210 119 115 20 37 189 105
8136 105 224 102 -118 173 194 103 254 -177 122 -147 -76 -29 75 -40 -186 201 108 -62 76 68 -373 -37
8158c7j8R2J65j92j15K93n8R8k02k35j82N43l83J45J22j35J94j61K92k54j1j37
8180a76P7J61q7J01q1j50K14k15L3L5N0
$$ plain form
8158 -37 -55 37 202 10 -105 188 130 228 26 -209 -391 152 -231 -86 36 -99 95 -66 226 -28 -39 -176
8180 -176 -99 62 -25 76 -5 -155 59 -156 -123 -88 -38
8191c8
$$ Imaginary data points
##PAGE= N=2
##DATA TABLE= (X++(I..I)), XYDATA
0@%%%%%%%%%%%%%%%%qJ6j6J6j6K4l2L2m0M8n2O0p2Q1q9J04j20J36j53J75j98K22
38A18k50K79l11L46l85M29m75N24n77O35p00P73q53R40j036J142j259J391j540
57h09J708j902K128k393K709l097L585m222N092o356Q411j2539L9375o3701K6065
72e946L9425n6744N5257m3133o015N0564m9475M96K6400k3375K7279k0249j1046
85a6562K3637j5545M695L643j0317Q760j2259J4523J514j5471J8615j0053K246
98b574J1649l0990J9542M182j8554K4251k1815L124L1771l9282J0884J8182k6269
111a5899K3253o766j4559K3447j6228N782P707k2979K1803L342j3283J3917j2141
124b604k10J3203j1758j088J574K627K460p651N795J052J739N468j5754L456Q646
$$ plain form
0 0 0 0 0 0 0 0 0 0 0 0 0 0 0 0 0 0 -8 8 -8 8 -8 16 -16 16 -24 24 -28 32 -40 41 -48 56 -64 72 -81 94 -104 118
38 118 -132 147 -164 182 -203 226 -249 275 -302 333 -367 406 -447 493 -543 599 -660 731 -809
57 -809 899 -1003 1125 -1268 1441 -1656 1929 -2293 2799 -3557 4854 -7685 31690 -32011 -5946
72 -5946 33479 -23265 31992 -11141 -17156 33408 -16067 -15571 10829 -12546 14733 -5516 -16562
85 -16562 7075 -8470 -3775 -132 -10449 -1689 -13948 575 2089 -13382 5233 -4820 -2574
98 -2574 9075 -21915 -2373 1809 -16745 7506 -14309 -11185 20586 -18696 -7812 10370 -15899
111 -15899 7354 588 -13971 9476 -6752 -970 6737 -16242 5561 8903 -4380 9537 -2604
124 -2604 -2814 10389 -1369 -2457 -883 1744 4204 -3447 2348 3400 5139 10607 -5147 -1691 6955
139F955n751O436r042j837J5861j1804j711O796p301R146m1q645M286l957R09
154C00j062o188P309J212j397j592o103O632K184k330k18q921O119L391o937Q934
170A333m145k561Q977j0227K547O849m927Q135p161p494J0692m875K125K627q717
185f822J0166J577p106M009m440M644K929j0348M009J142l0N374p421K244M480
200D407m299L986n055oQ566p500j38J053n103R592k213o486O406k050L313K090
216F563q632L867n43k662M588n533L602N725p486K366j962j378Q776n547l675
231a931K814l243M715k257m458N170k434J656K26o030P733j9n906L965o108J255
247d852P032p586J958L838k461M384n151l127O518j816K017j541n230P462j599
$$ plain form
139 6955 1204 7640 -1402 -3239 12622 818 -893 5903 -1398 7748 7707 -938 3348 -609 300
154 300 -762 -6950 359 1571 174 -1418 -7521 -889 1295 -1035 -1253 -10174 -4055 -664 -7601 1333
170 1333 -2812 -5373 3604 -6623 -4076 2773 -2154 5981 -1180 -8674 2018 -2857 -732 1895 -6822
185 -6822 3344 4921 -2185 1824 -2616 2028 4957 -5391 -1382 -240 -270 5104 -2317 -73 4407
200 4407 108 4094 -961 -967 7599 99 -39 1014 -4089 5503 3290 -3196 3210 1160 4473 6563
216 6563 -2069 1798 1255 -1407 3181 -2352 1250 6975 -511 1855 -107 -1485 7291 1744 -1931
231 -1931 883 -2360 2355 98 -4360 810 -1624 32 258 -5772 1961 1942 -3964 1 -6107 -4852
247 -4852 2180 -5406 -3448 390 -2071 2313 -2838 -5965 553 -1263 754 -787 -6017 1445 -154
262a54l323M263l003K863L363o702J948K426j325J580l827p62K762Q5K469l422
278g59K22N192l918j70j00l097N825n33m451L296j164J752J020m535L202J309
294C091p08J752m645Q92M046m295L59K28j229M857j630l134J503k78J312j129
310I92l517J859L64J51l24k725K725J746l334j80n02M09L134k201j903N57k96
327c045J175r20j304K913J479j126r14j484J110K181j839j383J065O89J458j23
343f8j901J735J744q55j155j099K212K121j659j305K21L72J857j049p12J830O17
360B906K6j689j608J354Q10k2j446q48K965M49j637M41j115J669J178l515P78
377F96J244o52J620k470j896L780n94k27l84j930L035p64k812J000j212R80J116
$$ plain form
262 -154 -3477 786 -2217 646 4009 -2693 -745 1681 356 1936 -1891 -2653 109 194 2663 -759
278 -759 -537 4655 737 567 467 -2630 3195 2662 -1789 1507 343 2095 3115 -1420 1782 3091
294 3091 2383 4135 -510 382 4428 133 492 720 -509 4348 2718 -416 1087 809 2121 992
310 992 -2525 -666 -302 -151 -475 -3200 -475 1271 -2063 -2243 -2745 -2336 798 -1403 -3306 -2749 -3045
327 -3045 -1870 -2790 -4094 -1181 298 -828 -1742 -3226 -2116 65 -1774 -3157 -2092 -1403 55 -68
343 -68 -1969 -234 1510 655 -500 -1599 613 2734 1075 -230 -9 363 2220 1171 459 2289 2906
360 2906 2932 1243 -365 989 1799 1777 331 -517 2448 2897 1260 1701 586 2255 3433 -82 696
377 696 1940 1288 2908 438 -1458 2322 1728 1501 1117 -813 2222 1458 -1354 -354 -1566 -586 530
394E30l270J147J371p1L86k542p79K532l10n87p80J58J876r13j178R28K35J530
412B63k31k172J370N40l70P97k627M57L127j620J93M12m64K789j736j941J649
429D36n36J586J27k794K012P72n87R43k395J169K774k659k38K42j121K672j972
446D31j819K235o37J393n18k336K468l77p92Q48l374K704J012k573J756j188K8
463g39K776l343QJ612j538K588k431j971L570k100O92J28k864M365p78k498K636
480A13k673J454J321l862K515r6k42K674l521R91K518k503K314j721j143M039
496B178k228k09R58k055L129p38k066K534j289J791L19l744K597O7q40J655k850
513g91J692K000k313J262j216l67K617k464L53J67q36K403j751j733K210r32Q04
$$ plain form
394 530 -2740 -1593 -222 -293 93 -2449 -3228 -696 -1006 -1593 -2373 -2215 -339 -1252 -2430 -1502 -1267 263
412 263 32 -2140 -770 -230 -600 197 -2430 -1973 1154 -466 -273 139 -325 2464 728 -1213 436
429 436 -100 1486 1613 -1181 831 1603 1016 1959 -436 733 3507 848 610 852 -269 2403 431
446 431 -1388 847 210 1603 1085 -1251 1217 840 48 896 -2478 226 1238 -1335 421 -767 -739
463 -739 2037 -1306 -1298 314 -1224 1364 -1067 -3038 532 -1568 -876 -748 -3612 753 -25 -2523 113
480 113 -2560 -1106 215 -3647 -1132 -1228 -1470 1204 -2317 -1326 1192 -1311 1003 -718 -1861 2178
496 2178 -50 -259 699 -1356 1773 1035 -1031 1503 214 2005 2324 -1420 1177 1244 404 2059 -791
513 -791 901 2901 588 1850 634 267 2884 420 773 940 104 2507 756 -977 1233 301 1105
530A105j41j931J862J81q93q9j523J697O48j949R56q38R32J220k617P34J85l26
548g87R38j783J71J263l45R0j416N0J814r18J42l28q33J991j086q37M07l61J838
567A0o25o88J214q47J120J05k339K352J9o53R31k012J937J001j868J033j160O76
585B06J982k319O69O73j407K191k013q02K474j010R86n84j526K782j494p89J094
602A113k118K169O01k296J435j201J025J063k724R83P82j181J606k073M7J789
618A020k075P36k92r43K826j782o12J400j743J470J53k292J856n63M6J290k472
635a977J164J025j592J302j292J57J956j872L48K36o28J917j325o87J762j003
651e09J303j73j445J436n35k15M11j162J606P41j323M42n06K88Q05j384K75J051
$$ plain form
530 1105 964 -967 895 1076 183 94 -1429 268 916 -1033 -77 -915 17 1237 -1380 -646 -461 -787
548 -787 151 -1632 -1461 -198 -543 -453 -1869 -1819 -5 -923 -781 -1109 -1942 49 -1037 -1874 -1467 -1828 10
567 10 -615 -1303 -89 -936 184 289 -2050 302 321 -332 599 -1413 524 1525 -343 690 -470 206
585 206 2188 -131 538 1211 -196 1995 -18 -820 1654 644 1630 1046 -480 2302 808 19 1113
602 1113 -1005 1164 1765 -531 904 -297 728 1791 -933 50 832 -349 1257 -816 -769 1020
618 1020 -1055 -319 -611 -1554 1272 -510 -1122 278 -1465 5 158 -2134 -278 -841 -795 495 -1977
635 -1977 -813 212 -1380 -78 -1370 -1213 743 -1129 -781 -545 -1173 744 -581 -1268 494 -509
651 -509 794 621 -824 612 77 -138 273 -889 717 1458 135 577 71 359 1164 -220 55 1106
669A106m59O24q97o08J360k62k50m5n14J112m85n35K32m51R57j77q30J33J33J26
689B70K99q35m4L79m9j70K0k74M81j12o33m52M66M82n0k40k04L63j2n44M0k75
711a094P89L39r57J36O97j85K97p07l28J126l96j40J89m66J000O5n14j8k16Q74
731D91L6q44M90K36j17K96q41K77N95O8p0l68o7R00o47Q9l05M8R50o74o24N44
753D63j98N59k87o75P07o3m64N80q94K52Q56j180L46l17J58Q79j028QJ11k74M80
774A9k91q70R83J35j41J5r00P29K33n39J86n15M72K51p81J34K34K05N63r51j64
795i93Q34l49M69p3p76J069l41n19M87j84Q31m8p71M16lK4O96r53J18R25o94K52
817D17m21K68N11l12K42l33j45N86r2o18J1M81L19k70q96N23K47M7P5o12L04l6
$$ plain form
669 1106 647 1271 374 -234 1126 864 614 569 55 1167 682 147 379 -72 885 708 -122 11 144 270
689 270 569 -266 -310 69 20 -150 -130 -404 77 -35 -668 -1120 -654 -172 -222 -462 -666 -303 -315 -859 -819 -1094
711 -1094 -305 34 -923 -787 -90 -275 22 -685 -1013 113 -283 -423 -234 -700 300 365 -149 -167 -383 491
731 491 527 -317 173 409 292 588 -253 24 619 687 617 249 182 1082 435 524 219 267 1217 543 -81 463
753 463 265 824 537 -138 569 506 42 622 -272 -20 836 -344 2 -315 -157 722 -306 -298 -187 -461 19
774 19 -272 -1142 -159 -24 -165 -150 -1050 -321 -88 -627 -441 -956 -484 -233 -1014 -880 -646 -441 122 -829 -993
795 -993 -159 -508 -39 -112 -888 181 -160 -679 -192 -376 455 407 -364 52 49 73 769 -184 -66 859 165 417
817 417 -4 264 775 463 705 372 227 813 721 103 114 595 914 644 -252 271 518 565 640 28 332 296
839B96l6o1k33k2N83r1p46L5K98l6K86j15l83K58r9l49j77Q3L92J26n21J50P8
862b84J79J36p95K22K97K4j47j28L19K01j21l45m3Q5N76r5n35J44J72M61k32n08
884d17M75Jl8L20p69O66L83m97J83l06O8M08n33K02L07k50L16k03p85R64l40L66
906E21k04n78P17J29n50Q3l06M51K31n02K01nj49J65m31K34K88m44P01o71p24
927h43J331o30r8J78p26O71r9l86K63j86M74N31j062R1L03m19N00n15P6L46j89
948c89mj22R7O81m77J0J17j98N75j38l27L60m92N63r8o95R35P9k61l4j39QM98
971E49m65L9P3L76J3k72m3L5J12K1k83j86J36J34L3k29K13o8K08k24k74J65M08
994D71k33l44P7j34K59m3p9l1O2K45k34m07K02J21J28j44m37J70L28p2j52l61
$$ plain form
839 296 260 199 -34 -56 527 436 -310 -275 23 -13 273 158 -225 33 -66 -415 -592 -509 -117 9 -512 -362 -284
862 -284 -105 31 -764 -542 -245 -221 -368 -496 -177 24 -97 -442 -485 -400 176 81 -454 -310 -138 323 91 -417
884 -417 58 59 21 341 -428 238 621 124 307 1 69 477 -56 146 453 203 519 316 -469 495 155 521
906 521 317 -261 456 585 35 118 -188 263 494 -8 193 188 39 204 -227 7 295 -149 552 -119 -843
927 -843 488 -142 -240 -62 -788 -117 -216 -602 -339 -525 -51 480 -582 -491 -188 -607 -107 -622 -546 -200 -389
948 -389 -393 -515 -418 263 -214 -204 -87 -285 290 152 -175 185 -307 256 158 -537 398 477 216 182 43 51 549
971 549 84 123 196 572 585 313 270 305 417 438 155 -31 105 239 272 43 256 188 396 172 -102 63 471
994 471 238 -106 -29 -163 96 53 -26 -57 5 250 16 -391 -189 -68 60 -84 -521 -351 -23 -95 -247 -608
1016f08N32J7l99j7k5K18R7L7k96O92n75Q1R1o81R64k9k08pm23L19K63j20Q4l36
1040c29K91L07k35k24P5L15J52n46N4M82k67R5J77l63M79j81O0P5m57O35k71n65
1062b41N65k06J34K50p17L87K10k60N3k97j6M13j51j50J96k25L06k57l48N44k15
1083b5K52m06j8P1K65l16rr9J88K85m77kJ70J27k2o71L77K6R5k0k06n8J84J88
1107a01j38j36J31j6K59j11j97K07P0J62k1l77K12K89k46J31m38J51K33Jq9J56
1129A32K80k48Nk68L39L4K88m90l45M09K18j20j71n6J84N6j28O8j40K42M4m82
1151a49k0L43r8j54pq9L78r9j30pj08K89k29j87J22j70K45K19j72l46L03J4K60
1174B08o13J72J59j45n8j47k9L72J0m4r0p4J63Kk54Q0J74K97Q3k75l02J99J2M24
$$ plain form
1016 -608 -76 -59 -458 -475 -500 -282 -185 -148 -444 248 -327 -246 -155 -836 128 99 -109 -116 -539 -220 43 -77 7 -329
1040 -329 -38 269 34 -190 -115 200 352 -194 -140 342 75 170 347 -16 463 282 342 417 -40 595 324 -241
1062 -241 324 118 252 502 -215 172 382 122 175 -122 -138 275 124 -26 170 -55 251 -6 -354 190 -25
1083 -25 227 -179 -197 -126 139 -177 -186 -285 -97 188 -289 -291 -121 6 -16 -687 -310 -284 -189 -209 -415 -473 -289 -101
1107 -101 -239 -375 -244 -260 -1 -112 -309 -102 -32 130 109 -268 -56 233 -13 118 -320 -169 64 65 -24 132
1129 132 412 164 169 -99 240 274 562 72 -273 136 354 234 63 7 191 247 119 187 47 289 333 -149
1151 -149 -169 174 76 -78 -85 -174 204 105 -25 -32 -140 149 -80 -267 -145 -315 -70 149 -23 -369 -66 -52 208
1174 208 -405 -233 -74 -219 -277 -424 -453 -81 -71 -115 -205 -279 -116 -114 -368 -288 -114 183 266 -9 -311 -112 -100 324
1198C24n23O5M30o2n9l55N51j42J77n70M95p4J55k34k07L02p7o8j70K8Q9JJ04
1221A80l7j02RJ71k05p9O8qJ49r5j94j56J92J94j64j20K1P8M00n78r5M83k98j81
1245c67K26R2j77J26j44k53M28j6k95O2K61j53J71k14j06K56j56L49l70n0r3M63
1267D0l8n6j58N4K70l10R6J55j90J11K13l77J79J03J70j00k35J19J87N5j37j39
1289A2J19J14j42L7L3R1L06o54n6M24K10j78n02M01K09l79k10J40J3L35o0j14
1311A49k87O9L3J11n14K45K95k67J78q4m3J33jjj55k60M90j06r2j6k5L38j27l45
1335b82Q4O7j27K32m26M65J88m04J51m1R9J3j12J16k05k9M45m01P3P1k35N48j28
1358A62l64N81k76K70k10j67M10l67n0L21l84M68J41n01J49l6j55P15n77k72L99
$$ plain form
1198 324 -199 -134 296 234 175 -180 371 229 406 -164 331 257 412 178 -29 273 196 128 -42 -14 75 76 180
1221 180 143 41 50 221 16 -63 5 -3 146 51 -143 -299 -107 87 -77 -197 -176 -98 302 -276 -371 112 -186 -367
1245 -367 -141 -49 -226 -100 -244 -497 -69 -85 -380 -318 -57 -210 -39 -253 -359 -103 -259 90 -280 -330 -423 40
1267 40 2 -54 -212 -158 112 -198 -102 53 -137 -26 187 -190 -11 92 262 162 -73 46 233 288 151 12
1289 12 131 245 103 140 173 264 570 -84 -140 284 494 316 -186 215 424 45 -165 -25 -12 323 263 149
1311 149 -138 -69 -36 75 -439 -194 101 -166 12 -72 -115 18 17 16 -139 -399 91 -15 -107 -123 -148 190 63 -282
1335 -282 -198 -131 -258 -26 -452 13 201 -203 -52 -93 6 19 -93 23 -182 -211 234 -167 -94 -23 -258 290 162
1358 162 -202 379 103 373 163 -4 406 39 -11 310 -74 394 535 34 183 147 -8 707 130 -142 257
1379B57m6K02l57J13n5k1J09M9k96J82l62J15J6j26M39j57l42P2q8L48M0m49J99
1402a58R7j04J5n6Q3J32k89K6k36M20J7M8k75J56l16N14m50j31K76M1J84j20j69
1425b95J77J65L2j47J39J0J26m32J93J76n6J45j68K1j3K03L41p26J35J68k8k7
1447A39J08k75O24m34j6L3k14L77k40k73N44k60j5Q3j94K42j91j69K37l45L63
1468A24M9n50N83k54JK51j07l28r8K23L72p57K98K26J11k72n9j71J19K96l99K86
1490e6j80L39O7m44J58j49K52n2j35J21O9O6p1l2k04K55K57Jk74j08K10L3j06
1513A7N5k38L84j55N7R0k12L2J79n1O0j1j54P1j27L58l0k00J34k2m09N0R3k3J26
1538G4P7L3m6k26J66j48K78p6j43K3j71J51k10J65J4P6j48o1q9R2K48k70Q7j45
$$ plain form
1379 257 211 413 56 169 114 93 202 251 -45 137 -225 -110 -94 -220 219 62 -280 -208 -296 52 92 -357 -158
1402 -158 -61 -165 -150 -206 -123 9 -280 -254 -490 -70 -53 -5 -280 -124 -440 74 -376 -507 -231 -190 -6 -126 -295
1425 -295 -118 47 79 -68 71 81 207 -225 -32 144 88 233 65 86 73 276 617 -109 26 194 166 139
1447 139 247 -28 596 162 146 179 -35 342 102 -171 373 113 98 181 -13 229 38 -131 106 -239 124
1468 124 173 -377 206 -48 -47 204 97 -231 -329 -106 266 -491 -193 33 144 -128 -187 -358 -239 57 -342 -56
1490 -56 -236 103 170 -274 -116 -265 -13 -65 -200 -79 -10 56 -15 -47 -251 4 261 262 -12 -120 90 123 17
1513 17 72 -166 218 63 120 210 -2 30 209 158 218 207 53 124 -3 355 325 125 259 237 -172 -122 -29 -52 74
1538 74 151 184 138 -88 78 -70 208 132 -11 12 -159 -8 -218 -53 -39 37 -111 -172 -261 -169 79 -191 -104 -249
1562b49J89j51k03O6K56J29l39J49j08K46j1j69J27j55L75k23j22M0KL11l9k37
1584a16K34q2%Q8l02K25L9Q0j00K09k04O0R7k43K4K40J09k18J57p2J00k12R8k17
1608fK24j16o9K82j89k4K51k44k96J13K28Ok74J08K35rj01k51P6J54l13J47J15
1631D7J06q0k28ko8j06K26j7j90K77j72n2j33o7K10J19j42J74l6K11q7k8k07K76
1655C1p5J74j24k83K22K76j17k6l54O09q1k58j27K65j10L96l96l6M3M7M16j57
1677C35j90j40J4k9L3R5L7J52j5k86R7J90o9k62Q8q6O5K24n8m64K03j5J02P0k11
1702a20mJ89j86l6m7P1j19J0j53Q8J78j93l4P7L25M7k20j10j32J15K31rj62j05
1726b99K16M21o09K78nr4M54m23j55P1K0M01j44j77OK65k62ok3L65l6k96K79q9
$$ plain form
1562 -249 -60 -211 -414 -348 -92 37 -302 -153 -261 -15 -26 -195 -68 -223 152 -71 -193 -153 -151 160 121 -116
1584 -116 118 36 36 124 -178 47 86 166 66 275 71 131 228 -15 9 249 358 140 297 225 325 113 211 -6
1608 -6 218 102 33 315 126 102 353 109 -187 -74 154 160 -114 -6 229 220 119 -132 -56 98 -215 -68 47
1631 47 153 73 -155 -157 -225 -331 -105 -122 -312 -35 -207 -259 -392 -459 -249 -130 -272 -98 -134 77 -10 -38 -245 31
1655 31 -44 130 6 -277 -55 221 104 78 -276 333 252 -6 -133 132 22 418 22 -14 29 76 492 335
1677 335 145 5 19 -10 23 118 155 307 292 6 103 293 224 -38 50 -36 29 253 195 -269 -66 -81 21 91 -120
1702 -120 -124 65 -121 -157 -204 -133 -252 -242 -395 -307 -129 -322 -356 -279 46 93 -127 -237 -369 -254 -23 -32 -194 -299
1726 -299 -83 338 -271 7 2 -92 362 -61 -216 -145 -125 276 132 -45 -39 226 -36 -42 -65 300 264 -32 247 158
1750A58j32J16j27J9K3K16j48J95q2M0p6j66m9n7J49K61n14K55P5J85O0o91J69
1773a21j39J48n7Q4L9l2j84K94k7K66k72o6j02p7R9n8m7Q6j8J68j38N5q1K04j8
1798Fk29M6p8L99k15j55K84r6rN2j68mK94Q5Lo1j71k10K95n5l3L1J32m8K18m1
1824B72k17M09m70k59L25j02J36j8N8o0J19N3n59L22K36l0k6l95J92Q0K96m86
1846a24J52L4q4J63o7P5k20oJ70k34k23L96k7m15K55l9K21k20J43p0k49K15o0
1869b14N9k58J40J28Q3l34L94j15j88M17l75L25K00k82R5r7k61L42J27j70K2K23
1891B61k00J65k89K55j27J22j70P4J41q9m2J48j48r6M34l87K5R2j45r0Q0L1J39
1914A84o7N8j53L5r6K66j25l09J0L49m17L46q3p0L2J33j23J50J46k49J9l31J34
$$ plain form
1750 158 26 142 15 34 57 273 125 320 238 278 202 36 -13 -70 79 340 -174 81 156 341 401 -290 -121
1773 -121 -260 -112 -169 -85 -46 -78 -262 32 5 271 -1 -67 -169 -246 -147 -205 -252 -166 -184 -16 -154 -99 -180 24 6
1798 6 -223 -177 -255 144 -71 -226 58 -38 -47 5 -163 -167 127 212 215 154 -17 -227 68 13 -20 11 143 95 313 272
1824 272 55 464 -6 -265 60 -42 94 76 134 74 193 246 -313 9 245 215 189 -206 -14 66 362 -124
1846 -124 28 62 -22 141 74 149 -71 -77 93 -141 -364 32 5 -410 -155 -194 27 -193 -50 -120 -369 -154 -214
1869 -214 -155 -413 -273 -145 -62 -396 -2 -117 -305 112 -263 62 262 -20 75 -22 -283 59 186 16 38 261
1891 261 61 226 -63 192 65 187 17 91 232 143 101 249 101 5 439 52 77 169 24 -66 14 45 184
1914 184 117 175 22 57 -39 227 102 -207 -197 152 -265 81 -2 -72 -40 93 -30 120 266 17 36 -295 -161
1937a61k1J48J4Rm7o8J54j32j19J97n7jj92K48n2J04l0p2jP5k2r4k6j33J54P8
1963d7k65L51l88J81J94J5N2K2P2j24J83k56K21k04p5L39j63J00j35rm8L3J26
1986A75j60o7R2Q3K19l76P7r4K33J44m5j79j74j95M4N1K38j4n5rq2J8J51m39J55
2011b09j3P6j42O5J66q7R0j12K47l66J59rj56J66r1K09K3l48kK91k2J73j89k02
2035b83J57J24K44j74p2J34l30J43k06K61J46k43j8j10M54j8j95J94k34J03J08
2056A85K33k54k38K66J25l3q0J06q9l91J62J05ON1k20lj65Q7K23k27L59o4j59
2079a5j4O7q9LJ13k41J97O5L7J05m37m2q8K65J39K0j43o6M33m89j43K58j41K04
2103bJ58l59L43j81k53J36j7J32Q6O7K4j65O9K2kr5m6K17q8J06l18Q3L72J5l38
$$ plain form
1937 -161 -182 -34 -20 -11 -58 -126 28 -104 -223 -26 -83 -84 -276 -28 -80 24 -6 -78 -79 -4 -26 -120 -146 -279 -125 -47
1963 -47 -312 39 -349 -168 26 41 93 115 187 63 246 -10 211 7 -68 271 108 208 73 64 16 49 175
1986 175 15 -52 40 123 342 -34 43 -51 182 326 281 102 -72 -267 -223 -172 66 52 -3 -12 -94 -76 75 -364 -209
2011 -209 -222 -146 -288 -223 -57 -144 -54 -166 81 -285 -126 -135 -291 -125 -216 -7 16 -332 -334 -43 -65 108 -81 -283
2035 -283 -126 -2 242 68 -4 130 -200 -57 -263 -2 144 -99 -117 -227 227 209 14 208 -26 77 185
2056 185 418 164 -74 192 317 284 204 310 221 -170 -8 97 103 154 -66 -69 -234 -147 76 -151 208 144 -15
2079 -15 -29 38 -51 -48 65 -176 21 86 123 228 -209 -251 -339 -74 65 85 -58 -124 309 -180 -323 -65 -206 -2
2103 -2 156 -203 140 -41 -294 -158 -175 -43 43 110 134 -31 38 60 58 -37 -83 134 46 152 -166 -83 289 304 -34
2128c4j2J77Oj06L6j53O1L02j11j99k4J97J34j46n6j18L5M7L3O0j29l0J06nk85
2153b14J89k08J85Mk26J50Q6k02J11K18j15j36J49Pj79J51o3k82L54j19R9j79
2175b20O8j58K80j05K49J08k57J09q3j21J36O5J75j07m54L31jK11k10N3J86lj96
2198E6j49p9L63j4j41M0k2l2L01j62k05R3O8K20j92k78J15O4l0J75k51K09j19
2221C0K31k49NJ20q3j68J10r2J11J13k17J06K57k48k43j5K20R5k56j67K19j33
2243b54K07j56R7J15j40J32N1j65j40P0m7J78%j48K51q4l9j73J66L62m85m6kM52
2267B02j66p4nJ76k05J91k16N8K18j91p9J61l3Q3n1j30M4j2p1L39k7J8k2kk38
2292c2k51K40J72J5n9J11j63J65M5j85j2q2J69M9l80K08k37K18k60K51L1m6k24
$$ plain form
2128 -34 -46 131 137 31 67 -86 -25 277 166 -33 -57 140 274 128 72 -46 -11 36 69 129 0 -30 76 71 -214
2153 -214 -25 -233 -48 -44 -270 -120 -34 -236 -125 93 -22 -158 -9 -2 -181 -30 -93 -375 -21 -140 -41 -220
2175 -220 -152 -310 -30 -135 114 222 -35 74 -9 -130 6 71 246 139 -315 16 15 226 16 69 255 252 56
2198 56 -93 -172 191 177 36 76 54 22 323 161 -44 49 117 337 145 -133 -18 46 16 191 -60 149 30
2221 30 261 12 17 137 54 -114 -4 -96 15 128 -89 17 274 26 -217 -232 -12 83 -173 -340 -121 -254
2243 -254 -47 -203 -106 9 -131 1 52 -113 -253 -183 -230 -52 -52 -200 51 -33 -72 -245 -79 283 -202 -248 -250 202
2267 202 36 -38 -43 133 -72 119 -97 -39 179 -12 -91 70 37 120 69 -61 -17 -29 -100 239 212 230 208 206 -32
2292 -32 -283 -43 129 144 85 196 33 198 243 58 46 -36 133 182 -198 10 -227 -9 -269 -18 13 -33 -257
2315b57K11k9j89K17l43J52J80nJ69n63L35j11Q1m9P3q1R4J19j84p9K13J04k56
2338a98J68r7K14L3O3j13k9k73M08k95K83l22K64J20j89L4P8J5l41L07p5Jq4K03
2362A75J3k6k04k1M0N5pJ18J26k34K2Q4j6j68N1K3K1m5q9Ml1J53q6M0r5j5J65
2389E3r8l56L99J30k97P8L1O6m4k93R6K63j08J28j04j44J97M1j78J31L4j67J35
2412gl5lM5mQ6j08pj82K2N16j97P8r7k37L22k14L81p8K2j65j12J64j13o8J58l26
2438a59L57l1j10R1k13P7J50J8j45J35k89K22K2j19K6j56N2Q5j24KK88j15j13
2461d9k5KK8N2j01J61j28J03j3j19Q1k6m6j42K5M3L09k21m8J25j06J89l73J03
2485a76j4j07O12o06M8L51r2Jj89K66j48L38k35r3m9P8J45k53J00K1j09K96j97
$$ plain form
2315 -257 -46 -75 -264 -47 -390 -238 -58 -63 106 -457 -122 -233 -152 -201 -128 -209 -115 4 -180 -259 -46 58 -198
2338 -198 -30 -127 87 120 183 70 41 -232 176 -119 164 -158 106 226 37 71 149 164 -177 130 55 56 -28 175
2362 175 188 162 -42 -63 -23 32 25 143 269 35 57 141 125 -43 8 31 52 7 -82 -78 -109 44 -42 -2 -97 -112 53
2389 53 -45 -401 -2 128 -169 -91 -60 6 -38 -331 -235 28 -80 48 -56 -200 -3 38 -140 -9 25 -142 -7
2412 -7 -42 -45 0 -4 82 -26 -33 -215 -193 323 126 204 107 -130 192 -22 359 281 303 138 26 190 77 9 167 -159
2438 -159 198 167 57 148 -65 12 162 180 35 170 -119 103 125 6 32 -124 -72 13 -111 -109 179 64 -49
2461 -49 -74 -72 -44 8 -93 68 -60 43 30 -89 -8 -34 -80 -222 -197 -154 155 -66 -114 11 -95 94 -279 -176
2485 -176 -190 -297 315 -291 -243 108 16 17 -172 94 -54 284 49 -44 -93 -15 130 -123 -23 -2 -111 185 -12
2508a2J59k7K19j59K3k37K57j19lj51J74J54k70J41k76K37j66K69j89j27K75j2
2530A60K30l74p9J33k61m1L31k74J6N1j09K16l2j31j4J14k64K30J0K34l38k7j12
2553c31J44K61o6j16j66L82l05N2q3K55P1Q7m14J99J58j08L01j88j04j01J98J1
2575A37k73L05P0p8j38K3K7k08j30O09j40j13l4o8L8K61m8l48K42J1k8J05l4M3
2599B31k83P6j12P1J61k66J46J21k9k59L49j40Rq2q2J08K30k68o8J18p6j81l6
2622b62Q1K37j43P1r1J08l74n6L80K5q7J34l60K24J37k00J65p3m6J0L01ln2j39
2646a3J36j89J78o0OK20k74R8M8o8l2ooRJ14j31o4L15l31j07K82k65n0L00j60
2671e0J00J6J4J25k74K64j50j72J91K0O1j60J29j42o3QP5L26m02j4j1o8L02l9
$$ plain form
2508 -12 147 120 339 180 203 -34 223 104 101 -50 124 278 8 149 -127 110 -56 213 24 -103 172 160
2530 160 390 16 -63 70 -191 -232 99 -175 -159 -108 -217 -1 -33 -164 -178 -64 -328 -98 -88 146 -192 -219 -331
2553 -331 -187 74 8 -108 -274 108 -197 -145 -228 27 98 185 -229 -30 128 20 321 133 29 -72 126 137
2575 137 -136 169 239 161 23 46 73 -135 -265 344 204 91 57 -11 27 288 240 -108 134 145 117 222 188 231
2599 231 -52 24 -88 -17 144 -122 24 145 116 -143 206 66 75 -7 -89 19 249 -19 -87 31 -45 -226 -262
2622 -262 -181 56 -87 -16 -107 1 -373 -429 -49 -24 -111 23 -337 -113 24 -176 -11 -84 -130 -120 181 178 126 -13
2646 -13 123 -66 112 52 58 278 4 102 150 82 50 44 38 47 161 30 -34 281 -50 -157 125 -140 -190 110 -50
2671 -50 50 66 80 205 -69 195 45 -127 64 84 145 -15 114 -28 -91 -83 -8 318 -84 -98 -109 -177 125 86
2695H6m07K04J27K06k57o0j44r2K37N6K5l3L3M1K37l33l5K58j48N3J27l07K17
2718I1l13M24q6j35J62j7k92K67j02k82K66J41k28QK78q1j60L71l04J86j84o1
2740e1J38P9k6j88J75K14M3j84l08J05o1j6K89l62L39l85K38Q7L4l98K62k03M6
2763a33j60L54J7l78R7M52p6j25n2j26k8L2k36J59K34j86J53L7j64k82L93j24
2785a42k8N8n7p0J13K2K82j18k5k36L40q6j75P2j6j3J36K28j65j56r2L1j29L92
2809A66o2J30l57K02L04l57J07p2Pj7p5K35j81PJ21m6J66j84o2k6J88m25O7O5
2833i9q2L14p7p0M9Pj36J12P2r5p0J13j21j11N2j33K03p1N2J29%k09O2j71K56
2858b4k16J35K2Q3r0L32m20J48j80J54Rj11J58N1j59M1K77k33J07J35j19j26p
$$ plain form
2695 86 -321 -117 10 216 -41 -101 -245 -337 -100 -44 -19 -52 -19 22 259 -74 -109 149 1 54 181 -126 91
2718 91 -222 202 116 -19 143 126 -166 101 -1 -283 -17 124 -104 -96 182 101 -59 312 8 194 10 -51
2740 -51 87 166 140 -48 127 341 384 200 -108 -3 -64 -80 209 -153 186 -199 39 126 160 -238 24 -179 -133
2763 -133 -293 61 78 -300 -203 249 173 48 -4 -130 -158 -126 -362 -203 31 -155 -2 35 -129 -411 -18 -142
2785 -142 -170 -112 -169 -239 -126 -104 178 60 35 -201 139 53 -122 -50 -66 -79 57 285 120 -36 -128 -97 -226 166
2809 166 104 234 -123 79 383 26 133 61 68 51 -24 211 30 37 158 112 278 94 32 6 194 -231 -164 -99
2833 -99 -181 133 56 -14 35 42 -94 18 90 -5 -75 38 -83 -194 -142 -275 -72 -143 -91 38 38 -171 -109 -280 -24
2858 -24 -240 -105 -83 0 -90 242 -178 -30 -210 -56 -47 -158 0 51 -108 -67 210 -23 84 219 100 -26 -33
2881c3J80j22K13l79K62p2p0J5Q3K6J2P3R6p1M5j32o7K3j03J98k15m7L58k26j4
2906C3q3N7q2K6K70n2l2k14j72K21K67j25j0o6m52N68k60Q5J27Pk70k8L82m6k43
2931i2L17k51p5J94o1m7J7J23k31K20O1j08k07k6j2Q4J72J4k85R4J36M5n8j72
2955a48Q2L28j60J20m26K98q6k19J78L9J75k01R5J58l48J95mo7K04l13J54k48
2977a94L46Q4j57N0k29L8L4J76l01n0N02m70J74j4M4Q0j7j31k34J37J83j90m8
3000a87K93j57J0j41O0n0j44L65k1j25j0K42K4l63k7L50K1l54O5K10P4N5r5K90
3024C85l17k79K59o3K3j73L40k47%J18J13k12J70j32K1P7P2p9J48j80K31M1m25
3047a09L54k82k2R0MO5Q3j79l6j32J47K24k69K7J32l12R7q1M7mJ42k5M1j22O0
$$ plain form
2881 -33 147 25 238 -141 121 49 -21 -6 77 103 115 188 284 213 258 126 59 82 -21 177 -38 -85 273 47 33
2906 33 -50 7 -75 -49 221 169 137 -77 -249 -28 239 114 104 38 -414 154 -106 -21 106 113 -157 -185 197 151 -92
2931 -92 225 -26 -101 93 32 -15 2 125 -106 114 175 67 -140 -166 -178 -94 78 92 -193 -99 37 82 24 -148
2955 -148 -66 262 102 222 -204 94 8 -211 -33 6 181 -20 75 233 -115 80 76 9 213 -100 54 -194
2977 -194 152 236 79 129 -100 -62 -28 148 -153 -203 299 -171 3 -11 33 113 96 -35 -269 -132 51 -139 -187
3000 -187 106 -51 -41 -182 -122 -172 -316 49 28 -97 -107 135 159 -204 -231 119 140 -214 -149 61 135 190 95 385
3024 385 68 -211 48 -15 8 -165 175 -72 -72 46 159 -53 117 -15 6 83 155 76 224 44 275 316 -109
3047 -109 245 -37 -59 31 35 100 183 4 -32 -164 -17 207 -62 -35 97 -215 -118 -199 -152 -156 -14 -39 2 -120 -60
3072f0J33k75P5J91j05j4q2K98J1k26N5r2J5j19J48J06j34o3K14L4j58L74j38
3095A88m19K42K84l62Q4m2l9J60j94R9J14L0j78m0L6j90N53k81n7J29Nj00O8j95
3119a05N15k25p1k85j1M00k28RM5j15K89l84J98K1j38N1p9K47l31J97r1J21j42
3142a12J67J66l82o0K00j62j2N8K02k3J99k29n4j33L3L49k31r3K50k24O8O6j03
3165f0J36N3j82K21j91P3j41Q4J7K40m04O1J58K0r0Kp4J52q5K52m59L10j4q7J4
3190FP6J02k12Q0Q7j76M0J13k6j13nJ39oj2j16K73k32l8Q7J12m40J93M6J02L0
3215A10j12J22j27o4j7O3l04M29n0N1j14O5jL5l14L01k3Rj67J31j29J94k9J38
3239A97n10K43J39r5N2J16l79J66l6J13j24Q5J2j45L26n0p4j23n8L20j33K2K22
$$ plain form
3072 -60 73 -202 -127 64 -41 -55 -137 161 172 -54 1 -91 -76 -195 -47 59 -75 -138 76 110 -48 326 188
3095 188 -231 11 295 -67 17 -25 -64 96 -98 1 115 145 -33 -73 -37 -227 326 45 -12 117 122 22 90 -105
3119 -105 410 185 114 -171 -182 218 -10 -1 44 -71 218 -166 32 53 -85 -34 -113 134 -197 0 -91 30 -112
3142 -112 55 221 -161 -221 -21 -183 -195 -137 65 42 241 12 -42 -175 -142 207 -24 -117 133 -91 -23 43 -60
3165 -60 76 129 -53 168 -23 50 -91 -7 10 250 -154 -93 65 85 -5 -3 -77 75 -10 242 -217 93 79 -8 6
3190 6 82 184 -28 52 139 -37 3 116 90 -23 -28 111 105 93 -23 250 18 -20 67 179 -261 -68 -22 80 110
3215 110 -2 120 -7 -71 -88 -25 -329 100 50 101 -13 52 51 86 -228 73 50 59 -108 23 -106 88 59 197
3239 197 -313 -70 69 -26 26 142 -237 -71 -107 6 -118 -33 -21 -166 160 110 36 -87 -145 175 42 64 286
3262B86m52L55k53P5R6k8k49K45o0R4R1k08k2Q6j9J30k10j8k5j30R1O1k2R8O2
3287G4L6k9r5J0r1PO9O7q6l7L1L75n78L7R9N7j97J48j8R9N7m0l4O2K22m50K40
3314C5J8q9o9J10J44j56m6J21o8J38j58K1J09k10R5m9M68m80J73j13J92r0k98
3337b02J05Q0rK4J7J24J49K9j95l3k95J54j65P8K93p7j75J73J22k59qL0R3j7P1
3362A07j46j48K1L33j96J65j58o9J25k63K43l12L37r9J44p2J12o1o9J4j23L28
3384B13k72O8J59o5k0P2j47j03MJ85J3K06k18J07j71R4n7k3j44r2J24j3K8K02
3408A50p5K5k07R6R1j74M03l09K34j65r5ML45k31j98k37N11m83P99r71K80R3p3
3431a87j14J41K38l24M14O2m52o2L76j45j70L92l82J63L9k1L20j91m5o9J41j0
$$ plain form
3262 286 -166 189 -64 11 107 79 -170 75 15 109 200 -8 -30 56 37 167 -43 -61 -86 -216 -125 -64 -86 12 74
3287 74 110 81 -14 -4 -95 -88 -19 48 -38 -75 -44 331 -247 -210 -111 -54 -251 -103 -121 -22 35 -5 -39 23 245 -205 35
3314 35 53 -36 -105 5 149 -7 -53 68 0 138 -20 1 110 -100 -5 -54 414 -66 107 -6 186 96 -202
3337 -202 -97 -17 -26 -2 15 139 288 317 122 89 -206 -52 -217 -139 154 77 -98 75 197 -62 -70 -40 53 36 107
3362 107 -39 -187 -166 167 -29 136 -22 -91 34 -229 14 -298 39 -60 84 12 124 63 -6 8 -115 213
3384 213 -59 9 168 103 83 155 8 -95 -91 94 107 313 95 202 31 125 68 45 -99 -191 -67 -80 -52 150
3408 150 75 100 -107 -11 80 -94 309 0 234 69 -26 -22 323 92 -106 -343 168 -315 484 -487 -207 -114 -187
3431 -187 -301 -160 78 -246 168 230 -222 -284 92 -53 -223 169 -213 -50 -11 -32 288 97 52 -17 124 114
3453A14k07J87j67RJ39p4l3N5j04j30K48r8L1q4J85k09J60J48o4k29J90l7n5J3
3477a2l8P4J02j30n0j02J72J42k14K24K64n36L5O3K05j57m57L62L66J8m50k04
3499c23K39R9k06J75J54j89q6K10n0Mr9O2j68O8J29N1j24k5j68L25j29L6K87r1
3523A81k15J96J9l3k9l01K40j59J68Q4J04l98L40m5j38K47j26nj57k55L50j51
3545h3j6O3j96L7L30l6k28L32l30M14l19l44J25j96P38R5j53po6lp02Q51l26J97
3569A77m61l8N60j88q0J5rK31j25j85J73k6R1j96J45o7K69l77J9j23L9J72p7M
3593e7J87kj74q8J95j65o6L82j33j78LN4Q7j51P4m8K33j55P9p0j18J3j26M26J9
3618B21m01J78N2Q3p1J3PO4j63j91K10k12K42R8ok64J33q2K10L1M5l62L06j97
$$ plain form
3453 114 -93 94 -73 -64 75 1 -32 23 -81 -211 37 -61 -30 -114 71 -138 22 170 106 -123 67 30 -25 -12
3477 -12 -50 24 126 -4 -54 -156 16 158 -56 168 432 -104 -69 -6 199 42 -415 -53 313 331 -119 -323
3499 -323 -84 15 -191 -16 138 -51 -137 73 23 27 -72 -10 -178 -110 19 70 -54 -79 -247 78 -51 -15 272 181
3523 181 -34 162 181 148 119 -182 58 -101 67 151 255 -143 197 152 14 261 135 130 -27 -282 68 -83
3545 -83 -99 -36 -232 -195 135 99 -129 203 -127 287 -32 -376 -251 -447 291 386 233 226 160 157 -545 306 -20 177
3569 177 -284 -322 238 50 -30 -15 -24 207 82 -103 70 44 135 -61 84 17 286 -91 -72 -195 -156 16 -61 -57
3593 -57 130 128 -46 -134 61 -104 -170 212 79 -99 -96 -42 45 -106 -32 -80 153 -2 77 7 -111 -98 -224 202 221
3618 221 -180 -2 50 133 62 75 82 146 -17 -208 2 -210 32 130 124 -140 -7 -89 121 152 197 -165 141 -56
3642e6l6j67K58L6j50J79k43K46j2j41J49j39K78j32j89M47m46J92l0p7R3j93
3664a33j8P6j88K53j36L1N0L2k0j24K10Q8j90L7P3j75Q5PJ79k13M54k09j75P1
3688F5j22J13j58M20j15P1J30n56l0R4j22L1M88j69j99J64pPr5k05J3rK95l82
3712b78M48j0m24K08j23J59Q3p1j88j9J73o3R3K8J67l53J50l4J91k07k2j5J61
3735E4q5j59J75J4l4j46J07J42k77K53k0O0k20J39o8j39j64K01j7K37k20L26j09
3758E0J30k41K87j89j43L72j7k28L09k54k73q1K79k51n3K52J76o40O84k68O2n9
3780i6Q8L2k19j07K11K42k83J81j85K40j85j52J13K50j25k17K05j14K30J20m30
3801b01J1J39R9J9j54m1J62j20J80o7R4n7k00k4M13j71k10j0J54q6r1Q4J44l28
$$ plain form
3642 -56 -92 -259 -1 35 -115 64 -179 67 55 -86 63 -76 202 70 -119 328 -118 74 44 -33 60 -133
3664 -133 -151 -75 -263 -10 -146 -115 -65 -33 -53 -177 33 121 -69 -32 41 -134 -49 -42 137 -76 378 169 -6 65
3688 65 -57 56 -102 318 203 274 404 -152 -182 -88 -210 -179 309 140 -59 105 98 105 10 -195 -182 -191 104 -278
3712 -278 170 160 -264 -56 -179 -20 63 -8 -196 -215 -42 -105 -12 16 183 -170 -20 -54 137 -70 -92 -107 54
3735 54 -31 -190 -15 -1 -35 -181 -74 68 -209 44 24 84 -136 3 -65 -204 -368 -167 -184 53 -167 159 50
3758 50 180 -61 226 37 -106 266 249 21 330 76 -197 -278 1 -250 -303 -51 125 -515 169 -99 -37 -96
3780 -96 -8 24 -195 -302 -91 151 -132 49 -136 104 -81 -233 -120 130 5 -212 -7 -121 109 229 -201
3801 -201 -190 -51 48 67 -87 -128 34 -86 94 27 121 64 -136 -160 253 82 -128 -138 16 -70 -161 -77 67 -261
3825b61KM19j35m7J62k09j6M5j52L43o2k50K21K4k07j28J90K02j68J14k23N2q9
3848a73M20l00O3N9j00o8P6P0L11p33L81On3P7l31J50K62K15n06J15J76q6J76
3871B07l23r7J74KJ45j51J91l06L85j53J14m31L56k70K19oj89M52m11n3Q7N2J33
3894A27Qn6j82P1Q8p3j5j89J54m7J26k36L00r9K3L32n04R6P4p4r9k2N69n45J49
3919b4J13p9j28M24l07q2l8J27N1K1R0k90j2J37J94l78P3K34l9J82k09m0J52m55
3943b83L82K9k67J36k2J93k99J27j02P6J69l99L47k21L01m71L31O7J79l05l1l
3965f6LJ16j7j08n0M5P2j92J52K62j42Q7n6j76j31J34K79q2nj07M5k93N3J63Q1
3990F7k25K66r1Pn0J7n2P3k42N2Q8nJ56P7j8q6L2k38K67K4l30K57J03j71P1K9
$$ plain form
3825 -261 -259 160 25 -22 140 -69 -85 -40 -192 151 89 -161 60 84 -123 -251 -61 141 -27 87 -136 -84 -173
3848 -173 247 -53 10 69 -31 -99 -23 47 358 -375 6 12 -41 36 -295 -145 117 332 -174 -59 117 31 207
3871 207 -116 -213 -39 -37 108 -43 148 -158 227 74 188 -243 113 -157 62 56 -133 319 -92 -145 -58 -6 127
3894 127 135 79 -103 -32 56 -17 -32 -221 -67 -114 12 -224 76 -23 0 332 -172 -76 -2 -76 -175 -197 372 -173 -24
3919 -24 89 10 -118 306 -1 -83 -121 6 57 78 168 -122 -134 3 197 -181 -108 126 87 269 60 20 172 -283
3943 -283 99 128 -139 -3 -25 168 -131 -4 -106 -30 139 -260 87 -134 167 -304 27 94 273 -32 -63 -66
3965 -66 -63 53 36 -72 -122 -77 -5 -197 -45 217 75 162 106 -70 -201 -67 212 130 125 18 63 -230 -177 -14 67
3990 67 -158 108 17 24 -26 -9 -61 12 -230 -178 -90 -95 61 138 120 34 66 -172 95 119 -211 46 149 -22 49 78
4016G8N2j95m1Q0P2k44J45J38j03J40m19K20J56j04q3J51n9j15L70n4j22J3r0
4039a4K0j1N2k2n0O7n3J44j35M4j30K15j65l1j1J06k22J25On9K82k6qk2m2m0o8
4066d8j3jL7n4J86j05J30k36J95j25J0R0k37k9L22o7j27J58j39P7K9j17n8k0K77
4091A35J55r0l24l6J87M8j15o6J45l5Qk60P0K37R1k91K04j18K8j52K54J05j47
4114C3k43K03n5K85M9k19q0r9J43J01j79j22j8K71K2j84K9J37l2j38K1k7J72j34
4138f4j9J37O2j09J13k12j65J10J51j67K8J71j80J33j72K23m2QJ50l01N6K2j1
4161g8OJ95k35J04k9m0K18k97L9P6j19K06j23J45j50p4K56j61K5pK2l0K13J29
4185B91o36K88J96j81l27L12R0J40k65J13l43M30j13n1K94j87p5M1M1k5n1K54
$$ plain form
4016 78 130 -65 -106 -26 46 -198 -53 85 -18 122 -297 -77 79 -25 -108 43 -16 -131 239 185 63 76 -14
4039 -14 6 -5 47 25 -25 42 -11 133 -2 42 -88 127 -38 -69 -80 26 -196 -71 -65 -124 158 132 124 102 60 20 -48
4066 -48 -61 -62 -25 -79 107 2 132 -104 91 -34 -24 66 -171 -200 122 55 -72 86 -53 24 53 -64 -122 -142 135
4091 135 290 200 -124 -160 27 75 -40 -106 39 4 12 -248 -178 59 150 -141 63 -55 -27 -179 75 180 33
4114 33 -210 -7 -62 223 272 53 -27 -126 17 118 -61 -183 -201 70 92 -92 -63 74 42 -96 -75 -102 70 -64
4138 -64 -83 54 116 7 120 -92 -257 -147 4 -163 -135 36 -144 -11 -183 40 -2 6 156 -145 -89 -67 -78
4161 -78 -72 123 -112 -8 -37 -77 141 -156 -117 -41 -160 46 -77 68 -82 -156 100 -61 -36 -43 -21 -51 162 291
4185 291 -345 -57 139 -42 -369 -57 33 173 -92 21 -322 108 -5 -56 238 51 -24 17 58 33 -18 236
4207B36k60J31J63j53J9k40J28K59k79j49R7J0J61k16J7L4L2q9p1J40R4p0k6K30
4231A98j98J57j74m6R6r3j45j6M14j36O7L1k11K17k2k15J36j24J32O9j17p5K19
4254A64l7m54O07k21j85K66j21L3Q1j91o9K54j94K3J40j95n5K01K8J43L4l00l3
4277h1R8m5r8J44j45K60k86K96j23p7K13j83j18K88k71J50N6o4l8J7j12K86p2
$$ plain form
4207 236 -24 107 270 117 136 -104 24 283 4 -145 -48 -38 123 -93 -76 -42 -10 -99 -170 -30 64 -6 -32 198
4231 198 0 157 -17 -63 33 -60 -205 -221 193 57 124 155 -56 161 139 -76 60 -64 68 137 20 -55 164
4254 164 127 -327 280 59 -126 140 19 52 133 -58 -127 127 -67 -44 96 -99 -154 47 75 218 252 -48 -81
4277 -81 17 -28 -126 18 -127 133 -153 143 20 -57 156 -27 -145 143 -128 22 78 14 -24 -7 -119 167 95
$$ [...]
8191c3
##END NTUPLES=NMR FID
##END=
