##TITLE=1H_L8-epoxy-b(f5)
 CDCl3
 8 sc, 
 23.09.2022
##JCAMPDX= 6.0         $$ Bruker NMR JCAMP-DX V2.0
##DATA TYPE= NMR FID
##DATA CLASS= NTUPLES
##ORIGIN= UXNMR, Bruker Analytische Messtechnik GmbH
##OWNER= root
$$ XWIN-NMR		Version 3.5
$$ Fri Sep 23 12:34:21 2022 Russian Standard Time (UT+4h)  she@DPX200
##.OBSERVE FREQUENCY= 200.1313499994
##.OBSERVE NUCLEUS= ^1H
##.DELAY= (6, 6)
##.ACQUISITION MODE= SIMULTANEOUS
##.ACQUISITION SCHEME= undefined
##.AVERAGES= 8
##.DIGITISER RES= 18
##SPECTROMETER/DATA SYSTEM= spect
##.PULSE SEQUENCE= zg30
##.SOLVENT NAME= CDCl3
##.SHIFT REFERENCE= (INTERNAL, CDCl3, 0, 15.7039)
##AUDIT TRAIL= $$ (NUMBER, WHEN, WHO, WHERE, WHAT)
$$ ##TITLE= Audit trail, XWIN-NMR		Version 3.5
$$ ##JCAMPDX= 5.01
$$ ##ORIGIN= Bruker BioSpin GmbH
$$ ##OWNER= she
$$ F:/spectra/data/she/nmr/H-F/1/audita.txt
$$ ##AUDIT TRAIL=  $$ (NUMBER, WHEN, WHO, WHERE, WHAT)
(   1,<2022-09-23 12:33:20.32 +0400>,<she>,<DPX200>,
      <created by zg, POWCHK disabled, PULCHK disabled
       configuration hash MD5:
       00 E9 B6 7A A2 85 ED C7 34 08 36 98 17 FE 4E 26
       data hash MD5: 16K
       86 8E D2 25 F1 23 D9 24 0D AD 09 FC 4F 0F 98 FC>)
$$ ##END=
$$ 
$$ hash MD5
$$ 1C 99 12 07 B2 98 EE 91 16 90 3F 38 B2 54 62 8C
##$RELAX= 
##$RELAX= 
##$RELAX= 
##$RELAX= 
##$RELAX= 
##$RELAX= 
$$ Bruker specific parameters
$$ --------------------------
##$DU= <F:/spectra>
##$EXPNO= 1
##$NAME= <H-F>
##$PROCNO= 1
##$TYPE= <nmr>
##$USER= <she>
##$AMP= (0..31)
100 100 100 100 100 100 100 100 100 100 100 100 100 100 100 100 100 100 
100 100 100 100 100 100 100 100 100 100 100 100 100 100 
##$AQSEQ= 0
##$AQ_mod= 1
##$AUNM= <au_zg>
##$AUTOPOS= <>
##$BF1= 200.13
##$BF2= 200.13
##$BF3= 200.13
##$BF4= 200.13
##$BF5= 200.13
##$BF6= 200.13
##$BF7= 200.13
##$BF8= 200.13
##$BYTORDA= 1
##$CFDGTYP= 0
##$CFRGTYP= 5
##$CHEMSTR= <none>
##$CNST= (0..31)
1 1 145 1 1 1 1 1 1 1 1 1 1 1 1 1 1 1 1 1 1 1 1 1 1 1 1 1 1 1 1 1 
##$CPDPRG= <>
##$CPDPRG1= <>
##$CPDPRG2= <>
##$CPDPRG3= <>
##$CPDPRG4= <mlev>
##$CPDPRG5= <mlev>
##$CPDPRG6= <mlev>
##$CPDPRG7= <mlev>
##$CPDPRG8= <mlev>
##$CPDPRGB= <>
##$CPDPRGT= <>
##$D= (0..31)
0 1.2 0 0 0 0 0 0 0 0.06 0 0.03 0 0 0 0 0.0002 0 0 0 0 0 0 0 0 0 0 0 0 
0 0 0 
##$DATE= 1663921999
##$DBL= (0..7)
120 120 120 120 120 120 120 120 
##$DBP= (0..7)
150 150 150 150 150 150 150 150 
##$DBP07= 0
##$DBPNAM0= <>
##$DBPNAM1= <>
##$DBPNAM2= <>
##$DBPNAM3= <>
##$DBPNAM4= <>
##$DBPNAM5= <>
##$DBPNAM6= <>
##$DBPNAM7= <>
##$DBPOAL= (0..7)
0.5 0.5 0.5 0.5 0.5 0.5 0.5 0.5 
##$DBPOFFS= (0..7)
0 0 0 0 0 0 0 0 
##$DE= 6
##$DECBNUC= <off>
##$DECIM= 32
##$DECNUC= <off>
##$DECSTAT= 4
##$DIGMOD= 1
##$DIGTYP= 9
##$DL= (0..7)
0 120 120 120 120 120 120 120 
##$DP= (0..7)
150 150 150 150 150 150 150 150 
##$DP07= 0
##$DPNAME0= <>
##$DPNAME1= <>
##$DPNAME2= <>
##$DPNAME3= <>
##$DPNAME4= <>
##$DPNAME5= <>
##$DPNAME6= <>
##$DPNAME7= <>
##$DPOAL= (0..7)
0.5 0.5 0.5 0.5 0.5 0.5 0.5 0.5 
##$DPOFFS= (0..7)
0 0 0 0 0 0 0 0 
##$DQDMODE= 0
##$DR= 18
##$DS= 0
$$ [...]
##$SUBNAM2= <"">
##$SUBNAM3= <"">
##$SUBNAM4= <"">
##$SUBNAM5= <"">
##$SUBNAM6= <"">
##$SUBNAM7= <"">
##$SUBNAM8= <"">
##$SUBNAM9= <"">
##$SW= 18.0517283424941
##$SWIBOX= (0..15)
0 0 2 0 0 0 0 0 0 0 0 0 0 0 0 0 
##$SW_h= 3612.71676300578
##$TD= 16384
##$TD0= 1
##$TE= 0
##$TE2= 300
##$TE3= 300
##$TEG= 300
##$TL= (0..7)
0 120 120 120 120 120 120 120 
##$TP= (0..7)
150 150 150 150 150 150 150 150 
##$TP07= 0
##$TPNAME0= <>
##$TPNAME1= <>
##$TPNAME2= <>
##$TPNAME3= <>
##$TPNAME4= <>
##$TPNAME5= <>
##$TPNAME6= <>
##$TPNAME7= <>
##$TPOAL= (0..7)
0.5 0.5 0.5 0.5 0.5 0.5 0.5 0.5 
##$TPOFFS= (0..7)
0 0 0 0 0 0 0 0 
##$TUNHIN= 0
##$TUNHOUT= 0
##$TUNXOUT= 0
##$USERA1= <user>
##$USERA2= <user>
##$USERA3= <user>
##$USERA4= <user>
##$USERA5= <user>
##$V9= 5
##$VALIST= <valist>
##$VCLIST= <CCCCCCCCCCCCCCC>
##$VD= 0
##$VDLIST= <DDDDDDDDDDDDDDD>
##$VPLIST= <PPPPPPPPPPPPPPP>
##$VTLIST= <TTTTTTTTTTTTTTT>
##$WBST= 1024
##$WBSW= 4
##$XGAIN= (0..3)
0 0 0 0 
##$XL= 0
##$YL= 0
##$YMAX_a= 132388
##$YMIN_a= -166452
##$ZGOPTNS= <>
##$ZL1= 120
##$ZL2= 120
##$ZL3= 120
##$ZL4= 120
##$ABSF1= 10
##$ABSF2= 0
##$ABSG= 5
##$ABSL= 3
##$ALPHA= 0
##$AQORDER= 0
##$ASSFAC= 0
##$ASSFACI= 0
##$ASSFACX= 0
##$ASSWID= 0
##$AUNMP= <proc_1d>
##$AZFE= 0.1
##$AZFW= 0.1
##$BCFW= 1
##$BC_mod= 2
##$BYTORDP= 1
##$COROFFS= 0
##$CY= 11.3945322036743
##$DATMOD= 1
##$DC= 2
##$DFILT= <>
##$DTYPP= 0
##$F1P= 2.36226072786647
##$F2P= -0.459571619588291
##$FCOR= 0.5
##$FTSIZE= 0
##$FT_mod= 4
##$GAMMA= 1
##$GB= 0.15
##$INTBC= 1
##$INTSCL= 1
##$ISEN= 128
##$LB= 0.24
##$LEV0= 0
##$LPBIN= 0
##$MAXI= 10000
##$MC2= 0
##$MEAN= 0
##$ME_mod= 0
##$MI= 1.114404
##$NCOEF= 0
##$NC_proc= 0
##$NLEV= 6
##$NOISF1= 3.799351
##$NOISF2= 2.8
##$NSP= 1
##$NTH_PI= 0
##$NZP= 0
##$OFFSET= 15.70392
##$PC= 1
##$PHC0= -18037.65
##$PHC1= 16.60069
##$PH_mod= 1
##$PKNL= yes
##$PPARMOD= 0
##$PSCAL= 0
##$PSIGN= 0
##$REVERSE= no
##$SF= 200.130013532006
##$SI= 16384
##$SIGF1= 3
##$SIGF2= 2
##$SINO= 400
##$SIOLD= 16384
##$SREGLST= <1H.CDCl3>
##$SSB= 0
##$STSI= 0
##$STSR= 0
##$SW_p= 3612.71676300578
##$SYMM= 0
##$S_DEV= 0
##$TDeff= 0
##$TDoff= 0
##$TI= <>
##$TILT= no
##$TM1= 0
##$TM2= 0
##$TOPLEV= 0
##$USERP1= <user>
##$USERP2= <user>
##$USERP3= <user>
##$USERP4= <user>
##$USERP5= <user>
##$WDW= 1
##$XDIM= 8192
##$YMAX_p= 0
##$YMIN_p= 0
$$ End of Bruker specific parameters
$$ ---------------------------------
##NTUPLES= NMR FID
##VAR_NAME=  TIME,          FID/REAL,        FID/IMAG
##SYMBOL=    X,             R,               I
##VAR_TYPE=  INDEPENDENT,   DEPENDENT,       DEPENDENT
##VAR_FORM=  AFFN,          ASDF,            ASDF
##VAR_DIM=   8192,          8192,            8192
##UNITS=     SECONDS,       ARBITRARY UNITS, ARBITRARY UNITS
##FACTOR=    0.0002768,     1,               1
##FIRST=     0,             0,               0
##LAST=      2.2672688,     0,               0
##MIN=       0,             -166452,         0
##MAX=       2.2672688,     132388,          0
$$ Real data points
##PAGE= N=1
##DATA TABLE= (X++(R..R)), XYDATA
$$ [...]
1825H9J41J39o33M9J78j41n77P47N66p19K77j19k83j58n5n3k35P3P88qL24M41
$$ 89 230 369 -264 -215 -37 -178 -755 -8 558 -161 116 -3 -286 -444 -499 -552 -787 -714 74 66 390 831
1847H31J01J62L9l56m93J1j46n28J65L14m15q9M59K49l53m1K97p86l16N84n50
$$ 831 932 1094 1133 777 284 295 149 -379 -214 100 -315 -404 55 304 -49 -90 207 -579 -895 -311 -861
1868h61m66O24N00m76O14J019n17P6M28l05j46p7Q9q1o0L3l28M04L47n03l84R6
$$ -861 -1327 -703 -203 -679 -65 954 437 513 941 636 490 413 502 421 361 394 66 470 817 314 -70 26
1890B6j85q44N9j6m81L56N63J6J95O86J95l38O57J49m92j50J47m38OJ66k02NN8
$$ 26 -159 -1003 -944 -960 -1441 -1085 -522 -506 -311 375 570 232 889 1038 546 396 543 105 111 277 75 80 138
1913A38k18j47L88l39l84J86j30k81J58O32R3j86N52K87k85j50K47l06n35J06
$$ 138 -80 -227 161 -178 -562 -376 -506 -787 -629 3 96 -90 462 749 464 314 561 255 -280 -174
1933a74k11j8J0J49p7L3K83j21R9M6n0O8K28J5m6K45J87l92J50K95o48O2K75n68
$$ -174 -385 -403 -393 -244 -321 -288 -5 -126 -27 19 -31 37 265 280 234 479 666 274 424 719 71 133 408 -160
1957a60o63M09L63p79J23M79j18j98M55J32o43K76L52m20J45M08j56J87P74k08
$$ -160 -823 -414 -51 -830 -707 -228 -346 -544 -89 43 -600 -324 28 -392 -247 161 5 192 966 758
1977G58k95K53K2o17L36J29q35n74R58n81m01P55M53p55J75O92o88p37N42m5p40
$$ 758 463 716 738 121 457 586 -249 -823 135 -446 -847 -92 361 -394 -219 473 -215 -952 -410 -455 -1195
1998a195P02M75j49J37P13Q0K50L43o94l44K91j53o93mM78o49J8M42M52n50J26
$$ -1195 -493 -18 -167 -30 683 763 1013 1356 662 318 609 456 -237 -241 237 -412 -394 48 500 -50 76
2019G6K5k87j64k15j54k94N35J80J32O13M2k78J61L48m04m21J41j45p46N75M1
$$ 76 101 -186 -350 -565 -719 -1013 -478 -298 -166 447 489 211 372 720 316 -105 36 -109 -855 -280 -239
2040b39j01N20L96p2j1K66l65n18L30j82n08r2L43J36j88M54j04k00L94l43j89
$$ -239 -340 180 576 504 493 759 394 -124 206 24 -484 -576 -233 -97 -285 169 65 -135 259 -84 -273
2061b73j61j23j64j44M53K40n2P41k9m5L62rm04j65J09k70k84Q4K5r7K56J32j85
$$ -273 -434 -557 -721 -865 -412 -172 -224 517 488 443 805 796 392 227 336 66 -218 -134 -109 -206 50 182 -3
2084cJ42J2m45J64L15q78l41P02m5J36J54K37j22K79M16m74o1O9m15J31K8J64
$$ -3 139 151 -294 -130 185 -693 -1034 -332 -377 -241 -87 150 28 307 723 249 188 257 -158 -27 1 165
2106A65m58M13L22j28j13M66n82l38L86k38m35L80J67l33J05R5Q5m12L82m5m54
$$ 165 -293 120 442 314 201 667 85 -253 133 -105 -540 -160 7 -326 -221 -126 -41 -453 -71 -116 -570
2127e70P6L29j76k57O61n5j32N17L21l97J19M16n53q8J63j15n50M22M89p10l8
$$ -570 -494 -165 -341 -598 63 8 -124 393 714 317 436 852 299 211 374 259 -291 131 620 -90 -128
2148a28N59o99K1K91j37o17M51K3l84M36M25m50J57N97k48o81N89J94p02N2K89
$$ -128 431 -268 -247 44 -93 -710 -259 -236 -620 -184 241 -209 -52 545 297 -384 205 399 -303 -251 38
2169C8q7j52N36p1j42M11l26j22L7J55l57j00K44l95k17L20J54l45M20L95p02
$$ 38 -49 -201 335 264 122 533 207 85 122 277 -80 -180 64 -331 -548 -228 -74 -419 1 396 -306
2190c06R3L90n45r5M86j08NJ23K49J1J75K43o1j12j03j97k76R0rl63K95k1k93
$$ -306 -213 177 -368 -463 23 -85 -80 43 292 303 478 721 660 548 445 248 -28 62 53 -310 -15 -36 -329
2213c29r8M02k80j12R8L70l45J7L00l09j83O40p7o8%J52k88O7M11l63l4J75p7
$$ -329 -427 -25 -305 -417 -319 51 -294 -277 23 -286 -469 171 94 26 26 178 -110 -43 368 5 -29 146 69
2236F9l2L33k32L1K39J9l97J09L10n53k85L13j85o2rM22m03O1P0j84p3N83j01
$$ 69 37 370 138 169 408 427 30 139 449 -104 -389 -76 -261 -323 -332 90 -313 -252 -182 -366 -439 144 43
2259D3k34M29J70j50K01J92j23j77K08m27l02L65l69n61M02N71n16M33K11j30
$$ 43 -191 238 408 258 459 651 528 351 559 132 -170 195 -174 -735 -333 238 -278 155 366 236
2279B36n48L24M5m32J78J96l25j92N36j14m12L83R2l64K14k6n9J97m9j08n9P49
$$ 236 -312 12 57 -375 -197 -1 -326 -518 18 -96 -508 -125 -33 -397 -183 -209 -268 -71 -120 -228 -287 462
2301D62p5J18J64O9k26l19J96q8p18K53P5m26j20J11p5K57K93J31l93Q7J77k66
$$ 462 387 505 669 738 512 193 389 301 -417 -164 -89 -515 -635 -524 -599 -342 -49 82 -311 -224 -47 -313
2323c13J07J44k72L31N70m52M76K41n7j32j07j98p2k76%m92K19J58kP4K50m3M7
$$ -313 -206 -62 -334 -3 567 115 591 832 775 643 536 338 266 -10 -10 -502 -283 -125 -127 -53 197 154 201
2346B01k62L20k79l56Q9L1k65K04K8L06M65r5m7J57J02k30k87K14o4m62j32K78
$$ 201 -61 259 -20 -376 -287 -256 -521 -317 -289 17 482 387 340 497 599 369 82 296 232 -230 -362 -84
2368h4j8Mo0K8J40K25n06K5M51l71j4o5L05o51L62L69k47K42K11m8n16O41j5o72
$$ -84 -102 -98 -158 -130 10 235 -271 -246 205 -166 -180 -245 60 -591 -229 140 -107 135 346 298 -218 423 408 -264
2392b64Q5J53o83K22P87l62N5M37Q4m60N5M44l85k00J37k32j14J65j75J24J1N2
$$ -264 -179 -26 -709 -487 300 -62 -7 430 514 54 109 553 168 -32 105 -127 -241 -76 -251 -127 -116 -64
2414f4q6j68or3J10q4M68n71J59L04K18j49L23K36n1J56k8j58m70K51k85l25J12
$$ -64 -150 -318 -324 -417 -307 -391 77 -494 -335 -31 187 38 361 597 546 702 674 516 46 297 12 -313 -201
2437b01%n7K3j48N16k85J56j01j78L20n09P6J19J70o6k1J45J43L76P2o1Q6L4m38
$$ -201 -201 -258 -235 -383 133 -152 4 -97 -275 45 -464 -388 -269 -99 -165 -186 -41 102 478 550 489 575 609 171
2461A71m4M2k39N8j3j95O7%M39o8rj66l9l4j4q4r2j71K75l38M03L52j93j25J93
$$ 171 127 169 -70 -12 -25 -220 -153 -153 286 218 209 43 4 -30 -44 -128 -220 -391 -116 -454 -51 301 108 -17 176
2486A76L5R0k68Q5K57j09m60K83k32K84K38k54J96k8m3k7j39j75j05o8N8j37J53
$$ 176 211 301 33 118 375 266 -194 89 -143 141 379 125 321 293 250 223 84 -91 -196 -264 -206 -343 -190
2509a90J13k9mJ60Pj76J98j03j65J84j4p6O3o1L9O8K70L28l17K65o6k68k4k33
$$ -190 -77 -106 -110 50 57 -119 79 -24 -189 -5 -19 -95 -32 -93 -54 14 284 612 295 560 494 226 202 -31
2533c1J4k47M13P5l66m9K63j59j04L38o9j88qP6j86J91j78J44j56N62ql06M01
$$ -31 -17 -264 149 224 -142 -191 72 -87 -191 147 78 -110 -118 -42 -228 -37 -215 -71 -227 335 327 21 422
2556D22j71R0K47n00j49q3J5j17r9K93Oj24K23N1l63L21J4N3m23J8P9m0N6K3j0
$$ 422 251 341 588 88 -61 -144 -129 -246 -345 -52 -46 -170 53 104 -259 62 76 129 -294 -276 -197 -237 -181 -158 -168
2581a68RK5K57N8j14J01J76l15O7K9j23K56rj09r9J01m7O3j00l1k37N7j37J06
$$ -168 -159 -134 123 181 67 168 344 29 96 125 2 258 249 140 41 142 95 158 58 27 -210 -153 -290 -184
2605a84k23J22j79K83J18k58L54p9J54j56j28J90q8J81J05j15K35l17J91m7j20
$$ -184 -407 -285 -464 -181 -63 -321 33 -46 108 -48 -176 14 -74 107 212 97 332 15 206 159 39
2626C9j3K45J54m04R4k10Jm5J41k03M0k0J40k3J83k30J7o7K11J0L3K6J7L6r5J40
$$ 39 26 271 425 21 115 -95 -94 -139 2 -201 -161 -181 -41 -64 119 -111 -94 -161 50 60 93 119 136 172 77 217
2652B17k69j6L97k02k68J54K34l72K73j43J11n9j47J48l29M40k19l04O5J20p8
$$ 217 -52 -68 329 127 -141 13 247 -125 148 5 116 57 -90 58 -271 169 -50 -354 -289 -169 -247
2673b47J59N8o8K8K6O9j24J02O1R0k9j8RK27j86J96j81m4J75k44j17J91J09k96
$$ -247 -88 -30 -98 -70 -44 25 -99 3 64 154 125 107 116 343 157 353 172 128 303 59 -58 133 242 -54
2697e4M9k3K14m70J18J7R3o4K05l09K83J14l43K92o7J30J87k02K30m49L78k73
$$ -54 -5 -28 186 -284 -166 -149 -56 -120 85 -224 59 173 -170 122 55 185 372 170 400 -49 329 56
2719E6pP3l79q3Q1J08j19N37m23J74K81kk70J42O5m13K61k93r0j76J69K14j85
$$ 56 49 122 -257 -340 -259 -151 -270 267 -156 18 299 297 27 169 234 -179 82 -211 -301 -477 -308 -94 -279
2742b79L77k29J82J01j42K37k78J14j58J17j83K44J5L53j39J72j86P4j21k45N9
$$ -279 98 -131 51 152 10 247 -31 83 -75 42 -141 103 118 471 332 504 318 392 271 26 85
2763H5j29k05O7j79n2j39L55L15j7m5J32r0j83l9J49pn5J84j64k8K35N8q5N3q8
$$ 85 -44 -249 -182 -361 -413 -552 -197 118 101 56 188 98 -85 -124 25 18 -37 147 -17 -45 190 248 163 216 128
2788A28Nj49K65k54j07j09k97L35RK7LK75j98O5Q9m29L55k40r8L60p1j23M0K20
$$ 128 133 -16 249 -5 -112 -221 -518 -183 -174 -147 -144 131 -67 -2 87 -342 13 -227 -325 35 -36 -159 -119 101
2812A01O7J37K74m00j3k10O7k4J12k20o9O7j73L91j11M2j7M3J32j82K0l70L40
$$ 101 168 305 579 179 166 -44 23 -1 111 -109 -178 -111 -284 107 -4 38 21 64 196 14 34 -336 4
2835Dn2k65K47j50L62m16P9K40j63Mn4N4l1l05L74J86m23M71J09l5m3l8P0P3k4
$$ 4 -48 -313 -66 -216 146 -270 -191 49 -114 -110 -164 -110 -141 -446 -72 114 -309 162 271 236 193 155 225 298 274
2860B74k43L4j95L8l88M16j5j73k57M22K01j74K61k11J17J17Q9m49J64j5J04m7
$$ 274 31 65 -130 -92 -480 -64 -79 -252 -509 -87 114 -60 201 -10 107 224 313 -136 28 13 117 70
2882G0k5M17k19q0o9J76k33j17J20l24N6J45j09N7K4J75r7N7K08m06L82j05l12
$$ 70 45 462 243 163 94 270 37 -80 40 -284 -228 -83 -192 -135 -111 64 -33 24 232 -174 208 103 -209
2905b09m4J96K08l85P6K35J99r8J27k76P0K33n44K80J46m05j20L43q2l3J14N9
$$ -209 -253 -57 151 -234 -158 77 276 178 305 29 99 332 -212 68 214 -191 -311 32 -50 -83 31 90
2927I0K4l0k86J58p7K7mo9K97j41l6m3j01L69K32M3j18m06nM2p1k67L22q9J05
$$ 90 114 84 -202 -44 -121 -94 -98 -167 130 -11 -47 -90 -191 178 410 453 335 -71 -76 -34 -105 -372 -50 -139 -34
2952c4k2qL60m8J05m11j05Q5N8J34j27J53j41n9m1J19J24q4Rj44Q8m6K21m38K76
$$ -34 -56 -64 296 248 353 -58 -163 -78 -20 114 -13 140 -1 -60 -101 18 142 58 67 -77 11 -35 186 -252 24
2977B4J84m9N5k5O3Kk04J65k35J54m18j7L35p4o5Q2J8l4j69p8L88N7N8k69j04
$$ 24 208 159 214 189 252 254 50 215 -20 134 -284 -301 34 -40 -105 -23 -5 -39 -208 -286 102 159 217 -52 -156
3002a56K16K6m0J38k86J12L7Q4k82K70m8r8j5J62J7k28J04J8k08K87j75r4P5L55
$$ -156 60 86 46 184 -102 10 47 131 -151 119 71 -27 -42 120 137 -91 13 31 -177 110 -65 -159 -84 271
3026B71k07n0q4K34m40K40o1K1J11k7j46q5N24l03k27M84O0k52m2J29l19L34N7
$$ 271 64 14 -70 164 -276 -36 -97 -76 35 8 -138 -223 301 -2 -229 255 315 63 21 150 -169 165 222
3049B22j43k0pq1j17K57o6l30K7J38K1N6J48l66J36r9J71j14J28J06k96M42j10
$$ 222 79 59 52 -29 -146 111 45 -285 -258 -120 -99 -43 105 -261 -125 -224 -53 -167 -39 67 -229 213 103
3072A03K03k08k34O5J47l21K90Nq3J39N8j02q3o4R2RJ3k18Q6K58k30m4Kj4j93
$$ 103 306 98 -136 -71 76 -245 45 50 -33 106 164 62 -21 -85 7 16 29 -189 -103 155 -75 -119 -117 -131 -324
3097c24J22j04K21o1m7L9R7L07N5m74L38j18J49j3j72J66m4j33J1K1N0m4l38J15
$$ -324 -202 -306 -85 -146 -193 -154 -57 250 305 -169 169 51 200 187 15 181 137 4 15 36 86 42 -296 -181
3121a81K83j44j18K08k89k0L47K40m30j00K52PO6K2k46r0L73l06J57J47k90N0
$$ -181 102 -42 -160 48 -241 -261 86 326 -104 -204 48 55 121 143 -103 -193 180 -126 31 178 -112 -62
3143f2L2J30j3j31K55j46J28j46J2m9r7O5j29J00l0K2j34M9P9J23j17K6N9k78
$$ -62 -30 100 87 -44 211 65 193 47 59 10 -87 -22 -151 -51 -81 -59 -193 -144 -65 58 -59 -33 26 -252
3167b52K57J45n5M92k08n7m7O2j99k82J92n0k17O6Q6k39J93n4J78j13L7L05j00
$$ -252 5 150 95 587 379 322 275 337 138 -144 48 -2 -219 -153 -67 -306 -113 -167 11 -102 -65 240 140
3190A40j84K3O6l7J70j73o1k0n9J9O1n6j09R2K60M5k17J82j76N0N3K12r5O7r5
$$ 140 -44 -21 45 8 178 5 -56 -76 -135 -116 -55 -111 -220 -128 132 177 -40 142 -34 16 69 281 186 253 158
3215A58j24J91o1m45r8J36Q2l14J36J69J33k6p6J33P3K20l90L80J85k71k01j65
$$ 158 34 225 164 -281 -379 -243 -161 -475 -339 -170 -37 -63 -139 -6 67 287 -103 277 462 191 -10 -175
3237a75L58J21k48R5j55j18J25j17J71J43j77J39j96k01K37k13L08K14l77K37
$$ -175 183 304 56 151 -4 -122 3 -114 57 200 23 162 -34 -235 2 -211 97 311 -66 171
3257A71n3j02m9Q9k89p4K06q8L17k53J78k8R9o6p8J99j85L28l54O9J5qk37K27
$$ 171 118 16 -33 56 -233 -307 -101 -189 128 -125 53 25 124 58 -20 179 -6 322 -32 37 52 44 -193 34
3281C4%k68J42J24k62J79j98N4K8j2n6K75J65J49m06J86qj12P7j42k6J70j29J5
$$ 34 34 -234 -92 32 -230 -51 -249 -195 -167 -179 -235 40 205 354 -52 134 126 14 91 -51 -77 93 -36 -21
3305b1P1K6Q0n7Rj11j53J36j59L38j62K3M3j60o1M9o0m4K78j97j13R9K78m03L91
$$ -21 50 76 156 99 108 -3 -156 -20 -179 159 -3 20 63 -97 -158 -109 -169 -213 65 -132 -245 -146 132 -271 120
3330A20j36R5M2O9r3R2L3j91m4NK34k28J54k33L5k19M26l34J28j6l7O9j60J03
$$ 120 -16 79 121 190 97 189 222 31 -13 -8 226 -2 152 -81 -46 -265 161 -173 -45 -61 -98 -29 -189 -86
3354h6M45n25J05l4P8k1R6m20L19J25l17K19J33Q8j41R0j36Rj48M54l58K12j74
$$ -86 359 -166 -61 -95 -17 -38 58 -362 -43 82 -235 -16 117 205 64 154 18 27 -121 333 -25 187 13
3377A3L60m35J65m6J48j69j00j13J27j21j16M53l26KJ7L5L20j19j16qj9J70p5
$$ 13 373 -62 103 57 205 36 -64 -177 -50 -171 -287 166 -160 -158 -141 -106 214 95 -21 -29 -48 122 47
3400D7jj04KJ13j22J47N3j27r0J40l7R3l8jl36K53J07l77K87J69j75P1K27j67
$$ 47 46 -58 -56 57 -65 82 135 8 -82 58 21 114 76 75 -261 -8 99 -278 9 178 3 74 301 134
3424A34L4k28N8j35m9L96k76O4J34K93n05K65k18m7R8L90l44K2J35m86M25mk24
$$ 134 168 -60 -2 -137 -186 210 -66 -2 132 425 -80 185 -33 -80 18 408 64 86 221 -265 160 156 -68
3447f8Q3k18K12m9j2J51k25m5K65M5k65j01K51j3j0n1J88j66L51j17k94K53n5
$$ -68 15 -203 9 -40 -52 99 -126 -171 94 139 -126 -227 24 11 1 -50 138 -28 323 206 -88 165 110
3470A10k11n8P6J52p1k7J06k30j18J18K22m3m28L68J28q3K87m28J71q1q9KN9J99
$$ 110 -101 -159 -83 69 -2 -29 77 -153 -271 -153 69 26 -402 -34 94 11 298 -130 41 -40 -129 -127 -68 131
3494A31m77M46q4O1j9j01J00p7K21k61J50j7j69J48q2J13j48r0J86j81j7j25L95
$$ 131 -346 100 16 77 58 -43 57 -20 201 -60 90 73 -96 52 -30 83 -65 -155 31 -150 -167 -292 103
3517A03j79j96J65Q1P0k2M0j34K63l01K55j50J56j06L4J40q5n8O6l34K01l1k19
$$ 103 -76 -272 -107 -26 44 22 62 -72 191 -110 145 -5 151 45 79 219 134 76 142 -192 9 -22 -241
3540b41K2n2K08%M4Jj2j40N1K2L22k68J57k26o9L16j37R1j69J33J1L4m4j46J4
$$ -241 -219 -271 -63 -63 -19 -18 -30 -170 -119 -97 225 -43 114 -112 -181 135 -2 89 -80 53 64 98 54 -92 -78
3565g8K50j1r6L1J07q2j99J93j76J43k4o9LJ59n49J93K56p2K03k19oJ75P0O0k68
$$ -78 172 161 65 96 203 121 -78 115 -61 82 58 -11 -8 151 -398 -205 51 -21 182 -37 -43 132 202 262 -6
3590fJ91j6j0Q8M5j24j57M1P2k94K10J33J00m07K11J82k85K4j2M88o45J24J32
$$ -6 185 169 159 247 292 168 11 52 124 -170 40 173 273 -134 77 259 -26 -2 -14 474 -171 -47 85
3613H5k00J46j89K37l50M16k48q9M28k25k2j43J91N6j08j24J49L7j32K49j85j66
$$ 85 -115 31 -158 79 -271 145 -103 -192 236 11 -11 -154 37 93 -15 -139 10 47 -85 164 -21 -187
3635a87L89l95K17o2j48k2J02j05j0K41j97L7l0J14L24m40J86N9m9j71L71l13
$$ -187 202 -193 24 -38 -186 -208 -106 -211 -221 20 -177 -140 -170 -56 268 -172 14 73 24 -147 224 -89
3657h9J8J98m6m7J4M3j06J4K74k80j1J23k67L11Ml20L48k29k11L68j63o5J5J42
$$ -89 -71 127 81 34 48 91 -15 -1 273 -7 -18 105 -162 149 153 -167 181 -48 -259 109 -54 -119 -104 38
3681C8j36J41j16klJ43n1K14Mj38R6j03J12j28j1O9l96K92j46P5J26k90K79j38
$$ 38 -98 43 -73 -75 -78 65 14 228 232 94 190 87 199 71 60 129 -267 25 -121 -46 80 -210 69 -69
3705f9q5K54n1j53L73l14k2l6n4J38O7N2KL9l15K65j02K62k96O9o7j01J62J3j21
$$ -69 -154 100 49 -104 269 -45 -67 -103 -157 -19 48 100 102 141 -174 91 -11 251 -45 24 -43 -144 18 31 -90
3730i0J91j43J81j42k3N4k8J16l5k79K73j13j55N0j76N6J09K65l6k06J17K29l10
$$ -90 101 -42 139 -3 -26 28 0 116 81 -198 75 -38 -193 -143 -319 -263 -154 111 75 -131 -14 215 -95
3753i5K25Q4l8k58j25j02M05J37m81Q0J61J08j10l9lJ05q5k11M50k55R8j78J50
$$ -95 130 214 176 -82 -207 -309 96 233 -248 -168 -7 101 -9 -48 -51 54 -31 -242 208 -47 51 -127 23
3776B3Q9j3k70j84L48J08l18K84k4n1J88o8j76oJ68j01k45L5L05j6P0k14L0J46
$$ 23 112 99 -171 -355 -7 101 -217 67 43 -8 180 112 -64 -70 98 -3 -248 -213 92 76 146 -68 -38 108
3800A08j18q5K17K9l76L14j44j44p7L27k66R5m8J96o9K43j16L23m12J75j49r4
$$ 108 -10 -95 122 151 -225 89 -55 -199 -276 51 -215 -120 -168 28 -41 202 86 409 -3 172 23 -71
3822g1J6O7j3j0j57R6J76P5l08m1L38n85K84J93j15J93k44R1k3k6O9j96L10k2
$$ -71 -55 12 -1 -11 -168 -72 104 179 -129 -170 168 -417 -133 60 -55 138 -106 -15 -38 -64 5 -191 119 97
3846I7jj14L4m5j92N94j39k05J24p9L9J34l26L3K04J1m09J70K39r5j70K9O6k16
$$ 97 96 -18 16 -29 -221 373 234 29 153 74 113 247 -79 -46 158 169 -240 -70 169 74 -96 -67 -1 -217
3870b17L01O6kk56K56k53K4M5n5J20k11N0Q2j39O9o2J56j07K22k7Q9j87j15Q2
$$ -217 84 150 148 -108 148 -105 -81 -36 -91 29 -182 -132 -50 -189 -120 -182 -26 -133 89 62 151 -36 -151 -69
3894f9K5K51m29J90J99j20O6J20k5L6N2j63k55O0N1k20J46L04j45p0O8J13j02
$$ -69 -44 207 -222 -32 167 47 113 233 208 244 296 133 -122 -62 -11 -231 -85 219 74 4 72 185 83
3917H3P6j05l4m9m4L08k70J27k80Q5m9K63p8J84j03k04J14k01N7K33k64L4K73
$$ 83 159 54 20 -29 -73 235 -35 92 -188 -103 -152 111 33 217 114 -90 24 -177 -120 113 -151 -117 156
3940A56k18J68J15j00O4k64%J30k07j26L64l1lp4J55Kk77MK68l20L24k99J54o8
$$ 156 -62 106 221 121 185 -79 -79 51 -156 -282 82 51 48 -26 129 131 -146 -142 126 -194 130 -169 -15 -83
3964h3o4K76m33L87n3j58j4O0j8J1q1K79l00K43J15l18J36J60l36L98l22k6K42
$$ -83 -147 129 -304 83 30 -128 -142 -82 -100 -89 -170 109 -191 52 167 -151 -15 145 -191 207 -115 -141 101
3987A01N0O6m12k6N48l12kR0j42n4K65n5j33M7j19L8K27k04j06J11k0j48P7K33
$$ 101 151 217 -195 -221 327 15 13 103 -39 -93 172 117 -16 31 -88 -50 177 -27 -133 -22 -42 -190 -113 120
4011A20j68K96k85j78K51K39k48J22k71K14j53K1m1M5nJ19k63L6N1q8K06J12k22
$$ 120 -48 248 -37 -215 36 275 27 149 -122 92 -61 -40 -81 -36 -41 78 -185 -149 -98 -186 20 132 -90
4034i0r5n2J72J08J78k58p0Q1K87l47J16K9r3J04j74L01m85J55K21k63K11m7Q6
$$ -90 -185 -237 -65 43 221 -37 -107 -26 261 -86 30 59 -34 70 -104 197 -288 -133 88 -175 36 -11 75
4057G5M5J6J05j87K7k45kJ69M2j65K32j7l6l09O9l6j32K14J97j70o6K72N4k38
$$ 75 120 136 241 54 81 -164 -166 3 45 -120 112 95 59 -250 -181 -217 -349 -135 62 -108 -174 98 152 -86
4081h6J76K1j64J45k29Q3P1J67k77KM7J57K8n6q8m2l8N7J89k60j11J86K48j39
$$ -86 90 111 -53 92 -137 -54 17 184 -93 -91 -44 113 141 85 -3 -45 -83 -26 163 -97 -208 -22 226 87
4105H7j20j28O2K15j15K63m31m2K12o1j66J44N2K07l70K24l5Jm7p9q0K27J91k96
$$ 87 -33 -161 -99 116 1 264 -167 -209 3 -58 -224 -80 -28 179 -191 33 -2 -1 -48 -127 -207 20 211 -85
4129h5K22p6l4p2r6M81p4m63l1L85q8k0k3l34N60j73J19j05lj18p9M3J85k46R4
$$ -85 137 61 27 -45 -141 340 266 -197 -228 157 69 49 26 -308 252 79 198 93 90 -28 -107 -64 121 -125 -31
4154c1j04j77L44k07O5n8K07l02L73j58m9j34J06K62j25k05L39k10q4K22j9J90
$$ -31 -135 -312 32 -175 -110 -168 39 -263 110 -48 -97 -231 -125 137 12 -193 146 -64 -148 74 55 245
4176B45k85J61O9J01l95R8J9n0p0K67j18R5j17j53M7J6j48J38p1K34l48K83m%
$$ 245 -40 121 190 291 -104 -6 13 -37 -107 160 42 137 20 -133 -86 -70 -218 -80 -151 83 -265 18 14 14
4200A4K14m10K55Q5Q9l70L21j15M1j92K43k13l5O6J60m5KJ1l63M97k02Q9k54J04
$$ 14 228 -182 73 158 247 -123 198 83 124 -68 175 -38 -73 -7 153 108 110 121 -242 255 53 142 -112 -8
4224hj03q4K40p1Q2j3N4l95J96J68Jm61M56J74l11J27l5O2p2Q3k50K01j15L3Q1
$$ -8 -111 -195 45 -26 56 43 97 -298 -102 66 67 -394 62 236 -75 52 17 79 7 90 -160 41 -74 -41 40
4249D0J27j67O1k70N7K33n0l1p6J04o6p2j2L72m05J35M8j4R1j51L9O8J13M6n6
$$ 40 167 0 61 -209 -152 81 31 0 -76 28 -38 -110 -122 250 -155 -20 28 14 105 -46 -7 61 174 220 164
4274A64j79k4K55m20K06K6j84J06J13J44j96k49L52j67K07j46p1P2k08J79J69
$$ 164 -15 -39 216 -204 2 28 -156 -50 63 207 11 -238 114 -53 154 8 -63 9 -199 -20 149
4295A49j87N0M6j12J1K15L1k03J78n5j27P3m0P3j80K43j39L4P2j58J88j38K46
$$ 149 -38 12 58 -54 -43 172 203 0 178 123 -4 69 29 102 -78 165 26 60 132 -26 162 24 270
4318B70n20K21j94K53P8l2j85K01nj46k8O3j10LL8NN6N9J7o1N5Q5L8k31N8K3j54
$$ 270 -250 -29 -223 30 108 76 -109 92 87 -59 -87 -24 -134 -131 -93 -88 -32 27 44 -17 38 123 161 -70 -12 11 -143
4345a43P1K2O8J6k18K3M08j84k19J45l3L14j53j96J58k46K36N3l17J13K7K34l07
$$ -143 -72 -50 18 34 -184 -161 247 63 -156 -11 -44 270 117 -79 79 -167 69 122 -195 -82 -55 179 -128
4368a28j06K96N8p5L1O3j73Q5J18k67L74l55K89N6k70J50j55j01Q6K1K6k2j00
$$ -128 -234 62 120 45 76 139 -34 51 169 -98 276 -79 210 266 -4 146 -9 -110 -24 -3 23 1 -99
4391i9o0R2P8j33J58m7Jn5RJ50n5RQ6m9J23m51K52L0j80K6J34j9n8P2p3k05O4
$$ -99 -159 -67 11 -122 36 -11 -10 -65 -56 94 39 48 134 85 208 -243 9 39 -141 -115 19 0 -58 14 -59 -264 -200
4418b00K30k25J8J90nj47L73j83k6J40k32K76j89J95L7k91L08k35J14j5l48k1
$$ -200 30 -195 -177 13 8 -139 234 51 25 165 -67 209 20 215 252 -39 269 34 148 133 -215 -236
4440b36J33K59j58n8J19k10J58r5j12L3M10k85M9j28k79L71R3k79M26k75O4OJ2
$$ -236 -103 156 -2 -60 59 -151 7 -88 -200 -167 243 -42 7 -121 -400 -29 64 -215 211 -64 0 6 18
4463A8l07L39K3O4j27m9Q6j33r9J16L6N5Q3j02J1L6k55J36m6q0L34J9O0k87j67
$$ 18 -289 50 73 137 10 -39 47 -86 -185 -69 -33 22 105 3 14 50 -205 -69 -115 -195 139 158 218 -69 -236
4488b36L18j67K43k14J78j74q6L07k62J5M5p6J27L2Q3q1M7J3n8%n6J2j27q2K8
$$ -236 82 -85 158 -56 122 -52 -138 169 -93 -78 -33 -109 18 50 133 52 99 112 54 54 -2 10 -117 -199 -171
4513a71OJ2J34j35K72k22J31j19M5J8J65l5j44Q1j37J37k41K97K50l99j94J62
$$ -171 -165 -153 -19 -154 118 -104 27 -92 -47 -29 136 101 -43 38 -99 38 -203 94 344 -55 -249 -87
4535h7p4J64n6n5J8J86o8k55K71q8J99j56q2K86n95O53n14P0L32k24L34m22K31
$$ -87 -161 3 -53 -108 -90 96 28 -227 44 -44 155 -1 -83 203 -392 261 -253 -183 149 -75 259 -163 68
4558F8j58q6J89j16l8M2J31M8l02O5m0M04Qk55P5l40K68j42N9J64j89M32j45m8
$$ 68 -90 -176 13 -103 -141 -99 32 80 -222 -157 -197 207 215 -40 35 -305 -37 -179 -120 44 -145 287 142 94
4582I4l29M03q3j45J14j14M0J56j48J53j49k4J13Ok4L8j77J47l5j19L15m63O7
$$ 94 -235 168 85 -60 54 -60 -20 136 -12 141 -8 -32 81 87 63 101 -76 71 36 -83 232 -231 -164
4605a64K27L8m1k1j44L48k11j03R2J06j77O5J35k35K4PLj4P6K7O2K41m47J31N0
$$ -164 63 101 60 39 -105 243 32 -71 21 127 -50 15 150 -85 -61 -54 -51 -65 11 38 100 341 -106 25 75
4630G5J2O4j44L5q0J99k80K58k06j94J81j61L06oq1j33k2J74K9k09K01J15k20
$$ 75 87 151 7 42 -38 161 -119 139 -67 -261 -80 -241 65 59 -22 -155 -177 -3 26 -183 18 133 -87
4653h7L33j95L5j52J54k8j90o8M91l99K24p8l6J13j95Q3Q2q0j20J9K91j72k50
$$ -87 246 51 86 -66 88 60 -130 -198 293 -106 118 40 4 117 -78 5 87 7 -113 -94 197 25 -225
4676b25J40P8Kj45J72M1J60k56no2j83K71J97l8k12m9J04J03Rk47J76Q4p0kq8
$$ -225 -85 -7 -5 -150 22 63 223 -33 -38 -100 -283 -12 185 147 -65 -114 -10 93 102 -145 31 115 45 43 -45
4701d5j55K88j66L65k39j70L22l58O2J50Q9o1j64J9J95j88J77l40L75k06J92j32
$$ -45 -200 88 -78 287 48 -122 200 -158 -96 54 143 82 -82 -63 132 -56 121 -219 156 -50 142 10
4723A0%k00L31j74J81l36J17M70k90n7j14J14Nj76M8J50J49n06M11O0l02PP6j76
$$ 10 10 -190 141 -33 148 -188 -71 399 109 52 -62 52 57 -119 -71 79 228 -278 133 193 -109 -102 -26 -202
4747b02nk5J46M6P1P3m26M66M5k36l7j9P8r7J77P6k90L11l00J76n4N9j11J34k49
$$ -202 -207 -232 -86 -40 31 104 -322 144 189 -47 -84 -103 -25 -122 55 131 -159 152 -148 28 -26 33 -78 56 -193
4772a93J19K21l60k8M9L74k83L7N8J60k39j01N2M1Kk1R5J00o5j89J86n0J42j65
$$ -193 -74 147 -213 -241 -192 182 -101 -64 -6 154 -85 -186 -134 -93 -91 -112 -17 83 18 -171 15 -35 107 -58
4796e8j01J83K38j2n09P9L33m4k5m7J82r2j10O8jnj80K8k04J56J16m8K75m14J66
$$ -58 -159 24 262 250 -259 -180 153 109 84 37 219 127 17 85 84 79 -101 -73 -277 -121 -5 -53 222 -192 -26
4821b6l0N4J38j01M2K31l67q8J66J6l6O5q0qk59M79j42k95K38j5k76K11j15K12
$$ -26 -56 -2 136 35 77 308 -59 -147 19 35 -1 64 -16 -24 -283 196 54 -241 -3 -18 -294 -83 -198 14
4845A4n7K83l4l63J69j62M8PL71n52N33l67J40j93J0K84k05p7L67j94p7K7n8R9
$$ 14 -43 240 206 -157 12 -150 -102 -95 276 -276 257 -110 30 -163 -153 131 -74 -151 216 22 -55 -28 -86 13
4869A3J24o9j42Mj1p4J12J10K3J50l09J05j36K83k31o7K63o2o2J2J5j9O3q0j56
$$ 13 137 68 -74 -70 -81 -155 -43 67 90 240 -69 36 -100 183 -48 -115 148 86 24 36 51 32 95 15 -141
4894a41J52n4L56k78J1j35K13j84j01K86q9m7K0j36K32k03J20j77P7M35k76k94
$$ -141 11 -43 313 35 46 -89 124 -60 -161 125 36 -11 9 -127 105 -98 22 -155 -78 357 81 -213
4916b13p3K71O7K2J05j41K17k75N5J53q3k56J25o3K49j9j20n0J95j53J40l29K95
$$ -213 -286 -15 52 74 179 38 255 -20 35 188 105 -151 -26 -89 160 141 21 -29 166 13 153 -176 119
4939A19m3k72K3K76j99J70k26j14J22R1J39R1j31j49M9j1j1j03J51P2l3o3R1K3
$$ 119 76 -196 -173 103 -96 74 -152 -266 -144 -53 86 177 46 -103 -54 -65 -76 -179 -28 44 11 -52 39 62
4963F2M8j85J38j31nJ07N7j23RJ85k77J67q8m8Q3m1Q2k01J44Q6J3m0j6k26K62
$$ 62 110 -75 63 -68 -73 34 91 -32 -23 162 -115 52 -36 -84 -1 -42 40 -161 -17 69 82 42 26 -200 62
4988F2J8M6J36r3k21PJ3N0q6P9K9j30PM4J22r6P5j18K24r7j83J3k14J79J92K8
$$ 62 80 126 262 169 -52 -45 -32 18 -68 11 40 -90 -83 -39 83 -13 62 -56 168 71 -112 -99 -313 -134 58 86
5014H6j85J7J61j22NN4k87J81J39lj88N8l1J12jo8Q7j23R8p8J81k85P8kJ02J28
$$ 86 -99 -82 79 -43 -38 16 -271 -90 49 46 -142 -84 -115 -3 -4 -72 15 -108 -10 -88 93 -192 -114 -116 -14 114
5040A14pk24O3r3J41k11Q2m2L70j80j2J96J15k22O5j42O8N4j42J34l6j01k86J66
$$ 114 107 -117 -54 -147 -6 -217 -135 -177 193 13 1 197 312 90 155 13 81 135 -7 127 91 -10 -296 -130
5064a30J20L7M3n4j1r7o6J46j07O9j51K3M3J8O4J95k46J74J45l46J08k8N5P9k26
$$ -130 -10 27 70 16 5 -92 -158 -12 -119 -50 -201 -178 -135 -117 -53 142 -104 70 215 -131 -23 -51 4 83 -143
5089a43Ko1J31n8J90k68J82j91n1K01m15N86j43n6p7O7J15N7K11K1m64K00j60
$$ -143 -141 -202 -71 -129 61 -207 -25 -216 -267 -66 -481 105 -38 -94 -171 -104 11 68 279 300 -164 36 -124
5112a24o8K56Q8l72L69j16J39J37j07l68Q2L97j68j39j74J20o3L6j32K96p7k48
$$ -124 -192 64 152 -220 149 33 172 309 202 -166 -84 313 145 6 -168 -48 -111 -75 -207 89 12 -236
5134b36J63n0J41LM5J13k05o7l7J35J10P6J60k78j79K05j44j56J50l3J18Kj82
$$ -236 -73 -123 18 21 66 179 -26 -93 -130 5 115 191 351 73 -106 99 -45 -201 -51 -84 34 36 -146
5157a46L55N0k62j6j79O6J36M6rJ12J72l27Lq8j21J58L5J76p2j96Q1k1l66M38
$$ -146 209 259 -3 -19 -198 -132 4 50 41 153 325 -2 1 -87 -208 -50 -15 161 89 -107 -26 -47 -413 25
5181B5l3J13o6j51L96k50j0J59j64n3J97j20rj87K35k16J83K7j52o9K05p3R9j48
$$ 25 -8 105 39 -112 284 34 24 183 19 -34 163 43 34 -153 82 -134 49 76 -76 -145 60 -13 86 -62
5205f2l8Q6r9K35j13J06r9n7K3j28J76m4O9N0m3p6o9K85k61k4K04j08J07m4l37
$$ -62 -100 -14 -113 122 9 115 16 -41 -18 -146 30 -14 55 105 62 -14 -83 202 -59 -83 121 13 120 76 -261
5230b61J53l6M7J44m2J9j42M6K18k1Q8Jm52O5J55J75r7K71k32O3j33R0q0l77M81
$$ -261 -108 -144 -97 47 5 24 -118 -72 146 125 213 214 -238 -173 -18 157 60 331 99 162 29 119 39 -338 143
5255A43j21K76l69J52o9K0kk12O4Q7L3M5O5l40M36j32j2l9j87J63m8J84l8k17
$$ 143 22 298 -71 81 12 32 30 -182 -118 -31 2 47 112 -228 208 76 64 25 -162 1 -47 137 99 -118
5279a18J68j15J07j08K1K83l09K69j94j20m5Q6o4M3K72l99J98J35q8j50J07l16
$$ -118 50 -65 42 -66 -45 238 -71 198 4 -116 -161 -75 -139 -96 176 -223 -25 110 22 -128 -21 -337
5301c37L60M2j66M2n1L48j26k23Q6K06k45J93l0oK8k73J36J43j20j17N0o3K95
$$ -337 23 65 -101 -59 -110 238 112 -111 -25 181 -64 129 99 93 121 -152 -16 127 7 -110 -60 -123 172
5324A72l3j49Q7j14j06k8J52j55M8K00k77K65k35K19n3J38%r8P8k32j26J40J52
$$ 172 139 -10 77 -37 -143 -171 -19 -174 -126 74 -203 62 -173 46 -7 131 131 33 111 -121 -247 -107 45
5347D5l5J51l32K16J0j80J11KQ7k05Q0l3jm8p9p0J81J61J04j04mJ0k5o1j74J48
$$ 45 10 161 -171 45 55 -125 -14 -12 75 -130 -50 -83 -84 -132 -211 -281 -100 61 165 61 57 67 42 -19 -193 -45
5373d5N8J39k74J42p6M4m0m2J7J85P0J20l55M09k07l35J15R2j6j61K19j13m7O6
$$ -45 13 152 -122 20 -56 -12 -52 -94 -77 108 178 298 -57 352 145 -190 -75 17 1 -160 59 -54 -101 -35
5397c5J07J5k17K41j61R7o7J88r4r7K49j53r2P5J14j63m4j43K92n81L52K42j96
$$ -35 72 87 -130 111 -50 47 -20 168 74 -23 226 73 -19 56 170 7 -37 -180 112 -469 -117 125 -71
5420g1N0J84J28l85L70k14nK25k89K11k98K03j9l42M01j95N4j36K34j91K0J07
$$ -71 -21 163 291 -94 276 62 57 282 -7 204 -94 109 90 -252 149 -46 8 -128 106 -85 -65 42
5442D2N4J37k35J02j15J7K48j59j33J45l5kl3n7m3%q7R0R2Mj63k6J96K5j11M82
$$ 42 96 233 -2 100 -15 2 250 91 -42 103 68 66 33 -24 -67 -67 -154 -64 28 32 -131 -157 39 64 -47 435
5468D35k09k43L0L7j0o4M2k12J43N8o0N0P9k35J15K16k3Q3j14k00j40K28k7k6
$$ 435 226 -17 13 50 40 -24 18 -194 -51 7 -53 -3 76 -159 -44 172 149 232 118 -82 -222 6 -21 -47
5492d7Q5k00L69j56q1M4K41n19K66J48M2j80N7j62J50q7J12k38LK86j17J89O0
$$ -47 38 -162 207 51 -30 14 255 -264 2 150 192 12 69 -93 57 -30 82 -156 -153 133 16 205 265
5515B65m55J2N8J78K6o0m9j40K87j73J43l19J57N0J83l61J85RR1k00L49qj05L7
$$ 265 -190 -178 -120 58 84 24 -25 -165 122 -51 92 -227 -70 -20 163 -198 -13 -4 87 -113 236 228 123 160
5539A60j59K32k81K7m4J76m6J11j37P4j73J49k00K61l29M37k51k47L43J40p0j6
$$ 160 1 233 -48 -21 -65 111 65 176 39 113 -60 89 -111 150 -179 258 7 -240 103 243 173 157
5561A57k32Q8j30K46j03k13L04K05k08Q2k49J76q2jj01J79J60n44K39j12O4J25
$$ 157 -75 13 -117 129 26 -187 117 322 114 196 -53 123 41 40 -61 118 278 -266 -27 -139 -75 50
5583E0J78m81J11J96j47J16l6O3n0p6P4J65k31J49j49l8k1J98j44J23j11p0L49
$$ 50 228 -253 -142 54 -93 23 -13 50 0 -76 -2 163 -68 81 -68 -106 -127 71 -73 50 -61 -131 218
5606B18k09n4o6k9j5J25J65j65J38r0k66L93j73l9J48q9j92K26J1lnj64M2L4n7
$$ 218 9 -45 -111 -140 -155 -30 135 -30 108 18 -248 145 -28 -67 81 -8 -200 26 37 34 29 -135 -93 -59 -116
5631a16R1j03R8oM8P5m5J79j1J7j89nR0k9m5l74L11o9k12K09P5P5k30K14n2K29
$$ -116 -25 -128 -30 -36 12 87 42 221 210 227 38 33 123 94 49 -325 -14 -83 -295 -86 -11 64 -166 48 -4 225
5657B25k02k60L22k15J90j61pJ2l08L83m8Q9R6j72K13m21J98K45j5j67j52q6K46
$$ 225 23 -237 85 -130 60 -101 -108 -96 -404 -21 -69 20 116 -56 157 -264 -66 179 164 -3 -155 -241 5
5680EQ7j56J04q3J24l69L03p3j51K39k79K40lj53Q5o8j32K91J96K4j89j87M00
$$ 5 92 -64 40 -43 81 -288 15 -58 -209 30 -249 -9 -12 -165 -80 -148 -280 11 207 231 42 -145 255
5703B55j78%J12m88L77J01l09J10m7L1L3R4j43K90j98n4N2j78N1J69l1Q0R3k02
$$ 255 77 77 189 -299 78 179 -130 -20 -67 -36 -3 91 -52 238 40 -14 38 -140 -89 80 49 129 222 20
5727B0jM0q4K39j32pl82L21Q6K00k76r4n1L7L6M8K3j43J13j63K39j3j33j10J12
$$ 20 19 59 -25 214 82 75 -307 14 100 300 24 -70 -121 -84 -48 0 23 -120 -7 -170 69 56 -77 -187 -75
5752g5J11p8m2l48M02Q4k3PK1j09NK27l51J0J80m9Q4k77K60l28M17n3O0KR2k96
$$ -75 36 -42 -84 -432 -30 54 31 38 59 -50 -45 182 -169 -159 21 -28 56 -221 39 -289 128 75 135 137 229 -67
5778f7J13R7j92R8K25k23j41j0K09J54m14L1m7L69k68L05k42J02K6J8k98K60p6
$$ -67 46 143 -49 49 274 51 -90 -100 109 263 -151 -120 -167 202 -66 239 -3 99 125 143 -155 105 29
5801B9J36k49K42k06p8K44J79k51j27J51J01l41K30K11l24j6M1L53k61k30J87
$$ 29 165 -84 158 -48 -126 118 297 46 -81 70 171 -170 60 271 -53 -69 -28 325 64 -166 21
5822B1k9J65k60J86k13J73K20m30J64J63j59r3O0J5J48k32rP9J83r0n4k95RK02
$$ 21 -8 157 -103 83 -130 43 263 -167 -3 160 1 -92 -32 -17 131 -101 -110 -31 152 62 8 -287 -278 -76
5846g6J40j24k17M16l9j27j19K30j44J14n8L39l18n1J28k53L77j16j1K5K9j50
$$ -76 64 -60 -277 139 100 -27 -146 84 -60 54 -4 335 17 -34 94 -159 218 102 91 116 145 -5
5868eK55l63rK39k90Jm9J95p3O8j55O21n17N0j5M1L20k39k4k37J38J84J83k89
$$ -5 250 -113 -122 117 -173 -172 -221 -26 -99 -31 -186 435 -82 -32 -47 -6 314 75 51 -186 -48 136 319 30
5892C0k62N7J93j6m2K20p0l52K76p2oR3j12J55k28pJ85j37k60J20M05k09q8J42
$$ 30 -232 -175 18 2 -40 180 110 -242 34 -38 -44 49 -63 92 -136 -143 42 -95 -355 -235 170 -39 -127 15
5916A5j30O7J21q9K63m58K95j41J70K4j59j82K10M6k01P7Q8o3J07Q3j40k61M58
$$ 15 -115 -48 73 -16 247 -211 84 -57 113 137 -22 -204 6 52 -149 -72 16 -47 60 143 3 -258 200
5939B00k10j31K33j73K82m04K50O8r3J94k64j06Q2M0K9j25N3K40j45J49k73Q0
$$ 200 -10 -141 92 -81 201 -203 47 115 22 216 -48 -154 -72 -32 -3 -128 -75 165 20 169 -104 -24
5961b4j32l0J2K44Mk95K28J01K2k29N43m04N4q7M3l69K63J01ro0J61M7j16O9M2
$$ -24 -156 -186 -174 70 74 -221 7 108 130 -99 444 40 94 7 50 -319 -56 45 36 -24 137 184 68 137 179
5986A79j63L6q9K40Ok72k51N4M53m08J8L9L8L29l83R5J90j47M1j73K82j43q4J84
$$ 179 16 52 -37 203 209 -63 -314 -260 193 -215 -197 -158 -120 209 -174 -79 111 -36 5 -168 114 -29 -113 71
6010G1j2p2l54K03K17j53M1o6R6L73k66j42L94k61%n4j55J28K9k97M78m0l34K63
$$ 71 59 -13 -367 -164 53 -100 -59 -125 -29 344 78 -64 330 69 69 15 -140 -12 17 -280 198 158 -176 87
6034H7l4J9q5L0q2J58M0r0k90K29n9K36j90J27j28P9J09l88M81k98o2J86o7L7
$$ 87 53 72 -13 17 -65 93 133 43 -247 -18 -77 159 -31 96 -32 47 156 -232 249 -49 -111 75 8 45
6058D5J30j90pK4Qj31O0J63k47J37j22j74O6K65k70K96l03K71k56M18r0Q5Pk00
$$ 45 175 -15 -22 2 10 -121 -61 102 -145 -8 -130 -304 -238 27 -243 53 -250 21 -235 183 93 178 185 -15
6082a5N7j51J37k45L10k32K24j00J88L0p4j27J66l67K23j20k26K54j8O2p3L1r8
$$ -15 42 -109 28 -217 93 -139 85 -15 173 203 129 2 168 -199 24 -96 -322 -68 -86 -24 -97 -66 -164
6105a64M5L8l3K16M7j02j94J50k9J6K1J72O7l51K54k90R8L3J54j84r8K65m7J3
$$ -164 -119 -81 -114 102 149 47 -147 3 -26 -10 11 183 250 -101 153 -137 -39 -6 148 -36 -134 131 84 97
6129I7k29J56j32R2m5J41L2l24Q0j9L07k75mk1K55k6K4k4Ok74j12L34M1J4o9l3
$$ 97 -132 24 -108 -16 -61 80 112 -212 -132 -151 156 -119 -123 -144 111 85 109 85 91 -183 -295 39 80 94 25 -8
6155hL1R1j13N8P0k80P3L3J85k46q7K39k51K51j39Q8J19m47L35L6l22M08l7j63
$$ -8 23 114 1 59 129 -151 -78 -45 140 -106 -193 46 -205 46 -93 -5 114 -333 2 38 -284 124 87 -76
6179g6R8N8j6K44k67O8k03K14n9q8J39r7J01j78n1N8L17k95Q2J14n40J94J6M9
$$ -76 22 80 64 308 41 109 -94 120 61 -27 112 15 116 -62 -113 -55 262 -33 49 163 -377 -183 -167 -118
6203a18L06j54j58J81R5k96r0K17j90L8J10J7m7j16M08j78j3J25p4j18j00k9M23
$$ -118 188 34 -124 57 152 -144 -234 -17 -207 -169 -59 -42 -89 -205 203 25 12 137 63 -55 -155 -184 239
6226B39m28J19K5k71L61j76J55j12L11j83J40m29K64p6om0L4Q1M2K0J6j21j19
$$ 239 -189 -70 -45 -316 45 -131 24 -88 223 40 180 -249 15 -61 -67 -107 -73 8 50 70 86 -35 -154
6249a54K22l3j10P2j49o1J92k45L66l40L93k06m1N2k08J96n1Q4QK26k95j38j1
$$ -154 68 35 -75 -3 -152 -213 -21 -266 100 -240 153 -53 -94 -42 -250 -54 -105 -21 -13 213 -82 -220 -231
6272b31K93M9j98P4J30ojj72J21j33K29k45K03pl13m0K46Q1OK4r9p3K06j44P5
$$ -231 62 111 -87 -13 117 111 110 -62 59 -74 155 -90 113 106 -207 -247 -1 80 86 110 11 -62 144 0 75
6297G5J58l51J29K55l03J92j28j38J18J03j02K2j75K81l26L14L6j30r7K6kJ40
$$ 75 233 -118 11 266 -37 155 27 -111 7 110 8 30 -145 136 -190 124 160 30 -67 -41 -43 97
6319I7j71m1K91k37r3K36j26j07K4no2J39j0K20l15K15J06j8l27K97j85o9L93
$$ 97 -74 -115 176 -61 -154 82 -44 -151 -127 -132 -194 -55 -65 155 -160 55 161 143 -184 113 -72 -141 252
6342B52k46lJ3Nn1n2o0L16j71P7O6j84J87l56L12j46N3K02l72J01k8O7Jj22L2
$$ 252 6 3 16 21 -30 -82 -142 174 3 80 146 -38 149 -207 105 -41 12 214 -158 -57 -85 -18 -17 -139 -107
6367a07Q3L3j57L24L5m32K22K5m1L9K39J1j76m1j86K77l6k09j49K98j02N8j46
$$ -107 -24 9 -148 176 211 -221 1 26 -15 24 263 274 98 57 -129 148 112 -97 -246 52 -50 8 -138
6390a38J89j97L50l89K02m4Kp6K53l39K47J42q8l37KL24M7J6j33J09k68K33J56
$$ -138 51 -146 204 -185 17 -27 -25 -101 152 -187 60 202 114 -223 -221 103 150 166 33 142 -126 107 263
6413B63j50k34O6j29J78M12l58N5l97K12K66n8q1r6Q2j17K1j01L5L51k68O8l24
$$ 263 113 -121 -55 -184 -6 406 48 103 -294 -82 184 126 45 -51 31 -86 -65 -166 -131 220 -48 20 -304
6436c04m1L35L17k78p5Q2K9K68j79m8N1k25k8L38k57j70M10k84K06k70L36j73
$$ -304 -345 -10 307 29 -46 36 65 333 154 106 157 -68 -96 242 -15 -185 225 -59 147 -123 213 40
6458D0O4j46o8l5l1O8Q2J79k83J97k19L09k50N1J06L8P9j48o0j16L60l02K20j36
$$ 40 104 -42 -110 -145 -176 -108 -26 153 -130 67 -152 157 -93 -42 64 102 181 33 -27 -143 217 -85 135 -1
6482aJ24k41K12l1J6j52r4L03j78R9r8m8K6K6k0J18J4j62K1K64k36J65Oq2r4Q5
$$ -1 123 -118 94 63 79 -73 -167 136 -42 57 -41 -89 -63 -37 -57 61 75 -87 -66 198 -38 127 133 51 -43 42
6508D2j61K18J72l67J42o8N1m1J09J20j32j6j45K28p6l30L34J71l77J11j40J27
$$ 42 -119 99 271 -96 46 -22 29 -12 97 217 85 69 -76 152 76 -254 80 251 -126 -15 -155 -28
6530b8m2J07n9k05K95j69l2k4j0J26n1o6L26m8K56l08n9j45L25j94K78k46n5K20
$$ -28 -70 37 -22 -227 68 -101 -133 -157 -167 -41 -92 -158 168 120 376 68 9 -136 189 -5 273 27 -28 192
6554A92j25p0O3j20J92j68k6J76j61oP4o3K25J4j41l4J58j62Q2l8l7k91N10l59
$$ 192 67 -3 60 -60 132 -36 -62 114 -47 -53 21 -42 183 197 56 22 180 18 100 62 25 -266 244 -115
6578a15j16M09j02J16l35J58O5j12P6j65N9q4K1J83j17K74q9q2J40j04m6l0P3
$$ -115 -231 178 76 192 -143 15 80 -32 44 -121 -62 -146 -125 58 -59 215 126 44 184 80 34 4 77
6601G7o4l56K94J38k91L08J88k19j62J18o2K08j20N0j79j88J07L33k38j11K42
$$ 77 13 -343 -49 89 -202 106 294 75 -87 31 -31 177 57 107 -72 -260 -153 180 -58 -169 73
6622G3n5j36K07j48k4J64j15J43j0o5n2J13j39L36k63J00j47nk4M8j23j96L1L15
$$ 73 18 -118 89 -59 -83 81 -34 109 99 34 -18 95 -44 292 29 129 -18 -23 -47 1 -122 -318 -287 28
6646B8J17k70k5k3K76j1N5k39J75Q8j08l9j89J63J57P0k88O6K2j05L71k02J98
$$ 28 145 -125 -150 -173 103 92 147 -92 83 171 63 24 -165 -2 155 225 -63 3 25 -80 291 89 287
6669B87l83N3q9O3K04j40J22J22k20K75j86J17l20J98m1k56J81k8J21j39J60n1
$$ 287 -96 -43 -132 -69 135 -5 117 239 19 294 108 225 -95 103 62 -194 -13 -41 80 -59 101 50
6691E0j67K11K20k50j48J0J02J72l47K9R2L91j70j24l0J37P2k44J4k03K14j01
$$ 50 -117 94 314 64 -84 -74 28 200 -147 -118 -26 365 195 71 41 178 250 6 20 -183 31 -70
6713g0J65j61J24J34l11M6p3K67j55q0R8J4k07J21J71l3K87k17m8q8J48k0j53
$$ -70 95 -66 58 192 -119 -73 -146 121 -34 -114 -16 -2 -209 -88 83 50 337 120 72 -16 132 112 -41
6736d1n1L39j03k78J67mj66M25k18j31J49m27K08R1o5K73l57n3Q4K77K4l0k08
$$ -41 -92 247 144 -134 33 29 -137 288 70 -61 88 -339 -131 -40 -105 168 -189 -242 -158 119 143 113 -95
6759i5NN8J35j33J00l00K34J69l33L11R3j83oR7j31K39j78j01O6oj42K02L0J65
$$ -95 -90 -32 103 -30 70 -230 4 173 -160 151 244 61 55 152 21 260 82 -19 47 41 -101 101 131 296
6783B96k16n0k06J02j4J20j02J26l8j40K11n5K21k11n4n7L9o1N3J13K05j95K17
$$ 296 80 30 -176 -74 -88 32 -70 56 18 -122 89 34 255 44 -10 -67 -28 -89 -36 77 282 87 304
6806C04m60J21M0k94K78k1n5J91j90K7j10j05L74j2k71R4r2J55o5J86l5J2M3R0
$$ 304 -156 -35 5 -289 -11 -32 -87 104 -86 -59 -169 -274 100 88 -183 -89 -181 -26 -91 95 60 72 115 205
6830B05k90K93j36K55k95l32M07j50j3p1l4k2K12rj09L8LN1PJ37k76J02j13k3
$$ 205 -85 208 72 327 32 -300 107 -43 -56 -127 -161 -183 29 20 -89 -51 -48 3 10 147 -129 -27 -140 -163
6854a63n3K75j04L39j67j54K12l20N76m08j09L5ok9J31J38l61J20Q6j28K09q4
$$ -163 -216 59 -45 294 127 -27 185 -135 441 33 -76 -41 -47 -76 55 193 -168 -48 38 -90 119 35
6876C5j27jj73K76Kq4J44j29O6R7r0l22N20j08l16L7K59p4n2K67l33J41n7K71
$$ 35 -92 -93 -266 10 12 -72 72 -57 9 106 16 -306 214 106 -210 -173 86 12 -40 227 -106 35 -22 249
6900B49k20O4j76J86k24J1q3R0J54k55j12K78K12n03K41O0J27j98j94J43J03J60
$$ 249 29 93 -83 103 -121 -110 -193 -103 51 -204 -316 -38 174 -329 -88 -28 99 -99 -293 -150 -47 113
6922A13k8j14J68k39K42l4k5j64mJ71R9p5r1M7j55R5j7j74K49J6q8N6j28r2M4
$$ 113 85 -29 139 -100 142 108 83 -81 -85 86 185 110 19 66 -89 6 -11 -185 64 80 -8 48 -80 -172 -128
6947a28J3K60p9j52N1P2q7J02j70P4m6J94l0l35J37r6N10J1k69k4N4j60j00J80
$$ -128 -115 145 66 -86 -35 37 -50 52 -118 -44 -90 104 74 -261 -124 -220 290 301 32 8 62 -98 -198 -18
6971a8k7j29K12k33L91o8m1m1j14lr4L12j95j71J52l2K17%k30N2JQ5J40R9r4j99
$$ -18 -45 -174 38 -195 196 128 87 46 -68 -71 -165 147 -48 -219 -67 -99 118 118 -112 -60 -59 26 166 265 171 -28
6997b8P2k15J02L47j82m82K31J45J25q0q7j79J29k09K00J85k03Q8J13m2J7j23
$$ -28 44 -171 -69 278 96 -386 -155 -10 115 35 -52 -231 -102 -311 -111 74 -129 -41 72 30 47 -76
7019g6J06m9j18L05pj59M3o0K7j48K23k40P0n1J76r7n8J09j90M17m51K21j2j76
$$ -76 30 -19 -137 168 161 2 45 -15 12 -136 87 -153 -83 -134 42 -55 -113 -4 -194 223 -228 -7 -19 -195
7043a95K55J36j58k33K72Q2l11m1K17k51J61j11K55Q2q5k40J00K10q6j01K89l15
$$ -195 60 196 38 -195 77 159 -152 -193 24 -227 -66 -177 78 160 75 -165 -65 145 59 -42 247 -68
7065f8K2J14L08m71K96j73k35K30l3J2J43l54K83j76J1J37q9J6K59j13j69M29
$$ -68 -46 68 376 -95 201 28 -207 23 -10 2 145 -209 74 -102 -91 46 -43 -27 232 119 -50 379
7087C79m25j26N4R9O8K40k42j97J64j05R0O5k7O5k27Q9l86P35l14M3O6M4N1J3
$$ 379 -46 -172 -118 -19 49 289 47 -150 14 -91 -1 64 37 102 -125 -36 -422 313 -1 42 108 152 203 216
7111B16k07p6M7j54K89J97l10k46J67J32k62M50l95J53j08L1k1Q4l4M7J94j91
$$ 216 9 -67 -20 -174 115 312 2 -244 -77 55 -207 243 -152 1 -107 -76 -97 -13 -47 0 194 3
7133CJ59k12J39q7J56j34J09k29Q7k28L97j62j22K88j13J20m5mk85K99n2k52J25
$$ 3 162 -50 89 2 158 24 133 -96 -9 -237 160 -2 -124 164 51 171 126 122 -163 136 84 -168 -43
7156d3j3J63o7k8K3j39Q3J68j90J63j49J60j84k16J85J6J25J32m13J43K8j35K26
$$ -43 -56 107 40 12 35 -104 -21 147 -43 120 -29 131 -53 -269 -84 -68 57 189 -224 -81 -53 -188 38
7179C8r6o6J0J17j42L83j34K40j56j36j81M49j84k05l8L9l3l0O8J30j36J09r9
$$ 38 -58 -124 -114 3 -139 244 110 350 194 58 -123 326 142 -63 -101 -62 -95 -125 -57 73 -63 46 -53
7202e3K0k5l8j01j38L29J48m36K38J08Q8j43J66n4n4M5k23J25j22K29l92J12N7
$$ -53 -33 -58 -96 -197 -335 -6 142 -294 -56 52 140 -3 163 109 55 100 -123 2 -120 109 -283 -171 -114
7225a14N7J02j69J69n8k7q8J42j37J7j59N1L58J73r2j55k76K18K52r7l52M63j64
$$ -114 -57 45 -124 45 -13 -40 -128 14 -123 -106 -265 -214 144 317 225 70 -206 12 264 167 -185 278 114
7248A14l37J88J6M8LOl3kj02lJ38j82J13J13k26P9J59MP1l30K94j19k96L67k37
$$ 114 -223 -35 -19 29 32 38 5 3 -99 -102 36 -146 -33 80 -146 -67 92 96 167 -163 131 12 -284 83 -154
7273a54M54p2J4j60r8J06m8k27P2P6M0O3j8j87K77j28K24J04k51l3l1k7K42l50
$$ -154 300 228 242 82 -16 90 42 -185 -113 -37 3 66 48 -139 138 10 234 338 87 54 23 -4 238 -112
7297a12PK41p8N6l92K16K14J05j80l77M69j27O8j03N8n0P3m73M25j4M3k8j73K34
$$ -112 -105 136 58 114 -278 -62 152 257 77 -300 169 42 110 7 65 15 88 -385 40 26 69 41 -132 102
7321A02j46J85j63j50K24P8j41K36k35P4j90K07m5l02L22qO4jJ02k66K05k13n5
$$ 102 -44 141 -22 -172 52 130 -11 225 -10 64 -126 81 36 -266 56 48 112 111 213 -53 152 -61 -116
7344a16J28K2n0k83L86K77m72P2J98k02K99l96K34j21K52k33J24j80L43m05P9
$$ -116 12 34 -16 -299 87 364 -108 -36 162 -40 259 -137 97 -24 228 -5 119 -61 282 -123 -44
7365d4J39q0K5k9J36r6j10R7jj42M1M00m48J12J5M0o0L9k20J33pj22N1J09Q5k30
$$ -44 95 15 40 11 147 51 -59 38 37 -105 -64 336 -112 0 15 55 -5 34 -186 -53 -60 -182 -131 -22 63 -167
7391a67P7J6OL5n6J63j92q0K90J98l80o5J19K32l12J2j48M22L5k01j88L69q7l58
$$ -167 -90 -74 -68 -33 -89 74 -118 -198 92 290 -90 -155 -36 196 -116 -104 -252 170 205 4 -184 185 98 -260
7415b60L28kQ3j37P7j85n7K82j60J7N4p7J91k01L3l1J03P9l4j30k98K08j40L29
$$ -260 68 66 149 12 89 -96 -153 129 -31 -14 40 -37 154 -47 -14 -45 58 137 103 -27 -325 -117 -257 72
7439G2k17J51j58K48L4l70L60j79N4J06l81L44o7K6k25J11k98M35n1J10o6l12
$$ 72 -145 6 -152 96 130 -240 120 -59 -5 101 -280 64 -3 23 -202 -91 -389 46 -5 105 39 -273
7461b73M31k00K28l59L26k33L17m75L91j37j81J55j61J82k57J38J7J57Qn5J02
$$ -273 158 -42 186 -173 153 -80 237 -238 153 16 -165 -10 -171 11 -246 -108 -91 66 74 19 121
7482A21p1q9k03K12j34J58K55n01J27P7J55k11O7r7K72J3j19j79K65j02O7l2j43
$$ 121 50 -39 -242 -30 -164 -6 249 -252 -125 -48 107 -104 -37 -134 138 151 32 -147 118 16 83 51 -92
7505i2j07J02M7K80m9r7j09j49LK42m9K6k7k06L80k69J19l4K14o5o1k26L5j25
$$ -92 -199 -97 -50 230 181 84 -25 -174 -171 71 22 48 21 -185 195 -74 45 11 225 160 99 -127 -92 -217
7529b17K63L3j78N0k36J45L1L11k15J29k5p6j02J12l7L8j78m7Q1m3Q9M9j76L71
$$ -217 46 79 -99 -49 -285 -140 -109 202 -13 116 91 15 -87 25 -12 26 -152 -199 -118 -161 -72 -23 -199 172
7553A72j12k93K98Q4J6k84R8j2j50K08o4k12L54j11K42l28J57r7J22j25R0j12
$$ 172 60 -233 65 149 165 -119 -21 -33 -183 25 -39 -251 103 -8 234 -94 63 -34 88 -37 53 -59
7575e9M8o5J67l2l4n4mJ33k93J76K3J53j4l02L3j94J96L48m36N4K87k85rK8k7
$$ -59 -11 -76 91 59 25 -29 -33 100 -193 -17 6 159 145 -157 -124 -318 -122 226 -210 -156 131 -154 -163 -135 -162
7600a62K47l5j64L25J19n72J22L63k87M7l0k76K60N0l6k77M03K4p0j11j74K78
$$ -162 85 50 -114 211 330 -242 -120 243 -44 3 -27 -303 -43 7 -29 -306 97 121 51 -60 -234 44
7622D4%J5l9J00M6l95J09p8K52k11L3L0OK13m1J86l31K60j14j76Mk6o2P1k44M2
$$ 44 44 59 20 120 166 -229 -120 -198 54 -157 -124 -94 -88 125 84 270 -61 199 85 -91 -87 -113 -175 -104 -348 -306
7648c06J60n8K08m3q8j88N17k18K93j57j97k06M08j35J97k53J41j63L82l88J56
$$ -306 -146 -204 4 -39 -127 -315 202 -16 277 120 -77 -283 125 -10 187 -66 75 -88 294 -94 62
7669F2k1j42J54j39K30k60L31Qj78J7n7L7K08k82K01k02R2j02J18k02L1N2J14
$$ 62 41 -101 53 -86 144 -116 215 223 45 62 5 42 250 -32 169 -33 59 -43 75 -127 -96 -44 70
7692G0j96J23N6n5K9j2O1j05K49j76m0j01m0M23j08l29J23j3r5K21j95R8J4j18
$$ 70 -126 -3 53 -2 27 15 76 -29 220 44 4 -97 -137 286 178 -151 -28 -41 -136 85 -110 -12 2 -116
7716a16L23l71J37j22L6J31Lk59K83mJ21K7n93L27K33j07j19o5J21R9J49l0J26
$$ -116 207 -164 -27 -149 -113 18 21 -238 45 41 162 189 -404 -77 156 49 -70 -135 -14 85 234 204 330
7739C30l47J03j81k08J98KJ8J13l54J01L42Q3j72j49L98j55j15J60j62J00r8k06
$$ 330 -17 86 -95 -303 -105 -103 -85 28 -326 -225 117 200 28 -121 277 122 7 167 5 105 7 -199
7761a99J14L01k80J22j53J65N8j06l1J23p2q1m1L22m50K39j32P7r4j68K37J42
$$ -199 -85 216 -64 58 -95 70 128 22 -9 114 42 -39 -80 242 -208 31 -101 -24 -118 -286 -49 93
7783I3j63j07J41M9o0j25J10j08O7O7O3j99K36j6J33l98J89n8K87j34J51o8m49
$$ 93 -70 -177 -36 13 -47 -172 -62 -170 -103 -36 27 -172 64 48 181 -217 -28 -86 201 67 218 150 -299
7806b99L44k5P9j25j7jJ70k17NQ2K13j48p4J25j22j17m6J97N1j12j07J7J1K9J35
$$ -299 45 20 99 -26 -43 -44 126 -91 -86 -4 209 61 -13 112 -10 -127 -173 24 75 -37 -144 -127 -116 -87 48
7831D8j67r9L45j2j67J88Om32J52M48k73J47J01l92K99m51L38j63P6L7pj24lK19
$$ 48 -119 -218 127 115 -52 136 142 -290 -138 310 37 184 285 -107 192 -259 79 -84 -8 29 22 -102 -105 114
7855A14k32k7J10J9k60J79j60K20J02r6j4K79k88J03p6J38l28L19l14J10K89l15
$$ 114 -118 -145 -35 -16 -276 -97 -257 -37 65 -31 -45 234 -54 49 -27 111 -217 102 -212 -102 187 -128
7877a28P5j55J42L13m03L17n2j75q4M9N8k50M56n7j88J43l8K2j59M41j28o3J4
$$ -128 -53 -208 -66 247 -156 161 109 -66 -150 -101 -43 -293 163 106 -82 61 23 45 -114 327 199 136 150
7900A50k07m7N6O6j91J08K62k01q6J40j55J53j28P2k04K94q4j42K38l1l65J25
$$ 150 -57 -104 -48 18 -173 -65 197 -4 -90 50 -105 48 -80 -8 -212 82 -2 -144 94 63 -302 -177
7922a77J60K13j15o4r3K07M1l7j63k47M12j22J35J7k00j14L2J05K11p7k94K8j62
$$ -177 -17 196 81 17 -76 131 172 135 -28 -275 137 15 150 167 -33 -147 -115 -10 201 124 -170 -142 -304
7945c04L42N8n6J03o0Q0j64O4k38J94P7M5q8Jj56%J64J21j41K51l34j2k2J55m6
$$ -304 38 96 40 143 83 163 -1 63 -175 19 96 141 53 54 -102 -102 62 183 42 293 -41 -53 -75 80 34
7970C4q2M3j06J99j6Q4m12J09L46r7j24N6k47J81J72j16J08L23p44K15j18J11
$$ 34 -48 -5 -111 88 72 156 -256 -147 199 102 -22 34 -213 -32 140 24 132 455 -289 -74 -192 -81
7992h1K86m31K26K07o7j93J37K7j87K11j57o3R5P4j74P0J73l48J80j70K00j85
$$ -81 205 -226 0 207 140 -53 84 111 -76 135 -22 -85 10 84 -90 -20 153 -195 -15 -185 15 -170
8014a70J13M10l45j85L70p1j00p6n3J24k1O6j0j54O0k04K49j55K44J69j41j33
$$ -170 -57 353 8 -177 193 122 22 -54 -107 17 -4 62 52 -102 -42 -246 3 -152 92 261 120 -13
8036a3mJ46k92L73r3k75J03p6L16k4k09J25j89J24q3J2L88m20K17k20n2N1P9k7
$$ -13 -17 129 -163 210 117 -158 -55 -131 185 161 -48 77 -112 12 -71 -59 329 -91 126 -94 -146 -95 -16 -43
8060d3R4o0J97k81o7J55q4o7K37Q7j31r6K79k17k78K65p7K14J41l18p8J50l8Q8
$$ -43 51 -9 188 -93 -160 -5 -89 -156 81 168 37 -59 220 3 -275 -10 -87 127 268 -50 -128 22 -16 72
8084G2j02J56J92k18l08J32L0K20p6j74j9K11K0j55J18Q3j77M8J71j60k56K56
$$ 72 -30 126 318 100 -208 -76 -46 174 98 -76 -95 116 136 -19 99 182 5 53 224 64 -192 64
8106F4m5P3k01n3J51J7k2K3n0J23j45o4n1J30J66n5N9j78K44k77J28j36j01L29
$$ 64 19 92 -109 -162 -11 6 -16 7 -43 80 -65 -129 -180 -50 116 61 120 -58 186 -91 37 -99 -200 129
8130A29k27J40Q6O9q3l1j65j05n9K74k10Q7K50o7p3k87K88J42k37j0L29j64Q3
$$ 129 -98 42 128 197 114 83 -82 -187 -246 28 -182 -95 155 88 15 -272 16 158 -79 -89 240 76 159
8153A59l73J35K0JK18l38O2r1K09K47k73J27l99N34j52j04o1K3q2j3K46ml4j18
$$ 159 -214 -79 -59 -58 160 -178 -116 -207 2 249 -24 103 -296 238 86 -18 -79 -56 -138 -151 95 91 57 -61
8177f1L04j8j37N5l26M11l27P4L7J91j80J64q5j63
$$ -61 243 225 88 143 -183 228 -99 -25 12 203 23 187 102 -61
8191f1
$$ Imaginary data points
##PAGE= N=2
##DATA TABLE= (X++(I..I)), XYDATA
0@%%%%%%%%%%%%%%%qJ6j6J6j6K3l1L2l7M5m9N7p1P9q8J04j20J36j52J70j93K17
$$ 0 0 0 0 0 0 0 0 0 0 0 0 0 0 0 0 -8 8 -8 8 -8 15 -16 16 -21 24 -25 32 -39 40 -48 56 -64 72 -80 90 -103 114
37A14k42K70l01L36l73M14m58N05n58O17o81P49q24R08j000J104j219J347j494
$$ 114 -128 142 -159 177 -196 218 -240 265 -293 324 -357 392 -432 476 -524 580 -639 708 -786
56g86J659j848K069k330K646l036L530m177N063o361Q443j2300K1710q4440r6294
$$ -786 873 -975 1094 -1236 1410 -1626 1904 -2273 2790 -3571 4872 -7428 14282 -70158 -166452
71a66452K20684J549j27541R4092R5846j16748j6497Q2173n3019o3933N7130L527
$$ -166452 54232 55781 -71760 22332 118178 1430 -15067 67106 14087 -49846 7284 10811
83A0811l7618L2332J2062l9371J8915J6383m0571N07L2154l0814j5336M6172L374
$$ 10811 -26807 5525 17587 -21784 -2869 13514 -27057 -26550 5604 -25210 -40546 5626 9000
96I000l2552L3260L6669k5802o970L0715j9622l6174J4052J998l9786J15L1573
$$ 9000 -23552 9708 46377 20575 13605 44320 24698 -11476 2576 4574 -35212 -35097 -3524
109c524r715j3006K9735J3734j5601R547J5290j5357j0100M481j1261q553Q426
$$ -3524 -13239 -26245 3490 17224 1623 11170 26460 11103 1003 5484 -5777 -14330 -5904
122e904n085m676J9685O916j2313R759J0192k0366l414J7269j4337j9066J9647
$$ -5904 -10989 -15665 4020 10936 -1377 8382 18574 -1792 -5206 12063 -2274 -21340 -1693
135a693P009k0879P582J9254j3584m624K0989o556j7985J1316L120j7542N253
$$ -1693 5316 -15563 -7981 11273 -2311 -6935 14054 7498 -10487 829 3949 -13593 -8340
148h340J3260j0089K67J5578k548m405R100m152p023J1382k986j6542P640O829
$$ -8340 4920 -5169 -4902 10676 8128 3723 12823 8671 1648 13030 10044 -6498 1142 7971
162G971j9342k201J5633j0813j1538J5647K010j4948O684J3173n971J906J4080
$$ 7971 -11371 -13572 2061 -8752 -20290 -4643 -2633 -17581 -10897 2276 -3695 -1789 12291
175A2291J104k171O079k819o823K135n412j0299M040K838j1095k22R121n040n394
$$ 12291 13395 11224 17303 14484 7661 9796 4384 -5915 -1875 963 -10132 -10354 -1233 -6273 -11667
190a1667R457J661p746N064M640p621J280Q823k146q28R442J988n375J672M72
$$ -11667 -2210 -549 -8295 -3231 1409 -6212 -4932 3891 1745 917 10359 12347 6972 8644 9116
205I116q394l604O12n384k903M513J277p05M867M658L28K634K090n557k502J895
$$ 9116 722 -2882 -2270 -7654 -10557 -6044 -4767 -5472 -605 4053 4381 7015 9105 3548 1046 2941
221B941n936o686M421M292l764K329Q646j291m332L039j080p059m84q2n412J543
$$ 2941 -2995 -9681 -5260 -968 -4732 -2403 6243 4952 620 3659 2579 -4480 -4964 -5046 -10458 -8915
237h915O500j149K343J0510N84k480O486q94j0589j090O94j0777k890O440j778
$$ -8915 -2415 -3564 -1221 9289 9873 7393 13879 12985 2396 1306 2000 -8777 -11667 -5227 -7005
252g005q92R373J237j718P652q37r464L901K584j3165k497J1070m553n986J2229
$$ -7005 -7897 1476 2713 995 8647 7810 -1654 2247 4831 -8334 -10831 239 -4314 -10300 1929
267A929N139p004M939N892q620k902M254o115n475N547K44l268O474L885l556
$$ 1929 7068 64 5003 10895 2275 -627 3627 -2488 -7963 -2416 -2172 -5440 1034 4919 1363
282A363L264L660n473k817K467n027n286L208P30k661M750M500l704J919N858
$$ 1363 4627 8287 2814 -3 2464 -2563 -7849 -4641 -3911 -6572 -1822 2678 -1026 893 6751
297F751m880o232N409J365r139J087R270k602l598Q889K753o328K254K872p725
$$ 6751 1871 -4361 1048 2413 -6726 -5639 3631 1029 -2569 6320 9073 2745 4999 7871 146
312A46k706L320o206l436P770j158m315Q464M119q730L139P484r940n616R890
$$ 146 -2560 760 -5446 -8882 -1112 -2270 -6585 1879 5998 -2732 407 7891 -2049 -7665 2225
327B225k727j0003Q520O533q096L702J0366o699m435R377m168j2279N326M640
$$ 2225 -502 -10505 -1985 4548 -3548 154 10520 3821 -614 8763 4595 -7684 -2358 2282
341B282j0926P18J1626k167l960Q739J402n550K379k58p838Q27K416p751K91Q565
$$ 2282 -8644 -7926 3700 1533 -2427 6312 7714 2164 4543 4285 -3553 -2726 -310 -8061 -7770 795
357G95k899l458R861K238q849K276O354q291n507O922P1n639M400N487q71K018
$$ 795 -2104 -5562 4299 6537 -2312 -36 6318 -1973 -7480 -558 -487 -6126 -1726 3761 2890 4908
373D908K985k554j087P35n913m561K490j524n216L737O131j479Q88O549J84l528
$$ 4908 7893 5339 4252 4987 -926 -5487 -2997 -4521 -9737 -6000 131 -1348 -460 6089 6273 2745
389B745J472n31o064k216J894k869k673N100L080j445L594M636k019j724K204
$$ 2745 4217 3686 -2378 -4594 -2700 -5569 -8242 -3142 -62 -1507 2087 6723 4704 2980 5184
404E184j556m790o62K071j269j190K038K421J038p47o05J460j562n030k836J662
$$ 5184 3628 -1162 -1824 247 -1022 -2212 -174 2247 3285 2538 1933 3393 1831 -3199 -6035 -4373
420d373j747l928J972M847oJ804N290J673R5J912P3k173q01j388k570R9p07k453
$$ -4373 -6120 -10048 -8076 -3229 -3235 -1431 3859 5532 5627 7539 7612 5439 4638 3250 680 779 72 -2381
438b381N50J099k589o11K215j483k111K677L42j899L598K075j688K367M574k290
$$ -2381 -1831 -732 -3321 -3932 -1717 -3200 -5311 -2634 -2292 -4191 -593 1482 -206 2161 6735 4445
454D445k315L368L38m967j375J156j979k171l96M84M27n39l57K262J781j358L85
$$ 4445 2130 5498 5836 869 -506 650 -1329 -3500 -3896 -3412 -2985 -3524 -3881 -1619 162 -1196 -811
471h11L505N61k044J599J806j593j667J096J41k817k194J311R2k083p73K356J271
$$ -811 2694 3255 1211 2810 4616 3023 1356 2452 2593 -224 -2418 -1107 -1015 -3098 -3871 -1515 -244
488b44k050J66K071q96j557Q19J419r95K05K672O09m38K153J304j946k44J450
$$ -244 -2294 -2128 -57 -953 -2510 -1691 -272 -1267 -1062 1610 2219 1781 3934 5238 3292 3048 4498
505D498k206l600K04O88k464k53K372K70n93K178K82j497o30j147k044o64j176
$$ 4498 2292 -1308 -1104 -416 -2880 -3133 -761 -491 -1084 1094 1376 -121 -751 -1898 -3942 -4606 -5782
522e782j688K466K945o3K342O777Q73k116L078K667o256l797K072k831n792J428
$$ -5782 -7470 -5004 -2059 -2122 220 6997 7870 5754 8832 11499 5243 1446 3518 687 -5105 -3677
538c677J860l538P64L827j557j656L163j29l249R64J446k363J507L730j12J594
$$ -3677 -1817 -5355 -4591 -764 -2321 -3977 -814 -943 -4192 -3228 -1782 -4145 -2638 1092 980 2574
554B574N334k40k395L065p20o858p36M23o434k090M923k634k782P475L171m911
$$ 2574 7908 7668 5273 8338 7618 760 24 447 -5987 -8077 -3154 -5788 -8570 -1095 2076 -2835
570b835L391O190m665l552M903j067n091K695K566l156J428L749k939j092K857
$$ -2835 556 6746 2081 -1471 3432 2365 -2726 -31 2535 -621 807 4556 1617 525 3382
585C382k686m328J766o96m686J651L293k215O78O097J801k117L277K085l296j454
$$ 3382 696 -3632 -1866 -2562 -7248 -5597 -2304 -4519 -3841 2256 4057 1940 5217 7302 4006 2552
601B552M43k861j991J450j582j290L463P19l207J850L563l133k835K943o71m353
$$ 2552 2995 134 -1857 -407 -1989 -3279 184 903 -2304 -454 3109 -24 -2859 84 -587 -4940
617d940Q79K284j645L19L800M79l55K417J052k196P90R03k910o31K302k260k264
$$ -4940 -4061 -1777 -3422 -3103 697 1176 821 3238 4290 2094 2884 3787 877 246 2548 288 -1976
634a976K792R07l328Q96K228j693j699M90o54j147P41l57m98K076O54r42J371
$$ -1976 816 1723 -1605 -709 1519 -174 -1873 -1383 -2037 -3184 -2443 -2800 -3298 -1222 -568 -1510 -139
651a39K260n45n82J294J024r45l49j72j06r24j086L05J06j070o18P93m5j307L03
$$ -139 2121 1576 994 2288 3312 2367 2018 1846 1740 816 -270 35 141 -929 -1547 -754 -799 -2106 -1803
670a803J352l31j06P16P29l15j18k38Q2N95o7j048M30J311j190j146J060K92q73
$$ -1803 -451 -782 -888 -172 557 242 124 -114 -32 563 496 -552 -122 1189 -1 -1147 -87 205 -668
689f68N01M57n42J8Q45q72Q19J924r19j423K020J98k934n5J693k202j415K099
$$ -668 -167 290 -252 -234 611 -261 558 2482 1563 140 2160 2358 -576 -631 1062 -1140 -2555 -456
707d56K88k279N71J756m38o75R62R5R1K14r30P5J570n31q47J868J883j972o68
$$ -456 -168 -2447 -1876 -120 -558 -1233 -271 -176 -85 129 -801 -726 844 313 -534 1334 3217 1245 577
726E77K550j219k329R60K10j864n05J273j513q28K294M33j387J322J406j795m71
$$ 577 3127 1908 -421 539 749 -1115 -1620 -347 -1860 -2688 -394 39 -1348 -26 1380 -415 -886
743h86Q67j169p88J440k84o4J099j60k06J554q3j604J816J213k907k22K737j601
$$ -886 -19 -1188 -1976 -536 -820 -884 215 55 -151 1403 1320 -284 1532 2745 -162 -384 2353 752
761G52l144K547J971k499k15K078j157j074P02m80j266J083O7j323J749J62k116
$$ 752 -2392 155 2126 -373 -588 1490 333 -741 -39 -519 -1785 -702 -635 -1958 -209 -47 -2163
778b163J132K187j811o18K818k32k367J697K084k456m32K906j092j668J351j74
$$ -2163 -1031 1156 -655 -1273 1545 1313 -1054 643 2727 271 -161 2745 1653 -15 1336 1162
794A162k589J331J160k642l62K667j068j802K181O83k403Q57J829j409n67J564
$$ 1162 -1427 -96 1064 -1578 -1940 727 -341 -2143 38 721 -1682 -825 1004 -405 -972 592
810E92j123j268K525j33k192K123J737k635q9L145k296k167L380O06m390K117
$$ 592 -531 -1799 726 593 -1599 524 2261 -374 -463 2682 386 -1781 1599 2205 -2185 -68
826f8L044l157j321L435n29k876K342K69k982J144J423l050K94L036k297j342
$$ -68 2976 -181 -1502 1933 1404 -1472 870 1139 -1843 -699 724 -2326 -2032 1004 -1293 -2635
842b635L260l04k822K446J631l231Q60L099k372j014L632Mk438J802J786k497
$$ -2635 625 321 -2501 -55 1576 -1655 -795 2304 -68 -1082 2550 2554 116 1918 3704 1207
858A207m18J768j662k370J552r4k575P38J455j376n8P94q8K13K83p76K36J630
$$ 1207 789 2557 895 -1475 77 -17 -2592 -1854 -399 -1775 -1833 -1039 -1127 -914 -631 -1407 -1171 459
876D59p25j579J954J671j328k99K932k71j932J305O77j971j123J025p49j782K09
$$ 459 -266 -1845 109 1780 452 153 3085 2814 882 2187 2864 893 -230 795 46 -1736 -1527
893a527O48j295j43J108K96N01K49K0K26P19p83l19Q48K18n87N86O51r19M82N66
$$ -1527 -879 -2174 -2317 -1209 -913 -412 -163 -143 83 802 19 -300 548 766 179 765 1416 497 979 1545
913A545j575j45J324j140k078J489P74k093J35K299j247j90J832J42m72Q67J59
$$ 1545 -30 -175 1149 9 -2069 -580 194 -1899 -1764 535 -712 -902 930 1072 600 1467 1626
930A626j443J052N1k132M28J421k347q37K781r48k674J973J108k493k0K341p64
$$ 1626 183 1235 1286 -846 -418 1003 -1344 -2181 600 -348 -3022 -1049 59 -2434 -2454 -113 -877
947h77m66J910K4n05K173P8j287J657J387k251m94J553k005j765P93j23j864K27
$$ -877 -1343 567 591 86 2259 2337 1050 2707 4094 1843 1349 2902 897 -868 -75 -198 -2062 -1835
965a835R24j463k0J284o70r52J550k4j067J468J451j069P39K288J33j121J063
$$ -1835 -911 -2374 -2394 -1110 -1780 -2732 -1182 -1206 -2273 -805 646 -423 316 2604 2737 1616 2679
982B679J492j700m10K86j203j359l37m03j170N7L8j061Q81J379j219j5K018K58
$$ 2679 4171 2471 2061 2347 1144 -215 -552 -955 -2125 -2068 -2030 -3091 -2210 -831 -2050 -2065 -47 211
1000B11j006Q62Q50l64J29J093m13j69J135p32q28Q79o85j611N52j27j847K74
$$ 211 -795 67 917 553 682 1775 1362 1193 2328 1596 768 1647 962 -649 -97 -224 -2071 -1797
1018a797J725j264q48J852L68r46J164M08m83Q71K87j428M59J164j517q34J656
$$ -1797 -72 -1336 -2184 -332 36 -910 254 662 179 1050 1337 -91 368 1532 15 -819 837
1035H37p97j336J219Q8j335O46N34j603M49J570j178l71K508j3j842J847J269
$$ 837 40 -1296 -77 11 -1324 -678 -144 -1747 -1298 272 -906 -1277 1231 1218 -624 1223 2492
1052B492k114r7K118j061k057J656K48j763K07O05j114l19Q22j426J40J086o23
$$ 2492 378 281 2399 1338 -719 937 1185 -578 -371 234 -880 -1199 -377 -1803 -1663 -577 -1200
1069a200j246J497J096j694M89K311n82r05J776P83j667R03J274j798n53J943
$$ -1200 -2446 -949 147 -1547 -1058 1253 671 -234 1542 2325 658 1561 2835 1037 484 2427
1085B427j360k354J669L61k618M80J576k079p52K235m76j569J509J285j853Q77
$$ 2427 1067 -1287 382 743 -1875 -1395 181 -1898 -2650 -415 -891 -2460 -951 334 -1519 -642
1101f42J821j227j6K022j061p06K288j85k734J671J328l153l45K655j688k174
$$ -642 1179 -48 -64 1958 897 191 2479 2294 -440 1231 2559 -594 -939 1716 28 -2146
1117b146K297N91k963J155K162j546r50K276n39j319J395K24j165M87M99j489
$$ -2146 151 742 -2221 -1066 1096 -450 -1400 876 337 -982 413 637 -528 -41 458 -1031
1133a031L09J464j178q93J985m85j282J240J191j355l3J178o81n50J195L09j388
$$ -1031 -722 742 -436 -1329 656 171 -1111 129 1320 -35 -68 1110 429 -121 1074 1383 -5
1150eN02J010r16j237J273j78j281J70O27q66k18O09j75l54M57p0o1O83O6o17
$$ -5 497 1507 591 -646 627 449 -832 -662 -35 -901 -1119 -510 -685 -1039 -582 -652 -713 -30 36 -581
1170e81J138O8p16K93J578j424m66J535O4j977O61Q47j007m94O71m64m79Q76n87
$$ -581 557 625 -91 202 1780 356 -110 1425 1489 -488 173 1020 13 -481 190 -274 -753 123 -464
1189d64l92P71j5j048Q07O44j339K88J089r19j29J147j73r25J365J24r07R48O09
$$ -464 -856 -85 -100 -1148 -341 303 -1036 -748 341 -578 -707 440 267 -658 707 831 -76 872 1481
1208A481j252O1Q20o74q45R25q5r88N16L86p37J50N12j091K79P97j050o39J313
$$ 1481 229 290 1110 436 -409 516 431 -557 -41 345 -392 -242 270 -821 -542 255 -795 -1434 -121
1227a21l7j552Q67J297r56l33J640mj121Q31Q09j321K19O88k10n82N33Om71M1
$$ -121 -158 -1710 -843 454 -502 -835 805 801 -320 511 1320 -1 218 906 696 114 647 653 182 223
1247B23K96n83k47P78q53n28N57L32o01O4L68m45q0N20j0n87Q03k29r48J177N73
$$ 223 519 -64 -311 467 -386 -914 -357 -25 -626 -562 -194 -639 -719 -199 -209 -796 7 -222 -1170 7 580
1268E80r95n4J425k57q03R68n6o85J14N85l62n73O06l18k65L64n69j20N95r5q75
$$ 580 -415 -469 956 699 -104 864 808 123 237 822 460 -113 493 175 -90 274 -295 -415 180 85 -790
1289g90M89L57j063l19J085k26n97J066k97j39M94M67l56M52N21q22j72J127n92
$$ -790 -301 56 -1007 -1326 -241 -467 -1064 2 -295 -434 60 527 171 623 1144 322 150 1277 685
1308F85n06O09M0r50P39k2j307P62K64j239Q3J042j002o86J313L3j343M79J197
$$ 685 179 788 828 -122 617 595 -712 50 314 -925 -842 200 -802 -1488 -175 -142 -1485 -1006 191
1327A91j153K2J330J23r27R26M00m87L91O16o86K78M12o42p02O42l57j399K62
$$ 191 -962 -940 390 513 -414 512 912 425 816 1432 746 1024 1436 794 92 734 377 -1022 -760
1346g60O62r52l05Q37J93r60J054M20p18K71P05m73k22J003k34m77M18K95q64
$$ -760 -98 -1050 -1355 -518 -325 -1285 -231 189 -529 -258 447 -26 -248 755 521 44 462 757 -107
1365a07KQ27o89j011J181j14j224P67L98n31K44J072o67m06J535q3j055P22L47
$$ -107 -105 722 33 -978 203 89 -1135 -368 30 -501 -257 815 148 -258 1277 1194 139 861 1208
1384A208j239j29Q60j146n83J092o26j000R12J80j024L71R26n73j60J244Pk97
$$ 1208 -31 -160 700 -446 -1029 63 -563 -1563 -651 -471 -1495 -1124 -198 -771 -931 313 320 23
1402B3J055K24n07K54P68o87k34J66k82q67k2k37q6l42j60J37m4J36k57l24K28
$$ 23 1078 1302 795 1049 1817 1130 896 1062 780 -87 -109 -346 -432 -774 -934 -797 -841 -705 -962 -1286 -1058
1423a058k06K21J58J70M69L57M65L15K46N19K3k17p1M5p37p04K97l94k56M5n0
$$ -1058 -1264 -1043 -885 -715 -246 111 576 891 1137 1656 1679 1462 1391 1436 699 -5 292 -102 -358 -313 -363
1444c63k10l63J17l81J72j34J68K49K61j98L91P71J22n6M02J85k79k25K71o01
$$ -363 -573 -936 -819 -1200 -1028 -1162 -994 -745 -484 -682 -291 480 602 546 948 1133 854 629 900 299
1464B99m51K61j32o65L98M05p24L46L78k47k63N01m36J09K68L4j20O43L66o74
$$ 299 -152 109 -23 -688 -290 115 -609 -263 115 -132 -395 106 -330 -221 47 81 -39 604 970 296
1484B96J17N07k39j151O50l73q36J6R69p36m01J181j78n00J001M07o38L17M91
$$ 296 413 920 681 -470 180 -193 -1029 -1013 -44 -780 -1181 0 -178 -678 323 730 92 409 900
1503I00k43l10Q60l56n90N29M16p75j12J16q55m49J44n84q2N37m21J13L82O54
$$ 900 657 347 1207 851 261 790 1206 431 319 435 -420 -869 -725 -1309 -1391 -854 -1275 -1162 -780 -126
1523a26m75L31P71j97m44P12L99o75L07N46l17j74M42O1o28j0j9n30m02N0l75
$$ -126 -601 -270 501 304 -140 572 971 296 603 1149 832 658 1100 1161 533 523 504 -26 -428 -378 -753
1544g53n08M09m0k51K03P35j85R1L20J12k15J62R2l61K76N16l11M83J05n4k88
$$ -753 -1261 -852 -892 -1143 -940 -205 -390 -299 21 133 -82 80 172 -189 87 603 292 775 880 826 538
1565E38k07J45m28o75O05k60Q9m17L60M40l18J05l3K21m04L25k46k26k36M33n7
$$ 538 331 476 48 -627 -22 -282 -193 -610 -250 190 -128 -23 -56 165 -239 86 -160 -386 -622 -189 -246
1586b46j22N02O2N4P9j46k98K23L0n37J78L40j8k0P39o8j65K82k08o30j75M78
$$ -246 -368 134 196 250 329 183 -115 108 138 -399 -221 119 101 81 820 752 587 869 661 31 -144 334
1608C34p82m97O29K4p72K90Q87l02l27P88j09p82N06j83j52M71p8K98J83L67j38
$$ 334 -448 -945 -316 -292 -1064 -774 113 -189 -516 272 163 -619 -113 -296 -448 23 -55 243 426 793 655
1629F55K03j30l19l75K72l32l50j05M80M8l45L87J51k64q1j26p8l47l5K06k70
$$ 655 858 728 409 34 306 -26 -376 -481 -1 47 -298 89 240 -24 -105 -231 -309 -656 -691 -485 -755
1650g55K33M96J65k94M40L54k59j39k44J97k38n4J13J38K58J00j71R7M40p07L5
$$ -755 -522 -26 139 -155 285 639 380 241 -3 194 -44 -98 15 153 411 511 340 437 877 170 205
1671B05J49q44q6K20m24k66N83N18n20M62L36j6m33M5m5j23m6P2J50J06K09J05
$$ 205 354 -490 -576 -356 -780 -1046 -463 55 -465 -3 333 317 -116 -71 -116 -239 -285 -213 -63 43 252 357
1693C57L81j62N7Q7n35j72j3R8n51L0M19m7k55M19J19l42K06m81j04j84k8j05
$$ 357 738 576 633 720 185 13 0 98 -453 -423 -4 -51 -306 113 232 -110 96 -385 -489 -673 -701 -806
1715h06N51N1r8J59O63o2k8N04m03n03J93J85n77K21L5L68OK43j06k00m74K20
$$ -806 -255 -204 -302 -143 520 458 430 934 531 28 221 406 -171 50 85 453 459 702 596 396 -78 142
1737A42k74m88j52J2K4J70L05K13K08J30k07j01M07n25l05Q8LL5K95J03K15L83
$$ 142 -132 -620 -772 -760 -736 -566 -261 -48 160 290 83 -18 389 -136 -441 -353 -350 -315 -20 83 298 681
1759F81L9K24m38j1Q0m25l14L5n7P5K44k11q3K28k8l72l55M96m88m45K93J89M61
$$ 681 720 944 506 495 575 150 -164 -129 -186 -111 133 -78 -161 67 39 -333 -688 -192 -680 -1125 -832 -643 -182
1782a82K7K77O42N7j90J06K7o0k43l69Q6j62Q0m58L30K8q4K42l57k3K06n62l92
$$ -182 -155 122 764 821 631 737 764 704 461 92 178 16 96 -362 -32 -4 -88 154 -203 -226 -20 -582 -974
1805i74L78J41Q0L07M04qJ14L11o73p3L71q77O5j94QJ4P80J37m99M65N91m11j93
$$ -974 -596 -455 -375 -68 336 328 442 753 80 7 378 -499 -434 -628 -620 -606 174 311 -188 277 868 457 264
1828B64L00m25o10M62J64l41K94L78l9k46J21j15l93j39O3o14k6J31j35K49O11
$$ 264 564 139 -471 -9 155 -186 108 486 447 201 322 207 -186 -325 -262 -876 -902 -771 -906 -657 -46
1849d6K41N2K78K69l48J27k7k48l36L98j14l42N43N38m59l58N68j74r10o3M95
$$ -46 195 247 525 794 446 573 546 298 -38 360 246 -96 447 985 526 168 736 562 -348 -411 84
1870H4j207l83P45j26l29Q75M69n50N93L49o18K58L30m78M7M99k46N1M71K10o03
$$ 84 -1123 -1506 -761 -887 -1216 -341 128 -422 171 520 -98 160 490 12 59 558 312 363 834 1044 441
1891D41M99R8q58k03m3m13n04L6O4j69J45P52j79K63M49j24j90J22J09j49n3K21
$$ 441 940 1038 180 -23 -66 -479 -983 -947 -883 -1052 -907 -155 -334 -71 378 254 64 186 295 146 93 314
1913C14j69L46Ok74K06j3n51j60O2n1n44K25L53m8K68L85L2k06J57L33l95j35
$$ 314 145 491 497 223 429 416 -135 -295 -233 -284 -828 -603 -250 -298 -30 355 387 181 338 671 276 141
1935A41K97j89l43R2K7l52L69k13j16r4K28j80Q2k4m7k9P22J9k74N25K26n88J63
$$ 141 438 249 -94 -2 25 -327 42 -171 -287 -381 -153 -333 -251 -275 -322 -351 371 390 116 641 867 279 442
1958D42L88o26m39M21j81m88M52mk07k00O42l79m26L69l07l30O38P5m05M41K89
$$ 442 830 204 -235 186 5 -483 -31 -35 -242 -442 200 -179 -605 -236 -543 -873 -235 -160 -565 -124 165
1979A65n5J49P98n71l93N31j31q18M38N79q66M4O98l72n99O42K53r22J31J01m61
$$ 165 110 259 1057 486 93 624 493 -325 113 692 -174 -130 568 196 -403 239 492 -430 -299 -198 -659
2000f59m84L87R6n6N10M09J07K45N17j011q4O17p28k27O04q6l83J86P42k02m02
$$ -659 -1143 -756 -660 -716 -206 203 310 555 1072 61 -23 594 -134 -361 243 157 -226 -40 702 500 98
2021I8O70k32q76Q8J48o72p0M27j17l7O33M63m33N14Jn88l1j27l64j13L51n7j60
$$ 98 768 536 -340 -252 -104 -776 -846 -419 -536 -573 60 523 90 604 605 17 -14 -141 -505 -618 -267 -324 -484
2044d84P19L5n7K04L38m79k20M06o29o4J58K45n63O85M89m46K59j11m35j34j18
$$ -484 235 270 213 417 755 276 56 462 -167 -231 -73 172 -391 294 783 337 596 485 50 -84 -202
2065b02l46l94M20k52l14O24L33rJ73M44j04m79M52k9k81J3j35o0M21K35j62j49
$$ -202 -548 -942 -522 -774 -1088 -464 -131 -140 33 477 373 -106 346 317 36 49 -86 -146 275 510 348 199
2087A99L37k39j81J41q3p00J23J4m34M24L25j33K45J97m3K1j32L51p23j09K33
$$ 199 536 297 116 257 174 -526 -403 -389 -823 -399 -74 -207 38 235 192 213 81 432 -291 -400 -167
2108a67qj92L91K21n4R4K16n21J61K60k26l53J75K4j65P9K29j21J80O6l90k01
$$ -167 -175 -367 24 245 191 285 501 -20 141 401 175 -178 -3 21 -144 -65 164 43 223 289 -101 -302
2130c02J45Kk99o2O09l03k40P58j83l19N60J75p08M29L36m94o8K87l66R8O27J22
$$ -302 -157 -155 -454 -516 93 -210 -450 308 125 -194 366 541 -167 262 598 104 36 323 -43 55 682 804
2152H04r23K11M41p35j96L30l13l40N87j66j73M87K77m07j7N63n52n09M57Jk70
$$ 804 -119 92 533 -202 -398 -68 -381 -721 -134 -300 -473 14 291 -116 -133 430 -122 -631 -174 -173 -443
2173d43L88J36l59M49L97k38j25M32o24R5J00k8j79J42O3l61J49L96m72K5L06
$$ -443 -55 81 -278 171 568 330 205 637 13 108 208 180 1 143 206 -155 -6 390 -82 -57 249
2194B49m27l58J64j10k77J59M00j24L88L83M0k69J49K15n51J73J21l79j99L06
$$ 249 -178 -536 -372 -482 -759 -600 -200 -324 64 447 487 218 367 582 31 204 325 -54 -253 53
2214E3J52m35M92j2m85K4J63N4j71J36l3l85L33J21o2R2K70k94r6p0l1j24M07
$$ 53 205 -230 262 250 -235 -211 -48 6 -165 -29 -62 -447 -114 7 -55 37 307 13 -83 -153 -184 -308 99
2237I9j26k00K36J86j18K22J64r4l07J99P8n71M39r0k56j75O03n52k31N66k61
$$ 99 -27 -227 9 195 77 299 463 369 62 261 339 -232 207 117 -139 -314 289 -263 -494 72 -189
2258a89j57M8L89m87K64L78j73q0P07k80l31J41J28m16j61M56l95k35N15j45j95
$$ -189 -346 -298 91 -396 -132 246 73 -7 700 420 89 230 358 -58 -219 237 -158 -393 122 -23 -218
2279b18K50K03j36J62K72o05k67M68J21l76M7M24n66K93L68n82J3M5J5m31K8k15
$$ -218 32 235 99 261 533 -72 -339 129 250 -126 -79 345 -221 72 440 -142 -129 -84 -69 -500 -472 -687
2301f87K49Q3K06K44n5N63J21k02m8J74k36n04M55m61k57J58m5J59o5O9r3K82
$$ -687 -438 -355 -149 95 40 603 724 522 474 648 412 -92 363 -98 -355 -197 -242 -83 -148 -79 -172 110
2323A10j86Kj71j82J9j33M0L19N4L50L38k99J59L03L5k72k48r5k69o3J16j70L75
$$ 110 -76 -74 -245 -427 -408 -541 -501 -182 -128 222 560 261 420 723 758 486 238 143 -126 -189 -73 -243 132
2346A32JR3k5K71m34k59j36l1j25Jl1r9K28L48J80K26L4rq7K9L9k81j20O0p0k87
$$ 132 133 226 201 472 38 -221 -357 -388 -513 -512 -543 -642 -414 -66 114 340 374 365 278 307 346 65 -55 5 -65 -352
2372c52M78j93J66L21j34k25QK40l93p8J03l30J4J71L24N0J18K41m4k41K8m13
$$ -352 126 -67 99 420 286 61 69 309 -84 -162 -59 -389 -375 -204 120 170 288 529 485 244 272 -141
2394a41k9R2l01k88J59L30k13J99L60P6j16K54L36n07p4kq3k41K97k36q2M04O2
$$ -141 -170 -78 -379 -667 -508 -178 -391 -192 168 244 128 382 718 211 137 135 52 -189 108 -128 -210 194 256
2417B56m87L59l3k89m18N54k15l81L62n0k55L13L71J71j25J14L36j25j37qr0r4
$$ 256 -231 128 95 -194 -612 -58 -273 -654 -292 -342 -597 -284 87 258 133 247 583 458 321 313 223 129
2439A29J44m49l0K85q0p2J15K11j77r6J25m94n1J07Q3m1j0J30Q7J78L4K4j19J98
$$ 129 273 -176 -206 79 -1 -73 42 253 76 -20 105 -389 -440 -333 -250 -291 -301 -171 -84 94 128 152 33 231
2463B31k2M8k87J22o4l1j28Q2O7K14J0J40l2r7j90M0l93j13P2K52k06K01j27J1
$$ 231 209 257 -30 92 28 -3 -131 -49 18 232 242 382 350 253 63 103 -290 -403 -331 -79 -285 -84 -211 -200
2487b00K85M3J11j87J19l13J9j37j76n4K20L44m5M4J72K72k9k52K03k97j38j0
$$ -200 85 128 239 52 171 -142 -123 -260 -436 -490 -270 74 29 73 245 517 488 236 439 142 4 -6
2509fk10p1K82k04K68M7l7J0p1J24q2m67L26M9l93J62K0%J5K54K16nN5k17L0J36
$$ -6 -216 -287 -5 -209 59 106 69 79 8 132 50 -417 -91 -42 -435 -273 -253 -253 -238 16 232 227 282 65 95 231
2535B31p5r7j50Pl57K06L84L1k94M28k76j27j83q0O8J91j46q6O2LK86Qj1J42J60
$$ 231 156 59 -91 -84 -441 -235 149 180 -114 314 38 -89 -272 -352 -284 -93 -239 -325 -263 -260 26 34 23 165 325
2560C25k4r4J45k96P4j47l4j85K74j03p3K76Q8n4k8k0m0k36j12J26N1L5j77m9
$$ 325 301 207 352 56 130 -17 -51 -236 38 -65 -138 138 226 172 144 124 84 -152 -264 -138 -87 -52 -229 -278
2584b78L25M5k77L35j27q5N5k07J61K31P8k71j46K89m2j3j73M86j45lP7m0k86
$$ -278 47 92 -185 150 23 -62 -7 -214 -53 178 256 -15 -161 128 86 73 -100 386 241 238 315 275 -11
2607a1j99J63pp2o9k63M97J0r1J19j24J41l08k8L61k26J16k4j24N5K89l2j90L33
$$ -11 -210 -47 -54 -126 -195 -458 39 49 -42 77 -47 94 -214 -242 119 -107 9 -15 -139 -84 205 173 -17 316
2631C16k26P6j95J45O0k30J79m03M42j59j24J33J08j44j24k6K07l7o3J44k75O9
$$ 316 90 166 -29 116 176 -54 125 -278 164 5 -119 14 122 -22 -146 -172 35 -2 -65 79 -196 -127
2653a27L47j38o1J60q7j41J55J78P8l17K52k74q9J15J07k74j27K25m5j9j01J46
$$ -127 220 82 21 181 94 -47 108 286 364 47 299 25 -64 51 158 -116 -243 -18 -63 -82 -183 -37
2675c7J39j15J24o9j00j33K63m02K56k02J14J79j66K13j48K32L39k48L8j48K82
$$ -37 102 -13 111 42 -58 -191 72 -330 -74 -276 -162 17 -149 64 -84 148 487 239 277 129 411
2696D11j46j85J86k37O1k93K55o2j25J37Q3k12O4R8J7j0q8j83O9k4j83M35l4l0
$$ 411 265 80 266 29 90 -203 52 -10 -135 2 85 -127 -63 35 52 42 -46 -229 -160 -184 -367 68 34 4
2720Dj68M10m08J32Q1J60k70p6p7l7M96P4j61P3o9J40k46o6L38l33p5j44J12J79
$$ 4 -164 246 -162 -30 51 211 -59 -135 -212 -249 247 321 160 233 164 304 58 -8 330 -3 -78 -222 -110 69
2744F9k11NK32k11N1K6j87q9J34M5q1J24n7N43l02L06J37m02K11Ll83J76J14m32
$$ 69 -142 -137 95 -116 -65 -39 -226 -315 -181 -136 -217 -93 -150 393 91 397 534 132 343 346 -37 139 253 -179
2768a79Q7l4o0r4J76K17KOj56N3j10j2o3J66%nK0oj59J71L80m63L07J59l20K53
$$ -179 -92 -126 -186 -280 -104 113 115 121 -35 18 -92 -104 -167 -1 -1 -6 14 8 -151 20 400 -63 244 403 83 336
2794C36q7m33K41n2l44N47j16j43k4j62K27o8O7j69p5K15j80O1r4J55K61l9J8
$$ 336 249 -184 57 5 -339 208 92 -51 -75 -237 -10 -78 -11 -180 -255 -40 -220 -159 -253 -98 163 124 142
2817A42M4r7K16k21J03Mk06J09n4K4k55J10O8K0l9PP5j41j60J91m9j78K56N9p0
$$ 142 186 89 305 84 187 191 -15 94 40 64 -191 -81 -13 7 -32 -25 50 -91 -251 -60 -109 -287 -31 28 -42
2842d2J69l7k76Q7J46k09p1J81q0j09K50l19K42jJ70O4Q2j0K86M9k02l43J83q2
$$ -42 127 90 -186 -99 47 -162 -233 -52 -132 -241 9 -310 -68 -69 101 165 247 237 523 572 370 27 210 128
2866A28k98Kj88L76l47K95jR6p0J4n1m9m6j45P7M3Or4K78K04j22K08N6l46jl4
$$ 128 -170 -168 -356 20 -327 -32 -33 63 -7 7 -44 -93 -139 -284 -207 -164 -158 -252 26 230 108 316 372 26 25 -9
2892ikk81n8PK16j27O1J09j6K69n7q1J57k36k6J43m20J68k37N56j52l7P0O6P9
$$ -9 -11 -292 -350 -343 -127 -254 -193 -84 -100 169 112 31 188 -48 -74 69 -351 -183 -420 136 -16 -53 17 83 162
2917A62K66r7j02l05P4J25m88K48K15j87j25M79j91P3n0k2k1r4j15p8J44k24Q8
$$ 162 428 331 229 -76 -2 123 -365 -117 98 -89 -214 265 74 147 97 75 54 -40 -155 -233 -89 -313 -225
2940b25L36p7J20P2k4J16k31j9p2J53j70M2k23J27N32j05k01l30K86q1j05J05
$$ -225 111 34 154 226 202 318 87 68 -4 149 -21 21 -202 -75 457 352 151 -179 107 26 -79 26
2962B6j72J12J7KL7r9O3K7R9k92Q3J02M0k36r0R4K48j84RMJ60J9L40p7l05l6P6
$$ 26 -146 -34 -17 -15 22 -77 -14 13 112 -180 -97 5 45 -191 -281 -187 61 -123 -114 -110 50 69 409 332 27 -9 67
2989F7j23K71q0j42L2Q7j66k19L83l21J13J95p6j76j52L32k14r6M02k96j1K40
$$ 67 -56 215 135 -7 25 112 -54 -273 110 -211 -98 97 21 -155 -307 25 -189 -285 117 -179 -190 50
3011E0p3Q8M0p4J5j8k33N0K02P6q1r3M6O2j31l5L26j86j00J75rk78J11K16m55
$$ 50 -23 65 105 31 46 28 -205 -155 47 123 42 -51 -5 57 -74 -109 217 31 -69 106 97 -181 -70 146 -309
3036c09K00L54l52J68j06p3K07j17j55J02L6j69J54Q3k9M11o9l7l5l07P5L18j71
$$ -309 -109 245 -107 61 -45 -118 89 -28 -183 -81 -45 -214 -60 23 -6 405 336 299 264 -43 32 350 179
3059A79j93RL9k51J28K25l29ON2O9j82J88L35J5k64J31Mj94J60J09k23n4J87j82
$$ 179 -14 -5 34 -217 -89 136 -193 -187 -135 -66 -248 -60 275 290 26 157 161 -33 127 236 13 -41 146 -36
3083c6K25j68Q1M0n7L4j9j78M0p3K40J28k03J35l46N6L30l58R4qQ0R1l96K38j
$$ -36 189 21 102 142 85 119 100 -78 -38 -111 129 257 54 189 -157 -101 229 -129 -35 -43 37 128 -268 -30 -31
3108c1l6N1O4NK47j93R8k46L96k14o8L6r5kPr1m3q8J69k45K81k44J50j09K13O9
$$ -31 -67 -16 48 53 300 107 205 -41 355 141 73 109 14 12 19 -72 -115 -203 -34 -279 2 -242 -92 -201 12 81
3134H1R2k58L26J26m93J20k6M0k72JK15P7j89K44k85J76J93m3j9K61l43J05O2
$$ 81 173 -85 241 367 -126 -6 -32 8 -264 -263 -48 29 -160 84 -201 -25 168 125 106 367 24 129 191
3157A91j03K11k78j02p7j70J79J6jK8K2Ok51J54P2J87K92l67J45J38R2m19L19
$$ 191 88 299 21 -81 -158 -328 -149 -133 -134 -106 -84 -78 -329 -175 -103 84 376 9 154 292 384 -35 284
3180B84k56P7k06J18j12j34L85p1j34p0R9o8O4Q8j4l7J8Q9p1jJ30k55J5p1J2j55
$$ 284 28 105 -101 17 -95 -229 156 85 -49 -119 -20 -88 -24 64 50 13 31 120 49 48 178 -77 -62 -133 -121 -276
3206b76j1J47J79k21M7J71j54K70k1O8p3L75j55j45R7l19JJ58j63l19J7J54j4
$$ -276 -287 -140 39 -182 -135 36 -118 152 131 199 126 501 346 201 298 -21 -20 138 -25 -344 -327 -173 -187
3229a87j12M61m76J93J34O6J6j7KrkL29l79k56M94k30P1J86l77L41j04m97L22
$$ -187 -299 162 -314 -121 13 79 95 78 80 71 69 398 19 -237 257 27 98 284 -93 248 144 -353 -31
3252c1k22M32j37Q2p7j99J96n5p7J30M0j88Q8j42P8k24J83J2j0P7k1R6O9p6q5
$$ -31 -253 179 42 124 47 -152 44 -11 -88 42 82 -106 -18 -160 -82 -306 -123 -111 -121 -44 -65 31 100 24 -61
3277f1O9J16J0M5k53L73r6n43M70k19L7j00j0J09j76K81Q3o9K48m21r8L75m2j15
$$ -61 8 124 134 179 -74 299 203 -340 130 -89 -52 -152 -162 -53 -229 52 135 66 314 -107 -205 170 128 13
3301A3M7Q8l56K05L1j9j28K57l00K70k50J58j74J42J10R6j27j11j26J62K2Q9j20
$$ 13 60 148 -208 -3 28 9 -119 138 -162 108 -142 16 -158 -16 94 190 63 -48 -174 -12 10 99 -21
3324b1p7K39k71k14J25J31J37O2m69N04j21l9J56k39o7N15j91l1m4j41M02k05
$$ -21 -98 141 -130 -344 -219 -88 49 111 -358 146 25 -14 142 -97 -164 351 160 129 85 -56 346 141
3346A41O7k93M1K95j60k18k04K33oK9j28J31K19o6k69K05J26m26K6j36M19o6r
$$ 141 208 -85 -44 251 91 -127 -331 -98 -104 -75 -203 -72 147 81 -188 17 143 -283 -257 -393 26 -40 -49
3369d9J13r7J75r6k6k66L30j3J89k72k4R0j63K90j43%K31k07l65M24k97J57k4
$$ -49 64 -33 142 46 20 -246 84 71 260 -12 -36 54 -109 181 38 38 269 62 -303 121 -176 -19 -43
3392d3Pq9n1Q7J32j91K96k67J67J39k60J19J66k44k21J35J55J84k8j34J24l75
$$ -43 -36 -125 -176 -89 43 -148 148 -119 48 187 -73 46 212 -32 -253 -118 37 221 193 59 183 -192
3414a92L19mk1n6O6j63m6K4K12k36M1K80j66l2j12k20L73q0K87m04p9K3J18J77
$$ -192 127 123 102 46 112 -51 -97 -73 139 -97 -56 224 58 26 -86 -306 67 -13 274 -130 -209 -186 -68 109
3438A09l7j72J70K09m44L05k09M74l50j08J27K88l27P5k7l25J25J54k41K14K9
$$ 109 72 -100 70 279 -165 140 -69 405 55 -53 74 362 35 110 83 -242 -117 37 -204 10 39
3459C9m2l5J5L8mj14Q9j9L19k11J11j63K36R6m54r2J45L6J60j51k9J58o6M9K1
$$ 39 -3 -38 -23 15 11 -103 -14 -33 286 75 186 23 259 355 -99 -191 -46 -10 150 -1 -30 128 62 111 132
3484A32k26R5J33k27L15k31J96j64r9p1jMJ80k2j35J00K98j81pL0p5J23k49J58
$$ 132 -94 1 134 -93 222 -9 187 23 -76 -147 -148 -144 36 14 -121 -21 277 96 89 119 44 167 -82 76
3508G6j00J90M0Qj50K16j25l95J90j67J65oM1j25k83K86o8K68J76l86j33K97j66
$$ 76 -24 166 206 214 64 280 155 -240 -50 -217 -52 -58 -17 -142 -425 -139 -207 61 237 -149 -282 15 -151
3531a51K59q1L01k64K16k85M2K34m17K67J17j80N0l35L05r3n4O9Rk44J53J28p7
$$ -151 108 27 328 64 280 -5 37 271 -146 121 238 58 108 -227 78 -15 -69 0 9 -235 -82 46 -31
3554c1J53j00n0K34j09j32r3K94j58j20K50K37o15K34O0n4k7m3L17j16o0J1j47
$$ -31 122 22 -28 206 97 -35 -128 166 8 -112 138 375 -240 -6 54 0 -27 -70 247 131 71 82 -65
3577f5J55k1j39J52k49r6R9J96k39l9O0L21j72J90m1qL2n0p7J69m7j40p4j4K28
$$ -65 90 69 -70 82 -167 -263 -164 32 -207 -246 -186 135 -37 153 112 104 136 86 9 178 131 -9 -83 -97 131
3602A31l00K42kl57K83k39K40j98N4oK01Q4m2J33K6l81QmK98k62j16J87j34Pn8
$$ 131 -169 73 71 -286 -3 -242 -2 -200 -146 -152 49 133 91 224 250 -131 -123 -127 171 -91 -207 -20 -154 -147 -205
3627b05J32J24M6M2j03L64m95L15l7j91J65N4j36n5l40J55J4J25k67J33m0K99
$$ -205 -73 51 97 139 36 400 -95 220 183 -8 157 211 75 20 -320 -165 -151 -26 -293 -160 -200 99
3649I9m8k71L44j97j0J16o5L89k80o9J74j35k19K29p0o2J94m61M34j53J01n8j09
$$ 99 51 -220 124 -73 -83 33 -32 357 77 8 182 47 -172 57 -13 -75 119 -342 92 -61 40 -18 -127
3672a27N4J66k44J64L0n7m8k05J67J60n6j56k89K71q9K96k01K43n5M6j64p9L08
$$ -127 -73 93 -151 13 43 -14 -62 -267 -100 60 4 -152 -441 -170 -259 37 -164 79 24 70 -94 -173 135
3695A35k16K26L9P6l61J55m02N04Mj23J80k87N8Q3k8J07k04qn5k33K91qK19j09
$$ 135 -81 145 184 260 -101 54 -348 156 160 37 217 -70 -12 71 43 150 -54 -62 -117 -350 -59 -67 152 43
3719D3j22O7K7j27R0j99J85P4j14K5P5J07j93K12k89R4j9J23K01j67J98mj53k64
$$ 43 -79 -12 15 -112 -22 -221 -36 38 -76 -51 24 131 -62 150 -139 -45 -64 59 260 93 291 287 134 -130
3743a30K7jj09L0L84j83o5l9J75j16j03LJ64J05k2M8m18L16j5j39J06N0J08j22
$$ -130 -103 -104 -213 -183 201 18 -47 -86 89 -27 -130 -127 37 142 120 168 -250 66 51 -88 18 68 176 54
3767E4P6k76J14k4k7k4K55k67K29j27j80K38q3j12J0j85J46K6Q3J43o6P6k42Q5
$$ 54 130 -146 -32 -56 -83 -107 148 -119 110 -17 -197 41 -42 -154 -144 -329 -183 -157 -74 69 3 79 -163 -78
3791g8j6J35J08l83O9J80K12p6k56J86M7N0j92J38J8J17k03L1R9j11j83L44l41
$$ -78 -94 41 149 -234 -165 15 227 151 -105 81 128 178 -14 124 142 259 56 87 186 75 -108 236 -105
3814a05r2Q0j4J18q9n7J03K5P1lNn9Rj32P1P6o2M8L5J9N4j19J91j92K28N5m16
$$ -105 -197 -117 -131 -13 -102 -159 -56 -31 40 37 42 -17 -8 -140 -69 7 -55 -7 28 47 101 -18 173 -19 209 264 -152
3841a52J70r2K4N3P2k71J9K13MQ2k57k53M91k26jJ85j28l1j77L56j8K1L7rJo5
$$ -152 18 -74 -50 3 75 -196 -177 36 40 122 -135 -388 103 -123 -124 61 -67 -98 -275 81 63 84 121 112 113 48
3867D8m9P8q4j0n91Q37j98j0l76L35J5J94k04J57r8j99K69j2k63n7L84m8n9J64
$$ 48 -1 77 -7 -17 -608 229 31 21 -355 -20 -5 189 -15 142 44 -155 114 102 -161 -218 166 118 59 223
3891B23p8j08j1J82p0j04N9k83L88l84J42K16r2k4j25K2J08j61j20J43j10M6Q
$$ 223 145 37 26 208 138 34 93 -190 198 -186 -44 172 80 56 -69 -47 61 -100 -220 -77 -187 -141 -133
3914a33K08j55NK13q1o2J09j41JJ13j46r0P5K5L05k22j81K65J18k31p9K95l95
$$ -133 75 -80 -75 138 57 -5 104 -37 -36 77 -69 -159 -84 -59 246 24 -157 108 226 -5 -84 211 -184
3937a84K98o8l1j56P5J6J59n4j59j67J68J33K5k07K85k19J2K50j6j09j20l5J77
$$ -184 114 46 15 -141 -66 -50 109 55 -104 -271 -103 30 55 -152 133 -86 -74 176 160 51 -69 -104 73
3960G3j96J92kj86jJ43k38K91k60lRK16K01l67J69k00j21N12l45J40Q5j1j83K
$$ 73 -123 69 67 -119 -120 23 -215 76 -184 -187 -178 38 239 -128 41 -159 -280 232 -113 27 112 101 -82 -80
3984h0J25m6k25M14l6j5Q3j86m1J09k12K30j0k79J4K76p4p3j1n0R0KJ72j52k57
$$ -80 45 -1 -226 188 152 137 220 34 -7 102 -110 120 110 -169 -155 121 47 -26 -37 -87 3 5 177 25 -232
4009b32K13N8Q3k59J31M5j52M99m37J86j18j17L40j24j21L56n13K97k27L08l40
$$ -232 -19 39 122 -137 -6 39 -113 386 -51 135 17 -100 240 116 -5 351 -162 135 -92 216 -124
4030a24K43j47R7O1k31J39j38R5j45J08K6nj14P4N7j16L35Lk30j21J82J2q3J87
$$ -124 119 -28 69 130 -101 38 -100 -5 -150 -42 -16 -21 -135 -61 -4 -120 215 218 -12 -133 49 61 -22 165
4054A65k72M46j58l1J03l1j16p6qk3L10m44L31l66K69j11l3q9o2j3K32j18M42
$$ 165 -107 339 181 150 253 222 106 30 22 -1 309 -135 196 -170 99 -12 -45 -134 -196 -209 23 -95 347
4077C47l24L5p9r4J73n6l9j69K16j78L98l22K86r8N9L7k24P2j28J72Rp4J01j64
$$ 347 23 58 -21 -115 58 2 -37 -206 10 -168 230 -92 194 96 155 192 -32 40 -88 84 93 19 120 -44
4101d4j72K18k03N6J9M0J16k56M41k71l0P2P1j99P0P5K4k21N31j85q5o8j64O3
$$ -44 -216 2 -201 -145 -126 -86 30 -226 215 -56 -86 -14 57 -142 -72 3 27 -194 337 152 67 -1 -165 -102
4125a02L04k34J92Qj78k3k14K10k54Q0K24n4j84K33j59N3j0J19j92j07J35N0J89
$$ -102 202 -32 160 168 -10 -33 -247 -37 -291 -211 13 -41 -225 8 -151 -98 -108 11 -181 -288 -153 -103 86
4148H6j54K85J84j97k75K74j55j26K87j97K42l61K24N0o7l9K6k39K98k24L2O2
$$ 86 -68 217 401 204 -71 203 48 -78 209 12 254 -107 117 167 100 61 87 -152 146 -78 -46 16
4170A6q7j95N7K97k19j0J81l5k02N12k77P7k1q9j1k01R1L1N2K20j22j95J31K41
$$ 16 -71 -266 -209 88 -131 -141 40 5 -197 315 38 115 94 5 -6 -207 -116 -85 -33 187 65 -130 1 242
4194B42l31j20J40p2Q6J72m0j74j00J19J32j16j12J63M9r9O0j68J16l8K28j66
$$ 242 -89 -209 -69 -141 -55 117 77 -97 -197 -78 54 -62 -174 -11 38 -61 -1 -169 -53 -91 137 -29
4216b9j09J00J30j17J76R0Nj13l2r6L5k93K89Pm9q9L3L19l26M3m1J55m2L16k11
$$ -29 -138 -38 92 -25 151 241 246 133 101 5 40 -253 36 43 -6 -95 -62 257 -69 -26 -67 88 46 362 151
4241A51k27K09k02k3k4K43l2J50j69N2j39Mk11J39jJ26j53j7J36K31l31q6J73
$$ 151 -76 133 -69 -92 -116 127 95 245 76 128 -11 -7 -218 -79 -80 46 -107 -124 12 243 -88 -174 -1
4264al02K15J69j3r8J49l16NK38k5Q6k1r3l05K66J47p8k72L82j10j92K99l06K45
$$ -1 -303 -88 81 68 -30 119 -197 -192 46 21 107 86 -7 -312 -46 101 23 -249 133 23 -169 130 -176 69
4288F9j76K55k67r4L90J8k47K67j35l80J95J9j51L40k59K84j43K7Pj06J60j9j06
$$ 69 -107 148 -119 -213 177 195 -52 215 80 -300 -105 -86 -237 103 -156 128 -15 12 19 -87 73 54 -52
4311e2j1jK33j67j14J27q5J14N6J18J05l19k40K08J05n7m0R0J33j67r4J04m23
$$ -52 -63 -64 169 2 -112 15 -70 44 100 218 323 4 -236 -28 77 20 -20 70 203 36 -58 46 -377
4334c77K99J04n7m3R2k81K09O8m9qJ5K9m3j37K6L38j70L14k12m5K30m2q2q2J13
$$ -377 -78 26 -31 -74 18 -263 -54 14 -35 -43 -28 1 -42 -179 -153 185 15 329 117 72 302 260 178 96 209
4359B09j75j75N7K02N6j15j39L5J03K8K8O2l0k93J13K52o4l06K97k70L43m08M03
$$ 209 34 -141 -84 118 174 59 -80 -45 58 86 114 176 146 -147 -34 218 154 -152 145 -125 218 -190 213
4382B13j50o7N6P9j81K06j78J72k17P9J79l36J42j40L97j73j22K47k43K11M1j36
$$ 213 63 -4 52 131 -50 156 -22 150 -67 12 191 -145 -3 -143 254 81 -41 206 -37 174 215 79
4404G9o2J68J27m26L10l31P9J07K9m8J33k34J81Q1p8k66L42n8j65k4j15L00M0
$$ 79 17 185 312 -114 196 -135 -56 51 80 32 165 -69 112 193 115 -151 191 133 -32 -56 -171 129 169
4427A69j86r7r2j0J60M0J52k19%k20J22L59j78N9Q4l82L81J96l88J50Q1q5j85
$$ 169 -17 -114 -206 -216 -56 -16 136 -83 -83 -303 -181 178 0 59 143 -239 142 338 -50 100 181 96 -89
4450h9qJ2Q0J14j5nk33P7r0k9R0l0J87l25L00l02K98N7k08L8J30j11J26l2n2J35
$$ -89 -97 -85 -5 109 94 89 -144 -67 -157 -186 -96 -126 61 -264 36 -266 32 89 -119 -81 49 -62 64 32 -20 115
4476A15j08J98k28%P5N7N4m4K72o70L43j36Q8l07J18K66J34n2j79J25j74j2NP6
$$ 115 7 205 -23 -23 52 109 163 119 391 -279 64 -72 16 -291 -173 93 227 175 -4 121 -53 -65 -60 16
4500A6m2j26J62j12M7P5J12j54J84j62P0K0j38J65P7j2j18O1j97K27l36K94k04
$$ 16 -26 -152 10 -102 -55 20 132 -22 162 0 70 90 -48 117 194 182 64 125 -72 155 -181 113 -91
4523i1J51l57K17n3J44j26K08J40k95J99p1j57J76k12j8M14j13j04J38Q8j05k69
$$ -91 60 -297 -80 -133 11 -115 93 233 -62 137 66 -91 85 -127 -145 269 156 52 190 278 173 -96
4545i6K76l43J9J13n4j21J01M9M9k07J62M1K5Q7j57J17Q7j76k21K60j75K87p3
$$ -96 180 -163 -144 -31 -85 -206 -105 -56 -7 -214 -52 -11 14 101 -56 61 148 -28 -249 11 -164 123 50
4568E0lk10J95n9R3K8M1j59n2J13q3M84l32k48J46J1k5j92R4J68L4k12k2j7O7
$$ 50 47 -163 32 -27 66 94 135 -24 -76 37 -46 438 106 -142 4 15 -10 -202 -108 60 94 -118 -140 -157 -90
4593i0J21j03Op6J17J39l02L15k94p7L63L1n6q3k28K97J32q2k10J43j34J24l5
$$ -90 31 -72 -66 -142 -25 114 -188 127 -167 -244 119 150 94 11 -217 80 212 130 -80 63 -71 53 18
4616A8k58P6q5O0J13p8K21k22K03p0j33K74k61J90k59K68k12p2L41J38k19J67
$$ 18 -240 -164 -249 -189 -76 -154 67 -155 48 -22 -155 119 -142 48 -211 57 -155 -227 114 252 33 200
4638B00k59j55J94K29k48r4K4n6J9J92Q9j51k15M72o7j03o8J5r6k58N09J80l30
$$ 200 -59 -214 -20 209 -39 -133 -109 -165 -146 46 135 -16 -231 241 174 71 3 18 -78 -336 173 353 23
4661B3j0K06k21k0l9L46l43P3P3j00j1N7p2J11j17M7R9j52J49j06pl8l4RL9L9
$$ 23 13 219 -2 -22 -61 285 -58 15 88 -12 -23 34 -38 73 -44 3 102 -50 99 -7 -14 -52 -86 -77 -38 1
4687Aj09J61j37j30M00k5j43K12l78K26K06l40p4J23lj58L62l66J99j45K50L7
$$ 1 -108 53 -84 -214 186 161 18 230 -148 78 284 -56 -130 -7 -10 -168 194 -172 27 -118 132 169
4709A69Nj72j89Q2K58k02o3Nj30K16j32J52k0m8j64K95l93J70rK30Q1o6j1m1j83
$$ 169 174 2 -187 -105 153 -49 -112 -107 -237 -21 -153 -1 -21 -69 -233 62 -331 -161 -170 60 141 75 64 23 -160
4734a60J65j14jK82l32R7l6J81l26L11q3q7J08P1N4j5p8p5j33j51K61j17j20J27
$$ -160 5 -109 -110 172 -160 -63 -99 82 -244 67 -16 -103 5 76 130 115 37 -38 -171 -322 -61 -178 -298 -171
4758a71K76k54J23P6L11m43K53j28j64L41j75r5J02q0K4j80N1J97m9J38ml12m0
$$ -171 105 -149 -26 50 361 -82 171 43 -121 220 45 -50 52 -28 -4 -184 -133 64 15 153 149 -163 -203
4781b03K29j60K74l17J36j25Q0K77r7j48J77k91L71j82P7n9p5L93m36R1P9L8j47
$$ -203 26 -134 140 -177 -41 -166 -86 191 94 -54 123 -168 203 21 98 39 -36 357 -79 12 91 129 -18
4804a8k9o3J84P2j23j11m4J46k39L24j44l05K20K26Qj10j1J80j83j28L58Q5j95
$$ -18 -47 -110 74 146 23 -88 -132 14 -225 99 -45 -350 -130 96 104 -6 -17 163 -20 -148 210 295 100
4827A00l74L13J4R4J89j42p6j03j63M2J75N4n3k79J58J12j62J27j10j20N22l65
$$ 100 -274 39 53 147 336 194 118 15 -148 -106 69 123 70 -209 -51 61 -101 26 -84 -204 318 -47
4849d7J67l83K54j71K54O7o8p4r1K45Pj76k13J07J85L2j46K1j07L11j56J39k35
$$ -47 120 -263 -9 -180 74 141 73 -1 -92 153 160 -16 -229 -122 63 95 -51 -30 -137 174 18 157 -78
4872g8K11j44k8J81J57j87k24J02J8K18k59k51K17l8K45l97L30p7j44K74k88K14
$$ -78 133 -11 -39 142 299 112 -112 -10 8 226 -33 -284 -67 -105 140 -257 73 -4 -148 126 -162 52
4894E2q9K45l69N0jJ38l7Q3j38n3J98Oj00O7j42j54K55k0J49k2j82K06j40j45
$$ 52 -37 208 -161 -111 -112 26 -11 72 -66 -119 79 85 -15 52 -90 -244 11 -9 140 118 -64 142 2 -143
4918a43Om0J86K1L18l55K9M0p2O4k6j21j6O0j46K54J86n0r4j98L2K14q0J03r9
$$ -143 -137 -177 9 30 348 -7 22 62 -10 54 28 -93 -109 -49 -195 59 245 195 101 -97 -65 149 69 172 73
4943G3l48K47j5o0J82k77K42N0q2j63M2K10j15j95R0K61j29K11l11p0J32L5P9
$$ 73 -275 -28 -43 -103 79 -198 44 94 12 -151 -109 101 -14 -209 -119 142 13 224 -87 -157 -25 10 89
4966H9q0ln3l8n9L83J15k11N9k06L4j96J38j31K07j61J96q5j11Pj30J91l7J37
$$ 89 9 6 -47 -85 -144 239 354 143 202 -4 30 -166 -28 -159 48 -113 83 -2 -113 -106 -236 -45 -82 55
4990E5N1j17o7L16k11Q6Q4n7k65L49l26p4K09l05J41J94l10Q4M6J26p7Q5k29K20
$$ 55 106 -11 -78 238 27 113 197 140 -125 224 -102 -176 33 -272 -131 63 -247 -163 -117 9 -68 17 -212 8
5014Hj18K41j45k2k3m5J69o2n2l9J44j42J51P3k02K08k5j88Q3j04J6J33N9L2j30
$$ 8 -110 131 -14 -36 -59 -104 65 3 -49 -88 56 -86 65 138 -64 144 119 -69 14 -90 -74 59 118 150 20
5039B0n1K61j55NKJ96k50j64j6P5O3m4O8k4K26N4k50r9J46J0j50j7J23m1P5l7
$$ 20 -31 230 75 80 82 278 28 -136 -152 -77 -14 -58 10 -14 212 266 16 -83 63 73 -77 -94 29 -12 63 26
5065B6j66J09L42m43M69l35k24N36m56j46K91j03J23J38l23J88J09l6j52K76k41
$$ 26 -140 -31 311 -132 337 2 -222 314 -142 -288 3 -100 23 161 -162 26 135 99 -53 223 -18
5086a8j11K33K1k83L42j76n3J40k59K97k02J06R5N9k41K07R0n11P2J2o6N7m1K10
$$ -18 -129 104 125 -158 184 8 -45 95 -164 133 -69 37 132 191 -50 157 247 -264 -192 -180 -246 -189 -230 -20
5110b0r2J98m5r0l4K13k10K89j02j20k0J82k7r8QO6j3K8k27K4j58J01P4J98l95
$$ -20 -112 86 41 -49 -83 130 -80 209 107 -13 -33 149 122 24 32 98 85 113 -114 -90 -248 -147 -73 125 -270
5135b70J76Q4k27l4K84M8j68K55k58J13q7K27j65o4l1J00O5P5j56n6L69n21K38
$$ -270 -94 -10 -237 -271 13 61 -107 148 -110 3 -84 143 -22 -86 -117 -17 48 123 -33 -89 280 -241 -3
5158ck79L49j7J52k38k34J10J69L10l14J40j41P4j24L2r2j40k9R6L79j95M7M2
$$ -3 -282 67 50 202 -36 -270 -160 9 319 5 145 4 78 -46 -14 -106 -246 -275 -179 200 5 52 94
5181I4J00j71k5k43M52k37J33J30l03J22j18J64j27j81J81j29J0L9J66k16J58
$$ 94 194 23 -2 -245 207 -30 103 233 -70 52 -66 98 -29 -210 -29 -158 -148 -109 57 -159 -1
5202aj32p4L20l03O3J92j00K29m99L11j9RJ14j59qJ09O4o3p8J95k32K63o7j89
$$ -1 -133 -207 113 -190 -127 65 -35 194 -305 6 -13 -4 110 -49 -57 52 116 53 -25 170 -62 201 134 -55
5226e5J95j21J60r3j69j7j19K20j55j8J07m3K01j00J01j38O3J4O0J1l56K95mp7
$$ -55 140 19 179 86 -83 -100 -219 1 -154 -172 -65 -108 93 -7 94 -44 19 33 93 104 -252 43 39 -38
5250c8p8Q1J94j67nO8J85l80JJ14l51L12N4J54O7m8K1k67J19q8q2j7r3M82j97
$$ -38 -116 -35 159 -8 -13 55 240 -140 -139 -25 -376 -64 -10 144 211 163 184 -83 36 -52 -134 -151 -244 238 41
5275D1L7n2r2oj33J5J34J50j2n05N45j21P6K3Qkp1k55L6J60r0K41j09m8j87P5
$$ 41 78 26 -66 -72 -205 -190 -56 94 82 -423 122 1 77 100 108 106 35 -220 -184 -24 -114 127 18 -30 -217 -142
5301a42o9K06K6j87J86j91K93l88K29N6j37K5j7K96o1n6p6j0M5l42L76j08N0j5
$$ -142 -211 -5 21 -166 20 -171 122 -266 -37 19 -118 -93 -110 186 125 69 -7 -17 28 -314 62 -46 4 -11
5325a1P2m7R0j06J29j39Q3Q6j83J81N6l91L94l52N5K6P4N0K2L6j22l13L04Q0J24
$$ -11 61 14 104 -2 127 -12 71 157 -26 155 211 -180 214 -138 -83 -57 17 67 89 125 3 -310 -6 74 198
5350A98p3j55J05K20n80L08Jj34K63r9Qj72l6L75k51j92N37l88N1p3k2R5L0P5
$$ 198 125 -30 75 295 -285 23 24 -110 153 54 62 -110 -146 229 -22 -214 323 -65 -14 -87 -109 -14 16 91
5374I1l23L95r9j04J4J65m6l60K67J87J19j50l01J66q0Q3r8J25R0p8k36J43K13
$$ 91 -232 163 64 -40 -26 139 93 -267 0 187 306 156 -145 21 -59 24 -74 51 141 63 -173 -30 183
5397A83j46k28K03k15K1J42m01L12j14K22k45L14M6k52K25k2l87M20j7m0kj64
$$ 183 37 -191 12 -203 -182 -40 -441 -129 -243 -21 -266 48 94 -158 67 45 -342 78 61 21 19 -145
5419a45J51N1m8k59K61L6p2L5p5O8l3J2K67j46N2p4L4l58K82k18J15R7j02R8J32
$$ -145 6 57 9 -250 11 47 -25 10 -65 3 -30 -18 249 103 155 81 115 -243 39 -179 -64 33 -69 29 161
5444A61j82j1Rj69%P2J30P0l01L79p8M1L2k46J35J8j8j69K4j5j72L64m25L17k20
$$ 161 -21 -32 -23 -192 -192 -120 10 80 -221 158 80 121 153 -93 42 60 42 -127 -103 -118 -290 74 -351 -34 -254
5469b54J06J56j23k9J60n4J95j27j83L59M9m3j62j46J6J71l28K81k57K50J05j68
$$ -254 -148 8 -115 -144 16 -38 157 30 -153 206 255 212 50 -96 -80 91 -237 44 -213 37 142 -26
5491b6l2J7L6K0J47K8r1q1j6J8k20RJ12N6J52k30J82j31j7r9L53k68J40j42K72
$$ -26 -58 -41 -5 15 162 190 99 18 2 20 -200 -191 -79 -23 129 -101 81 -50 -67 -166 187 -81 59 -83 189
5516A89n0j90Q9P1K35o24M4K73K2q8K50j25j85j25L1J42J60n7k04M38l76J87j30
$$ 189 139 -51 38 109 344 -280 -236 37 59 -29 221 96 -89 -214 -183 -41 119 62 -142 296 -80 107 -23
5539b3%o4m1L85n9l62p5K58K46j78l05K42j54K8K17l30K66L6o9r2j09O3j1Q8P2
$$ -23 -23 -87 -128 257 198 -164 -239 19 265 87 -218 24 -130 -102 115 -215 51 87 18 -74 -183 -120 -131 -43 29
5564B9j4nQ9j02J18K8l07K04P4p9J76l18L05j46J12j75p6j46L82j1p2o7k09N34
$$ 29 15 10 99 -3 115 143 -164 40 114 35 211 -107 198 52 164 -11 -87 -233 149 138 66 -1 -210 324
5588C24m96K92J18j72j48J16J35j12l1N0j19J77k8Kj11j10K36l1k1n0k9j5m7J31
$$ 324 -172 120 238 66 -82 34 169 57 26 76 -43 134 106 108 -3 -113 123 92 71 21 -8 -23 -70 61
5612F1m8J6j2k4Kkj87M95l25p0Q8K0k36K20L11n42K01k88L38j22J69J93l26K5
$$ 61 13 29 17 -7 -5 -7 -194 301 -24 -94 -6 14 -222 -2 309 -233 -32 -320 18 -104 65 258 -68 -43
5636d3J51j25J57K2k72OJ39j78N83l53O6k37n7K05j85J37j37K88j67R3o9Q1j01
$$ -43 108 -17 140 162 -110 -104 35 -143 440 87 153 -84 -141 64 -121 16 -121 167 0 93 24 105 4
5659Dm0j13m4K02P5n8L6j27n9j15M32k45O7O3k42J22J63p3J26l23J74j45L7QJ0
$$ 4 -36 -149 -193 9 84 26 62 -65 -124 -239 193 -52 15 78 -164 -42 121 48 174 -149 25 -120 -83 -75 -65
5684f5M04j47k45n0K67l70J17j79J16M40m70K69J17l8j16j56L9Q1p0J45r0o9K89
$$ -65 339 192 -53 -103 164 -206 -89 -268 -152 288 -182 87 204 166 50 -106 -67 14 -56 89 -1 -70 219
5707B19j11r6no1K1J06N3K43m40J61k99K26m6J40j26J01L05l36l6r0P1K6J36j69
$$ 219 108 12 7 -54 -33 73 126 369 -71 90 -209 17 -29 111 -15 86 391 55 19 -71 0 26 162 -7
5731gL5K9m3J37k08j01Q8J85k00N1J27L6K5J51m09m1L47j63r8K18k33R4J44n3
$$ -7 28 57 14 151 -57 -158 -70 115 -85 -34 93 129 154 305 -104 -145 202 39 -59 159 -74 20 164 111
5755A11r1p5j05p7J04K36J13m80L35k37RJ58K0M0j13L3m1J80j17P7k27j6K51R1
$$ 111 20 -55 -160 -237 -133 103 216 -264 71 -166 -157 1 21 61 -52 -19 -60 120 3 80 -147 -163 88 179
5779A79l13k3K41K73l06Km9k4K29j73k34M40k59r1j16K45j87r0j2L33L8Q3l47
$$ 179 -134 -157 84 357 51 53 4 -20 209 36 -198 242 -17 -108 -224 21 -166 -256 -268 65 103 186 -161
5802a61L36k76L16p4k07q5J00J21k1j17L83ql12n0P0o7J82j08j21K32j41r7j72
$$ -161 175 -101 215 141 -66 -151 -51 70 49 -68 315 307 -5 -55 15 -52 130 22 -99 133 -8 -105 -277
5825b77K20K14r8j67j50K41J75j73K21k33K53m3l66K29j4k0R7q0J01j01nR0n7
$$ -277 -57 157 59 -108 -258 -17 158 -15 206 -27 226 183 -183 46 32 12 109 29 130 29 24 114 57
5848E7r4j19kK60Pl37J51J98l29K37j9J09j54K58k99j7L62k18M1o9K8rj9N9N6
$$ 57 -37 -156 -158 102 109 -228 -77 121 -208 29 10 119 -35 223 -76 -93 269 51 92 23 51 42 23 82 138
5873A38k25Q1Kj76K06P5l94K10Rm4j2L66P2k86j37K9J38r5j65K85j36J11J99j91
$$ 138 -87 -6 -4 -180 26 101 -293 -83 -74 -118 -130 236 308 22 -115 -86 52 -43 -208 77 -59 52 251 60
5897F0p4k1ko1k5K25jl06M52j43J44l40K37r1P3j18Qj29K70j89M8m5J63k3j98
$$ 60 -14 -35 -37 -98 -123 102 101 -205 247 104 248 -92 145 54 127 9 17 -112 158 -31 17 -28 135 112 -86
5922h6o5J48J28k14L5j6R6k08L80P8j23k65M7j74K71Pj41J77o3r3L12j01j05l2
$$ -86 -151 -3 125 -89 -54 -70 26 -182 198 276 153 -112 -65 -239 32 39 -102 75 12 -81 231 130 25 -7
5946gK3K6rJ95m16Q6J09o2L3K19l45J66K35k23l6m5N3J51k35O8k08J25J2p1M05
$$ -7 16 42 33 228 -188 -102 7 -55 -22 197 -148 18 253 30 -6 -51 2 153 -82 -14 -222 -97 -85 -156 249
5971B49l37r7k4M19k88J94j31J50K29j26m50J84oJ33L8m34J49m9K00k59OJ68l
$$ 249 -88 -185 -209 210 -78 116 -15 135 364 238 -212 -28 -34 99 137 -297 -148 -197 3 -256 -250 -82 -85
5994h5J17l21L96k09OJ34K49k43J75j01j8k8J06l70M10m5m79J99J25k72K42l7
$$ -85 32 -289 107 -102 -96 38 287 44 219 118 100 72 178 -192 218 173 -306 -107 18 -254 -12 -49
6016d9j55K01k78K11O4Jj63J71n4K70m2K25l64Q7j11j41R0o7j71L28j66J58l73
$$ -49 -204 -3 -281 -70 -6 -5 -168 3 -51 219 177 402 38 125 14 -127 -37 -104 -275 53 -113 45 -328
6039c28L26M5l25L54k97j32L23k07K22mj65J14j6J81l82L54j50o1N7K95k37J11
$$ -328 -2 43 -282 72 -225 -357 -34 -241 -19 -23 -188 -74 -90 91 -291 63 -87 -148 -91 204 -33 78
$$ [...]
8191c50
##END NTUPLES=NMR FID
##END=
