##TITLE=1H_L8-epoxy-b(f10)
 CDCl3
 8 sc, 
 23.09.2022
##JCAMPDX= 6.0         $$ Bruker NMR JCAMP-DX V2.0
##DATA TYPE= NMR FID
##DATA CLASS= NTUPLES
##ORIGIN= UXNMR, Bruker Analytische Messtechnik GmbH
##OWNER= root
$$ XWIN-NMR		Version 3.5
$$ Fri Sep 23 12:29:49 2022 Russian Standard Time (UT+4h)  she@DPX200
##.OBSERVE FREQUENCY= 200.1313499994
##.OBSERVE NUCLEUS= ^1H
##.DELAY= (6, 6)
##.ACQUISITION MODE= SIMULTANEOUS
##.ACQUISITION SCHEME= undefined
##.AVERAGES= 8
##.DIGITISER RES= 18
##SPECTROMETER/DATA SYSTEM= spect
##.PULSE SEQUENCE= zg30
##.SOLVENT NAME= CDCl3
##.SHIFT REFERENCE= (INTERNAL, CDCl3, 0, 15.7039)
##AUDIT TRAIL= $$ (NUMBER, WHEN, WHO, WHERE, WHAT)
$$ ##TITLE= Audit trail, XWIN-NMR		Version 3.5
$$ ##JCAMPDX= 5.01
$$ ##ORIGIN= Bruker BioSpin GmbH
$$ ##OWNER= she
$$ F:/spectra/data/she/nmr/H-F/1/audita.txt
$$ ##AUDIT TRAIL=  $$ (NUMBER, WHEN, WHO, WHERE, WHAT)
(   1,<2022-09-23 12:28:39.70 +0400>,<she>,<DPX200>,
      <created by zg, POWCHK disabled, PULCHK disabled
       configuration hash MD5:
       00 E9 B6 7A A2 85 ED C7 34 08 36 98 17 FE 4E 26
       data hash MD5: 16K
       E8 01 36 FB 86 13 FB 1F B3 B5 24 F9 97 9B 95 91>)
$$ ##END=
$$ 
$$ hash MD5
$$ 82 8C 3E 7A E5 C1 9C FD 4A DC 44 5B 92 8F E0 B5
##$RELAX= 
##$RELAX= 
##$RELAX= 
##$RELAX= 
##$RELAX= 
##$RELAX= 
$$ Bruker specific parameters
$$ --------------------------
##$DU= <F:/spectra>
##$EXPNO= 1
##$NAME= <H-F>
##$PROCNO= 1
##$TYPE= <nmr>
##$USER= <she>
##$AMP= (0..31)
100 100 100 100 100 100 100 100 100 100 100 100 100 100 100 100 100 100 
100 100 100 100 100 100 100 100 100 100 100 100 100 100 
##$AQSEQ= 0
##$AQ_mod= 1
##$AUNM= <au_zg>
##$AUTOPOS= <>
##$BF1= 200.13
##$BF2= 200.13
##$BF3= 200.13
##$BF4= 200.13
##$BF5= 200.13
##$BF6= 200.13
##$BF7= 200.13
##$BF8= 200.13
##$BYTORDA= 1
##$CFDGTYP= 0
##$CFRGTYP= 5
##$CHEMSTR= <none>
##$CNST= (0..31)
1 1 145 1 1 1 1 1 1 1 1 1 1 1 1 1 1 1 1 1 1 1 1 1 1 1 1 1 1 1 1 1 
##$CPDPRG= <>
##$CPDPRG1= <>
##$CPDPRG2= <>
##$CPDPRG3= <>
##$CPDPRG4= <mlev>
##$CPDPRG5= <mlev>
##$CPDPRG6= <mlev>
##$CPDPRG7= <mlev>
##$CPDPRG8= <mlev>
##$CPDPRGB= <>
##$CPDPRGT= <>
##$D= (0..31)
0 1.2 0 0 0 0 0 0 0 0.06 0 0.03 0 0 0 0 0.0002 0 0 0 0 0 0 0 0 0 0 0 0 
0 0 0 
##$DATE= 1663921719
##$DBL= (0..7)
120 120 120 120 120 120 120 120 
##$DBP= (0..7)
150 150 150 150 150 150 150 150 
##$DBP07= 0
##$DBPNAM0= <>
##$DBPNAM1= <>
##$DBPNAM2= <>
##$DBPNAM3= <>
##$DBPNAM4= <>
##$DBPNAM5= <>
##$DBPNAM6= <>
##$DBPNAM7= <>
##$DBPOAL= (0..7)
0.5 0.5 0.5 0.5 0.5 0.5 0.5 0.5 
##$DBPOFFS= (0..7)
0 0 0 0 0 0 0 0 
##$DE= 6
##$DECBNUC= <off>
##$DECIM= 32
##$DECNUC= <off>
##$DECSTAT= 4
##$DIGMOD= 1
##$DIGTYP= 9
##$DL= (0..7)
0 120 120 120 120 120 120 120 
##$DP= (0..7)
150 150 150 150 150 150 150 150 
##$DP07= 0
##$DPNAME0= <>
##$DPNAME1= <>
##$DPNAME2= <>
##$DPNAME3= <>
##$DPNAME4= <>
##$DPNAME5= <>
##$DPNAME6= <>
##$DPNAME7= <>
##$DPOAL= (0..7)
0.5 0.5 0.5 0.5 0.5 0.5 0.5 0.5 
##$DPOFFS= (0..7)
0 0 0 0 0 0 0 0 
##$DQDMODE= 0
##$DR= 18
##$DS= 0
$$ [...]
##$SUBNAM2= <"">
##$SUBNAM3= <"">
##$SUBNAM4= <"">
##$SUBNAM5= <"">
##$SUBNAM6= <"">
##$SUBNAM7= <"">
##$SUBNAM8= <"">
##$SUBNAM9= <"">
##$SW= 18.0517283424941
##$SWIBOX= (0..15)
0 0 2 0 0 0 0 0 0 0 0 0 0 0 0 0 
##$SW_h= 3612.71676300578
##$TD= 16384
##$TD0= 1
##$TE= 0
##$TE2= 300
##$TE3= 300
##$TEG= 300
##$TL= (0..7)
0 120 120 120 120 120 120 120 
##$TP= (0..7)
150 150 150 150 150 150 150 150 
##$TP07= 0
##$TPNAME0= <>
##$TPNAME1= <>
##$TPNAME2= <>
##$TPNAME3= <>
##$TPNAME4= <>
##$TPNAME5= <>
##$TPNAME6= <>
##$TPNAME7= <>
##$TPOAL= (0..7)
0.5 0.5 0.5 0.5 0.5 0.5 0.5 0.5 
##$TPOFFS= (0..7)
0 0 0 0 0 0 0 0 
##$TUNHIN= 0
##$TUNHOUT= 0
##$TUNXOUT= 0
##$USERA1= <user>
##$USERA2= <user>
##$USERA3= <user>
##$USERA4= <user>
##$USERA5= <user>
##$V9= 5
##$VALIST= <valist>
##$VCLIST= <CCCCCCCCCCCCCCC>
##$VD= 0
##$VDLIST= <DDDDDDDDDDDDDDD>
##$VPLIST= <PPPPPPPPPPPPPPP>
##$VTLIST= <TTTTTTTTTTTTTTT>
##$WBST= 1024
##$WBSW= 4
##$XGAIN= (0..3)
0 0 0 0 
##$XL= 0
##$YL= 0
##$YMAX_a= 71890
##$YMIN_a= -104950
##$ZGOPTNS= <>
##$ZL1= 120
##$ZL2= 120
##$ZL3= 120
##$ZL4= 120
##$ABSF1= 10
##$ABSF2= 0
##$ABSG= 5
##$ABSL= 3
##$ALPHA= 0
##$AQORDER= 0
##$ASSFAC= 0
##$ASSFACI= 0
##$ASSFACX= 0
##$ASSWID= 0
##$AUNMP= <proc_1d>
##$AZFE= 0.1
##$AZFW= 0.1
##$BCFW= 1
##$BC_mod= 2
##$BYTORDP= 1
##$COROFFS= 0
##$CY= 11.3945322036743
##$DATMOD= 1
##$DC= 2
##$DFILT= <>
##$DTYPP= 0
##$F1P= 2.36226072786647
##$F2P= -0.459571619588291
##$FCOR= 0.5
##$FTSIZE= 0
##$FT_mod= 4
##$GAMMA= 1
##$GB= 0.15
##$INTBC= 1
##$INTSCL= 1
##$ISEN= 128
##$LB= 0.24
##$LEV0= 0
##$LPBIN= 0
##$MAXI= 10000
##$MC2= 0
##$MEAN= 0
##$ME_mod= 0
##$MI= 1.114404
##$NCOEF= 0
##$NC_proc= 0
##$NLEV= 6
##$NOISF1= 3.799351
##$NOISF2= 2.8
##$NSP= 1
##$NTH_PI= 0
##$NZP= 0
##$OFFSET= 15.70392
##$PC= 1
##$PHC0= -18039.62
##$PHC1= 19.60069
##$PH_mod= 1
##$PKNL= yes
##$PPARMOD= 0
##$PSCAL= 0
##$PSIGN= 0
##$REVERSE= no
##$SF= 200.130013532006
##$SI= 16384
##$SIGF1= 3
##$SIGF2= 2
##$SINO= 400
##$SIOLD= 16384
##$SREGLST= <1H.CDCl3>
##$SSB= 0
##$STSI= 0
##$STSR= 0
##$SW_p= 3612.71676300578
##$SYMM= 0
##$S_DEV= 0
##$TDeff= 0
##$TDoff= 0
##$TI= <>
##$TILT= no
##$TM1= 0
##$TM2= 0
##$TOPLEV= 0
##$USERP1= <user>
##$USERP2= <user>
##$USERP3= <user>
##$USERP4= <user>
##$USERP5= <user>
##$WDW= 1
##$XDIM= 8192
##$YMAX_p= 0
##$YMIN_p= 0
$$ End of Bruker specific parameters
$$ ---------------------------------
##NTUPLES= NMR FID
##VAR_NAME=  TIME,          FID/REAL,        FID/IMAG
##SYMBOL=    X,             R,               I
##VAR_TYPE=  INDEPENDENT,   DEPENDENT,       DEPENDENT
##VAR_FORM=  AFFN,          ASDF,            ASDF
##VAR_DIM=   8192,          8192,            8192
##UNITS=     SECONDS,       ARBITRARY UNITS, ARBITRARY UNITS
##FACTOR=    0.0002768,     1,               1
##FIRST=     0,             0,               0
##LAST=      2.2672688,     0,               0
##MIN=       0,             -104950,         0
##MAX=       2.2672688,     71890,           0
$$ Real data points
##PAGE= N=1
##DATA TABLE= (X++(R..R)), XYDATA
0@%%%%%%%%%%%%%%qJ6j6J6j6K4l2L2m0M8n6O5p3Q8j04J20j36J53j75J99k23K52
$$ 0 0 0 0 0 0 0 0 0 0 0 0 0 0 0 -8 8 -8 8 -8 16 -16 16 -24 24 -32 33 -40 48 -56 64 -72 81 -94 105 -118 134
36A34k85L19l58M00m44M95n51O09o73P44q22R08j000J102j217J340j474J627j795
$$ 134 -151 168 -190 210 -234 261 -290 319 -354 390 -432 476 -524 578 -639 701 -773 854 -941
55i41J984k198K444k730L062l456L931m524N284o291P711r873J3604k1851P6492
$$ -941 1043 -1155 1289 -1441 1621 -1835 2096 -2428 2856 -3435 4276 -5597 8007 -13844 62648
70F2648l9044o7536J15822j9461p9052J1429M6881l5556j5125J2427K930p512
$$ 62648 23604 -43932 71890 52429 -26623 -15194 31687 -3869 -18994 -6567 -3637 -11149
82a1149l157j1004J7730J1334j5925l409J6085j8893j1474K3340J235k1483K1782
$$ -11149 -14306 -25310 -7580 3754 -12171 -15580 505 -18388 -29862 -6522 -5287 -26770 -4988
95d988K5702j5689p761K1523l356k2438K75J4178k437j2372j427J4163M911j3401
$$ -4988 20714 5025 -2736 18787 15431 -7007 -6732 7446 5009 -7363 -8790 5373 10284 -3117
109c117k22J9230k215j6034J0901J5356j4943j5979O800M718p658n097R66N583
$$ -3117 -3339 15891 13676 -2358 8543 23899 8956 -7023 -223 4495 -3163 -8260 -7294 -1711
123a711K195o315Q70J0013n408j2593P167R029o959j980N991j816M48P108j310
$$ -1711 484 -5831 -4961 5052 -356 -12949 -5782 3247 -3712 -5692 299 -1517 -1069 6039 4729
138D729l288M475J96k817J964j378k325J462n216j965J1761l004j7456P881J4541
$$ 4729 1441 5916 6112 3295 5259 3881 1556 3018 -2198 -4163 7598 4594 -12862 -4981 9560
153I560j4985j0152J5183J194j2383N057O535m172J520j470m431J1973N105j6976
$$ 9560 -5425 -15577 -394 800 -11583 -6526 9 -4163 -2643 -4113 -8544 3429 8534 -8442
167h442M008K1187j0517j4754J7823O729j8071L088J4021q654n992N510o327m901
$$ -8442 -4434 16753 6236 -8518 9305 16034 -2037 1051 15072 6418 426 5936 -391 -5292
181e292O336l519o868O503J273n356M862J382o561N865N389r264M863J3939r639
$$ -5292 1044 -2475 -9343 -2840 -1567 -6923 -2061 -679 -7240 -1375 4014 -5250 -387 13552 3913
196C913j0416J4242M609j5758q05J0871j930p398j273K257K024o284q257Q376
$$ 3913 -6503 7739 12348 -3410 -4215 6656 4726 -2672 -3945 -1688 336 -5948 -14205 -5829
210e829Q672j1104l348J5859J371j3155M433R431o262l514P170J019k964M98n48
$$ -5829 2843 -8261 -11609 4250 5621 -7534 -3101 6330 68 -3446 3724 4743 1779 2277 1729
225A729M73L21j658M84K595l421O23N059m846n724P896K391r770K958J0048n263
$$ 1729 2202 2523 865 1349 3944 523 1146 6205 1359 -4365 3531 5922 -3848 -890 9158 3895
241C895p631M208K996m109m997n43N355K276r037r42J3204k808j3061P557J0200
$$ 3895 -3736 472 3468 -641 -5638 -6181 -826 1450 -7587 -8529 4675 1867 -11194 -3637 6563
256F563r735m724R126J34m566L096n54k71O489j640n279P801K740j0177J869O252
$$ 6563 -3172 -7896 1230 1364 -3202 -106 -660 -931 5558 3918 -1361 6440 9180 -997 872 7124
272G124p593l717P196m403m898P531j231q237O223N604q161j23P195k684k178
$$ 7124 -469 -4186 3010 -1393 -6291 1240 9 -8228 -2005 3599 -4562 -4685 2510 -174 -2352
287b352K826j966J684M837n349j833J1215n84j1725O799Q479j0235n662Q493r50
$$ -2352 474 -1492 192 5029 -320 -2153 9062 8478 -3247 3552 12031 1796 -3866 4627 3677
302C677o707J037O65r70K319l483l030O769J403r039J482P821m672m944N589J417
$$ 3677 -3030 -1993 -1328 -2298 21 -3462 -6492 277 1680 -7359 -5877 1944 -2728 -7672 -2083 -666
318f66l623J994K212j443K251K148k251J043K719p80q96m25j24K178j047n509
$$ -666 -4289 -2295 -83 -1526 725 2873 622 1665 4384 3604 2708 2283 2159 4337 3290 -2219
334b219K015N999n101n686O573L804o999k648N870J795m674l449L521M170n379
$$ -2219 -204 5795 694 -4992 1581 5385 -1614 -4262 1608 3403 -1271 -4720 -1199 2971 -2408
349b408n547P690M873r201j129J0609j598q285N339M021o133P61M589l500q98
$$ -2408 -7955 -265 4608 -4593 -5722 4887 3289 -4996 343 4364 -1769 -1008 3581 81 -817
364h17L985j953k437L521m34j870J523j901j107M286l829o538P574M006j1382
$$ -817 3168 1215 -1222 2299 1865 -5 1518 -383 -1490 2796 -1033 -7571 3 4009 -7373
379g373M23J2563m386r692P730N808p001k074M064J076P18j095l155N409L232
$$ -7373 -6950 5613 1227 -8465 -735 5073 -1928 -4002 62 1138 1856 761 -2394 3015 6247
394F247p963L09R821k924p872N798L344p216p30K999l649K08K765l596q58M606
$$ 6247 -1716 -1407 8414 5490 -2382 3416 6760 -456 -1186 1813 -1836 -1628 1137 -2459 -3317 1289
410A289k716l474L351rk735K663O32k757M137K154n836K137P334m079m340N784
$$ 1289 -1427 -4901 -1550 -1559 -4294 -1631 -999 -3756 381 2535 -3301 -1164 6170 2091 -2249 3535
426C535K097n859j719K490J88j038k575M52N521Q7o751K389O016m325n218M600
$$ 3535 5632 -227 -1946 544 732 -306 -2881 -2429 3092 3179 -3572 -1183 4833 508 -4710 -110
442a10K906m396j629K663J730j159k528R24M264q11l069K262K448l540k80K410
$$ -110 2796 -1600 -3229 -566 1164 5 -2523 -1599 2665 1854 -1215 1047 3495 -45 -325 2085
458B085k530p97M273j836k661M344J187n323k10L046j214j889m91r34K604k81
$$ 2085 -445 -1242 3031 1195 -1466 2878 4065 -1258 -1468 1578 364 -1525 -2016 -2950 -346 -627
474f27o112K692P434n142n827R877M602r771p36Q693k043n812K886K934o28j037
$$ -627 -6739 -4047 3387 -1755 -7582 2295 6897 -2874 -3610 5083 3040 -2772 114 3048 2420 1383
490A383j420J339L345m029m072N705J866o848Q21M378m884k633M803j152m085
$$ 1383 -37 1302 4647 618 -3454 2251 4117 -2731 -1910 2468 -2416 -5049 -246 -1398 -5483
505e483M677K617m434J316M407k908k426K199J553J43q98k294L973K469o706j459
$$ -5483 -806 1811 -2623 -1307 3100 192 -2234 -35 1518 1661 763 -1531 2442 4911 -1795 -3254
521c254Q559j00q443M611P752n749o207M595J322n307j405J405J067l18k586j36
$$ -3254 5305 5205 -3238 1373 9125 3376 -2831 1764 3086 -2221 -3626 -2221 -1154 -1472 -4058 -4194
537d194L318q13l965K694L217j999m75K620j026j071K634m90j510K788L109j570
$$ -4194 -876 -1689 -5654 -2960 257 -1742 -2217 403 -623 -1694 940 450 -1060 1728 4837 3267
553C267j22J697j32k272k157L3K888k086m335L518L728n158k996N246J102m765
$$ 3267 3145 4842 4710 2438 281 314 3202 1116 -3219 299 4027 -1131 -4127 1119 2221 -2544
569b544O32K095p07j040k283j075K553Q8m255K771N838k545k607N415J449m343
$$ -2544 -1912 183 -524 -1564 -3847 -4922 -2369 -2281 -6536 -3765 2073 -472 -3079 2336 3785 -558
585e58J748K323j711J223J252l001J639K561m016j866M118r20l688J441k0l411
$$ -558 1190 3513 1802 3025 4277 1276 2915 5476 1460 -406 3712 2792 -896 545 525 -2886
601b886J000Jl990K029L314l826o73N147k87l738K511K194j043J95K04J47L212
$$ -2886 -1886 -1885 -5875 -3846 -532 -4358 -5031 116 -171 -3909 -1398 796 -247 -52 152 299 3511
618C511j118m638M031M667n672k734O716l66n520J401K571k749r59J149q31O71
$$ 3511 2393 -2245 1786 6453 781 -1953 4763 4397 -1123 278 2849 100 -859 290 -541 130
634A30L93k357M6K128k395j359K662j50j450J970K59k378K316K256l573kM421
$$ 130 523 -1834 -1788 340 -2055 -3414 -752 -902 -2352 -382 -123 -2501 -185 2071 -1502 -1504 2917
651B917m68l519J121K503j110k125K66K685N13l653m3M334j325n706K042M018
$$ 2917 2449 -1070 51 2554 1444 -681 -415 2270 2783 -870 -913 3421 2096 -3610 -1568 2450
667B450l311k978L122J504j566q55M01J212P12j540n10K855l2l373J873J919l043
$$ 2450 -861 -3839 -717 787 -779 -1634 -1233 -21 691 -849 -1359 1496 1464 -1909 -36 1883 -1160
684a160M54K617j652n10K920r37l044K734J337l634k93K258l99j139m76m40J771
$$ -1160 -706 1911 259 -251 2669 1732 -1312 1422 2759 -875 -1168 1090 691 -448 -924 -1364 407
701D07L90l477L70M693k340l970M037K590m408o45L525p6j251N46N7J123N54k508
$$ 407 797 -2680 -2310 2383 43 -3927 110 2700 -1708 -2353 1172 1096 -155 391 448 1571 2125 -383
719c83k16L464j494l781L006K181m237l29L044k100j643K613k93j888K193L91
$$ -383 -599 2865 1371 -2410 596 2777 -1460 -1789 1255 -845 -2488 125 -168 -2056 137 528
735E28k416P88J534r68K5Q63n10J229N26k472O25L504k331k922L688K187m440
$$ 528 -1888 -1100 434 -534 -509 354 -156 1073 1599 -873 -248 3256 925 -1997 1691 3878 -562
752e62r81L879k85l454l83K323Q29k274j824K656K017m108j223M178l24l573J518
$$ -562 -1543 2336 2051 -1403 -1786 537 1366 -908 -2732 -76 1941 -2167 -3390 788 464 -3109 -1591
769a591K725j575r37J720j30o45P99L28m64J043m58l67J195j156o32K265p98k924
$$ -1591 1134 -441 -1378 342 212 -433 366 694 230 1273 815 448 1643 487 -145 2120 1322 -1602
787a602K473K064m606r58M364n77m412J148L153j416k001K67K438K60k652l27
$$ -1602 871 2935 -1671 -2629 1735 1158 -3254 -2106 1047 -369 -2370 -2103 335 595 -2057 -2384
803b384M411n4m519J143N205k282l446L005K042k598j6J153q93J81R5j043J37
$$ -2384 2027 1973 -2546 -1403 3802 1520 -1926 1079 3121 523 507 1660 767 948 1043 0 137
820A37J182j769m40J238q09r21J217j151j030K316m1l369J796L155k875j535L120
$$ 137 1319 -450 -890 348 -461 -1382 -165 -1316 -2346 -30 -71 -3440 -1644 1511 -1364 -2899 221
837B21P38k447M23J751N44K2j366M67K586j044k578J618K583k804j811K781K70
$$ 221 959 -1488 -1065 686 1230 1252 -114 353 2939 1895 -683 935 3518 714 -1097 1684 1954
854A954k245o56J251j25l22j121j44J471k73k405J234J626k215M99K036p75j027
$$ 1954 -291 -947 304 179 -143 -1264 -1408 63 -210 -2615 -1381 245 -1970 -1471 565 -210 -1237
871a237K390j98k295K523J244k501k66K422j76j724j46P22N00q12k227J168K448
$$ -1237 1153 955 -1340 1183 2427 -74 -340 2082 1906 182 36 758 1258 446 -1781 -613 1835
888A835k613k735L788J474l711q73L465m85k662Q89K063J95j060m99J652J080
$$ 1835 -778 -3513 275 1749 -1962 -2835 630 145 -2517 -1628 435 630 -430 -929 723 1803
904A803k044o38K409M65k476J131J742k453m59J824p94j349J673kj451Q31J015
$$ 1803 -241 -879 1530 1995 -481 650 2392 -61 -520 1304 510 -839 834 832 -619 212 1227
921A227j196r60J47M35P76j034j459K619J015l560k52L756m40m182K014L624k553
$$ 1227 31 -929 -782 -347 429 -605 -2064 555 1570 -1990 -2242 1514 1074 -3108 -1094 2530 -23
938b3j947K141J239j423r98N26J636J68k223R84K134j250k531J824J330k301M02
$$ -23 -1970 171 1410 -13 -1011 -485 1151 1319 -904 80 2214 964 -1567 257 1587 -714 -312
955c12J180j434n33J665j113j388J254R63j361J45J411j47l4m22RJ793L3k696
$$ -312 868 -566 -1099 566 -547 -1935 -681 282 -1079 -934 477 330 296 -126 -117 1676 1709 -987
973i87J584K804k158k061K570J032l147l50J657J10j657o52L94R52j247j884J028
$$ -987 597 3401 1243 -818 1752 2784 -363 -713 944 1054 -603 -1255 -861 91 -1156 -3040 -2012
990b012J743j843q44K563K96j929J363J105o17N73M01m91N13J143p22n87Q51j2
$$ -2012 -269 -2112 -2956 -393 -97 -2026 -663 442 -175 398 799 308 821 1964 1242 655 1506 1494
1008A494m77P7k84k40O40j042j731J472J064k794j05K210p39j510N70J303k36
$$ 1494 1017 1094 810 570 1210 168 -1563 -91 973 -1821 -1926 284 -455 -1965 -1395 -92 -328
1025c28p74O8Q52J232j190j486K546J114k780NK880p16j793R78R26j042q3L05
$$ -328 -1102 -1034 -182 1050 -140 -1626 920 2034 -746 -741 2139 1423 -370 608 1534 492 409 714
1043G14m04J77K36j304J51J053j610m08J130p66p6J068p26r49J589J82j891K48
$$ 714 310 487 723 -581 -430 623 -987 -1395 -265 -1031 -1107 -39 -765 -1714 -125 57 -1834 -1586
1061a586K232p43j157J518N91j59n99K50Q13O31j365m86K710k73k871P72K297
$$ -1586 646 -97 -1254 264 855 696 97 347 1160 1791 426 -60 2650 2377 -494 278 2575
1078B575j786j623J684M60j345m94L23l79L5r23n82J317l5j492J149J053j345
$$ 2575 789 -834 850 1310 -35 -529 -206 -585 -550 -1473 -2055 -738 -773 -2265 -1116 -63 -1408
1095a408M5J485n54n48J908K16j887J067J451j228o23J456M5p16o05N83M90m75
$$ -1408 -1363 122 -432 -980 928 1144 -743 324 1775 547 -76 1380 1425 709 104 687 1177 702
1113G02j404O68J487j884j460K169Q19k062o98J572M7j009K90L70O63j45j066
$$ 702 -702 -34 1453 -431 -1891 278 1097 -965 -1663 -91 -44 -1053 -763 -393 270 125 -941
1130i41Q19J626j591l70J742K24j535N83J320j529r9J308j403q55J601o62j105
$$ -941 -122 1504 -87 -457 1285 1509 -26 557 1877 348 249 1557 154 -701 900 238 -867
1147h67N04N26j092j11K07l95R78k58j456J011J690j605r70K527N8j993P21K127
$$ -867 -363 163 -929 -1040 -833 -1228 -250 -508 -1964 -953 737 -868 -1838 689 747 -1246 -525 1602
1165A602p23j053N68M72Q12p49p72P98O84j601o42J765q35j470R62R26j426P4
$$ 1602 879 -174 394 866 1678 929 157 955 1639 38 -604 1161 326 -1144 -182 744 -682 -608
1183f08N67p98OJ073p90j51O66j44k59P87k5k36N40l00r59J193O22k048j89K336
$$ -608 -41 -839 -833 240 -550 -701 -35 -179 -438 349 324 88 628 328 -631 562 1184 -864 -1053 1283
1203A283n00k002R29J461j139j153J254M41m44j300L31J192j87j421O37J202r09
$$ 1283 783 -1219 -290 1171 32 -1121 133 574 130 -1170 -839 353 166 -1255 -618 584 -325
1220c25o72R04K42q43N42L73j21K43m1k11O44J64q08L62N51p78L54O16j112k61
$$ -325 -997 -93 149 -694 -152 221 100 343 302 91 735 899 91 453 1004 226 580 1196 84 -177
1240a77J155k76j824J378Q66j673q74J576k7j236O4N54J08j91m34L31Q79n90o83
$$ -177 978 702 -1122 256 1122 -551 -1425 151 124 -1112 -1048 -494 -386 -577 -1011 -680 199 -391 -1074
1259a074J312R79j527oJ371j41r07N77K90j43m47q5j02N20k86o60R8J85q50L11
$$ -1074 238 1217 -310 -316 1055 914 7 584 874 731 284 199 97 617 331 -329 -231 -46 -896 -585
1279e85M22p44J29R45p63o38J626L59j497Q50J117r23l79N62R9J80m3p25N41Q97
$$ -585 -163 -907 -778 167 -596 -1234 392 751 -746 104 1221 298 -81 481 580 760 717 -8 533 1430
1299A430p89j052J227K62k027Q1J517q65j115P40O26q24J6k33L73K61l31r7O05
$$ 1430 641 -411 816 1078 -949 -868 649 -216 -1331 -591 35 -789 -773 -1006 -633 -372 -703 -800 -195
1318a95M05q25N26K50l63J27O55n70n3P33j67n37K36M53m23l69J41L83M37n65
$$ -195 210 -615 -89 161 -202 -75 580 10 -43 690 523 -14 222 675 252 -117 24 407 844 279
1338B79o72J236Mj548K61J364n94j475O41J131j103r31Q77L89k10k86K10P58j6
$$ 279 -393 843 847 -701 -440 924 330 -1145 -504 627 -476 -1407 -530 -141 -351 -637 -427 331 315
1357C15r14O39R32q46m79P76K74q58P01N29q74m26J031p64k55K00R2n75p1k87
$$ 315 -599 40 972 126 -353 423 697 -161 540 1069 195 -231 800 36 -219 -19 73 -502 -573 -860
1377h60K26J08q58M42J040r8j443J301J297j409n48J848j53j039N41J071l64n57
$$ -860 -634 -526 -1384 -942 98 0 -1443 -142 1155 -254 -802 1046 893 -146 395 1466 1102 545
1395E45L38j46M12l91q79L82K21p36o98R36K2q84K10L50p66M91N56m63L8N47j39
$$ 545 883 737 1149 758 -121 261 482 -254 -952 -16 6 -878 -668 -318 -1084 -593 -37 -500 -462 85 -54
1416e4m64O00K3k05K66J44O4M22o17n46Q69J20r36J30J097m19j074L78M89k77
$$ -54 -518 82 105 -100 166 310 374 796 179 -367 502 622 -314 -184 913 494 -580 -202 287 10
1436A0m86r8N60O4n43m46J086K04q77M4J059m20o84O68K15k11K00j01j1M4o1K3
$$ 10 -476 -574 -14 50 -493 -939 147 351 -526 -482 577 157 -527 141 356 145 345 244 233 277 216 239
1458B39K01j79j69M85k68k41j3K98m96N0O96l12j203O53M72p26m26Q38l75j51
$$ 239 440 261 92 577 309 68 55 353 -143 -93 603 291 -912 -259 213 -513 -939 -101 -476 -627
1478f27m35K34M81L35q39J34J356m70n36P21P83q38j83Q84l79l51N30l14L0L10
$$ -627 -1062 -828 -347 -12 -851 -717 639 169 -367 354 1137 299 116 1000 621 270 800 486 516 826
1498H26l38p69P42l88n08OL95m86m97M15l08P1M58J3l93L90O23k54j62O49j66
$$ 826 488 -281 461 73 -435 -429 -34 -520 -1017 -602 -910 -839 -381 -368 -761 -371 252 -2 -164 485 319
1519C19k0K28J35J16J91p18N55L97n60q94P28J35r05m87K33J74l80N2O7L16j24
$$ 319 299 527 662 778 969 251 806 1203 643 -251 477 612 -293 -780 -547 -373 -753 -701 -634 -318 -442
1540d42l21K00N39m72j19N80K59o89Q6N31J9K88M56m49J85j46j11k01M46k03j23
$$ -442 -763 -563 -24 -496 -615 -35 224 -465 -379 152 171 459 915 466 651 505 394 193 639 436 313
1561C13j42J5RJ31J1r15N48K50p10o4Q67n60p15O15K98m25l62L98K43M12j82n27
$$ 313 171 186 195 326 337 -578 -30 220 -490 -554 313 -247 -962 -347 -49 -474 -836 -438 -195 217 35 -492
1583d92Q04K78r09J62J080m69m76O38J51p81M60K77p25M09l10l6j77J68o5q45
$$ -492 312 590 -319 -157 923 454 -22 616 767 -14 446 723 -2 407 97 61 -116 52 -13 -858
1603h58M75J13n93K60R9l68P72K27n99rR59k55n17P01N75m19k39L12L56j94j82
$$ -858 -383 -270 -863 -603 -504 -872 -100 127 -472 -481 478 223 -294 407 982 563 324 636 992 798 616
1624F16k79M03m79m65K33K43l48j96j03o2k85R0J23j87L15Oj52nP21n75J77K05
$$ 616 337 740 261 -204 29 272 -76 -272 -375 -437 -722 -632 -509 -696 -381 -375 -527 -532 189 -386 -209 -4
1646dO9nL22j20k24O69k08m04M47N0o75N24J01rn61k24J49q3K9J9j8K46k51l77
$$ -4 65 60 382 262 38 707 499 95 542 592 -83 441 542 533 -28 -252 -103 -186 -157 -138 -156 90 -161 -538
1670e38J96L83p29R9L05j83K06J07K35L1J01j27N0N12k13r6J24K3m46K86r5l48
$$ -538 -342 41 -688 -589 -284 -467 -261 -154 81 112 213 86 136 648 435 339 463 486 40 326 231 -117
1692a17K30L35n48k17L22r6n67L58J18m85p4K84P7qq6J80J50M13l6l30M96K80
$$ -117 113 448 -100 -317 5 -91 -658 -300 -182 -667 -741 -457 -380 -388 -474 -294 -144 269 233 -97 399 679
1714F79p62N10P4K6l39N9M05l19R9M9l51K26k28k77M83n75m56K99R8j29L0j06
$$ 679 -83 427 501 527 188 247 652 333 432 481 130 356 128 -149 334 -241 -697 -398 -300 -429 -399 -505
1736e05L0J34J69k0m9J8K33q9K71Q0p9K08J5k0M03k3n22m7N77l16o55K62k4o85
$$ -505 -475 -341 -172 -192 -241 -223 10 -79 192 272 193 401 416 396 799 776 254 207 784 468 -187 75 51 -634
1760f34M19n5K09k69j11K72J0l3l44O16r4n38J04L33q0P8p4O29j00R8Mk48J30
$$ -634 -215 -270 -61 -330 -441 -169 -159 -192 -536 80 -14 -552 -448 -115 -195 -117 -191 438 338 436 440 192 322
1783C22J08l72J93L15o95K11J90j21n32N21j17o09M11K58n48K1L37j89o3lK15
$$ 322 430 58 251 566 -129 82 272 151 -381 140 23 -586 -175 83 -465 -444 -107 -296 -359 -362 -147
1804a47M6K23k00k1N56k0m24L11Q7l06l01Q51m69j30J14J36k30k82L15j74k18
$$ -147 -101 122 -78 -99 457 437 13 324 411 105 -196 655 186 56 170 306 76 -206 109 -65 -283
1825b83K03p5r9O6p0J29kl17K5L03L9l71M33K66o55L76L45k12j61K10L48m60K8
$$ -283 -80 -155 -254 -188 -258 -129 -131 -448 -423 -120 -81 -452 -19 247 -408 -32 313 101 -60 150 498 38 66
1848F6R8K81K0m40p0M14K18o23J55O49p83n16J89K42m11L31j4j67J38p8J67l4
$$ 66 164 445 465 25 -45 369 587 -36 119 768 -15 -531 -342 -100 -511 -180 -194 -361 -223 -301 -134 -168
1870a68l4J2L06O1j43J47K69l97L72M50l51l30N06k32m39l14L29q9k96m1J11R7
$$ -168 -202 -190 116 177 34 181 450 53 425 875 524 194 700 468 29 -285 44 -45 -341 -382 -271 -174
1892a74Lj81j29L94j45o94M31J62k95K8N00K05j70M64R2K86j76L20n62M17k81
$$ -174 -171 -352 -481 -87 -232 -926 -495 -333 -628 -600 -100 105 -65 399 491 777 601 921 359 776 495
1913D95p8l79M4q0K73j69j14l13M71k17Rl97N8M0j92L74j50n7L9R4L71L7j98J00
$$ 495 417 38 82 2 275 106 -8 -321 150 -67 -58 -455 -397 -357 -549 -175 -325 -382 -343 -249 122 159 -39 61
1937F1K05j07l24L76l5j58J28l2J1M9j8N2j7q0o0j94J39r3j50M39l32j23kN1l1
$$ 61 266 159 -165 211 176 18 146 114 125 174 156 208 191 111 51 -143 -4 -97 -247 192 -140 -263 -265 -214 -245
1962b45k5L40j18Q9LJ27j20k13M37k38J3P5J44J0J44j15j46K75l25K52Ok66k9
$$ -245 -270 70 -48 41 44 171 51 -162 275 37 50 125 269 279 423 308 162 437 112 364 370 104 75
1985G5Q2j0l77k63J85qj8j77r9M17P6n71L23L38p6k33L59M6k86J26M51j61K36
$$ 75 157 147 -230 -493 -308 -316 -334 -511 -610 -193 -117 -688 -365 -27 -103 -336 23 69 -217 -91 360 199 435
2008D35J80n5k86K85k19R3j22m76K18Kq1n05L82m0k71qK33J51j90K17r6J30j89
$$ 435 615 560 274 559 340 433 311 -165 53 55 -26 -531 -149 -189 -460 -468 -235 -84 -274 -57 -153 -23 -212
2031b12j8n3J81l1K70K08r1RK70n8j50j31R0l71O8O3J26j75R1k38L1nJ06k18p0
$$ -212 -230 -283 -102 -133 137 345 254 263 533 475 325 194 284 -87 -19 44 170 -5 86 -152 -121 -126 -20 -238 -308
2056c08J53k53K53k23J55j19J39Q6J99q2L52m72K0M17q1l68J90J37K24k91M5j02
$$ -308 -155 -408 -155 -378 -223 -342 -203 -117 82 0 352 -120 -100 317 236 -132 58 195 419 128 173 71
2078G1J47K6l13J61J56l13o9j39j8J3J01j46J17J69l53K62k57K35p7K55j10N5
$$ 71 218 244 -69 92 248 -65 -134 -273 -291 -278 -177 -323 -206 -37 -390 -128 -385 -150 -227 28 -82 -27
2100b7k26N31J42l10L24q2k17J46R9j54J2q3L0n3O6m00NPj94J37K35k15r0K66
$$ -27 -253 278 420 110 434 352 135 281 380 226 238 155 185 132 198 -202 -197 -190 -384 -247 -12 -227 -317 -51
2124e1j6n26M93K0k75K24J82J64Q4k10L07j39M1j60L39J34l00L2j06M8l02J42
$$ -51 -67 -593 -100 -80 -355 -131 51 215 299 89 396 257 298 138 477 611 311 343 237 285 -17 125
2146A25P6m04k7K82k52j51j05L92l95m0L09Q9m45L29J21M9J45j6m1P1k16J02L18
$$ 125 201 -203 -230 52 -200 -351 -456 -64 -459 -499 -190 -101 -546 -217 -96 -47 98 82 41 112 -104 -2 316
2169C16Q4j58j44J61k15K52k45l6j00J12j02R8M0l62Q5L7J31k30J08L6j56J42
$$ 316 400 242 98 259 44 296 51 15 -85 27 -75 23 63 -299 -214 -177 -46 -276 -168 -132 -288 -146
2191a46J1J29l7P3l08K56J08j01P6J36qj94M08o1j9j75K74j34k35J12Kl51mJ50
$$ -146 -135 -6 -43 30 -278 -22 86 -15 61 197 189 -5 403 342 323 148 422 288 53 165 167 -184 -188 -38
2215c8m50K76k22P3K7J21j2O2m9J44j19L76o0q8r6O6K61p6R7J2kj88L6J8K88m22
$$ -38 -488 -212 -434 -361 -334 -213 -225 -163 -212 -68 -187 189 129 41 -55 11 272 196 293 305 303 115 151 169 457 35
2241C5L68m66P2m5O1k52K68j16j27k18R8J60l39n6N87j56k88L04K62o3R0k52O1
$$ 35 403 -63 9 -36 25 -227 41 -75 -202 -420 -322 -162 -501 -557 30 -126 -414 -110 152 89 179 -73 -12
2264a2J34J44k94K12j43J93j51J42o5k85M38m45n3J71J7r8j14m4J42N2k48K38
$$ -12 122 266 -28 184 41 234 83 225 160 -125 313 -132 -185 -14 3 -95 -209 -253 -111 -59 -307 -69
2286f9j0L58n75L26J63k23J33J28k38j09J37J22Kp5K22l47L87j92o6l8M20r35
$$ -69 -79 279 -296 30 193 -30 103 231 -7 -116 21 143 145 70 292 -55 332 140 74 36 456 -479
2308d79M50k98J61J16O8J33j49Ok10R7n6K1j17J29k81L02k92K02J48K81j04Q2
$$ -479 -29 -327 -166 -50 18 151 2 8 -202 -105 -161 -140 -257 -128 -409 -107 -399 -197 -49 232 128 210
2330B10P8K54k08K4p2k36J17j03Lp4K5O4k00O1N0m5q5k8nJ2K5j79L38k21K48k33
$$ 210 288 542 334 358 286 50 167 64 67 -7 18 82 -118 -57 -7 -52 -137 -165 -170 -158 -133 -312 26 -195 53 -180
2356a80K43K8K0k8J70Qj26n8O1jj51j90N5M0J74O8j07O5q6j1j73L1n9K9j03L3
$$ -180 63 91 111 83 253 261 135 77 138 137 -14 -204 -149 -109 65 133 26 91 5 -6 -179 -148 -207 -178 -281 -248
2382b48M3pM9k73M10L4M3J42k17K81N1j38k0KJ16k53L76m12J57j73P9O4j37J91
$$ -248 -205 -212 -163 -436 -26 8 51 193 -24 257 308 170 150 152 268 15 391 -21 136 -37 42 106 -31 160
2406A60L0n14M4N35m72q7j56N29l80L7K43%o6n6K30R9m4P7j38m0K01K0j97J3K00
$$ 160 190 -324 -280 255 -217 -304 -460 69 -311 -274 -31 -31 -97 -153 77 176 132 209 71 31 232 252 55 68 268
2431B68Q3n1R7n13L41q1l7m8j67J21k03J25m9l2j43N7J78lm5J5J1k9L30k38L45
$$ 268 351 300 397 -116 225 144 107 59 -108 13 -190 -65 -114 -146 -289 -232 -54 -57 -102 -87 -76 -105 225 -13 332
2456C32m75L45q0PK67k03QN0l1m24L91N0l60k5K0j5j9m6P0j39lj46K10J56o1M0
$$ 332 -143 202 122 129 396 193 201 251 220 -204 187 237 -123 -148 -128 -143 -162 -208 -138 -277 -280 -426 -216 -60 -121 -81
2482h1k4j3K12m53N65k87j2L00k10J26K9p8j10L48l06q3J36L11k26N1Q5k27j48
$$ -81 -105 -118 94 -359 206 -81 -93 207 -3 123 152 74 -36 312 6 -77 59 370 144 195 280 53 -95
2505i5Pp7P1J34j42J91N4k31j28Q7J29nR9j07P7l0K70o0j75o4J3M2J91Q9j91n7
$$ -95 -88 -165 -94 40 -102 89 143 -88 -216 -129 0 -5 94 -13 64 34 304 244 69 5 18 60 251 340 149 92
2531I2r2k34J06j72K79k92J83K8N9nj01N0j16m0L22m9k87J3J74J63k22L72J8j90
$$ 92 0 -234 -128 -300 -21 -313 -130 -102 -43 -48 -149 -99 -215 -255 67 18 -269 -256 -82 81 -141 231 249 59
2555E9L55l12J91Rp4j8j40j04J21J08m16L10j51p9J4K71j74r9K5k80L59k34l5
$$ 59 414 102 293 302 228 210 70 -34 87 195 -221 89 -62 -141 -127 144 -30 -129 -104 -384 -25 -259 -294
2578b94P5P5o9j29L56rj10o5J06L45j00L2K08r3k94l7J88k13L56j7q6l84O8K68
$$ -294 -219 -144 -213 -342 14 5 -105 -170 -64 281 181 213 421 328 34 -3 185 -28 328 311 225 -159 -91 177
2602A77l61n7j61L41k5J14k39j20N7J21o3J03J82J44l44K65J45P6l28J06l0j3
$$ 177 -184 -241 -402 -61 -86 28 -211 -331 -274 -153 -216 -113 69 213 -131 134 279 355 27 133 103 90
2624I0J86j89j00K9J91q4o2J63j14l15J12j85K53j77J80p4l71K66K1L3J62k13
$$ 90 276 87 -13 16 207 123 61 224 110 -205 -93 -278 -25 -202 -22 -96 -467 -201 -180 -147 15 -198
2646a98K35m9N9O4N5q5M9P2k92J28K15N6l19P4j31J28p2J11k16kJ16mk2J54m38
$$ -198 37 -12 47 111 166 81 130 202 -90 38 253 309 -10 64 -67 61 -11 100 -116 -118 -2 -6 -28 126 -312
2671c12K30m5J68l24M2K28n5k2J61N6K7J6k11K39p8J68j69J99j98J75l72k09L68
$$ -312 -82 -127 41 -283 -241 -13 -68 -90 71 127 154 170 -41 198 120 288 119 318 120 295 -77 -286 82
2694H2J21l24K82q8l00J32q9M1Q9k85l0J14lJ62L8J93k75j24K37L56m38L01J8
$$ 82 203 -121 161 73 -227 -95 -184 -143 -54 -339 -369 -255 -258 -96 -58 135 -140 -264 -27 329 -109 192 210
2717B10J44j23J0j14p8L03j61m5j57k22J32P8J37k51L13m30P8M2j38J72j2P7j0
$$ 210 354 231 241 127 49 352 191 146 -11 -233 -101 -23 114 -137 176 -254 -176 -134 -272 -100 -112 -35 -45
2740d5J39j9l91K94K34l04L78m80J01L43k05%K84j72j25j18L01l3k35J70k76K19
$$ -45 94 75 -316 -22 212 -92 286 -194 -93 250 45 45 329 157 32 -86 215 182 -53 117 -159 60
2762F0N8j35j28N0jl5L6k28J80K20j53m3K92m72J89R5l2K68m26K31J1L2K89m12
$$ 60 118 -17 -145 -95 -96 -131 -95 -323 -143 77 -76 -119 173 -299 -110 -15 -47 221 -205 26 37 69 358 -54
2786e4KJ21J85n0k36R3j19J29q0k83K7R1J33r6j23j1K71k88L1L14k84K25K08j76
$$ -54 -52 69 254 204 -32 61 -58 71 -9 -292 -265 -174 -41 -137 -260 -271 0 -288 -257 57 -227 -2 206 30
2810C0r1O5J15l21K71J02L8n7J95k04qL6j70r7Q8J87l67M4J36N5k02Q5k68J13
$$ 30 -61 4 119 -202 69 171 209 152 347 143 135 171 1 -96 -8 179 -188 -144 -8 47 -155 -70 -338 -225
2834b25J6P8J65j21j25j38M82l45K83K05j39m6n8n9K51n2j49Q9l6L4j55L5q6j12
$$ -225 -209 -131 34 -87 -212 -350 132 -213 70 275 136 90 32 -27 224 172 23 112 76 110 -45 -10 -96 -208
2858b08J00K79k57K29j46P3j12O1k70K59J76l59L19l3j3j6M0l85L19k09K81kl11
$$ -208 -108 171 -86 143 -3 70 -42 19 -251 8 184 -175 144 111 98 82 122 -263 56 -153 128 126 -185
2881a85J56l2L53k05j32J48j48j0J23k2j4J14R3n42K78r5Kk16J28J33r2P6M6o4
$$ -185 -29 -61 292 87 -45 103 -45 -55 68 46 32 146 239 -303 -25 -120 -118 -334 -206 -73 -165 -89 -43 -107
2905a07R9N07m87k9K1O5JRp3L39l11K22j97k5R2M8j87K7q1j27R0n9j13J67j0p
$$ -107 -8 499 12 -17 4 69 70 79 6 345 34 256 59 34 126 174 -13 14 -67 -194 -104 -163 -276 -109 -119 -126
2931a26k6l0j7K00pk0k83L05j33m9K4Q9L16k66K63L9k41o7L0L34m19J00J27j33
$$ -126 -152 -182 -199 1 -6 -26 -309 -4 -137 -186 -162 -73 243 -23 240 279 38 -29 1 335 -84 16 143 10
2955A0M0J9l11J65J25r4l3p1J1K5O3N6Q1Qr8p0Q2J63o4j71j12P9M12k59j78J40
$$ 10 50 69 -242 -77 48 -46 -79 -150 -139 -114 -51 5 86 94 -4 -74 8 171 107 -64 -176 -97 315 56 -122 18
2981A8j9j36J40j23j12M83l63J7K8M2j3J6j16O1j49j7K34k59J91k9p9K81k00J89
$$ 18 -1 -137 3 -120 -232 251 -112 -95 -67 -25 -38 -22 -138 -77 -226 -243 -9 -268 -77 -106 -185 96 -104 85
3005H5k35L72j50Q0j28P4o8P9n6R1J69m34L3L19l25J18L4j34K17j22j35j55J42
$$ 85 -150 222 72 152 24 98 30 109 53 144 313 -121 -88 231 -94 24 58 -76 141 19 -116 -271 -129
3028a29J20j9P2o5p6J37j63j97K19P9N6J29k77K26J24k98K16k14P0r0p3J90Jq7
$$ -129 -9 -28 44 -21 -97 40 -123 -320 -101 -22 34 163 -114 112 236 -62 154 -60 10 -80 -153 37 38 -49
3052d9L58l86R1l6j42J8j36L32j45K34k39j72L16j23k07J57J24J26k19J12J93
$$ -49 309 -77 14 -22 -164 -146 -282 50 -95 139 -100 -272 44 -79 -286 -129 -5 121 -98 14 207
3073B07q9K6k39K37J09Q3l46O3J3J82m23R7n7l4K09j56p4J60j10P8nP4j22k64
$$ 207 118 144 -95 142 251 334 -12 51 64 246 -177 -80 -137 -171 38 -118 -192 -32 -142 -64 -69 5 -117 -381
3097c81M31J30j80p6J37q0l00P05k78k52K41N7M6r7J05k11j77K44l55P3J74J4
$$ -381 50 180 0 -76 61 -19 -319 386 108 -144 97 154 200 103 208 -3 -180 64 -291 -218 -44 -30
3119c0J66l65L26k18J53L8j49r0N1J13K6Q8j31j15K03j55j55O12l96L3r1J38j52
$$ -30 136 -229 97 -121 32 70 -79 -169 -118 -5 21 109 -22 -137 66 -89 -244 368 -28 5 -86 52 -100
3142a00J03J18k13J84N4j21mj5m1j14R2j31N2M2j1M4j18K80o7j8k11J99j11J62
$$ -100 3 121 -92 92 146 25 21 6 -35 -149 -57 -188 -136 -94 -105 -61 -179 101 34 16 -195 4 -107 55
3166E5j07J51P6l35J37j21K24j58L52K00m40N1J6P4n5n0K13k63K1j65K19n8Rj65
$$ 55 -52 99 175 -160 -23 -144 80 -78 274 474 34 85 101 175 120 70 283 20 41 -124 95 37 46 -119
3190a19P4J75j55j3R7rk2L1J73j55k71K39mJ31Pk83p9J53r6J31J65j71Q4j40K1
$$ -119 -45 130 -25 -38 59 50 28 59 232 77 -194 45 41 172 179 -104 -183 -30 -126 5 170 -1 83 -57 -36
3215c6q8j2qO8J64j36p0K70k07q3Ml1M10j28jn9j7K00k88J86R3j54m3j66K49j66
$$ -36 -124 -136 -144 -76 88 -48 -118 152 -55 -138 -134 -165 245 117 116 57 40 240 -48 138 231 77 34 -132 117 -49
3241d9O7j0J22m46L38r7Q0k39L73j00j73j72K34J25j26Q5k67O95m17k18J02O2
$$ -49 18 8 130 -316 22 -75 5 -234 139 39 -134 -306 -72 53 -73 12 -255 440 23 -195 -93 -31
3263c1j64K44L2l8K63l56o3M9q6J36j04K18R0J51l33m6J70J45k27J9j79J50k61
$$ -31 -195 49 81 43 306 -50 -113 -64 -150 -14 -118 100 190 341 8 -38 132 277 50 69 -110 40 -221
3286b21J37k28M15k7j09L5J72l68L34J95l13Q9M3L5mk74L19J0k27M3p2J46k83
$$ -221 -84 -312 103 76 -33 2 174 -194 140 335 22 111 154 189 185 -89 230 240 13 56 -16 130 -153
3309a53M89m70k13K62r4O2J65J4j65N9J70r5j64j4M25l60n7J70J0J63P4k26j54
$$ -153 336 -134 -347 -85 -179 -117 48 62 -103 -44 126 31 -133 -147 278 -82 -139 31 41 204 278 52 -102
3332a02MK00j22K59m8r1L7k48OJ94P8k21L5J64k89L00l14Nj23K61Q4l32L09k01
$$ -102 -98 102 -20 239 191 100 137 -111 -105 89 167 -54 -19 145 -144 156 -158 -153 -276 -15 69 -263 46 -155
3356a55oj1N3J50L1j1J01m52M36r7P4k06J16n6J86k80L06j91l1M4K7l2MJ36l13
$$ -155 -161 -172 -119 31 62 51 152 -300 136 39 113 -93 23 -33 153 -127 179 -12 -43 1 28 -4 0 136 -177
3381a77J12j26o4L21j46J9qJ04J19j00K8j40M42l09p7M7O6j08r8J38L3j29j16
$$ -177 -65 -191 -255 66 -80 -61 -69 35 154 54 82 -58 384 75 -2 45 111 3 -95 43 76 -53 -169
3404a69J38J47J13k77K06j54k79K9L46l50J87J25k18J75rj64O1j48L19k98M8O1
$$ -169 -31 116 229 -48 158 4 -275 -246 100 -250 -63 62 -156 19 10 -154 -93 -241 78 -220 -172 -111
3426a11J08q9JJ90o2j2j47L41l9k47Q4M1j67J1K76l4l11R4J48l06L59j29k79J90
$$ -111 -3 -92 -91 99 37 25 -122 219 180 -67 17 58 -109 -98 178 144 -167 -73 75 -231 128 -1 -280 -90
3450i0J55k6q6Q6q4L9j12J17p1j72P3L37n7q9J92k02R5q6o9K72n17M37j03J31
$$ -90 65 39 -47 39 -45 -6 -118 -1 -72 -244 -171 166 109 20 212 10 105 19 -50 222 -295 142 39 170
3474A70J49p2n37R5L9J34Q8m7j31J94k85K26m10M58o4j79K3J94j89J82o4K82q0
$$ 170 319 247 -290 -195 -156 -22 66 19 -112 82 -203 23 -387 71 7 -172 -149 45 -144 38 -26 256 176
3497A76R2j46m82O77l57J13j84K02j15p7J76p5R3n9J21j97K50k28M5J28j12m19
$$ 176 268 122 -360 317 -40 73 -111 91 -24 -101 75 0 93 34 155 -42 208 -20 25 153 41 -378
3519c78K92J53j72k4N8P5j75M2K09n4J84j9o8j10N8j81j05K85L9j48J04m86L07
$$ -378 -86 67 -105 -129 -71 4 -171 -129 80 26 210 191 123 13 71 -110 -215 70 109 -39 65 -421 -114
3542a14j53J53J62k49J67P2l14N92m96K52r1n9K58k69L54m64K99p5l3K0l1jj62
$$ -114 -267 -114 48 -201 -34 38 -276 316 -180 72 -19 -78 180 -89 265 -199 100 25 -8 12 -19 -20 -182
3565a82J05j92L06J45j33R5J51j49j92m8pl3N9k08L33m0Q9k20J05j57r9K47o1
$$ -182 -77 -269 37 182 49 144 295 146 -46 -94 -101 -134 -75 -283 50 10 99 -121 -16 -173 -272 -25 -86
3588h6L2J28J21j06N7j32k8J20r2j13Q6K16q5j78P7j5n6K47k94M4L6J67k43J64
$$ -86 -54 74 195 89 146 14 -14 106 14 -99 -13 203 118 -60 17 2 -54 193 -101 -57 -21 146 -97 67
3612F7q1o8J07k29n9M31q6n3Pq2J11Q6j60j19m4K44J46l55L34n0L9q8j22J01j69
$$ 67 -14 -82 25 -204 -263 168 82 29 36 -46 65 151 -9 -128 -172 72 218 -137 197 147 186 98 -24 77 -92
3637i2M6j53J53J11k7k18J97P4Jj97L9J11j75N8J04K83l12m9l4K42j06r6O1k27
$$ -92 -46 -199 -46 65 38 -180 17 91 92 -105 -66 45 -130 -72 32 315 3 -46 -80 162 56 -40 21 -206
3661b06J30J28j50K10m7k65K22o9p2M2K32j27J7j06k8l5L51l13L3Q2l06Q7J28
$$ -206 -76 52 -98 112 65 -200 22 -47 -119 -77 155 28 45 -61 -89 -124 227 -86 -53 29 -277 -190 -62
3684f2L63m12Q6l7K09J19l07L59j86k15R3J26M6j39j6K26k00l06J31J36oj99L39
$$ -62 301 -111 -25 -62 147 266 -41 318 132 -83 10 136 182 43 27 253 53 -253 -122 14 8 -191 148
3707A48k52L89l40k9J5r8L86r1R0j54m0NJ08p9K61n19L81k95R2J37l28M20j59
$$ 148 -104 285 -55 -84 -69 -167 219 128 218 64 24 29 137 58 319 -200 181 -114 -22 115 -213 207 48
3730D8l2j92N8J32P3j72J26j72j13P0N7k5J69R5k75K15o9RPJ50r4P6J86m67K36
$$ 48 16 -176 -118 14 87 -85 41 -131 -244 -174 -117 -142 27 122 -153 62 -7 2 9 159 65 141 327 -140 96
3755I6K9k75J09q0M96l79j76M11l98J96J28j90j17J08K55k94j97K97J15j15Q4
$$ 96 125 -150 -41 -121 375 -4 -180 231 -167 29 157 -33 -150 -42 213 -81 -278 19 134 19 103
3776A03p7o0K71k51l27M84r0k6K78j22J00m86N55k10p8j71J87l02K97j96N6P6
$$ 103 26 -34 237 -14 -341 143 53 27 305 183 283 -203 352 142 64 -107 80 -222 75 -121 -65 11
3798A1K4j9Mj80k8K60j6j97k1p8M80n30N5J25K14j55j52J59mj9K12r8K6j7K3J57
$$ 11 35 16 20 -160 -188 72 56 -141 -162 -240 240 -290 -235 -110 104 -51 -203 -44 -48 -67 145 47 73 56 79 236
3824B36J7l27L06r6l45M69n14J75R3j22Jj3J38p8j01j32K69o9N0J27l4k09j11
$$ 236 253 -74 232 136 -209 260 -254 -79 14 -108 -107 -120 18 -60 -161 -293 -24 -93 -43 84 50 -159 -270
3847b70R4K01r3j0K42j67j58J96J07P9j92L8r2nJ33K4k35K24%j10K3j8r9J1N3
$$ -270 -176 25 -68 -78 164 -3 -161 35 142 221 29 67 -25 -30 103 127 -108 116 116 6 29 11 -88 -77 -24
3872b4j29R1kK04j44n2j22J70p1J25jQ8K6j78L17k70k08K75q7J12o1j8k31J86
$$ -24 -153 -62 -64 140 -4 -56 -178 -8 -79 46 45 133 159 -19 298 28 -180 95 8 120 59 41 -190 -4
3896dk06K95q9N2N6n1R8k51K13k72j34M9J21L56m88L51N1R7n6k36J50j97J02J98
$$ -4 -210 85 -4 48 104 53 151 -100 113 -159 -293 -244 -123 233 -255 96 147 244 188 -48 102 -95 7 205
3920B05k99j1kJ72N3j0J02m45M48l66J45P5k30K05k53L2L83j7k76K48m6k48J36
$$ 205 -94 -105 -107 65 118 108 210 -235 213 -153 -8 67 -163 42 -211 -179 204 187 -89 159 113 -135 1
3943AN6p4O4p9M4n6rK19m3J00M1l74J84j2j42n8n2L27n6j64j04oK12k8j69J42
$$ 1 57 -17 47 -32 12 -44 -53 166 123 223 264 -110 74 62 -80 -138 -190 137 81 -83 -187 -193 19 -9 -178 -36
3969c6k22K39m6O7J7R4j17j50K32p0l2J04k93K12J56j55N4J29j90n1P3l9L1o5
$$ -36 -258 -19 -65 2 19 113 -4 -154 78 8 -24 80 -213 -1 155 0 54 183 -7 -58 15 -24 7 -58
3993e8J0j08K87j40j76k7K3L02k96J22L9k26M33J5l01K42k22L81j79O7j47P3j56
$$ -58 -48 -156 131 -9 -185 -212 -189 113 -183 -61 -22 -248 185 200 -101 141 -81 300 121 188 41 114 -42
4016d2L62k35J38k77m5L77J26l63q8K12j37K44n72M93m77J61j4K25q8j90O8K28
$$ -42 320 85 223 -54 -99 278 404 41 -47 165 28 272 -300 193 -284 -123 -137 88 0 -190 -122 106
4038A06n4n7n6J07L9kN1K8m09L92l9O3j00K8J55k60J07j09j73K97N5j44k85M89
$$ 106 52 -5 -61 46 85 83 134 162 -247 145 106 169 69 97 252 -8 99 -10 -183 114 169 25 -260 229
4062B29m57L05j10j12J09j23K16p4O0J17k89M13j94p4k31K52K10k78J52j7o0J40
$$ 229 -228 77 -33 -145 -36 -159 57 -17 43 160 -129 284 90 16 -215 37 247 -31 121 104 44 184
4084A84j1j0q6j10O8rk55Q2J52J15Lm75M05N4j61k26J51J45j05k39M51J3k48R1
$$ 184 173 163 77 -33 35 26 -229 -147 5 120 123 -352 53 107 -54 -280 -129 16 -89 -328 123 136 -112 -21
4108b1J01L39k52k24J59K3j13n1K17j42o3J60J31j89k49L3J18o4j92J21Q2K5J44
$$ -21 80 419 167 -57 102 125 12 -39 178 36 -27 133 264 75 -174 -141 -23 -87 -279 -158 -76 -51 93
4131I3k82J38j44J86k05K43j35Q7q4n8L00K09m55j15J99K30l78J18K34k67p3K80
$$ 93 -189 -51 -195 -9 -214 29 -106 -19 -103 -161 139 348 -107 -222 -23 207 -171 -53 181 -86 -159 121
4153A21o8k4J02k78J5J03J19M8j58k29L96q5k81q3J02m8J87o2o5K47q6n6o2J52
$$ 121 53 29 131 -147 -132 -29 90 138 -20 -249 147 62 -219 -302 -200 -248 -61 -123 -188 59 -27 -83 -145 7
4177Gp3N5J87m4o7N6J51r7r4j46J25J89l76J35l13L64jo7O4K8j08Oq0KJ11o1j62
$$ 7 -66 -11 176 132 65 121 272 175 81 -65 60 249 -127 8 -305 59 58 -9 55 83 -25 -19 -99 -97 14 -47 -209
4204b09K36k12J91j25K34N5j38k5k16K86k0j33l7L18j14l96J94M4j39j37L90j34
$$ -209 27 -185 6 -119 115 170 32 7 -209 77 57 -76 -113 205 91 -305 -111 -67 -206 -343 47 -87
4226h7j31L52l36K76l12K85j73L57l15K60l13K68j4p5r2K20l05J81p6j27p3L11
$$ -87 -218 134 -202 74 -238 47 -126 231 -84 176 -137 131 117 42 -50 170 -135 46 -30 -157 -230 81
4248H1O4o3r1j35K4K53k72L16l46K43j60K65k84P3r5P1r5j28J67j84M92k70J07
$$ 81 145 82 -9 -144 -120 133 -139 177 -169 74 -86 179 -105 -32 -127 -56 -151 -279 -112 -296 196 -74 33
4271C3J66q1k60M16q4k63Qn4K46k22J44j71L4O7J55p4J1J21m37J81K3K6r2Q2J16
$$ 33 199 118 -142 274 190 -73 -65 -119 127 -95 49 -122 -88 -21 134 60 71 192 -245 -64 -41 -15 -107 -25 91
4296I1k84J42m0J97n7K96l43O8J54j80j2R9k51K06j2k22MK01K5j32n1J47J77l78
$$ 91 -193 -51 -91 106 49 345 2 70 224 44 32 131 -120 86 74 -148 -144 57 82 -50 -101 46 223 -155
4320a55J43J0J41j76Q4q5j47K05Jl07L76O8k58%K63N7nk37J57k15j98L75j87J83
$$ -155 -12 -2 139 -37 47 -38 -185 20 21 -286 90 158 -100 -100 163 220 215 -22 135 -80 -278 97 -90 93
4344I3j30J41r0q3j54M63k16L7j75P1j17K25j67j11K67o1J07j63K22l58P8J56
$$ 93 -37 104 14 -69 -223 240 24 61 -114 -43 -160 65 -102 -213 54 -7 100 -63 159 -199 -121 35
4366C5Pr6k05K32K8J07L7J4l39J60J35J40k53j22J64k40L21j23j04N5k0P0l0K5
$$ 35 42 -54 -259 -27 1 108 145 159 -180 -20 115 255 2 -120 44 -196 125 2 -102 -47 -67 3 -27 -2
4390bk08P9k14K14q9J98j62J21L03j32j99R0J18k13Q8m1K0K98l43K87j24K03j93
$$ -2 -210 -131 -345 -131 -220 -22 -184 -63 240 108 -91 -1 117 -96 -8 -49 -29 269 -74 213 89 292 99
4413I9M1j20J52j99q6J41o6J26k20N2K49L8q0Q5j68qKj42P1J94k46o2J86M4j43
$$ 99 140 20 172 -27 -113 28 -38 88 -132 -80 169 207 127 212 44 36 38 -104 -33 161 -85 -147 39 83 -60
4438f0K73qj07%j23m2O9j79n7N7L1j0P8L9J5j0J10j81o7mN3J95k91J62R6k2j62
$$ -60 213 205 98 98 -25 -67 2 -177 -234 -177 -146 -156 -78 -39 -24 -34 76 -105 -172 -176 -123 72 -219 -57 39 17 -145
4465a45o9K8j3M1L21l88J79m3J67K2j81K10j49Kr7J65k67L25J52m85K91J3l81
$$ -145 -214 -186 -199 -158 163 -225 -46 -89 78 100 -81 129 -20 -18 -115 50 -217 108 260 -225 66 79 -302
4488c02K19J11n8R9j7k0o8j14J08P0k1Q7J11j47p5l3K44Ok26n9J41j1M7j34k9
$$ -302 -83 28 -30 69 52 32 -36 -150 -42 28 7 94 205 58 -17 -50 194 200 -26 -85 56 45 92 -42 -71
4513g1J29L2j14J32m6j54J62K14k96P9oj50Q8k17K75n3l9jK06j38J92k46l6J02
$$ -71 58 90 -24 108 62 -92 70 284 -12 67 61 -89 -1 -218 57 4 -35 -36 170 32 224 -22 -58 44
4537D4R1Q2jk29m7jkL0J52j96J86q7n2J09l19K72j66m3K00K19k60J1O8k65K42
$$ 44 135 217 216 -13 -60 -61 -63 -33 119 -77 109 22 -30 79 -240 32 -134 -177 23 242 -18 -7 61 -204 38
4562C8j73K37j01J53j20J47l72Q6J60q4M0n2k39J34J03j15L4o7K27j4J44o1j04
$$ 38 -135 102 1 154 34 181 -191 -105 55 -29 11 -41 -280 -146 -43 -158 -124 -191 36 22 166 105 1
4585Aj05K49j26j21O8k81J76m2P4L43l55J21L17n13P9L01k76P1QJ18j43j54J31
$$ 1 -104 145 19 -102 -34 -315 -139 -181 -107 236 -119 2 319 -194 -115 186 -90 -19 -11 107 -36 -190 -59
4608e9j2l2k3K5j9R5r7jQ8l70L16PJ27r4m7N8j16M16J66l35j70j09P5L0q3l8J28
$$ -59 -71 -103 -126 -101 -120 -25 -122 -123 -35 -405 -89 -82 45 -49 -96 -38 -154 262 428 93 -77 -186 -111 -81 -164 -202 -74
4635g4j19J16K41j80J29q9k12J0L3K44R2j89j65L05p8k50l5L20j38m7J32j98J83
$$ -74 -193 -77 164 -16 113 24 -188 -178 -145 99 191 2 -163 142 64 -186 -221 99 -39 -86 46 -152 31
4658C1o5j66L73p9J85p2J07l66J98j3r0j98K97k18P3r7K64k62K32p8J41l7k98
$$ 31 -34 -200 173 94 279 207 314 -52 146 133 43 -155 142 -76 -3 -100 164 -98 134 56 197 160 -138
4681a38J93k42L19l13L5J44q9k43J52K76J08k17m7K10OK4j17O8j27j2J6j01L62
$$ -138 55 -187 132 -181 -146 -2 -91 -334 -182 94 202 -15 -62 148 154 178 61 129 2 -10 6 -95 267
4704B67k18k04J32r1J68j17j5q5O1j37p5j5L09j8J82k99J41J5q5K26K0l4j68L3
$$ 267 49 -155 -23 -114 54 -63 -78 -163 -102 -239 -314 -329 -20 -38 144 -155 -14 1 -84 142 162 128 -40 -7
4728gj09M2M0J98k0o6J00j65j51O6L66l30L41l97m8L92k17k49K80K31j93P8k26
$$ -7 -116 -74 -34 164 144 78 178 13 -138 -72 294 -36 305 -92 -140 252 35 -214 66 297 104 182 -44
4751d4K3pJ03M1Pj27j22j09J54K59j27l8L4R5j26k9J19m8j38J37k33K29m4r3K47
$$ -44 -21 -28 75 116 123 -4 -126 -235 -81 178 51 13 47 142 16 -13 106 58 -80 57 -176 53 9 -84 163
4776A63k50J59m80L29L03l31Q4j34J23k5n0J8n3J74n5J51j91J32j16J04q9L1k01
$$ 163 -87 72 -408 -79 224 -107 -23 -157 -34 -59 -109 -91 -144 30 -25 126 -65 67 -49 55 -34 -3 -204
4799b04J47qn0K65j68m10N15p7O7k03O9J6K8n2k10K47l9m1K46l88J41j83L05j13
$$ -204 -57 -65 -115 150 -18 -428 87 10 77 -126 -57 -41 -13 -65 -275 -28 -67 -108 138 -250 -109 -292 13 -100
4823a00k8k19K68L92j11k15m4K52k05Q7o1q6P4L2L0m9j2p6L6J79k09P9J88J1k48
$$ -100 -128 -347 -79 313 202 -13 -57 195 -10 77 16 -70 4 36 66 17 5 -71 -35 144 -65 14 202 213 -35
4848c5j08J91lr3J78k81K62j99J68o6Q9m1j05J44O9r2j35R7k03K05k70K4P3L11
$$ -35 -143 48 45 -48 130 -151 111 -88 80 14 103 62 -43 101 170 78 -57 40 -163 42 -228 -204 -131 180
4872A80m6n8k53J89J61J4l54J57j16J11N6m22M09O5J4j78L68l98o9K15l4J65m40
$$ 180 134 76 -177 12 173 187 -167 -10 -126 -15 41 -381 28 93 107 -71 297 -101 -170 45 11 176 -264
4895b64M34j28m9J03o6K35l60pL29l86m5J39j40mK95r9L7K4n7J38l02J52k25L87
$$ -264 170 42 -7 96 30 265 -95 -102 227 -159 -204 -65 -205 -209 86 -13 24 48 -9 129 -173 -21 -246 141
4919A41J42l75J32J74l57J29J16P1j73J88k52K6k2m7J49r7P3j98J87p5J26j32
$$ 141 283 -92 40 214 -143 -14 102 173 0 188 -64 -38 -60 -107 42 -55 18 -180 7 -68 58 -74
4941g4K00K06m00k9J18k3J82j68k67K38q8N1J00J84j80M3j7k1j02K88j10l5k19
$$ -74 126 332 -68 -97 21 -2 180 12 -255 -17 -105 -54 46 230 50 93 76 55 -47 241 131 96 -123
4964a23K37q8j20k29L98k48K43j72L34k28J62l98J51J5K92j82j16j72K39N6l46
$$ -123 114 26 -94 -323 75 -173 70 -102 232 4 166 -232 -81 -66 226 44 -72 -244 -5 51 -295
4985b95L54Jr1j26K33K9j09J26k89LK10j67J94j30p2K85j84J25l14J11Q0j00R9
$$ -295 59 60 -31 -157 76 105 -4 122 -167 -164 46 -121 73 -57 -129 156 -28 97 -217 -106 -26 -126 -27
5008b7j91J13J25J14j94j58J17N3n8J66p4k33K04n5K13P4k25j97K77K4j23j31
$$ -27 -218 -105 20 134 -60 -218 -101 -48 -106 60 -14 -247 -43 -98 115 189 -36 -233 44 68 -55 -186
5030a86L12k54J13qJ87M1q2j96P7J50j51k7R5j43j4N2K63k37l9P6Q2r7O%l5j1
$$ -186 126 -128 -15 -23 164 205 123 -73 4 154 3 -24 71 -72 -86 -34 229 -8 -47 29 111 14 20 20 -15 -26
5056b6k1k5n2N1K73j29k26K37k25k5j15K11J7J03n6r1oJ71j24n8J57m23M59j04
$$ -26 -47 -72 -124 -73 200 71 -155 82 -143 -168 -283 -72 -55 48 -8 -99 -105 66 -58 -116 41 -382 77 -27
5080b7L03l12mN6J14j12L5L1O3n5q7K6L6k88J04j5j21L21k61J55j95J60Q8j23
$$ -27 276 -36 -40 16 130 18 53 84 147 92 5 31 67 -221 -117 -132 -253 68 -193 -38 -233 -73 15 -108
5104a08q7J53K57j30n3L7Q2j97J17p5K6N7J15l40q4K17r6K24j14N8kk47J43J34
$$ -108 -195 -42 215 85 32 69 151 -46 71 -4 22 79 194 -146 -230 -13 -109 115 1 59 57 -190 -47 87
5128H7j10k10L60l3m4j91R9P2J18l85K84k39K62j47q9K60r2j36K55k04j16L40
$$ 87 -23 -233 127 94 50 -141 -42 30 148 -237 47 -192 70 -77 -166 94 2 -134 121 -83 -199 141
5150A41r9Jn4K08n6l31K77j1j04J50k4p6oK38k83o3j8L42n00J28L30k70K66j12
$$ 141 42 43 -11 197 141 -190 87 76 -28 122 98 22 16 254 -29 -92 -110 232 -268 -140 190 -80 186 74
5174G4O8n7j43L4J70o8j80R5L45l00N0q1L8j01J11M7J19k78L5j79N1N6lQr6R8
$$ 74 142 85 -58 -24 146 78 -102 -7 338 38 88 7 45 -56 55 102 221 -57 -22 -201 -150 -94 -97 -89 -185 -87
5200h7P4j45k1P8N1j15N6K05k10K76m32L34l8L45k68O0l12J51l0J91P2l49J43
$$ -87 -13 -158 -179 -101 -50 -165 -109 96 -114 162 -270 64 26 371 103 163 -149 2 -28 163 235 -114 29
5223B9Q0j74M2n7n0J66L00m32J74q0j13L29k91Q5K2R3m36L91no5L2k44L96k28
$$ 29 109 -65 -23 -80 -130 36 336 -96 78 -2 -115 214 -77 8 30 123 -313 78 73 8 40 -204 192 -36
5247c6Q5m5n6J17k0J45j2k17l0J86j35j04K39j36j42L08l28P0K48j24lk84K33
$$ -36 49 4 -52 65 45 190 178 -39 -69 117 -18 -122 117 -19 -161 147 -181 -111 137 13 10 -274 -41
5270d1N3K36j11j67K56l60K52P4j57r3M26j43k34q9P9K50m28L16np7o5L07l77
$$ -41 12 248 137 -30 226 -134 118 192 35 -58 368 225 -9 -98 -19 231 -197 119 114 37 -28 279 -98
5293i8K1KQ8J74j89Q1P4o6p9r5l0J42m0m5P5J14mN8r9k05J31N1j51J63J5L9pp1
$$ -98 -77 -75 13 187 -2 79 153 87 8 -87 -117 25 -15 -60 15 129 125 183 84 -121 10 61 -90 73 88 127 120 49
5321D9j73R1J36r4jj33K97n8Pj07k0l13K95K75o7k05J00j83j83K52p6K33Kj33
$$ 49 -124 -33 103 9 8 -125 172 114 121 14 -6 -319 -24 251 184 -21 79 -104 -287 -35 -111 122 124 -9
5345iL1k36N7L46j63O7J27l22J78j20l8l8J15O2j74K24k15K6rl2J6L3O8j20J19
$$ -9 22 -214 -157 189 26 93 220 -102 76 -44 -82 -120 -5 57 -117 107 -108 -82 -91 -123 -107 -74 -6 -126 -7
5370gJ33l49R2J33j02L8N9J95r1j14m4J59j48N1j35PJ91N7l4R6k00j02J01L5j55
$$ -7 126 -223 -131 2 -100 -62 -3 192 101 -13 -57 102 -46 5 -130 -123 68 125 91 187 -13 -115 -14 21 -134
5395a34M5j32K88k72J70O5Q2j78P3J34k98P7rJ02j04J86k2Kk35J85J7J14j77k32
$$ -134 -89 -221 67 -205 -35 30 112 -66 7 141 -157 -80 -89 13 -91 95 73 75 -160 25 42 156 -21 -253
5419b53K84j18L7j77j8K4J99L8l4o4L8M6J18j0j8lj51Q5J37j04k5J09m6l44J65
$$ -253 31 -87 -50 -227 -245 -221 -22 16 -18 -82 -44 2 120 110 92 89 -62 23 160 56 31 140 94 -250 -85
5444h5J21J10n3r8R7N0J70k16k78K22j01J19q3O4q3K18j88j27J29J59N7l33K37
$$ -85 36 146 93 -5 92 142 312 96 -182 40 -61 58 -25 39 -44 174 -14 -141 -12 147 204 -129 108
5467A08j7J7r8j67K58k6R0l13Q1K44k29o2o0K72J20k54J28j3r9R3l7k78K91n5
$$ 108 91 108 10 -157 101 75 165 -148 -67 177 -52 -114 -174 98 218 -36 92 79 -20 73 36 -242 49 -6
5491fp2K24J3o5j50j91m2K75Jj65j31J68K97k58L25l01k9J31p1K01q0j5j37J20
$$ -6 -78 146 159 94 -56 -247 -289 -14 -13 -178 -309 -141 156 -102 223 -78 -107 24 -47 154 74 59 -78 42
5515D2k86L30p6m7j74J51N4n3J40k32K17j37Kk0P4J0r2J49k81M70j53j29K1oj0
$$ 42 -244 86 10 -37 -211 -60 -6 -59 81 -151 66 -71 -69 -89 -15 -5 -97 52 -229 241 88 -41 -20 -26 -36
5540c6L2k63L10k57J84J72j27k8O3N5l00L27P0j70j94R0l5Q3o8J69k98K36J60
$$ -36 -4 -267 43 -214 -30 142 15 -13 50 105 -195 132 202 32 -162 -72 -107 -24 -92 77 -221 15 175
5563A75j86j7mj50P7M4j8J10k30J79J0P5J21j63K41l16M7J62k34J77j70k4N6k8
$$ 175 -11 -28 -32 -182 -105 -61 -79 31 -199 -20 -10 65 186 23 264 -52 -5 157 -77 100 -70 -94 -38 -66
5587f6n5m4J81r1O1P8j0Rr1P0j09K48k74L17k12P2j56J92L6j30J4N0k08J67j31
$$ -66 -121 -165 16 -75 -14 64 54 63 -28 42 -67 181 -93 224 12 84 -72 120 156 26 40 90 -118 49 -82
5612h2K30k74L05j3j80P1k47o1O0R9k2L66j2l09k8R3q4J45oK75m61J42J6P2k42
$$ -82 148 -126 179 166 -14 57 -190 -251 -191 -92 -114 252 240 -69 -97 -4 -88 57 51 326 -135 7 23 95 -147
5637a47M56k36q6J73j08P0j94k5o7J27M3pKj19Q5j43J46J29o2L0j66l4J54J32
$$ -147 309 73 -13 160 52 122 -72 -97 -164 -37 6 -1 1 -118 -33 -176 -30 99 37 67 -99 -133 21 153
5661A53n5q4k4O7k03O7N3K35j29M2j60J27R5k33J37q2J98j38j57K14j64J7j6J59
$$ 153 98 14 -10 57 -146 -79 -26 209 80 122 -38 89 184 -49 88 6 204 66 -91 123 -41 -24 -40 119
5685A19k6j17o9J49k34L2j06J54N9J69j42J33k21K0J61j57K42j90j4k62K68l4
$$ 119 93 -24 -93 56 -178 -146 -252 -98 -39 130 -12 121 -100 -80 81 -76 166 -24 -38 -300 -32 -66
5707f6K09j03J33J1l91L92k55j09K52j7J52l71J67K68n26J46J21j02J27l74J68
$$ -66 143 40 173 184 -207 185 -70 -179 73 56 208 -163 4 272 -254 -108 13 -89 38 -336 -168
5728a68J37Q4J69k59J23Q3l94J40n8K00l2j45K24j41nK2J27k08L5kJ24P5l61N1
$$ -168 -31 53 222 -37 86 169 -225 -85 -143 57 25 -120 104 -37 -42 -20 107 -101 -66 -68 56 131 -230 -179
5752a79P8N2K8R0l8J2r1J47r4K4J74J25k94l8K6j89L18m9n0j55M19k76k60J0L86
$$ -179 -101 -49 -21 69 31 43 -48 99 5 29 203 328 34 -4 22 -167 151 102 52 -103 316 40 -220 -210 176
5777A76k60k4J52j53J73j27k4K06n00K21J61r7n6J78K2j69K39r9j25j02L79j40
$$ 176 -84 -108 44 -109 64 -63 -87 119 -381 -160 1 -96 -152 26 48 -121 118 19 -106 -208 171 31
5799C1k0o5K66j48p7L09j46j33r4P5j26J57p6RO8j0K8m2K0j79J26J76k22R6j85
$$ 31 11 -54 212 64 -13 296 150 17 -77 -2 -128 29 -47 -38 30 20 48 6 26 -153 -27 149 -73 23 -162
5824a62M42k29R4l1j60M0J39J78n42O7J46o6J34K63k50r4K0n0N0j18L08l92L49
$$ -162 280 51 145 114 -46 -6 133 311 -231 -164 -18 -84 50 313 63 -31 -11 -61 -11 -129 179 -213 136
5847A36O7j72L7j70p1J84J73j66J11k56J75J7K52k00k40M07j08j36m6l5L09l86
$$ 136 203 31 68 -102 -173 11 184 18 129 -127 48 65 317 117 -123 284 176 40 -6 -41 268 -118
5869a18K05k32N8j3K82k60o4P9K3P2M6k7j08P1J03k21P6L10l01k9J8o7L2j47J32
$$ -118 87 -145 -87 -100 182 -78 -142 -63 -40 32 78 51 -57 14 117 -104 -28 282 -19 -48 -30 -97 -65 -212 -80
5894h0r4M21m02K64k5k12R8j51J22l2j5L0O0J67j68M8J30k59P9j28l7K63J39k01
$$ -80 -174 247 -155 109 84 -128 -30 -181 -59 -91 -106 -76 -16 151 -17 31 161 -98 -19 -147 -184 79 218 17
5918A7j18k3J90o8J04n9m4j0M9J80pJ45m87J61M7j57J04J03j25K30j78n4o4J68
$$ 17 -101 -124 66 -2 102 43 -1 -11 38 218 211 356 -131 30 77 -80 24 127 2 232 54 0 -64 104
5942A04k91o0K58q0J65p3k32J37K53l89R1N7n7J08J01p9k5k02J68l3L5Jk8j71
$$ 104 -187 -247 11 -69 96 23 -209 -72 181 -208 -117 -60 -117 -9 92 13 -12 -214 -46 -79 -44 -43 -71 -242
5966b42K55j97nJ41j91L13j59K62l05L5L43m84J57r8J21l0PK47j9j76%q9J13k2
$$ -242 13 -184 -189 -48 -239 74 -85 177 -128 -93 250 -234 -77 -175 -54 -84 -77 170 151 -25 -25 -114 -1 -23
5990b3r8J7K04j32J08O2j59j40K28rk55K06k39p7L86j79Q9J13P8k91K84k57K07
$$ -23 -121 -104 100 -32 76 138 -21 -161 67 58 -197 9 -230 -307 79 -100 -11 102 180 -111 173 -84 123
6013A23m74L58J44k97j24M02R4k22j32M4K24K2j80Q9j61O0M5p8N0N6j12K2L1j61
$$ 123 -351 7 151 -146 -270 132 226 4 -128 -84 140 162 -18 71 -90 -30 15 -63 -13 43 -69 -47 -16 -177
6037a77K66J09l47R8J85j80J0M8J45m1J5j44j63K3nL80k06j69K15qn4J8j3j03
$$ -177 89 198 -149 -51 134 -46 -36 12 157 116 131 -13 -176 -153 -158 222 16 -153 62 54 0 18 5 -98
6061i8K93m56K32k1J76j17j40L09k10k6J20q9r2o9J83K13l95m3j29K63O1J53k21
$$ -98 195 -261 -29 -50 126 9 -131 178 -32 -58 62 -27 -119 -188 -5 208 -187 -230 -359 -96 -35 118 -103
6084a03K54q1l8j14j26K71j85J23O5R3k32j08L27j70N4K4j42j02L33q7j66O3P0
$$ -103 151 70 32 -82 -208 63 -122 1 66 159 -73 -181 146 -24 30 54 -88 -190 143 56 -110 -47 23
6107B3Mp1m3J31R3k11j10M18j96j41J42o5K07j72L57m99L46j98k27J04qJ71l09
$$ 23 27 -44 -87 44 137 -74 -184 234 38 -103 39 -26 181 9 366 -133 213 15 -212 -108 -116 55 -254
6130b54L18O5j03k45K35k68K92p7j22J11P2J07l55K27O7j22k38K51K6j39K32j22
$$ -254 64 129 26 -219 16 -252 40 -37 -159 -48 24 131 -224 3 70 -52 -290 -39 -13 -152 80 -42
6152d2k74L45J9k36M01j15l73K34k7l4J04m4o7P9r2J65k05R1q6J64K23k59J53
$$ -42 -316 29 48 -188 213 98 -275 -41 -68 -102 2 -42 -109 -30 -122 43 -162 -71 -157 7 230 -29 124
6175A24p2r9R7n9%j73K47K14j77n7J57m04K68j4j89M3J80N2r3k10K96p3j37J5
$$ 124 52 -47 50 -9 -9 -182 65 279 102 45 202 -202 66 52 -137 -94 86 138 45 -165 131 58 -79 -64
6199f4J60l20k0K61l6K16k84K6K21j28m48N55M0L6k54M4P8j4j49J73k5N4J11l05
$$ -64 96 -224 -244 17 -19 197 -87 -61 160 32 -416 139 179 215 -39 5 83 69 -80 93 68 122 233 -72
6223g2n4L59j88j7l2j0K12k18k31K79nk49L00N4j42oJ31j12N3N5n4n4J34k16K68
$$ -72 -126 233 45 28 -4 -14 198 -20 -251 28 23 -226 74 128 -14 -20 111 -1 52 107 53 -1 133 -83 185
6248A85j78Q8P1QR6j69n19K50L81m31O4kJ82m8p1o6O1R4k81J96l1p2J08K01l34
$$ 185 7 95 166 174 270 101 -418 -168 213 -218 -154 -156 26 -22 -93 -159 -98 -4 -285 -89 -120 -192 -84 117 -217
6273b17J72m2K81l8J82l72K71l08n2L3kq2P3j44K36R4j72o6O9q3K49J36j43J11
$$ -217 -45 -87 194 156 338 -34 237 -71 -123 -90 -92 -174 -101 -245 -9 85 -87 -153 -84 -167 82 218 75 186
6297A86k59K38k33J26k55J13L3R2k95N18k36J97j40l98O40k47p4l6j42K53J29
$$ 186 -73 165 -68 58 -197 -84 -51 41 -254 264 28 225 85 -313 327 80 6 -30 -172 81 210
6318B10k02N7J07j05j84j0L95%k72J07k71j43K89K13j90K38j05k27r7L49Nj62
$$ 210 8 65 172 67 -117 -127 268 268 -4 103 -168 -311 -22 191 1 239 134 -93 -190 159 164 2
6340Bm5j36L48Q0k58J26j15O7k79J50M4l5n3O7j5lk4O5j7J83o6l8q1J5j43J79
$$ 2 -43 -179 169 249 -9 117 2 69 -210 -60 -16 -51 -104 -37 -52 -55 -79 -14 -31 152 86 48 -33 -18 -161 18
6366A8l4J89j52K15l06P9K13k01n4j63M10j9k88K78K8k08N6n6k59L53K5k27J11
$$ 18 -16 173 21 236 -70 9 222 21 -33 -196 214 195 -93 185 213 5 61 5 -254 99 124 -103 8
6389HJ22j80m2j22k2L60j77k4J46p7o2J43m9j33J05k59P5K80k3o7K62k33k77K24
$$ 8 130 -50 -92 -214 -236 124 -53 -77 69 -8 -70 73 24 -109 -4 -263 -188 92 69 2 264 31 -246 -22
6413b2k0K04j34J87k96K53J49m60m1J66l22L76l50J90M2k39K54j7P8j75L12r5
$$ -22 -42 162 28 215 -81 172 321 -139 -180 -14 -336 40 -310 -120 -78 -317 -63 -80 -2 -177 135 40
6435D0l58M50r1q6J0K14r2q7J24l27L40l35R1P7j9J14l97K11M10m19j14J99J87
$$ 40 -318 132 41 -45 -35 179 87 0 124 -203 137 -198 -107 -30 -49 65 -332 -121 289 -130 -244 -45 142
6458A42o5k76R9k9k2J31j68o5P3L49j05j6j44J82j0N6m01N30k47jk01K11r8Q2
$$ 142 77 -199 -100 -129 -151 -20 -188 -253 -180 169 64 48 -96 86 76 132 -269 261 14 13 -188 23 -75 7
6482G%R3j14K31l68r4L05j64j22K53p0j74J54k02M7K37J61k19J68m3j45m4LQ5
$$ 7 7 100 -14 217 -151 -245 60 -104 -226 27 -43 -217 -63 -265 -218 19 180 -39 129 86 -59 -103 -100 -15
6506a5K13l06L5J03K32r0p8J47l18J77N5l39J38J18j30K2q6L6K23l21o6L4M00
$$ -15 198 -108 -73 30 262 172 94 241 -77 100 155 -184 -46 72 -58 -36 -122 -86 137 -184 -250 -216 184
6529A84n5j89Qj51M18k69J83j52r1r8J91J1N1M7q8j94R3K69l3M7l37L90l29J40
$$ 184 129 -60 -52 -203 215 -54 129 -23 -114 -212 -21 -10 41 88 0 -194 -101 168 135 182 -155 235 -94 46
6553D6N7q7j27J29k1q2K94l57q9M2J47J5J19p0p6J0J40m17L85J63j19o2j59l5
$$ 46 103 16 -111 18 -3 -85 209 -148 -237 -195 -48 -33 86 16 -60 -50 90 -327 58 221 102 40 -119 -154
6577a54Q8Q8qj03L19j96j85J46Q7j77K08k06QK1P2j53R8k72M58l39K90j49K4N4
$$ -154 -66 22 14 -89 230 34 -151 -5 82 -95 113 -93 -85 -64 8 -145 -47 -319 139 -200 90 -59 -35 19
6601A9j3M9O1k11M6L17l03K45r1k34j30J38q9N8N4m5k9r1M59k98K2k02L03k41
$$ 19 6 55 116 -95 -49 268 -35 210 119 -115 -245 -107 -196 -138 -84 -129 -158 -249 210 -88 -66 -268 35 -206
6625b06J17J91N8k46o1L69l11L5j0q4L1J29l59K63j08l4P3J75o5M4p7J91n6K8
$$ -206 -89 102 160 -86 -147 222 -89 -54 -64 -148 -117 12 -347 -84 -192 -226 -153 22 -43 1 -76 115 59 87
6649H7q1k27L97k22o3J48R8pl25K92l89M08k67j1K24m1P2k89K10J04j71J58J33
$$ 87 6 -221 176 -46 -109 39 137 130 -195 97 -292 116 -151 -162 62 21 93 -196 14 118 -53 105 238
6672B38k19q8RK83k84R6l2j21K90j96o6R5l6l4lJ19j54O1R6J32j96J79k59K14
$$ 238 19 -69 -60 223 -61 35 3 -118 172 -24 -90 5 -31 -65 -68 51 -103 -42 54 186 -10 169 -90 124
6696A24K1j85p9Q9J61K7P7j64o0%M7r4j2j65J00k2K51j0j4k80M3K12J16k01r0
$$ 124 145 -40 -119 -30 131 158 235 71 11 11 58 -36 -48 -213 -113 -135 116 106 92 -188 -145 67 183 -18 -108
6721a08n3l0R6Q3J50M9l67O0P0Oo8K84m02K02N3P8k0k67L00L00l63k52J82j34
$$ -108 -161 -191 -95 -12 138 187 -180 -120 -50 -44 -112 172 -230 -28 25 103 83 -184 116 416 53 -199 -17 -151
6745a51M46l48j82J05PN00n65K9K17n6j56J38J35l31K29K06k14L14l68J02K27
$$ -151 295 -53 -235 -130 -123 377 -188 -159 58 2 -154 -16 119 -212 17 223 9 323 -45 57 284
6766B84l65J11j32K95k38j8L3O8j99R3P7m9m7K21k63J30K18Nn00PO2L50k59L2
$$ 284 -81 30 -102 193 -45 -63 -30 38 -161 -68 9 -40 -87 134 -129 1 219 224 -276 -269 -207 143 -116 -84
6790h4l7K99j65oK3L3k58L25K38l65J88j26J44k59J8N4P5j30L3j22K16j92O9k
$$ -84 -121 178 13 7 30 63 -195 130 368 3 191 65 209 -50 -32 22 97 -33 0 -122 94 -98 -29 -31
6814c1O9m0M1l41K50j16R3J16j01J44j74J47O3l5J05k26K5K32j20j59K46j46l71
$$ -31 38 -2 39 -302 -52 -168 -75 41 -60 84 -90 57 120 85 190 -36 -11 221 101 -58 188 42 -329
6837c29L19K14l35J52K0P7l11K99j09o9j56K92j37j26J87m04J52K63m5N5J5k2
$$ -329 -10 204 -131 21 41 118 -193 106 -3 -72 -228 64 -73 -199 -12 -416 -264 -1 -46 9 24 2
6859Bn9K87j0j74q6j65L17l13L13r8k57L20R7Q1k33nj6J69k93N1j48J88m4O7J70
$$ 2 -57 230 220 46 -40 -205 112 -201 112 14 -243 77 174 255 22 17 1 170 -123 -72 -220 -32 -76 -9 161
6884A61m2p6O5O1l09K80k70J03O9k3J0j93n1O6M4J48l9l3K00k31L39l68J28j33
$$ 161 119 43 108 169 -140 140 -130 -27 42 19 29 -164 -215 -149 -105 43 4 -29 171 -60 279 -89 39 -94
6908i4k3J78k70J22N4J96O0j95j07K87j97J34j23k0J7L7J45m8j04l2J12j28r8
$$ -94 -117 61 -209 -87 -33 163 223 28 -79 208 11 145 22 2 19 56 201 153 49 17 129 1 -97
6931i7J21r3J07j53J1P7j12J14m4J36l64M81m33M15j40J2k32O2P6j00Q9J75j65
$$ -97 24 -69 38 -115 -104 -27 -139 -25 -69 67 -297 184 -249 166 26 38 -194 -132 -56 -156 -67 108 -57
6954e7K24J4j70Q2j3j48j06M75k64Pk82K35J0O5o0k8L2o3L7k11K32J45l06J64
$$ -57 167 181 11 93 80 -68 -174 301 37 44 -238 -3 7 72 12 -16 16 -47 -10 -221 11 156 -150 14
6978A4P4N7J73m52J10j80J73qM2J31k85M41J2k09j91K09j94J40Q3m1l46K26j62
$$ 14 88 145 318 -134 -24 -204 -31 -39 3 134 -151 290 302 93 -98 111 -83 57 140 99 -247 -21 -183
7001a83J88J4j88K76n5p5J14j42J07m51L06K68k43J20j28K23j03k39K50k4O4n1
$$ -183 5 19 -169 107 52 -23 91 -51 56 -395 -89 179 -64 56 -72 151 48 -191 59 35 99 48
7023D8k00R2J98j72K8Mq8L12j19j33j71J09r4L18l1k40L24l68J54m6K0K42j20
$$ 48 -152 -60 138 -34 -6 -2 -90 222 103 -30 -201 -92 -186 132 101 -139 185 -183 -29 -75 -55 187 67
7046F7k12L15j20k15K49p0j45K54n2J02j03j21K65m59L15r4O6j61L07j17J70j77
$$ 67 -145 170 50 -165 84 14 -131 123 71 173 70 -51 214 -245 70 -24 42 -119 188 71 241 64
7068F4k13M37l59NJ48M5l6j28p7P1J00J3n09M11P2j95J86j43M1J08r1K13J07k88
$$ 64 -149 288 -71 -66 82 127 91 -37 -114 -43 57 70 -439 -28 44 -151 35 -108 -67 41 -50 163 270 -18
7092a8K33l57K83o2k47J63j32O7J32m8J88k76K12l39J77o5m4K99k84Q3PK24k25
$$ -18 215 -142 141 79 -168 -5 -137 -70 62 14 202 -74 138 -201 -24 -89 -133 166 -118 -35 -28 196 -29
7115b9o5P5k07K63J87j86j69K45n4K2j84J52L36l50L3r8k1j06J20O5k71R4r7J60
$$ -29 -94 -19 -226 37 224 38 -131 114 60 82 -102 50 386 36 69 -29 -50 -156 -36 29 -242 -148 -245 -85
7139h5J82k15n8J08L1N1N9R5K0m57M06N0l85J45j32J05K84O9k08n0rn0k40K67
$$ -85 97 -118 -176 -68 -37 14 73 168 188 -269 137 187 -198 -53 -185 -80 204 273 65 15 6 -44 -284 -17
7163a7J38l67K99k11M09j62M4k06p6l8J11K28k14K57n50N38l98K23J92j97p5Q3
$$ -17 121 -246 53 -158 251 89 133 -73 -149 -187 -76 152 -62 195 -355 183 -215 8 200 3 -72 11
7185A1L31j92r3j30J91n10M42k48L0J15k17L42p8p3J24n36L00M7L16l11J52q2
$$ 11 342 150 57 -73 118 -392 50 -198 -168 -53 -270 72 -6 -79 45 -491 -191 -144 172 -139 13 -69
7207f9N9L6k89L38R3k51Q8P8l6J81k62Q4K9mk01L50K5j30J29k20k04j5L92j56
$$ -69 -10 26 -263 75 168 -83 5 83 47 228 -34 50 79 75 -126 224 249 119 248 28 -176 -191 201 45
7231D5k6M2L4j61j03K03J74k33Oj57O2J69j78r0J11K88k81%J89j85P7j60K48n
$$ 45 19 61 95 -66 -169 34 208 -25 -19 -176 -114 55 -123 -213 -102 186 -95 -95 94 -91 -14 -174 74 69
7255F9P9j17p7J04P2k24n7Q7j03K63P7k1k14j66J45J35j45n2K9j04J9M65n36L81
$$ 69 148 31 -46 58 130 -94 -151 -64 -167 96 173 152 -62 -228 -83 52 -93 -145 -116 -220 -201 264 -272 109
7279A09j80j24L23n4n5P6k57L92k96P0j77J07J05J18k09n9K97k83j04O7J89l22
$$ 109 -71 -195 128 74 19 95 -162 230 -66 4 -173 -66 39 157 -52 -111 186 -97 -201 -134 55 -267
7301b67M08P7k31M2Q6k19L8j13J22K9Q0NrR1j26j9M9P5j26Q2ml7Jr3L7N%J44J0
$$ -267 141 218 -13 29 115 -104 -66 -179 -57 -28 52 57 48 139 13 -6 43 118 -8 74 70 33 34 -59 -22 -17 -17 127 137
7330A37k17j5J54K86l18k86K97J69k97m1J13J16l17j7j2L42l18K90j64O6m7K00
$$ 137 -80 -95 59 345 27 -259 38 207 -90 -131 -18 98 -219 -236 -248 94 -224 66 -98 -32 -79 121
7352A21j17k44K55q4J74q9O5j36O6J5j99J56k3O0k02J16K63j29j95K33j67K38
$$ 121 4 -240 15 -69 105 16 81 -55 11 26 -173 -17 -40 20 -182 -66 197 68 -127 106 -61 177
7374A77k67K33l65L00k21Q2L68l70n5J29k74M45j29J25m04L67n3k33L12l26J16
$$ 177 -90 143 -222 78 -143 -61 307 -63 -118 11 -263 182 53 178 -226 141 88 -145 167 -159 -43
7395d3k00L69j47NK6J8j13K48r5N8q7m1j4j35J16k09O2K43p6P2R4k1J9k72M1o0
$$ -43 -243 126 -21 -16 10 28 -85 163 68 126 39 -2 -16 -151 -35 -244 -182 61 -15 57 151 130 149 -123 -82 -142
7421a42J04K06N2l14j02K96r0N4J57k48r2J7K44M2k64P4j27N11j39j74k08q5Q1
$$ -142 -38 168 220 -94 -196 100 10 64 221 -27 -119 -102 142 184 -80 -6 -133 378 239 65 -143 -228 -147
7444a47K16l21L16pk23R4J21K0L46j41l58J10j64K18M4k09J59q3J28k05L3q5J43
$$ -147 69 -252 64 57 -166 -72 49 69 415 274 -84 26 -138 80 124 -85 74 -9 119 -86 -53 -138 5
7467Eq8J23P2r5M0j56K16k51K28j01J24k13P7j72J74j14K84j29L7J37l52L33j56
$$ 5 -83 40 112 17 57 -99 117 -134 94 -7 117 -96 -19 -191 -17 -131 153 24 61 198 -154 179 23
7490B3j84L56m58R5j54L90l35L43J4q4r7k7K24k38L79l27kO5P1l6J2k87L11K8
$$ 23 -161 195 -263 -168 -322 68 -267 76 90 6 -91 -118 106 -132 247 -80 -82 -17 54 18 30 -257 54 82
7514H2J46o1P4n55j12K79L40k86J56K0j01K6KJ91j09k74J54Q1k06J17k0R1k75
$$ 82 228 167 241 -314 -426 -147 193 -93 63 83 -18 8 10 201 92 -182 -28 53 -153 -36 -56 35 -240
7537b40J98j87L49j96K54j09j09J85L5j39k22K47j51P4J17j16j01L90m68J12Q2
$$ -240 -42 -229 120 -76 178 69 -40 145 180 41 -181 66 -85 -11 106 -10 -111 279 -189 -77 5
7558Ej58J83j29oK61Pm06K6K08J21j00p1J2K50k86J70J21k64j65J13J67p2mL36
$$ 5 -153 30 -99 -105 156 163 -243 -217 -9 112 12 -59 -47 203 -83 87 208 -56 -221 -108 59 -13 -17 319
7582C19k96J98K25m99M5j52J57M4o2q2M10o17J91m6K09p4J0m5J1JK79j45j31j73
$$ 319 23 221 446 -53 -8 -160 -3 41 -21 -103 307 -310 -119 -165 44 -30 -20 -65 -54 -53 226 81 -50 -223
7606b23K79p9K6J19l44L21l35Q3j56N79k87k1L0R8k23J29J8J64k21M9k61L46j83
$$ -223 56 -23 3 122 -222 99 -236 -153 -309 270 -17 -38 -8 90 -133 -4 14 178 -43 6 -255 91 -92
7629i2j96J80O1R8j07k1J07%K75m21o4J47K32l75J57NM4J5J9K8j15K82k35j3l23
$$ -92 -288 -108 -47 51 -56 -77 30 30 305 -116 -180 -33 199 -176 -19 -14 30 45 64 92 -23 259 24 11 -312
7654c12J96L50k66j80J44l46P21k72J13l47J56o1J08M7m2k00K90p1R9J71k12l9
$$ -312 -116 234 -32 -212 -68 -414 307 35 148 -199 -43 -104 4 51 9 -191 99 28 127 298 86 47
7676D7k39K09R2k16P0J64N2n2m32L17j24J14j78L15j08j39O1L6J23ok18k1J8Q5
$$ 47 -192 17 109 -107 -37 127 179 127 -305 12 -112 2 -176 139 31 -108 -47 -11 112 106 -112 -133 -115 -30
7700c0K39k24L7L8k32K97q2r0o0K03k13J24j86J60J22j03m8k0J16j84J63K9m1
$$ -30 209 -15 22 60 -172 125 43 -47 -107 96 -117 7 -179 -19 103 0 -48 -68 48 -136 27 56 15
7723A5j35K2L02k71J94l99N60k22j82L06K8j76K72k36l23K59k08J07L23j67k23
$$ 15 -120 -98 204 -67 127 -272 288 66 -116 190 218 42 314 78 -245 14 -194 -87 236 69 -154
7744a54J92j71J34l4N9l64L7K83q8m9J90j87J65K94j44j94j25R5K29J1j09j86
$$ -154 38 -133 1 -33 26 -338 -301 -18 -106 -155 35 -152 13 307 163 -31 -156 -61 168 179 70 -116
7766a16K28r6Q7j94q9J90l73N38M6PL4m04M61m47R0J50o4O2j81p5M77k85J56k92
$$ -116 112 16 103 -91 -180 10 -363 175 221 228 262 -142 319 -128 -38 112 48 110 -71 -146 331 46 202 -90
7790i0K24N4j58NK17k61K2R5R5k34j35J44n4K40k56J97l12K02j9P3q3j18m6K56
$$ -90 134 188 30 35 252 -9 13 108 203 -31 -166 -22 -76 164 -92 105 -207 -5 -24 49 -34 -152 -198 58
7814E8J1J60j61k6J72j76l4J27j05J46j42P1j58M5k37N03r9n53L86O2k97K68L8
$$ 58 69 229 68 42 214 38 4 131 26 172 30 101 -57 -12 -249 254 155 -398 -12 50 -247 21 59
7837E9K4j92l2O8r5K40k18N2J0J22qj46j39M4J26R6o2J27jo2j28J59m2J06Rl84
$$ 59 83 -109 -141 -73 -168 72 -146 -94 -84 38 30 -116 -255 -211 -85 11 -51 76 75 13 -115 44 2 108 117 -267
7863b67K58R5K06l15L5J59p2K7j2j09Q8o8P1M0k52K26L5j88j04Q6j1J21l40K35
$$ -267 -9 86 292 -23 12 171 99 126 114 5 93 25 96 136 -116 110 145 -43 -147 -61 -72 49 -291 -56
7887e6j45J56L8j76j5J53M3jq3J58k02L3K74m9m10L60K21n82M63j88J93k80j2
$$ -56 -201 -45 -7 -183 -198 -45 -2 -3 -86 72 -130 -97 177 128 -282 78 299 -283 180 -8 185 -95 -107
7910a07R3M8k4j3j81L06j34J11j70J95M3k60J88j77p4M8q0j1L90j64N5p1k30M0
$$ -107 -14 34 10 -3 -184 122 -12 99 -71 124 167 -93 95 -82 -156 -108 -188 -199 191 27 82 11 -219 -179
7934a79K78q6qk61K72m2q9j07K11J28o8Q9r2Q6k24L60j27j52J48rk47m1K21L9
$$ -179 99 13 5 -256 16 -26 -115 -222 -11 117 49 138 46 132 -92 268 141 -11 137 128 -119 -160 61 100
7958A00l6o9MJ32p9J44j22p8q8J49Q3m9L2q9j75K04J88k11p6j40J51r4M8q6L66
$$ 100 64 -5 -1 131 52 196 74 -4 -92 57 140 91 123 34 -141 63 251 40 -36 -176 -25 -119 -71 -157 209
7983B09k96m8K0J04o2J47pJ17j55j3P3R7m8k24Q9l2lQ2O2n9%l0J0n0j39J7L23
$$ 209 -87 -135 -115 -11 -73 74 67 184 29 16 89 186 138 -86 3 -29 -32 50 112 53 53 23 33 -17 -156 -139 184
8010A84m46J63K97l42j08J04J96Q8j67R9j16Q5J02k1j35Qk73K50m2O4J06Q4k13
$$ 184 -262 -99 198 -144 -252 -148 48 136 -31 68 -48 37 139 118 -17 -9 -282 -32 -74 -10 96 180 -33
8033c3j82j23K0K61j44K33n6P5k28Q6K06k05K1J09m63O23l06Q6Q4r5N6Ok58K21
$$ -33 -215 -338 -318 -57 -201 32 -24 51 -177 -91 115 -90 -69 40 -423 200 -106 -20 64 -31 25 31 -227 -6
8057fn9j25K02qq8O1Nj4j17K31o6Jp9J90l09J17kJ0P5o5M7k08L34j52J9o8J46
$$ -6 -65 -190 12 4 -84 -23 -18 -32 -149 82 16 17 -62 128 -181 -64 -66 -56 19 -46 1 -207 127 -25 -6 -74 72
8084G2J50m00K16Oq1m7j20n0lO47m83J06Q8k06J88l47L05j67K28r4O8n8J38l10
$$ 72 222 -178 38 44 -37 -84 -204 -254 -257 390 -93 13 101 -105 83 -264 41 -126 102 8 76 18 156 -154
8108a54r5K52r4m6J52J84k39r9K50j01J52n2R5k03M3j02MR1n9o3K41n9j92K96
$$ -154 -249 3 -91 -137 15 199 -40 -139 111 10 162 110 205 2 45 -57 -53 38 -21 -84 157 98 -94 202
8132B02k9J02l06L04m51K93k3J21l41Q9O6k29L27l30J90k00J47j79K78o2K2J71
$$ 202 173 275 -31 273 -178 115 92 213 -128 -39 27 -202 125 -205 -15 -215 -68 -247 31 -31 -9 162
8154A62m8Pj11k0O3p8K5Q9lj55k93N48qk37N5N2m7k42R6R4Q9J10l7l6M1k12L13
$$ 162 114 121 10 -10 53 -25 0 89 86 -69 -362 186 178 -59 -4 48 1 -241 -145 -51 38 148 111 75 116 -96 217
8181B17l23J54l4J56j07k36J29J8K62j61
$$ 217 -106 48 14 170 63 -173 -44 -26 236 75
8191G5
$$ Imaginary data points
##PAGE= N=2
##DATA TABLE= (X++(I..I)), XYDATA
0@%%%%%%%%%%%%%%%%%pJ5j6J6j6J6j9K7l2L2m0M8n3O1p0P8q8J02j13J26j42J58
$$ 0 0 0 0 0 0 0 0 0 0 0 0 0 0 0 0 0 0 -7 8 -8 8 -8 8 -11 16 -16 16 -24 24 -29 32 -38 40 -48 54 -59 67 -75 83
39H3j76J97k19K43k70K98l28L64m02M42m86N35n90O49p17P95q80R75j087J218
$$ 83 -93 104 -115 128 -142 156 -172 192 -210 232 -254 281 -309 340 -377 418 -462 513 -574 644
59F44j372J558j787K077k457K980l749M982p270J2878m9845o3589J34260K2139
$$ 644 -728 830 -957 1120 -1337 1643 -2106 2876 -4394 8484 -41361 -104950 29310 51449
73E1449q2231J9401O9824k9195l0958J7386L017j6417l574m232J1685J3557j5426
$$ 51449 -30782 -11381 58443 29248 -1710 15676 18693 2276 -1298 -5530 6155 19712 4286
86D286r375J6882j1447j7381J7961L298k7159Q531K2254j9553j6499K2622N611
$$ 4286 -5089 11793 346 -17035 926 4224 -22935 -14404 7850 -11703 -28202 -5580 31
99C1j7426O948K3007O29j2338r66J0036M12j6662m446J6805O85j4504J0421J9858
$$ 31 -17395 -10447 12560 13189 851 -115 9921 10333 -6329 -10775 6030 6715 -7789 2632 22490
114B2490r967j3491J2618R870r320p299M78M08l272r424l982O449l276j1363P598
$$ 22490 12523 -968 11650 21520 12200 4901 5379 5787 2515 -6909 -10891 -4442 -7718 -19081 -11483
129a1483J2854n625m828O980J95l306M272j319n666L790K307k442K618K369q92
$$ -11483 1371 -4254 -9082 -2102 -1907 -5213 -941 -2260 -7926 -4136 -1829 -4271 -1653 716 -176
144a76K936l48j844Q613p59j6367M675J6009j2211j2792J6788P142j3194L243
$$ -176 2760 2412 568 9181 8422 -7945 -3270 12739 528 -12264 4524 11666 -1528 1715
158A715J0222n336k815P02m913M716L322j6996k777J8706p782j8280J5554J2772
$$ 1715 11937 6601 3786 4488 -425 4291 7613 -9383 -12160 6546 -1236 -19516 -3962 8810
172H810j6543O78J8325n241r482P507o36o218O564J35p779N025L671o942J365
$$ 8810 -7733 -7055 11270 6029 -3453 4054 3418 -2800 3764 3899 -3880 1145 4816 -2126 -761
187g61L325p073J634N862q923j553J1468p764j3080J3075R029j3480j80J5555
$$ -761 2564 -4509 -2875 2987 -5936 -7489 3979 -3785 -16865 -3790 5239 -8241 -8421 7134
201G134O24p867J103M197Q43n111n841O605Q533r558o879J4220L234j5386J667
$$ 7134 7758 -109 994 5191 6034 923 -4918 1687 10220 662 -6217 8003 11237 -4149 -2482
216b482J0912o569p236O053Q90o124l13R13j27K512M24J037L641j342j425L614
$$ -2482 8430 1861 -5375 678 1568 -4556 -4869 -3956 -4083 -1571 -1147 -110 3531 2189 764 4378
232D378l609o619N526M302r374J150J1493k978q254O026O173n071l935M68K941
$$ 4378 769 -5850 -324 3978 -5396 -4246 7247 4269 -3985 2041 8214 3143 -792 -324 2617
247B617l99q598l462J0370j153j2822O341J3188p745o874J0405K076p448P90J650
$$ 2617 2218 -6380 -9842 528 -625 -13447 -7106 6082 -1663 -8537 1868 3944 -3504 -2714 -1064
262a064k300M179m9m338O930O080q090J138R167m932o182O707k362q202M697R80
$$ -1064 -3364 815 766 -3572 3358 9438 1348 2486 11653 6721 539 7246 4884 -3318 1379 2359
278B359q976M043P626p021j878Q665j308n425K438j093k464K658l866m640R031
$$ 2359 -6617 -2574 5052 -1969 -3847 4818 3510 -1915 523 -570 -3034 -376 -4242 -8882 149
293A49J321j0778M856J1392p749o369J0082K283q233J137L089j349J133q50k930
$$ 149 1470 -9308 -4452 6940 -809 -7178 2904 5187 -3046 -1909 1180 -169 964 114 -2816
308b816N791L349p392k03Q721l671p212M884K149n770j83K264k313K72J744k081
$$ -2816 2975 6324 -1068 -1271 7450 3779 -3433 1451 3600 -2170 -2353 -89 -2402 -2130 -386 -2467
324b467l78L151l18j939O78P63J510K10l255K196O012k945n693O388M728o901
$$ -2467 -2845 306 -12 -1951 -1273 -510 1000 1210 -2045 151 6163 3218 -2475 3913 8641 1740
340A740l044N979J718n603l400L402K621n040o041N779N085r097l708J0108L0
$$ 1740 -1304 4675 6393 790 -2610 792 3413 -1627 -7668 -1889 3196 -5901 -9609 499 529
355E29r574M323P049n435q60O635j500k556M400m50l542L179J193l241J861m2
$$ 529 -9045 -4722 2327 -3108 -3968 2667 1167 -1389 3011 2561 -981 2198 3391 150 2011 1969
371A969j638L493j215o059N142N509r879k424J1413k848j1575O123P909p401l206
$$ 1969 331 3824 2609 -3450 1692 7201 -2678 -5102 6311 3463 -8112 -1989 5920 -1481 -4687
386d687N575Q72j752p64k510K890L399o674j772R874j254q574N035O424o814j932
$$ -4687 888 1760 8 -756 -3266 -376 3023 -3651 -5423 4451 3197 -5377 -342 6082 -732 -2664
402b664N328j981j597L509k492k226M700j200m200L662J945l919J187J598l739
$$ -2664 2664 683 -914 2595 103 -2123 2577 1377 -2823 839 2784 -1135 52 1650 -2089
417b089J088K007n668o24P327k720n449N770M058n565j322M650O97j790j127L14
$$ -2089 -1001 1006 -4662 -5286 2041 -679 -6128 -358 3700 -1865 -3187 1463 2160 370 -757 -443
433d43M125k0o082J340P000l047n383N035L944n105k936K568O82k491k871Q64
$$ -443 3682 3662 -2420 -1080 5920 2873 -2510 2525 6469 1364 -1572 996 1678 -813 -3684 -2820
449b820L118m15l611K050L243l228r54L419j218j941L210m32l733L500K675m212
$$ -2820 298 -117 -3728 -1678 1565 -1663 -2617 802 -416 -2357 853 421 -3312 188 2863 -1349
465a349K66N048l71j792M09m45Q75o03n572K1O397m742p556P833N829r893k542
$$ -1349 -1083 3965 3594 1802 2211 1766 2641 2038 -3534 -3513 2884 -1858 -9414 -1581 4248 -5645 -8187
482h187J0154K23o689L053N216j925j277l44J173L004k437l146N124K931o350
$$ -8187 1967 2190 -4499 -1446 3770 1845 568 224 1397 4401 1964 -1182 3942 6873 523
497E23p60N599m123m503M639pn220K604L053n282n75M624j970l225L221K431r42
$$ 523 -237 5362 1239 -3264 1375 1368 -3852 -1248 1805 -3477 -4052 572 -1398 -4623 -1402 1029 87
514H7j005j616K118K394n613k638Q105J407q458L029R089m574o396O018M340m761
$$ 87 -918 -2534 -416 1978 -3635 -6273 1832 3239 -5219 -2190 6899 2325 -4071 1947 6287 1526
530A526r44L308O21j502k322j145J993n22l793J422L649k585k001K305j118k397
$$ 1526 582 3890 4511 3009 687 -458 1535 1013 -2780 -1358 2291 -294 -2295 10 -1108 -3505
546c505J478o3k461J713K403k078p73K173Q52n57n62K099L432n63l620K578L763
$$ -3505 -2027 -2090 -4551 -2838 -435 -2513 -3286 -1113 -261 -818 -1380 719 4151 3588 -32 2546 6309
563F309n305l709N535J837m855N86L701q63j874r68j080J364L86m741j0M665l291
$$ 6309 1004 -2705 2830 4667 -188 398 4099 3236 1362 394 -686 678 1064 -3677 -3687 978 -2313
580b313n112M681J874m554O77M282q90J02K623j879Q7L643k196k457N244Q79l488
$$ -2313 -7425 -2744 -870 -5424 -4747 -465 -1355 -1253 1370 -509 -422 3221 1025 -1432 3812 4691 1203
597A203J816J981k509K60J158l507J77K919l879l336M442q83n308J585L319j634
$$ 1203 3019 5000 2491 2751 3909 402 579 3498 -381 -3717 725 -158 -5466 -3881 -562 -2196
613b196o90J189J2J865m65l872K778N026m313l755O661J833o450J238M317j788
$$ -2196 -2886 -1697 -1685 180 -285 -4157 -1379 3647 -666 -4421 2240 4073 -2377 -1139 3178 1390
629A390j817K418j54l16P97j694m75K298j494k083K351M78l104J207M14k606R56
$$ 1390 -427 1991 1837 1521 2318 624 149 2447 953 -1130 1221 1699 -1405 -198 216 -2390 -1434
646a434J889k964q60L950kl979J109L091p98k171R52K772P53k963k26M482r22
$$ -1434 455 -2509 -3369 581 579 -3400 -2291 800 2 -2169 -1217 1555 2308 -655 -881 3601 2679
663B679n027J831M748k491l826K973K326l119j215P51M75L23j193j036K528N0
$$ 2679 -2348 -517 4231 1740 -2086 887 3213 94 -1121 -370 105 428 -765 -1801 727 777
679G77l250J049K418k318p61L086j282j356K992j59l149K114K541l240n76L188
$$ 777 -2473 -1424 994 -1324 -2085 1001 -281 -1637 1355 1196 -1953 161 2702 -538 -1114 2074
695B074j81j619k16L09O14M60l016l12M401j753m721L119L457m542j653M466Q3
$$ 2074 1893 274 58 367 981 1441 -1575 -1887 2514 761 -3960 -841 2616 -1926 -3579 887 970
712I70k715P64Q96L70M69j918l93L598k98l857K515L696l922j285L815q96k733
$$ 970 -1745 -981 -85 285 754 -1164 -1557 2041 1743 -2114 401 4097 175 -1110 2705 1809 -924
729i24K280K99k626Q63P66k284K60J892j108n89J094l37J2O92j746k9K885j542
$$ -924 1356 1655 -971 -108 658 -1626 -1366 526 -582 -1171 -77 -414 -402 290 -1456 -1485 1400 -142
747a42l065L633K985m179j395M530K53l494J04K482J055k110k012K235J633l441
$$ -142 -3207 426 3411 -768 -2163 2367 2620 -874 -770 1712 2767 657 -1355 880 2513 -928
763i28j679M167J39l738O45L209k563j794J920l6j051Q95l86j06R34K89r28J512
$$ -928 -2607 1560 1699 -2039 -1394 1815 -748 -2542 -622 -658 -1709 -814 -1200 -1306 -372 -83 -1011 501
781E01O0p14J748M35k968K018K679l639j405M437K8m822J191L649j974k616Q74
$$ 501 561 -153 1595 2030 -938 1080 3759 120 -1285 3152 3180 -1642 -451 3198 1224 -1392 -518
798e18J427qk894q32L521M13m331r7N228j668m031K693L003k961p83K052l59N2
$$ -518 909 901 -1993 -2825 696 1109 -3222 -3319 1909 241 -3790 -1097 1906 -1055 -1838 214 -145 -93
816i3M56k95J34J819j238r12J689l86j023P10j18j511J626P61l156M59L437k437
$$ -93 363 68 202 2021 783 -129 1560 1174 151 861 743 -768 858 1619 -1537 -1078 2359 -78
834g8k512K954J155l032l10J772l15p56n13J88J849j9k514J887L003j790k228
$$ -78 -2590 364 1519 -1513 -1823 -51 -366 -1122 -1635 -1447 402 383 -2131 -244 2759 969 -1259
851a259L046J122k383m48J570J21p17m58k03J075k73k561Q68J489k079j175J909
$$ -1259 1787 2909 526 78 1648 1769 1052 594 391 1466 1193 -1368 -500 989 -1090 -2265 -356
868c56o68j869J723J76k216J624K342k357k06K832M59j927M32J334K05m02j326
$$ -356 -1024 -2893 -1170 -994 -3210 -1586 756 -1601 -1807 1025 1484 -443 -11 1323 1528 1126 -200
885b00R19K386j558k935K949K091m451j445L819k18l168J27K729q17j513m11J369
$$ -200 719 3105 1547 -1388 1561 3652 -799 -2244 1575 1357 -1811 -1684 1045 228 -1285 -1696 -327
902c27R58j819n57K544Q12k550O55K246j759j541K122M4j813J261R45k071L32
$$ -327 631 -1188 -1745 799 1611 -939 -284 1962 203 -1338 784 828 -985 276 1221 -850 -518
919e18J370j130j013O28M80L62n01p77J692J368l175j072M090p7m152J253L858
$$ -518 852 -278 -1291 -663 -183 179 -322 -1099 593 1961 -1214 -2286 1804 1727 -2425 -1172 2686
936B686k461k741K316J184j594o85N02J090M04j546J15K387p03k559J994K062
$$ 2686 225 -2516 -200 984 -610 -1295 -793 297 701 -845 -730 1657 954 -1605 389 2451
952B451k176k57K151r37j193J849n57k013R21J053j888l10N76m09o49n22j80J186
$$ 2451 275 18 2169 1232 39 1888 1331 -682 239 1292 -596 -906 -330 -739 -1388 -1910 -2090 -904
970i04K53j938M13L502j589k396L002J911k446n58L223K30j700l8Q30M99q45j816
$$ -904 -651 -2589 -2176 1326 -263 -2659 343 2254 -192 -750 2473 2703 1003 965 1795 2294 1449 -367
988c67M72J359j869j490J494K89k391J16J467n64k85O02M2K30J106j09n60J127
$$ -367 105 1464 -405 -1895 -401 -112 -2503 -2387 -920 -1484 -1769 -1167 -1125 -895 211 102 -458 669
1006F69L03j02M26J15k30R34l73j475J303Q76k350o46K174p63k520M91J221p86
$$ 669 972 870 1296 1411 1181 2115 1742 267 1570 2446 96 -550 1624 861 -1659 -1168 53 -733
1024g33p52J07P81K74o82j361J757J353k455m65K967m15k186J245J436j398J87
$$ -733 -1485 -1378 -597 -323 -1005 -2366 -609 744 -1711 -2176 791 376 -1810 -565 871 -527 -340
1041c40P98q7K12M59q16k0J478j449k52J458m64o11P96j09r21P73N47k010j60
$$ -340 458 371 583 1042 226 206 1684 235 -17 1441 977 366 1162 1053 132 905 1452 -558 -718
1060g18J907j175j718J104O01j012p61J1R47N65j103m98K155M46k457P48K742
$$ -718 1189 14 -1704 -600 1 -1011 -1772 -1761 -814 -249 -1352 -1850 305 751 -1706 -958 1784
1077A784j116j636K019J101j295k81R06q6J0q03j52N17j64j886K00J011j508m43
$$ 1784 668 -968 1051 2152 857 576 1482 1396 1406 603 451 968 804 -1082 -882 129 -1379 -1822
1095a822J240p07j081J428N54j785P57J938j090o86J753R87r04l78R93R09l37
$$ -1822 -582 -1289 -2370 -942 -388 -2173 -1416 522 -568 -1254 499 1486 582 204 1197 2106 1769
1112A769j132O02J082j291j747J444J069k334o86J457J43j242j78K43J75M12j309
$$ 1769 637 1239 2321 1030 -717 727 1796 -538 -1224 233 376 -866 -1044 -801 -626 -214 -1523
1129a523Q28J141j080j110J717J136k117J63J378q47m87J430l69p02J202N7j366
$$ -1523 -695 446 -634 -1744 -27 1109 -1008 -845 533 -314 -801 629 260 -442 760 817 -549
1146e49P98O32n04m70L53l29O97l2j114L46J442j372j280J976M84k602L64K244
$$ -549 249 881 377 -93 260 -69 628 596 -518 -172 1270 -102 -1382 594 1078 -1524 -1160 1084
1164A084p87j557N91R87J8m20q92J250R01j297p91K027r5j809J140J191j372j26
$$ 1084 297 -1260 -669 318 336 -84 -976 274 1175 -122 -913 1114 1019 -790 350 1541 169 43
1182D3P90n61k59N49l17o89N24k49p90J95K53r05P29J8n96P61J193k077k98K381
$$ 43 833 272 13 562 245 -444 80 -169 -959 -764 -511 -1416 -687 -669 -1265 -504 689 -1388 -1686 695
1202F95J07j956P14J979p65r39R05P92o85r10N83J152l83j900P02R54q01j059
$$ 695 802 -1154 -440 1539 774 -165 740 1532 847 -63 520 1672 1289 -611 91 1045 244 -815
1220h15N64N61j055J51N18m62J60J67n28L23M98n10L20M92n83K68Q70p64l84J184
$$ -815 -251 310 -745 -594 -76 -538 -378 -211 -739 -416 82 -428 -108 384 -199 69 939 175 -209 975
1240I75j49j586Q81J424j960o62J722M1j755K1Q30l68o0k71J58P55k91r78J222
$$ 975 826 -760 121 1545 -415 -1077 645 686 -1069 -1048 -218 -586 -646 -917 -759 -4 -295 -1273 -51
1259e1R08j416m92J326M82j293M70N31k84PO6M4M11j9p60L87O92o79k26N93k39
$$ -51 857 -559 -1051 275 757 -536 -66 465 181 188 254 298 709 690 -70 317 1009 330 104 697 458
1280D58n39J015q36j225J275M10j309k78J423o66r30N94M19m33j48J63J9J112
$$ 458 -81 934 98 -1127 148 558 -751 -1029 394 -272 -1202 -608 -189 -622 -770 -607 -588 524
1298E24j018o56J448J012j917j80J891j36j457N68R66o40m50L52n8N13m35o43
$$ 524 -494 -1150 298 1310 -607 -787 1104 968 -489 79 1045 405 -45 307 249 762 327 -316
1316c16P01k22p37l5L69m90l55R34m91k42O32K05p33O89Q26m16j88K34N05O0m62
$$ -316 385 163 -574 -609 -240 -730 -1085 -151 -642 -884 -252 -47 -780 -91 735 319 131 365 870 930 468
1337D68M3N18M30j657n0J623l67j717M81J268j285j199R79N51r91N1K69M18l77
$$ 468 511 1029 1459 -198 -248 1375 1008 -709 -228 1040 -245 -1444 -465 86 -905 -854 -585 -167 -544
1356e44n86N42P11l17o23Q56O95j057L04P28n53k72Q80J93p31L69K54m32nl6j80
$$ -544 -1130 -588 123 -194 -817 39 734 -323 -19 709 156 -116 764 957 226 595 849 417 412 376 196
1377A96K94q14NP95k15j106O24J085j260p48J383L98j726L67J389m01p08p5N18
$$ 196 490 -324 -319 476 261 -845 -221 864 -396 -1144 239 637 -1089 -722 667 266 -442 -517 1
1396AK98l00l65N21Q46q22k93P62J93q73L8O53q02q8M72m21k37M32l47n69N07
$$ 1 299 -1 -366 155 1001 179 -114 648 841 -32 6 659 -143 -231 241 -180 -417 15 -332 -901 -394
1417c94K15l77j62L64J15j63K45o11P35P41q80J5J325k63j079P69K84l6o02J50
$$ -394 -179 -556 -718 -354 -239 -402 -157 -768 -33 708 -172 -157 1168 905 -174 595 879 843 241 391
1437C91P9N06p23n56P13K87q84k44O70k44q95M10M59n82j23K73j12KK95k32K72
$$ 391 470 976 253 -303 410 697 -187 -431 239 -5 -900 -490 -31 -613 -736 -463 -575 -573 -278 -510 -238
1458b38L03N0k30N49l69J67L10j99k78P45j35n64J18M07m78k07Q0J10l67p9K3
$$ -238 65 115 -115 434 65 232 542 343 65 810 675 111 229 636 158 -49 31 141 -226 -305 -282
1479b82J63O0l41k46Q68k1j266P42Q68r05m16J244k60l09K12rJ91M52j96n71Q19
$$ -282 -119 -59 -400 -646 222 201 -1065 -323 545 -360 -776 468 208 -101 111 102 293 745 549 -22 797
1500G97K89p77j80O71k50o35M62r0p47L17k0o17jM64n99P8O41j79k05m2J78L7
$$ 797 1086 309 129 800 550 -85 377 287 -460 -143 -163 -780 -781 -317 -916 -838 -197 -376 -581 -623 -445 -408
1522d08J58m97M21Q85k34p96J062O26n55m67N51K34m99j70N9K5j16l51j75Q09
$$ -408 -250 -747 -326 559 325 -471 591 1217 662 195 746 980 481 311 370 395 279 -72 -247 562
1542E62n39q00M60P4o75pL73K25k51J38J85j97K81L86j88K62K73n05L41k60N11
$$ 562 23 -777 -317 -243 -918 -925 -552 -327 -578 -440 -255 -452 -171 215 27 289 562 57 398 138 649
1563F49km24k69N83K20m99k31N86J3j105L40K01l24m58K31J65K88o67q4N08J97
$$ 649 647 223 -46 537 757 258 27 613 626 -479 -139 62 -262 -720 -489 -324 -36 -703 -787 -279 -82
1584h2l98m23J033J02p47N98M47q06M47J27k05K51M41m2o23N90O1q59K96J12l37
$$ -82 -480 -903 130 232 -515 83 530 -276 171 298 93 344 785 743 120 710 771 -88 208 320 -17
1605a7j80J81k07J13J68o44j75P62m08m17P04K04m51l33M56Q9j39j3L01M58k35
$$ -17 -197 -16 -223 -110 58 -586 -761 1 -407 -824 -120 84 -367 -700 -244 -155 -294 -307 -6 452 217
1626B17n12M26M00q5k21J30J90l01j37L7J27r7l93K6j33J33q0K6J64j42k90J97
$$ 217 -295 131 531 446 225 355 545 244 107 144 271 174 -219 -193 -326 -193 -273 -247 -83 -225 -515 -318
1648c18L01n93M69j52j75L23N46k16l85P97j22k00K34J65j49p7j45qM35n64m91
$$ -318 -17 -610 -141 -293 -468 -145 401 185 -200 597 475 275 509 674 525 448 303 295 730 166 -325
1669c25L75K42o06l8J89k88j8j6o0p4Q4j75q8K15N05l21M68L21l03L06K44j05
$$ -325 50 292 -314 -352 -163 -451 -469 -485 -545 -619 -535 -710 -798 -583 -78 -399 69 390 87 393 637 532
1691E32k01L66l39l13M46j1k91l41P45j24o22K09J0m01Q8l54j8L01l39P3L67L36
$$ 532 331 697 358 45 491 480 189 -152 593 469 -153 56 66 -335 -247 -601 -619 -318 -657 -584 -217 119
1713A19n02J6O89k76l09K89J82k50LM18l22L20R2l48M05o5l06K99l25P6j39k70
$$ 119 -383 -367 322 46 -263 26 208 -42 -39 379 57 377 469 121 526 461 155 454 129 205 66 -204
1735b04R6j48K26j91k15J23N7p7p8N2j29R5p8q8N04L63l32P7N43q1m85J73L73
$$ -204 -108 -256 -30 -221 -436 -313 -256 -333 -411 -359 -488 -393 -471 -559 -55 308 -24 53 596 515 30 203 576
1758E76j51k87L21j13l42J45l3j93J96l89L76j15j58m12L63R6o59J41J04J10q1
$$ 576 425 138 459 346 4 149 116 -77 119 -270 106 -9 -167 -579 -216 -120 -779 -638 -534 -424 -505
1779e05L44k4K7K46j6J14K6o7L81j48l53K54M69j91m01R6L26l36l19N20l61l10
$$ -505 -161 -185 -158 88 72 186 212 145 526 378 25 279 748 557 156 252 578 242 -77 443 82 -228
1801b28k05K72m93K00q1k35M26o6l90M08O57j74l39N77L05o66J99K57k65K7K55
$$ -228 -433 -161 -654 -454 -535 -770 -344 -410 -800 -392 265 91 -248 329 634 -32 167 424 159 186 441
1822D41l59K10j53K8J0m31K10J65mo6l68L13m24N6J79M82o13R2M53k38j40J61
$$ 441 82 292 139 167 177 -254 -44 121 117 51 -317 -4 -428 -372 -193 289 -324 -232 221 -17 -157 4
1844DK53k17l11O2L67j80L23l63J16M27n41M05L16l8n98N97j34m06OJ52j26k94
$$ 4 257 40 -271 -209 158 -22 301 -62 54 481 -60 345 661 623 25 622 488 82 88 240 114 -180
1866a80N5j40M6J2j8j96K8L8J8K28j06k87N17j11k0J79J08k1l2O45l24k24O8Q1
$$ -180 -125 -265 -219 -207 -225 -421 -393 -355 -337 -109 -215 -502 15 -96 -116 63 171 150 118 763 439 215 283 364
1890C64l9N3m28j26N34m6m05J66M7k89k70K50o9k12j35K02MK46J58k72K47L14
$$ 364 325 378 -50 -176 358 312 -93 73 120 -169 -439 -189 -258 -470 -605 -403 -399 -153 5 -267 -20 294
1912B94j54K3M14j99j6j87L08l98M10q8m06K53k48J35j9k6m97J52l48J10r0K07
$$ 294 140 163 577 378 362 175 483 85 495 407 1 254 6 141 122 96 -401 -249 -597 -487 -577 -370
1934c70o7J42J78j65j73M08J64j19j29M21n3k79K28k7K6J09r9j65M04J7m93J70
$$ -370 -437 -295 -117 -282 -455 -47 117 -2 -131 290 237 -42 186 159 185 294 195 30 434 451 -42 128
1956A28K58j43j83P7j59J88k43Ll57N02j06l4j31m7O3k29j1J51J8j71JL78M7N7
$$ 128 386 243 60 137 -22 166 -77 -74 -431 71 -35 -69 -200 -247 -184 -413 -424 -273 -255 -426 -425 -47 0 57
1980E7P0L8p3l6K40K88j13m5J49m14J06r9l84L07j63M6m16M81j28k36P8R2j32
$$ 57 127 165 92 56 296 584 471 426 575 161 267 168 -216 91 -72 -26 -442 39 -89 -325 -247 -155 -287
2003b87P5L02l54n1L23j59K2J67J6K64Q1M4k55L96j95j28J19j79j12l34O58k26
$$ -287 -212 90 -264 -315 8 -151 -129 38 54 318 399 443 188 584 389 261 380 201 89 -245 413 187
2025A87m53J28J6j81k2j05N4k87K61k7K82l59K9L22L47k77k74P27k35R3K17j93
$$ 187 -266 -138 -122 -303 -325 -430 -376 -663 -402 -429 -147 -506 -477 -155 192 -85 -359 368 133 226 443 250
2047B50o6Q3J73l23J15K7j89L9j51L46n77L31j60L5P6j20j4k09L58l10j22J20
$$ 250 184 267 440 117 232 259 70 109 -42 304 -273 58 -102 -67 9 -111 -125 -334 24 -286 -408 -288
2069b88L23k44P3K74j10j33kK79K40k70j00J86J44j0K7M1j64j28k17K02k03k2
$$ -288 35 -209 -136 138 28 -105 -107 172 412 142 42 228 372 362 389 430 266 138 -79 123 -80 -102
2091a02L4k85L5J58j41j24J56k3j23K03j89m7N22l15j47N98M4m1J61J10l75J56
$$ -102 -68 -353 -318 -160 -301 -425 -269 -292 -415 -212 -401 -448 74 -241 -388 210 254 213 374 484 109 265
2113B65J60k39J89j72K43k76J23n6l81M08k31l88J81j05K01n6j42K67j52j48J37
$$ 265 425 186 375 203 446 170 293 237 -144 264 33 -355 -174 -279 -78 -134 -276 -9 -161 -309 -172
2134a72l42L84j1j56L73k79K75R9K53l23M7n3J31J2J03L1m66J30J60J29o83L63
$$ -172 -514 -130 -141 -297 76 -203 72 171 424 101 148 95 226 238 341 372 -94 36 196 325 -358 5
2156Ek13j56K18k08j19M10k53lR2J39l07M34k8j73J30r0L16j22O9K04j9J19o0
$$ 5 -208 -364 -146 -354 -473 -63 -316 -319 -227 -88 -395 39 11 -162 -32 -122 194 72 141 345 326 445 385
2179C85k78O7j06K82P5p7j49l32K48j70p2j23o1J04l1l6o2r8L2N4J37K8L9J29
$$ 385 107 174 68 350 425 348 199 -133 115 -55 -127 -250 -311 -207 -238 -274 -336 -434 -402 -348 -211 -183 -144 -15
2203a5Q3j00J02K22l15M6L81k2k28K87K5l58j6j40O0j02K33l87J39J76l85J55
$$ -15 68 -32 70 292 -23 23 404 382 154 441 466 108 92 -48 12 -90 143 -244 -105 71 -314 -159
2225a59j50K66k72OJ07L5J45q0J34k06M00j98J58j3Q7m8L3l69M8K27j7k94J46
$$ -159 -309 -43 -315 -309 -202 -167 -22 -102 32 -174 226 28 186 173 260 212 245 -124 -76 151 134 -160 -14
2248a4n7R1P8J53j22j11r6j64K65l76J84k25M5p2J20J1J85j65P8P1K04m11L14
$$ -14 -71 20 98 251 129 18 -78 -242 23 -353 -169 -394 -349 -421 -301 -290 -105 -270 -192 -121 83 -328 -14
2271a4L20k87M4J31n6K59O9j02j02nl25J02k5j05l1J19n18M70l33R4J23L24N1
$$ -14 306 19 63 194 138 397 466 364 262 257 -68 34 9 -96 -127 -8 -526 -56 -389 -295 -172 152 203
2294B03o62J20L88k53J85j9K82j86q9K73j52K04j08p8Q6k6k22K90r7J24n30J04
$$ 203 -459 -339 49 -204 -19 -38 244 58 -31 242 90 294 186 108 194 168 -54 236 139 263 -267 -163
2316a63J54l39L15M6j17r7K84k12m7J6m5n3j5K18M8K3o5J51R6J47M0j11j7k43
$$ -163 -9 -348 -33 13 -104 -201 83 -129 -176 -160 -205 -258 -273 -55 -7 16 -49 102 198 345 385 274 257 14
2340A4q3M64l44J0n3K80r4J7k28qQk93J42J13j52j12P3N4L5j0J36j34K38J22j84
$$ 14 -69 395 51 61 8 288 194 211 -17 -25 -17 -310 -168 -55 -207 -319 -246 -192 -157 -167 -31 -165 73 195 11
2365A1j86K83P7k16J1j06K13o6J22j44K68j3j18N1j29q7j24J53k04K29m0ok73
$$ 11 -175 108 185 -31 -20 -126 87 21 143 -1 267 254 136 187 58 -29 -153 0 -204 25 -15 -21 -294
2388b94P8R6R4l61M07j59j73K54J84m8j36k58L95j16j04J82r6K96j34K62j31m3
$$ -294 -216 -120 -26 -387 20 -139 -312 -58 126 78 -58 -316 79 -37 -141 41 -55 241 107 369 238 195
2410A95q0N7n9l50mPK21k14J00n4j57L2m8K48jJ2lp8KK76j16L09j61j92M63l42
$$ 195 115 172 113 -237 -241 -234 -13 -227 -127 -181 -338 -306 -354 -106 -107 -95 -98 -176 -174 102 -14 295 134 -58 405 63
2436F3Rj5J92Q4l10P6K60k58k40K56L1m19rq8J51J54j55l5L2R6p2J99k71J54Q4
$$ 63 72 57 249 333 23 99 359 101 -139 117 148 -271 -280 -368 -217 -63 -218 -253 -221 -125 -197 2 -269 -115 -31
2461c1j63K26J24N6k38K26j7p5j81K31n6J95l46O4R8q0j04K93k59p0k61L91j59
$$ -31 -194 32 156 212 -26 200 183 108 -73 158 102 297 -49 15 113 33 -71 222 -37 -107 -368 23 -136
2484a36o6p7J89mp8M16l26L1j47J91J03j96N5K67O4o4n2P6l00qK91q5j88K29K9
$$ -136 -202 -279 -90 -94 -172 244 -82 -51 -198 -7 96 -100 -45 222 286 222 170 246 -54 -62 229 144 -44 185 214
2509B14m70L66k06M3P3O4O6m30L79l20J61j51K69k95K8n6j48O6K48J91JJ44J50
$$ 214 -256 110 -96 -53 20 84 150 -280 99 -221 -60 -211 58 -237 -209 -265 -413 -347 -99 92 93 237 387
2532C87l57K46R3k09Rr3J94l64K12m94L56K91j84l14J14j0n8J03p4K7ol02L18
$$ 387 30 276 369 160 169 76 270 -94 118 -376 -20 271 87 -227 -113 -123 -181 -78 -152 -125 -131 -433 -115
2555a15L2K03j07Oj2l7N0j1j14J71J06k55M57l60l6K8n3N3j39L28j18q9n9j03
$$ -115 -83 120 13 19 7 -30 20 9 -105 66 172 -83 374 14 -22 6 -47 6 -133 195 77 -12 -71 -174
2579a74J18p7j00J19j08J43j36K39j71J12K01r1j82J57r3J63l02M47j41j58J46
$$ -174 -56 -133 -233 -114 -222 -79 -215 24 -147 -35 166 75 -107 50 -43 120 -182 265 124 -34 112
2600A12J43J58n07K38j55N3Pn8J48J25n38J92M3j80j97K05J02q8P1m7J77j7oj63
$$ 112 255 413 -94 144 -11 42 49 -9 139 264 -274 -82 -39 -219 -416 -211 -109 -197 -126 -173 4 -13 -19 -182
2624a82J75l5J23J10M2J28o3r9J25j51J21k04rr8M3o4J72o4j64pj46J52J28j83
$$ -182 -7 -42 81 191 233 361 298 199 324 173 294 90 81 -17 26 -38 134 70 -94 -101 -247 -95 33 -150
2648a50j94L05k19K39n7l26L73K25J52l98rJ84JJ57Q1l89K68m0j31l9L49j66l80
$$ -150 -344 -39 -258 -19 -76 -402 -29 196 348 -50 -59 125 126 283 364 -25 243 203 72 33 382 216 -164
2671a64J58M5l28K07jm6k02L13j31O6J93j35n6p6q1K29J02j69R5N89m83J61k20
$$ -164 -6 39 -289 -82 -83 -129 -331 -18 -149 -83 110 -25 -81 -157 -238 -9 93 -76 19 608 125 286 66
2694F6K44J11k64J99l61J75j20k2J5Q3j06L6k24l9J42j98Q3J4L07m23M2O5J37
$$ 66 310 421 157 356 -5 170 50 28 43 126 20 56 -168 -207 -65 -263 -180 -166 141 -282 -240 -175 -38
2717c8J54j56L46m00J12L39l62J75l07L92j1k25N5M7j4J0j00M67m06j62l8j29
$$ -38 116 -40 306 -94 18 357 -5 170 -137 255 244 19 74 121 107 117 17 484 78 -84 -122 -251
2739b51L66m36o1J98m9l4K64j91J8J48j23J46P9k38K92j67j6r7L02k15K28R2k76
$$ -251 115 -321 -382 -184 -233 -267 -3 -194 -176 -28 -151 -5 74 -164 128 -39 -55 -152 150 -65 163 255 -21
2762b1K99m26L29k02K51j81K59l96j2K8J06j92k27K08N3lj06p4l2P7Rj3M68r4
$$ -21 278 -148 181 -21 230 49 308 -88 -100 -72 34 -158 -385 -177 -124 -127 -233 -307 -339 -262 -253 -266 202 108
2786A08m8j41M36j6j89m3Q0j74J60P8k20R8j88J5K7%M5J42l21J68p3J45j7k72
$$ 108 60 -81 355 339 150 107 187 13 173 251 31 129 -59 -44 -17 -17 28 170 -151 17 -56 89 72 -200
2810b00j13J87j27m0q8L78j34k26M29K17j61k1O8n3n7J50m39K83M0Qj8k4n1K0
$$ -200 -313 -126 -253 -293 -381 -3 -137 -363 66 283 122 101 169 116 59 209 -230 53 93 101 83 59 8 28
2834B8n2K24N3k01j92J08o5q7J25P8j30K2l8P3M2N7qJ15n7p5P6Q7r0j40l6K18
$$ 28 -24 200 253 52 -140 -32 -97 -184 -59 19 -111 -89 -127 -54 -12 45 37 152 95 20 96 183 93 -47 -83 135
2860A35j20j5p6L18K4m21O1L10k52j32j2J42j08K86l77J33J49r6K20k04M5k9K53
$$ 135 15 0 -76 242 266 -155 -94 216 -36 -168 -180 -38 -146 140 -237 -104 45 -51 169 -35 10 -19 234
2883B34n23L98n5L9j53J79j18J00L3p6k15L33O0j79kk67J61K6j8k49J8J81J13
$$ 234 -289 109 54 93 -60 119 1 101 134 58 -157 176 236 57 55 -212 -51 -25 -43 -292 -274 -93 20
2906B0l04l5Q7J97j49J18k29L33P7j05j93L60j09n4L60m23K28j12J38k56j7K43
$$ 20 -284 -319 -232 -35 -184 -66 -295 38 115 10 -183 177 68 14 374 -49 179 67 205 -51 -68 175
2928A75j56k1k11K75R5lk18J90k39k5p9J60Q7p1R0m9j05MJ1Q2R6k00Q6Q2O5k21
$$ 175 19 -2 -213 62 157 154 -64 126 -113 -138 -217 -57 30 -41 49 0 -105 -101 -90 -8 88 -112 -26 56 121 -100
2954a00K27n2k78L12L8j97l2L1M3N5k2j32J13n8J0k41L04p8m9LJ68l83M72r2j15
$$ -100 127 75 -203 109 147 -50 -82 -51 -8 47 25 -107 6 -52 -42 -283 21 -57 -106 -103 65 -318 154 62 -53
2979e3J08j17J58K10j09Nj08O3L8j33j42O3q8N7j0J33J29j77k85O9m7K39j07N7
$$ -53 55 -62 96 306 197 202 94 157 195 62 -80 -17 -105 -48 -58 75 204 27 -258 -189 -236 3 -104 -47
3003d7J0k4k4lN0l9O5q6L49m24L70k85J82j12j0mM8J05j43J93q0M8r5pK58l42
$$ -47 -37 -61 -85 -88 -38 -77 -12 -98 251 -173 197 -88 94 -18 -28 -32 16 121 -22 171 91 139 44 37 295 -47
3029d7J26j84K83k92j74J1J88K6J54k33J0o8L73m73K88m9J45l69K86K50Kjj85
$$ -47 79 -105 178 -114 -288 -277 -89 -63 91 -142 -132 -200 173 -300 -12 -61 84 -285 1 251 253 252 67
3052F7O1J7q5n4r6J65p4O1Qj83J8N6rL6k6Q4j10o0J20j72R5o5K13m1K5o1j87M15
$$ 67 128 145 60 6 -90 75 1 62 70 -113 -95 -39 -48 -12 -38 46 -64 -124 -4 -176 -81 -146 67 26 51 -10 -197 218
3080B18k12PJ54k28K08J99j09m5K4l20J78Q9l16L47m8k62P5J84k81J63kn1l70
$$ 218 6 13 167 -61 147 346 237 192 216 -104 74 163 -153 194 146 -116 -41 143 -138 25 23 -28 -398
3103c98P7K8K93j06J5o3J95j80N9J92k50M69j65P6k65P6m0N3K7j67K72j55j45
$$ -398 -321 -293 0 -106 -91 -154 41 -139 -80 112 -138 331 166 242 -23 53 13 66 93 -74 198 43 -102
3126a02L8J19Mj95Q7J83j75l49L18O6K38l13O1J39k02O2J2N8K06r6L8j26p9K33
$$ -102 -64 55 59 -136 -49 134 -41 -390 -72 -6 232 -81 -20 119 -83 -21 -9 49 255 159 197 71 -8 225
3150B25M1l46j28M61qr5l08J84K63k49j1n6k44K08L3j45J2L59l01J90q7N1q9j5
$$ 225 266 -80 -208 253 245 150 -158 26 289 40 29 -27 -271 -63 -30 -175 -163 196 -105 85 -2 49 -40 -55
3174e5J13o8k39L37j05l4K83kj63R5o5p1J22L9j77P1k70O1L7L5N3l27N66m40M1
$$ -55 58 -10 -249 88 -17 -51 232 230 67 162 97 26 148 187 10 81 -189 -128 -91 -56 -3 -330 236 -204 -163
3199a63K70j48j61J65m3L39j05j58J14j03r5o2J93o1j06l3R4K34l21J75K58l98
$$ -163 107 -41 -202 -37 -80 259 154 -4 110 7 -88 -150 43 -18 -124 -157 -63 171 -150 25 283 -115
3221a15p9K61k13K68k12J22m5j99J55m94L34K15j3K7J12l83M1M73k16J11j50J8
$$ -115 -194 67 -146 122 -90 32 -13 -212 -57 -551 -217 -2 -15 12 124 -259 -218 255 39 150 0 18
3243A8J58J60k42r7l9J52p3Q3j8j27o3O7K60k83m00L83j93Q7N1J39p9K2L44k32
$$ 18 176 336 94 -3 -42 110 37 120 102 -25 -88 -21 239 -44 -444 -61 -254 -167 -116 23 -56 -34 310 78
3267G8r8J37k04q8J35j31J39J60K1R3j02J84j27j60J13JR6P7n33K62k90K61n9
$$ 78 -20 117 -87 -175 -40 -171 -32 128 149 242 140 324 197 37 150 151 247 324 -209 53 -237 24 -35
3290c5j24J5K82L3n13N07k53J12k98k22M35R8j49K7K96rj6j24J09q7k06L45Jl51
$$ -35 -159 -144 138 171 -342 165 -88 24 -274 -496 -61 37 -112 -85 211 202 186 62 171 84 -122 223 224 -127
3314a27K81j7J23l06Q8K3k20K91L4l95Q7N1J42k31J99P9l16K62j89N5oQ4J28k18
$$ -127 154 137 260 -46 42 65 -155 136 170 -225 -138 -87 55 -176 23 102 -214 48 -141 -86 -92 -8 120 -98
3338i8J92r7j64J04K20p7l2O0j05J26Lj10J6o7L2n2k8K8M2j44J62j43M5m8Q4j3
$$ -98 94 -3 -167 -63 157 80 48 108 3 129 132 22 38 -29 3 -49 -77 -49 -7 -151 11 -132 -87 -135 -51 -64
3364f4P8Nj51m2K09j70J72J87k9r6j77K28j27q2%Q5P5k3Q8r6R3k71Jp3K92l03
$$ -64 14 19 -132 -174 35 -135 37 224 195 99 -78 150 23 -59 -59 26 101 78 166 70 163 -108 -107 -180 112 -191
3390a91J47k02L85j79K62r4l55M22m14K21k5l1K80k50J05j15K7P9K40j76o2Pj35
$$ -191 -44 -246 139 -40 222 128 -227 195 -219 2 -23 -54 226 -24 81 -34 -7 72 312 136 74 81 -54
3413e4n9K01p8j56k2J76j93K77j35j93J6p8M44j42q3Q7j8o9K46k73L68k59mJ53
$$ -54 -113 88 10 -146 -168 8 -185 92 -43 -236 -220 -298 146 4 -79 8 -10 -79 167 -106 262 3 -1 152
3437A52j13j13j34K58kk3n3n4J64k4j43J95j02j19K5j13M58l99Q8k8j34K66j29
$$ 152 39 -74 -208 50 48 25 -28 -82 82 58 -85 110 8 -111 -86 -199 259 -140 -52 -80 -214 52 -77
3460g7J35p0K62l65mK25k5J9j52M3J22J29l34J30j26K72k08K1L76k62j55j56K98
$$ -77 58 -12 250 -115 -119 106 81 100 -52 -9 113 242 -92 38 -88 184 -24 -3 373 111 -44 -200 98
3483I8l10K26J4j07Q8j4j37n4J5J6J30j66M41j15k16K90k28J48j01P4L6N2j25
$$ 98 -212 14 28 -79 9 -5 -142 -196 -181 -165 -35 -201 240 125 -91 199 -29 119 18 92 128 180 55
3506E5K9q0k47K95J42m39N4K90k62M59k49k91L7K62j14k10K71k21L04k43K31k28
$$ 55 84 4 -243 52 194 -245 -191 99 -163 296 47 -244 -207 55 -59 -269 2 -219 85 -158 73 -155
3528a55L22O2l25J3J61J58k42K04k67K74k14K0O3j52J26j75L41J14k57k97K06
$$ -155 167 229 -96 -83 78 236 -6 198 -69 205 -9 11 74 -78 48 -127 214 328 71 -226 -20
3549b0r7O5k8J0J21k06J85k36L06k70K36K4j81M8K08j33J14j85J86n6R5j53J5
$$ -20 -117 -52 -80 -70 51 -155 30 -206 100 -170 66 90 -91 -43 165 32 146 -39 147 91 186 33 48
3572D8Q4j52J70j69q5Q8m6R8j07J57l58K12O7k41M5J92j73K23k08Q9Q7k14K57
$$ 48 132 -20 150 -19 -104 -16 -62 36 -71 86 -272 -60 7 -234 -189 3 -170 53 -155 -66 21 -193 64
3595F4k12R1K03j69J25k40Q4J67J7k28K45n0r6K21j68j80L3oQ2j38K05l5n9L5
$$ 64 -148 -57 146 -23 102 -138 -54 113 130 -98 147 97 1 222 54 -126 -93 -99 -17 -155 50 15 -44 -9
3619ij99O7J57N3j80J6J15l2O7l8j98K24n2K85lk8k31j55J44J21j77J70k16K55
$$ -9 -208 -141 16 69 -111 -95 20 -12 55 17 -181 43 -9 276 273 245 14 -141 3 124 -53 117 -99 156
3643A56j49J2j55J4L4k6N5l0j8J91p8k27J06J08j15L50pk70O7O4O1j56J4J30l69
$$ 156 7 19 -136 -122 -88 -114 -59 -89 -107 84 6 -221 -115 -7 -122 228 221 -49 18 82 143 -13 1 131 -238
3668b38M29P8k36k51L19j07m8j26K45j53k3q5N5J28Q7k16J7L20j93J07k70J67
$$ -238 191 269 33 -218 101 -6 -54 -180 65 -88 -111 -196 -141 -13 74 -142 -125 195 2 109 -161 6
3690Fj49k9j56J63J39K4J71Lk07J93j39j8J19k33J84K6j46J67p6j63JK70l2j89
$$ 6 -143 -172 -328 -165 -26 -2 169 172 -35 158 19 1 120 -113 71 97 -49 118 42 -121 -120 150 118 -71
3714g1N6p5Q9j32O1J9k30M31k54L90l47O9J12k47J24n9Kn7L75k01j88K45j65n1
$$ -71 -15 -90 -1 -133 -72 -53 -283 148 -106 284 -63 6 118 -129 -5 -64 -62 -119 256 55 -133 112 -53 -104
3738a04P2l4J11j43K34j07p9M0k6j36j00L26r0K54l30J39J61l01N05j54R4k91
$$ -104 -32 -66 45 -98 136 29 -50 -10 -36 -172 -272 54 -36 218 -112 27 188 -113 392 238 332 41
3760D1J82r6m3j03J87j31j48L21j28o0j44R7k51K72K36m27P9K24m67M53n3j76
$$ 41 223 127 84 -19 168 37 -111 210 82 22 -122 -25 -276 -4 232 -195 -116 108 -359 94 41 -135
3782a35Q6J54l10J03Q5k8m0K60R4m59K85J16k78K64j28r2o3O9n4K74p9%n9j31
$$ -135 -49 105 -205 -102 -17 -45 -85 175 269 -190 95 211 -67 197 69 -23 -86 -17 -71 203 124 124 65 -66
$$ [...]
8191A82
##END NTUPLES=NMR FID
##END=
