##TITLE=1H_L8-epoxy-3g(f5)
 CDCl3
 8 sc, 
 23.09.2022
##JCAMPDX= 6.0         $$ Bruker NMR JCAMP-DX V2.0
##DATA TYPE= NMR FID
##DATA CLASS= NTUPLES
##ORIGIN= UXNMR, Bruker Analytische Messtechnik GmbH
##OWNER= root
$$ XWIN-NMR		Version 3.5
$$ Fri Sep 23 12:44:54 2022 Russian Standard Time (UT+4h)  she@DPX200
##.OBSERVE FREQUENCY= 200.1313499994
##.OBSERVE NUCLEUS= ^1H
##.DELAY= (6, 6)
##.ACQUISITION MODE= SIMULTANEOUS
##.ACQUISITION SCHEME= undefined
##.AVERAGES= 8
##.DIGITISER RES= 18
##SPECTROMETER/DATA SYSTEM= spect
##.PULSE SEQUENCE= zg30
##.SOLVENT NAME= CDCl3
##.SHIFT REFERENCE= (INTERNAL, CDCl3, 0, 15.7039)
##AUDIT TRAIL= $$ (NUMBER, WHEN, WHO, WHERE, WHAT)
$$ ##TITLE= Audit trail, XWIN-NMR		Version 3.5
$$ ##JCAMPDX= 5.01
$$ ##ORIGIN= Bruker BioSpin GmbH
$$ ##OWNER= she
$$ F:/spectra/data/she/nmr/H-F/1/audita.txt
$$ ##AUDIT TRAIL=  $$ (NUMBER, WHEN, WHO, WHERE, WHAT)
(   1,<2022-09-23 12:43:46.95 +0400>,<she>,<DPX200>,
      <created by zg, POWCHK disabled, PULCHK disabled
       configuration hash MD5:
       00 E9 B6 7A A2 85 ED C7 34 08 36 98 17 FE 4E 26
       data hash MD5: 16K
       E3 5A 3C DC 91 F4 74 2A 9E 9C 3C 5A 14 E1 EF F2>)
$$ ##END=
$$ 
$$ hash MD5
$$ 3D F7 30 0E 1A F7 AF 1E 8A 4D 70 E5 08 39 52 0E
##$RELAX= 
##$RELAX= 
##$RELAX= 
##$RELAX= 
##$RELAX= 
##$RELAX= 
$$ Bruker specific parameters
$$ --------------------------
##$DU= <F:/spectra>
##$EXPNO= 1
##$NAME= <H-F>
##$PROCNO= 1
##$TYPE= <nmr>
##$USER= <she>
##$AMP= (0..31)
100 100 100 100 100 100 100 100 100 100 100 100 100 100 100 100 100 100 
100 100 100 100 100 100 100 100 100 100 100 100 100 100 
##$AQSEQ= 0
##$AQ_mod= 1
##$AUNM= <au_zg>
##$AUTOPOS= <>
##$BF1= 200.13
##$BF2= 200.13
##$BF3= 200.13
##$BF4= 200.13
##$BF5= 200.13
##$BF6= 200.13
##$BF7= 200.13
##$BF8= 200.13
##$BYTORDA= 1
##$CFDGTYP= 0
##$CFRGTYP= 5
##$CHEMSTR= <none>
##$CNST= (0..31)
1 1 145 1 1 1 1 1 1 1 1 1 1 1 1 1 1 1 1 1 1 1 1 1 1 1 1 1 1 1 1 1 
##$CPDPRG= <>
##$CPDPRG1= <>
##$CPDPRG2= <>
##$CPDPRG3= <>
##$CPDPRG4= <mlev>
##$CPDPRG5= <mlev>
##$CPDPRG6= <mlev>
##$CPDPRG7= <mlev>
##$CPDPRG8= <mlev>
##$CPDPRGB= <>
##$CPDPRGT= <>
##$D= (0..31)
0 1.2 0 0 0 0 0 0 0 0.06 0 0.03 0 0 0 0 0.0002 0 0 0 0 0 0 0 0 0 0 0 0 
0 0 0 
##$DATE= 1663922626
##$DBL= (0..7)
120 120 120 120 120 120 120 120 
##$DBP= (0..7)
150 150 150 150 150 150 150 150 
##$DBP07= 0
##$DBPNAM0= <>
##$DBPNAM1= <>
##$DBPNAM2= <>
##$DBPNAM3= <>
##$DBPNAM4= <>
##$DBPNAM5= <>
##$DBPNAM6= <>
##$DBPNAM7= <>
##$DBPOAL= (0..7)
0.5 0.5 0.5 0.5 0.5 0.5 0.5 0.5 
##$DBPOFFS= (0..7)
0 0 0 0 0 0 0 0 
##$DE= 6
##$DECBNUC= <off>
##$DECIM= 32
##$DECNUC= <off>
##$DECSTAT= 4
##$DIGMOD= 1
##$DIGTYP= 9
##$DL= (0..7)
0 120 120 120 120 120 120 120 
##$DP= (0..7)
150 150 150 150 150 150 150 150 
##$DP07= 0
##$DPNAME0= <>
##$DPNAME1= <>
##$DPNAME2= <>
##$DPNAME3= <>
##$DPNAME4= <>
##$DPNAME5= <>
##$DPNAME6= <>
##$DPNAME7= <>
##$DPOAL= (0..7)
0.5 0.5 0.5 0.5 0.5 0.5 0.5 0.5 
##$DPOFFS= (0..7)
0 0 0 0 0 0 0 0 
##$DQDMODE= 0
##$DR= 18
##$DS= 0
$$ [...]
##$SUBNAM2= <"">
##$SUBNAM3= <"">
##$SUBNAM4= <"">
##$SUBNAM5= <"">
##$SUBNAM6= <"">
##$SUBNAM7= <"">
##$SUBNAM8= <"">
##$SUBNAM9= <"">
##$SW= 18.0517283424941
##$SWIBOX= (0..15)
0 0 2 0 0 0 0 0 0 0 0 0 0 0 0 0 
##$SW_h= 3612.71676300578
##$TD= 16384
##$TD0= 1
##$TE= 0
##$TE2= 300
##$TE3= 300
##$TEG= 300
##$TL= (0..7)
0 120 120 120 120 120 120 120 
##$TP= (0..7)
150 150 150 150 150 150 150 150 
##$TP07= 0
##$TPNAME0= <>
##$TPNAME1= <>
##$TPNAME2= <>
##$TPNAME3= <>
##$TPNAME4= <>
##$TPNAME5= <>
##$TPNAME6= <>
##$TPNAME7= <>
##$TPOAL= (0..7)
0.5 0.5 0.5 0.5 0.5 0.5 0.5 0.5 
##$TPOFFS= (0..7)
0 0 0 0 0 0 0 0 
##$TUNHIN= 0
##$TUNHOUT= 0
##$TUNXOUT= 0
##$USERA1= <user>
##$USERA2= <user>
##$USERA3= <user>
##$USERA4= <user>
##$USERA5= <user>
##$V9= 5
##$VALIST= <valist>
##$VCLIST= <CCCCCCCCCCCCCCC>
##$VD= 0
##$VDLIST= <DDDDDDDDDDDDDDD>
##$VPLIST= <PPPPPPPPPPPPPPP>
##$VTLIST= <TTTTTTTTTTTTTTT>
##$WBST= 1024
##$WBSW= 4
##$XGAIN= (0..3)
0 0 0 0 
##$XL= 0
##$YL= 0
##$YMAX_a= 115499
##$YMIN_a= -139641
##$ZGOPTNS= <>
##$ZL1= 120
##$ZL2= 120
##$ZL3= 120
##$ZL4= 120
##$ABSF1= 10
##$ABSF2= 0
##$ABSG= 5
##$ABSL= 3
##$ALPHA= 0
##$AQORDER= 0
##$ASSFAC= 0
##$ASSFACI= 0
##$ASSFACX= 0
##$ASSWID= 0
##$AUNMP= <proc_1d>
##$AZFE= 0.1
##$AZFW= 0.1
##$BCFW= 1
##$BC_mod= 2
##$BYTORDP= 1
##$COROFFS= 0
##$CY= 11.3945322036743
##$DATMOD= 1
##$DC= 2
##$DFILT= <>
##$DTYPP= 0
##$F1P= 2.36226072786647
##$F2P= -0.459571619588291
##$FCOR= 0.5
##$FTSIZE= 0
##$FT_mod= 4
##$GAMMA= 1
##$GB= 0.15
##$INTBC= 1
##$INTSCL= 1
##$ISEN= 128
##$LB= 0.24
##$LEV0= 0
##$LPBIN= 0
##$MAXI= 10000
##$MC2= 0
##$MEAN= 0
##$ME_mod= 0
##$MI= 1.114404
##$NCOEF= 0
##$NC_proc= 0
##$NLEV= 6
##$NOISF1= 3.799351
##$NOISF2= 2.8
##$NSP= 1
##$NTH_PI= 0
##$NZP= 0
##$OFFSET= 15.70392
##$PC= 1
##$PHC0= -18029.56
##$PHC1= 5.400695
##$PH_mod= 1
##$PKNL= yes
##$PPARMOD= 0
##$PSCAL= 0
##$PSIGN= 0
##$REVERSE= no
##$SF= 200.130013532006
##$SI= 16384
##$SIGF1= 3
##$SIGF2= 2
##$SINO= 400
##$SIOLD= 16384
##$SREGLST= <1H.CDCl3>
##$SSB= 0
##$STSI= 0
##$STSR= 0
##$SW_p= 3612.71676300578
##$SYMM= 0
##$S_DEV= 0
##$TDeff= 0
##$TDoff= 0
##$TI= <>
##$TILT= no
##$TM1= 0
##$TM2= 0
##$TOPLEV= 0
##$USERP1= <user>
##$USERP2= <user>
##$USERP3= <user>
##$USERP4= <user>
##$USERP5= <user>
##$WDW= 1
##$XDIM= 8192
##$YMAX_p= 0
##$YMIN_p= 0
$$ End of Bruker specific parameters
$$ ---------------------------------
##NTUPLES= NMR FID
##VAR_NAME=  TIME,          FID/REAL,        FID/IMAG
##SYMBOL=    X,             R,               I
##VAR_TYPE=  INDEPENDENT,   DEPENDENT,       DEPENDENT
##VAR_FORM=  AFFN,          ASDF,            ASDF
##VAR_DIM=   8192,          8192,            8192
##UNITS=     SECONDS,       ARBITRARY UNITS, ARBITRARY UNITS
##FACTOR=    0.0002768,     1,               1
##FIRST=     0,             0,               0
##LAST=      2.2672688,     0,               0
##MIN=       0,             -139641,         0
##MAX=       2.2672688,     115499,          0
$$ Real data points
##PAGE= N=1
##DATA TABLE= (X++(R..R)), XYDATA
$$ [...]
1790A132n36j496J335J45j376P98K79p12j94R23q29m09P32j96l06R77K7n16N71
1809C49K33m17N32J36p05O55J53o87j12M53p57M6M65m10r2M59r1p77M74o4m25
1830e82O5P3k53K35J38l85J28N28o53J13N73M1l15M64O81o06J57K57J6o13J26
1851A88P13l86q01K18R6k20J97K24j074K72R24m78j75J88k2l57L83L25p26P3Q55
1872D17p66p4R91q60m41J314j26n36N48O88j507N91Q80j169l23J216o21j126O06
1891b98L18j007%Q53n1o32N11K65j84O8M06l21J13L9j77L30J05l82R7L41J48o14
1913g2M14Q14q18o7N65l83q65O60O33j740J68O87l66o65P83o1r39R85L98r54N72
1934b51O18q94N67Q37j230m57J449j52j084R90J72j045P60N90r70J25J066j055
$$ plain form
1790 1132 596 -900 435 580 -796 2 281 -431 -625 298 -531 -940 -208 -404 -710 267 294 -222 349
1809 349 582 165 697 833 128 783 936 249 137 590 -167 -121 344 -66 -158 301 210 -567 -93 -157 -582
1830 -582 -517 -444 -697 -462 -324 -709 -581 -53 -706 -593 -20 21 -294 170 851 245 402 659 675 62 188
1851 188 901 515 -286 -68 28 -192 5 229 -845 -573 351 -127 -302 -114 -136 -493 -110 215 -511 -438 417
1872 417 -349 -423 568 -292 -733 581 455 -81 467 1155 -352 239 1119 -50 -373 843 222 -904 -298
1891 -298 20 -987 -987 -134 -185 -817 -306 -41 -225 -157 249 -72 41 80 -97 233 338 -44 53 394 542 -72
1913 -72 342 1156 338 271 836 453 -412 248 881 -859 -691 -4 -370 -1035 -252 -313 -1252 -267 131 -823 -251
1934 -251 367 -527 40 877 -353 -810 639 487 -597 393 565 -480 280 870 -100 25 1091 36
1952C6l18J085r21o10R68J1j185L99O65p31K05L78k94j92Q92k2p26P33K57q46
1972b16J28O98j40n53L07N52p90k63J027m87r63P68M11q09J9O97o40k52O03l25
1992b28q35O91L87o73K59O04j090M26J222j024k06J390l54m36N26M16j064J21
2010A32J175j065o80J230o61n29O04K15j158O74N09j135K71Q30l70p24Q71n30
2028c41n64P29N60j003L19N52k6m87K29K87j69j55M00M01p89M94L33p51Q4M34
2048E37j72p31K87J11o97N79J43m01J44N0j75OL90k26p1L85Q1p39N47J58m52L12
2070F6N29n97K18K86l9m41N67l03j7K43n00k63J20L9m75K26N1m13M58ll90K07
2092d31P11n78J01M68k19j92L06R5m06J87P5%K22J0l63M17j09k33K73j19K77l97
$$ plain form
1952 36 -282 803 -118 -728 240 251 -934 -535 130 -601 -396 -18 -312 -504 388 366 -360 373 630 -216
1972 -216 -88 610 470 -83 224 776 -14 -277 750 263 -700 68 479 -330 -311 386 -254 -506 97 -228
1992 -228 -1063 -372 15 -658 -399 205 -885 -459 763 -261 -467 923 569 133 659 1075 11 132
2010 132 1307 242 -438 792 131 -398 206 421 -737 -63 446 -689 -418 412 42 -682 189 -341
2028 -341 -905 -176 384 -619 -300 252 226 -261 -32 255 86 -69 331 732 -57 437 770 19 103 537
2048 537 365 -366 -79 32 -665 -86 57 -344 -200 -150 -325 -319 71 -155 -226 159 240 -499 48 206 -246 66
2070 66 595 -2 216 502 463 22 589 286 269 512 12 -251 -131 -92 -567 -341 -290 -703 -245 -248 -638 -431
2092 -431 280 -298 -197 271 52 -140 166 261 -145 42 117 117 339 349 -14 403 294 61 334 215 492 95
2114I5m14K63R6m05K41K47q23K91L46l53n6L96j12l05O05L05o37J34N78k17m72
2135a97N74q6m16M91R7n45L2N44m50J38K82l51q0L57n82m57N43J71q77N44L51
2156H3q45J31Q33o45N8O60l83J3M37J4m67M50K01n79L73Q0j71j09L5%k28K04O7
2179B12m32K58K12n50J42k09K35l36L63J60k12j37L55k40k57M61J27l94K77O91
2199G26m14M6K24k52l89M69J11n78K19L95p63m4Q38p60n71J018k04r56J057j37
2219C5o20J03Q86p93l49J255m82o61R25K4q21Q19M79p16m3P69m71m03N77%o00
2240h7L49M38r75J23N34o64l42O46J19q19K63O94q42K3N92m5k27K31K93o98M20
2261B6L57m05Q1K99k52j15M07j49j49L0M85o03k87M82k57n49R75k22q55M30N81
$$ plain form
2114 95 -319 -56 40 -365 -124 123 -700 -409 -63 -416 -472 -76 -188 -493 112 417 -220 -86 492 275 -197
2135 -197 377 291 -125 366 463 -82 -50 494 44 182 464 113 33 390 -192 -649 -106 65 -812 -268 83
2156 83 -762 -631 202 -443 -385 275 -108 -95 342 356 -111 339 540 -39 334 414 243 134 169 169 -59 145 212
2179 212 -220 38 250 -300 -158 -367 -132 -468 -105 55 -157 -294 61 -179 -436 25 152 -242 35 726
2199 726 312 358 582 330 -59 410 521 -57 162 557 -206 -250 588 -172 -743 275 71 -885 172 35
2219 35 -585 -482 404 -389 -738 517 35 -626 299 323 -498 321 800 84 41 810 339 -64 513 513 -87
2240 -87 262 700 -275 -152 382 -282 -624 22 141 -678 -415 279 -563 -540 52 7 -220 11 304 -394 26
2261 26 383 -22 59 358 106 -9 398 249 100 130 615 12 -275 207 -50 -599 376 154 -701 -271 310
2282C10r06J93P11p87j68R55m59m18N89M99o47L54P0n1l66M36lj20J83J74k60
2303B89k36L60l57m4N8n9j27K41k87j87J85K68n34Q9p4L63l60K86k4J40j74K15
2325C1J4L2J33r0k08P11l30j73J75J28l71j15K63j33k67L80l81j35L09j51l06
2346d84K94L8j50J97K4m64L12K9J88j1P0K04o70Q06O9m57J76L27k88l32L15K60
2368D53m17J37k1m5l60J45J4j67K75M1j99q7k7K72k33N00m31N3J1N09n72R5K58
2391B04k3n1L37k8l56m1L67l64j49L35j34j38J96j73j68n1j89K20J49j93k69L90
2413a29Q9j94R9j29k91M96L03k20j56M61k64q1L08Ol72K83j4J69K4O0m00K07k4
2436B31m66R8M62k25m87L39L80o35j09N97m73J18lj0k02N69P5l61pK70m02J89
$$ plain form
2282 310 -596 -403 308 -479 -647 308 -151 -569 20 519 -128 226 296 245 -121 315 312 192 375 549 289
2303 289 53 413 56 12 70 11 -116 125 -162 -349 -164 104 -430 -341 -415 -52 -412 -126 -150 -10 -184 31
2325 31 45 77 210 120 -88 623 293 120 295 423 52 -63 200 67 -200 180 -201 -336 -27 -178 -484
2346 -484 -190 -152 -302 -105 -81 -545 -233 -204 -16 -27 43 247 -423 383 452 -5 171 498 210 -122 193 453
2368 453 36 173 152 107 -253 -108 -94 -261 14 55 -144 -231 -258 14 -219 281 -150 -97 -86 423 -149 -54 204
2391 204 181 130 467 439 83 42 409 45 -104 231 97 -41 155 -18 -186 -237 -426 -206 -57 -250 -519 -129
2413 -129 -40 -234 -135 -264 -555 -59 244 24 -132 329 65 -16 292 298 -74 209 195 364 388 448 48 255 231
2436 231 -235 -137 325 100 -387 -48 332 -303 -412 185 -288 -170 -173 -183 -385 184 259 -102 -109 161 -241 -52
2458e2L32O9l45L63ml90L53P9o63K55K14l17j20n5K13j32K76K13n99j42M40J38
2480A26m83J67P25q77J70N79j75k09L0K18n46O32L43k97m16P65o72p9K74j51o00
2501d76N95K95p55J37M02n04k66O55j21l95L62J86m75K1M94k68j34L40N7l03M34
2522B81J60m53K49M43o11J7M81j95k73J07L27p86N9J62j19k68N64j02m59M70J35
2543A89o12L05K85m37j34O05m7k33J48m9j34K55L12k94K71q8j98j29K71k02n8
2564B6L11k68m93J19L17n6l51M27k92o3K19j5l43N24j63j11k3K40J39L9j85J91
2586A89J59l20L30j01q2J85N0j93j66J35k53J33J41k80j16L96j28m54M15K22n58
2607b96J52J80l85J75J90j17m0L50j32k96M68j7j74J34L40m51k16O09j95j74P3
$$ plain form
2458 -52 280 349 4 367 363 -27 326 405 -258 -3 211 -106 -226 -281 -68 -200 76 289 -310 -452 -12 126
2480 126 -357 -190 535 -342 -172 407 232 23 53 271 -275 357 700 403 -13 752 80 1 275 124 -476
2501 -476 119 414 -341 -204 198 -306 -572 83 -38 -433 -71 115 -360 -339 155 -113 -247 93 150 -153 281
2522 281 441 -12 237 680 69 86 567 372 99 206 533 -253 -194 -32 -151 -419 145 43 -416 54 189
2543 189 -423 -118 167 -270 -404 201 154 -79 69 20 -114 141 453 159 430 342 144 15 286 84 26
2564 26 337 69 -424 -305 12 -44 -395 32 -260 -323 -104 -119 -462 62 -101 -212 -235 5 144 183 -2 189
2586 189 348 28 358 257 175 360 410 217 51 186 -67 66 207 -73 -189 207 79 -375 40 262 -296
2607 -296 -144 36 -349 -174 16 -101 -141 209 77 -219 249 232 58 192 532 81 -135 474 279 105 178
2628A78k25j5j46J92o6j74J14r1j0L38j88m6q0R0p0J68J2J45k95L70k70J13n3
2651iK86j65J46k19J82J64k70J67l64j26K35J80m52OJ79j60P4mJ7Q9r7o1K94k61
2675a69J46Or3L0J70J14J3J56l09K60q3J10k53j02K94j10p8Q4R4m58K39k43j28
2698c10L40n4o9k68K69p8m7o7J18o2l54M37J84l75K42P4J2j97K18R8J07j9J28
2721C27J0k4j98j30K45O3m09p5O7K71l32J14K05m39O2K82k3k10Q7L22k67r6J42
2744fj75J80K59k78j08N19k78j03j2P7j11J54L9K9o5j75l18J87Q3j15k4n1L35
2767D3l80k4L35k7l60N22k38m1K85M8k17J16P5O0r6J52K6k92M17n31K68j72J93
2790A62j95J83m7L9k89K57L5k05j7K7j85J08LJ12k47K43P3nJ79k81P3k6K07j34
$$ plain form
2628 178 -47 -62 -208 -16 -82 -256 -142 -233 -243 95 -93 -139 -219 -129 -199 -31 -19 126 -169 201 -69 44 -9
2651 -9 277 112 258 39 221 385 115 282 -82 -208 27 207 -245 -239 -60 -220 -146 -150 -133 -44 -141 -202 92 -169
2675 -169 -23 -17 -110 -80 90 204 217 373 64 324 241 351 98 -4 290 180 102 186 280 -178 61 -182 -310
2698 -310 30 -24 -93 -361 -92 -170 -217 -284 -166 -228 -582 -145 39 -336 -94 -20 -8 -205 13 111 218 199 327
2721 327 337 313 115 -15 230 293 -116 -191 -124 147 -185 -71 134 -305 -243 39 16 -194 -107 215 -52 -148 -6
2744 -6 -181 -1 258 -20 -128 391 113 10 -2 75 -36 118 157 186 121 -54 -372 -185 -102 -217 -241 -292 43
2767 43 -337 -361 -26 -53 -413 109 -129 -170 115 163 -54 62 137 197 101 253 279 -13 404 -127 141 -31 162
2790 162 -33 150 103 142 -147 110 145 -60 -77 -50 -235 -127 -124 -12 -259 -16 57 52 231 -50 23 -3 204 70
2814G0k4j08J93j04j58M36o4k51K51r8k17J06o3k81K43J76m29L59q5j40j12L80
2836H0p5j88K08j2n0O7J85k77L26L5j89P0J86o3n05J23K65k78q2K22k29J93j19
2859a07K1l00O8L71k16J00k24M65m88J33J17j05J58O2j80J6L5K61k72j1L78j35
2881A47J38k02K6j05K00j53j36J58p0j69J05J99k01p7M47j47l72M5O5J21l38O31
2903C12l65N4o9J42j10k24K18K22r6j85K80j31J39j66J77M2l03n4K37k49K09j57
2925g7J86j60j72K68k11R3o2K34p7k27M07%M1m58N11Pj58N0j39J20j09J0J36j60
2949E3J32l15L5K44j52k8r4L47L4m24j84M46j25l05K88m7l8K2Q7l0j00K98lj18
2973B3Qq6M7J70N8l26J27J46k83K99k83K50k9p3Kk01l16O12l24J41N9j65N7J04
$$ plain form
2814 70 46 -62 131 27 -131 305 241 -10 241 143 -74 32 -31 -312 -69 107 -322 37 -48 -188 -300 80
2836 80 5 -183 25 13 -37 30 215 -62 264 299 110 180 366 303 -202 -79 186 -92 -174 48 -181 12 -107
2859 -107 -86 -386 -318 53 -163 -63 -287 178 -310 -177 -60 -165 -7 55 -125 -109 -74 187 -85 -96 282 147
2881 147 285 83 109 4 204 51 -85 73 3 -166 -61 138 -63 -140 307 160 -212 -167 -102 19 -319 312
2903 312 -53 1 -68 74 -36 -260 -42 180 84 -101 179 48 187 21 198 240 -63 -117 120 -129 80 -77
2925 -77 109 -51 -223 45 -166 -73 -135 99 22 -205 202 202 243 -215 296 303 145 195 56 176 67 77 213 53
2949 53 185 -130 -95 149 -3 -31 -125 222 256 -168 -352 94 -31 -336 -48 -95 -133 -111 -24 -54 -154 144 141 23
2973 23 31 -55 -8 162 220 -106 21 167 -116 183 -100 150 121 48 50 -151 -467 145 -179 -38 21 -144 -87 17
2997A7k16K25j26N5lp5J86l70L67p8K04l35M06k21J07j01J95p1k96K10J65m16
3019a71L47k56J05l30L61j1k35M6Q3k78J54L48l22J7K04k61M52j63p9m9K22P9
3041B63k08L18k25r1k72L38o4k3J73k6n0m3K12n52R0K73k48L5R3k06J84R9j58
3064h8j01j3N08m17k34L30Q5O3P1l8k50J97p3q7K23k25K77l10L77k06J76l99P1
3087f3j08m0L10k60L8K69j97l7j49L60p0R1k1J32m05J13oJ48j12k2M4l2Nj21K87
3112A54M8j91Qj29j0l4j40K73K0k39K13M87p22L1K91p6M8j84J5p4L28l40R9L8
3136h6M2j18J32K14k99L71n7O2k06J60l12K21K6k36J40l5p3J19l11J10j32K88
3158B0o1l6N5K8K3j35K54p9K33l34j63L21l4l1k38j78M37j59j1L5Q1L15n32M07
$$ plain form
2997 17 -199 26 -100 -45 -48 -123 63 -307 60 -18 186 -149 257 36 143 42 237 166 -130 80 245 -171
3019 -171 176 -80 25 -305 56 45 -190 -144 -61 -339 -185 163 -159 -142 62 -199 253 90 11 -38 184 263
3041 263 55 373 148 57 -215 123 59 36 209 183 133 90 302 -250 -160 113 -135 -100 -7 -213 -29 70 -88
3064 -88 -189 -202 306 -111 -345 -15 70 133 204 166 -84 113 40 -47 176 -49 228 -82 295 89 265 -134 -63
3087 -63 -171 -211 99 -161 -123 146 -51 -88 -237 123 53 144 123 255 -150 -37 -43 105 -7 -29 15 -17 -12 -133 154
3112 154 202 11 19 -110 -120 -154 -294 -21 -1 -240 -27 460 -262 -231 60 -16 32 -152 -137 -211 117 -223 -124 -86
3136 -86 -44 -162 -30 184 -115 256 199 261 55 215 -97 124 150 -86 54 19 -54 65 -246 -136 -268 20
3158 20 -41 -77 -22 6 29 -106 148 69 302 -32 -195 126 92 61 -177 -355 82 -77 -88 -53 28 343 -189 218
3182B18Pj93j12K07j51j28J50j94M8m9K23j38O82p89P9J37L49j07l82Q7J51l6
3204E9O6K7k55k9K16Jj49J66j48L1M8m7O3k80K54j10K82j61k74N0J92n5R9m6k1
3229b1J53o7J20k15L65k02M3M1Op5j70L95n04R0K17j59N1j17J13q0JMj85M85l79
3254i0L13k57o9J48j07M9K4K3k38J57l2K41o7K15m5j34q3k1M3M6j10p6L11k38
3278CJ09k93K15n8k5N8p5q1J82k16k2J04J19j73J68J46k18j91J94r2K05n0j6O6
3302E9m9J22r5J6o3K31k7l47K67J65l00j3j93Q5k0K01j80k04M21l1l1J51l3l66
3326b34K80k05j23N30m22J54J51j13O8j57Q6N1m5j64L72k74q5J94p6l15K61l0
3348i6J17M5k48M33l00k08K23l07L08j58K21l6K52R9m90J15k53L01m7L9j37K22
$$ plain form
3182 218 225 32 -80 127 -24 -152 -2 -196 -148 -197 26 -112 570 -219 -140 -3 346 239 -143 -56 95 59
3204 59 125 152 -103 -132 84 85 -64 102 -46 -15 33 -14 49 -231 23 -87 195 34 -240 -190 2 -53 46 0 -21
3229 -21 132 65 185 -30 335 133 176 217 223 148 -22 373 -131 -41 176 17 68 -49 64 -16 -15 -11 -196 289 -90
3254 -90 223 -34 -103 45 -62 -13 11 34 -204 -47 -79 162 95 310 265 131 48 27 70 116 6 -70 241 3
3278 3 112 -181 34 -24 -49 9 -66 -147 35 -181 -203 -99 20 -153 15 161 -57 -248 -54 -146 59 9 -7 59
3302 59 10 132 37 53 -10 221 194 -153 114 279 -21 -34 -227 -142 -162 39 -141 -345 76 45 14 165 132 -234
3326 -234 46 -159 -282 248 -174 -20 131 18 86 -71 15 66 21 -143 229 -45 -130 64 -12 -327 -66 -96
3348 -96 21 66 -182 251 -49 -257 -34 -341 -33 -191 30 -6 246 345 -145 -30 -283 18 -29 10 -127 95
3370I5P5K1j60K5J68l2qj85N3j41K29n1%j47J09Ok77n9K10Q9o4J85k77N3J36r
3396D4J15l45m6K23q5j96L22k8K81k34j72j6K01k39J44J55k30L46m05K92l71J94
3418e0k6j1m1m5L12k54K62p8J13q5k69J90j8J37O6j67n0J17m8j65L1J18J23j19
3442D3l4p6Q9N7j06o3k25M09k15M7PJ41k04P8m5J27kj24K48l57L11R4p9k97L48
3467A72j40K43j47j61m0QM64n97N3K63m06K93j14KJ70j53L6RKP8P3j9k61J58k12
3492b26K94p7J70k5j67P5K11m85K25j39J24J31r8l5J8j6J13j38l72M83k65J75
3514b4R0Q5L5j33Mm5o7M5j63K00oJ68l5l78J79LK40j87k8K78j14k61M1N0p6J28
3540B9O8r8j47o8J11KJ1m7K62j30L2j65J57q5M7K18p5l10Q9O7J47J33l34O9N6
$$ plain form
3370 95 170 191 31 56 224 192 184 -1 52 -89 140 89 89 -58 51 57 -220 -279 -69 20 -44 141 -136 -83 53 44
3396 44 159 -186 -232 -9 -94 -290 32 4 285 51 -121 -137 64 -175 -31 124 -106 240 -165 127 -244 -50
3418 -50 -76 -87 -128 -173 139 -115 147 69 182 97 -172 18 0 137 203 36 -14 103 55 -110 -79 39 162 43
3442 43 9 -67 22 79 -27 -90 -315 94 -121 -74 -67 74 -130 -52 -97 30 28 -96 152 -205 106 200 121 -176 172
3467 172 32 275 128 -33 -73 -65 399 -198 -145 118 -288 5 -109 -107 63 -90 -54 -45 -43 35 108 89 -172 -14 -226
3492 -226 68 -9 161 136 -31 44 255 -230 -5 -144 -20 111 13 -22 -4 -20 93 -45 -417 66 -199 -24
3514 -24 66 151 186 53 57 12 -55 -10 -173 27 21 189 154 -224 -45 -42 198 11 -17 261 147 -114 -73 -23 -99 29
3540 29 97 -1 -148 -216 -105 -103 -92 -139 123 -7 25 -140 17 -68 -21 197 122 -188 -99 -32 115 248 -86 -17 39
3565C9N3n1o7n8M8K73k13K03k19j93K08J5q5N7Q2k57J71K14o7m00K40P5j19N9
3589Hn2r9K32l0o7K52m20J59J88kk05kM2NKQ6k69J90j73J50j6J0J62l16J68j19
3615a16k9K0J20j5J50j7r5p9j31M08n3N8m03J74j45K67J79l76J3J7J4m2L2j44
3639a93K30j61J34p6r8K40J7J4M0l34J38j05K06k8o1p2J86Q1J62m30R8k8K43j68
3663C5J12k63J58j81O4J96o8J35J49n28J69J31l47P0rJ87M4n7j08OK06qk48J01
3687e4L47k99j04K11k03P7L73l28K17p6o03K47J17J8J63q8KJ1n8R3P3k30q2J30
3711d6r3K6k0J32j3N3R9K5o8J51l07J86M4L4j8k59K6J37k43L21J22j33N6r6j46
3736c0J31O5k62R3o9k21K03J68K0J96l10m8P4j78K34j37Q2m5j73K04Q9k23J88
$$ plain form
3565 39 92 41 -26 -84 -36 237 24 227 8 -185 23 38 -47 10 92 -165 6 220 153 -247 -7 68 -51 8
3589 8 -44 -143 89 59 -8 244 -176 -17 171 169 -36 -38 4 9 11 97 -172 18 -155 -5 -21 -11 151 -165 3 -116
3615 -116 -145 -125 -5 -20 130 113 18 -61 -192 216 163 221 -182 -8 -153 114 293 -83 -70 -53 -39 -81 -49 -193
3639 -193 37 -124 10 -66 -164 76 93 107 147 -187 -49 -154 52 24 -37 -109 77 158 320 -110 -12 -40 203 35
3663 35 147 -116 42 -139 -75 121 53 188 337 -191 -22 109 -238 -168 -177 10 54 -3 -111 -105 101 93 -155 -54
3687 -54 293 -6 -110 101 -102 -25 348 20 237 161 -442 -195 -78 -60 103 15 17 28 -30 63 136 -94 -176 -46
3711 -46 -139 -113 -133 -1 -14 39 138 163 95 246 -61 125 169 203 185 -74 -48 89 -154 167 289 156 212 116 -30
3736 -30 101 166 -96 -3 -72 -293 -90 78 98 294 -16 -64 10 -168 66 -71 11 -34 -207 -3 86 -137 51
3759E1J36j07K27j98j50M4K74m12J98n5J1j24K4K03l14L37m5m99N60N4j60j55
3781a00p0L70k8m7j51k2o8K63J47l04J36J09j61j99K90j42j21J90j52q5K94j31
3803A8Lj41K61j84j20J73j42j99P5K90r7N0L5n9Ok1L16j73o2k8R3q8l0J77q0l39
3829b66j14L12L09k68N3J67j0l00oJ18j58N1j27K17%j67L44lpj12l57M74j97Q1
3853C4k28L21N4k85J74m4k84M11k65J04o2L22k26J66k12J94j59J82j52j30J69
3874H4m0Q5p3m41J45M07l15O1k1K7J51K08n41N46k75J63j86kj58K24j60j5J87
3897F1J9k61J0M33k02j57J36l9j34O4j49J19OJ40N2k07j88L50o6J04m38J70M4
3920a33J18K09R2p2k64J23L3k4k96j8L47o8P9j90k37L77m0J95j27q0l3J6j58K89
$$ plain form
3759 51 187 80 307 109 -41 3 277 -135 63 8 19 -105 -81 122 -192 145 100 -399 161 215 55 -100
3781 -100 -170 200 172 125 -26 -48 -116 147 294 -10 126 235 74 -125 165 23 -98 92 -60 -145 149 18
3803 18 21 -120 141 -43 -163 10 -132 -331 -256 34 -63 -13 22 -37 -31 -52 264 91 29 1 94 6 -24 153 73 -266
3829 -266 -380 -68 241 -27 26 193 183 -117 -123 -5 -163 -112 -239 -22 -22 -189 155 152 145 33 -324 150 -47 34
3853 34 -194 127 181 -104 70 26 -258 153 -112 -8 -70 252 26 192 -20 174 15 197 45 -85 84
3874 84 44 129 56 -385 -240 167 -148 -87 -108 -81 70 278 -263 283 8 171 -15 -17 -175 49 -111 -126 61
3897 61 80 -181 -171 262 60 -97 39 0 -134 -70 -219 -100 -94 46 98 -109 -297 53 -13 91 -347 -177 -133
3920 -133 -15 194 286 214 -50 73 106 82 -214 -232 115 47 126 -64 -301 76 36 231 104 24 -9 7 -151 138
3944A38J27m52q0L52j04j75j07L76Q2l83M04l10K2M9MRJ73o6n6j40J62O2j12J88
3968A63k19N8nO5k97L33k41P9K00k01L20l93K47R4j80J19Ql05J33r2K05j9j10
3991c8l0J49pp4r2J34k22K63p0j24Q6R1J49l94J91j78n7K99M9m1Om60M56j18j6
4016d8P6k02J51K36l48K61J00j91j90Q2R6r6rJJ72j50o3Q2J10j21J13p8j80J94
4040bJ24k75K5l2N7J38J73j11j02L7J8Q9J44j95M9j10p5J08j00J28j31Q0k7k23
4064b13K81P1L55m24k14k10J57J40J77l45K28J42M8l50L5J74L2K5r7J52N9n8k33
4087f8J59K31j95m0m3M5j10M9l24L53r0P3k16J28m2m1K35j73J88j00J5M2j48N9
4111a3j11K83n1j94K41k3k25J12KN2r6L00l64L30k39MO6j93K48l16L19j70j93
$$ plain form
3944 138 265 -187 -267 85 -19 -194 -301 75 157 -226 178 -132 -110 -61 -57 -48 125 59 3 -137 25 87 -25 163
3968 163 -56 2 -3 62 -235 98 -143 -64 136 -65 255 -138 109 203 23 142 150 -155 -22 -114 91 72 -38
3991 -38 -68 81 74 0 -92 42 -180 83 13 -111 -25 66 215 -179 12 -166 -223 76 125 84 90 -370 86 -32 -48
4016 -48 28 -174 -23 213 -135 126 226 35 -155 -73 23 -73 -82 -81 91 -59 -122 -40 70 -51 62 -16 -196 -2
4040 -2 122 -153 -128 -160 -103 35 208 97 -5 32 50 139 283 88 137 27 -48 60 -40 88 -43 37 10 -213
4064 -213 68 139 494 70 -144 -354 -197 -57 120 -225 3 145 193 -157 -122 52 84 109 12 164 223 165 -68
4087 -68 91 322 127 87 44 89 -21 28 -296 57 -33 40 -176 -48 -90 -131 104 -69 119 19 34 76 -72 -13
4111 -13 -124 159 108 -86 155 132 -93 19 21 73 -23 277 -87 243 4 8 74 -119 129 -187 132 -38 -231
4134b31L46k8k93J61J52j26n7J17K59k28J74j35o6%n3K06j56r1O4n3O0r3Pk4K15
4159A27l07J14O4Mj52j48R2K07J21j97j75K24J74j57l1m9J46n0M8k59M53q5p4
4182I0l5k5j77K60j53k8j07L28N8Ln23K57J4q4J30K8Qj15j11K36k05K2j92J86
4206a35Q9j23L28l45J06L48kj54l04K58J9n5J77k83R7QqL1j00J49k48j19N31m79
4230b14J72J0r8J41J2K47l06l06J81K51j01M3j67L10k69K00j82n1J51o7K42n6
4252A43j46m5J50l66J04j5j68L21L8M9OK2k06K72L3k00n7JpK61j90K18j87q8J59
4277A02k18N8N5K18j20j43rJ86nj34L9j6k63K41o7K8N7J59l53P4J14o9J52j10
4301b4p0J32P7j0K1r5j16o8J83K7k3q9J28k30K53k15J31O6K3j04J37j87K44j10
$$ plain form
4134 -231 115 87 -206 -45 107 -19 -76 41 300 72 246 111 45 45 -8 198 42 -49 15 -38 22 -71 -64 -88 127
4159 127 -180 -66 -2 2 -150 -298 -206 1 122 -75 -250 -26 148 -9 -40 -89 57 7 55 -204 249 164 90
4182 90 55 30 -147 113 -40 -68 -175 153 211 214 -309 -52 -38 -122 8 36 44 -71 -182 54 -151 -129 -321 -135
4206 -135 -46 -169 159 -186 -80 268 266 112 -192 66 85 30 207 -76 21 29 21 52 -48 101 -147 -266 265 -214
4230 -214 -42 -32 -130 11 23 270 -36 -342 -161 90 -11 32 -135 175 -94 106 -76 -127 24 -43 199 143
4252 143 -3 -48 102 -264 -160 -175 -343 -22 16 65 71 93 -113 159 192 -8 -65 -64 -71 190 0 218 31 -57 102
4277 102 -116 -58 -3 215 95 -48 -57 129 124 -10 29 13 -250 -9 -76 -48 9 168 -185 -111 3 -66 86 -24
4301 -24 -94 38 115 105 126 31 -85 -153 30 57 34 -55 73 -157 96 -119 12 78 101 -3 134 -53 191 81
4325H1J7j9k95J34J41j32KJ22k14L51j64j09N26l45L0J19j26L0r0P9q6k28J12
4348f4J71M0k27J57N8l73R1j16K55NJ12k03m8J48K9k49Q4ML02j29l8N5l57M00
4372A07n9o7Q7l6J62l38L94l72J69r3l49O59l21p8k0m1P8j61O0J14j15J43J9Q8
4396C0p8RQK10j08Rk41M18l52N0J22l57M80j96j98J15K53m2k66J54mk75K73k32
4420b18N2K30o0j62J35J94k66KK67j23k5MJ98k75J06P7k02L2J51j16N9L4N2r3
4444E3J48m19L06k47Q8j57M71m23P8J02j46L11r8k63J87K86l75J39r4j41M0J58
4466DQ7Rj30P3Q5l60N75l23R8k17j00K04j2J47k85L58o6j03N2j49R6j41L41k69
4490b6p1J06J84k07j3j52K31j4q7J27p3L5j08j10K36r3J06O0J62k85j11k5L08
$$ plain form
4325 81 98 79 -216 -82 59 -73 -71 51 -163 188 24 -85 441 96 126 245 119 149 59 138 52 -176 -64
4348 -64 107 147 -80 77 135 -238 -147 -263 -8 -3 109 -94 -142 6 35 -214 -130 -126 176 47 9 64 -293 107
4372 107 48 -19 68 32 194 -144 250 -122 47 -46 -395 264 -57 -135 -155 -196 -118 -279 -219 -105 -220 -77 -58 30
4396 30 -48 -39 -31 179 71 80 -161 257 -95 -45 77 -280 200 4 -194 -79 174 132 -134 20 16 -259 14 -218
4420 -218 -166 64 4 -158 -23 171 -95 -93 174 51 26 30 228 -47 59 136 -66 -34 117 1 60 94 146 53
4444 53 201 -218 88 -159 -71 -228 243 -180 -102 0 -146 165 67 -196 -9 277 -98 41 -53 -194 -154 4
4466 4 91 100 -30 43 128 -232 343 20 118 -99 -199 5 -7 140 -145 213 147 44 96 -53 43 -98 243 -26
4490 -26 -97 9 193 -14 -27 -179 52 38 -49 78 5 40 -68 -178 58 -35 71 131 293 8 -103 -128 180
4513A80n77L36p5Q3j54K24J12j52k1K04R9l60J79R9l9N6j02r7L17k33m7j12R9
4536A9J91k02R8k77J60L07k09k34o0P0K43l56j00J47K34l6j84O3R5R5j20K44l89
4559b01K30J65j3j01k0Pj43J80l7k12N29m30n6K00j0m7o3MP4L4K71m25m7p9L74
4584A84l10J71Q6l25J73j22P2J74n3J2N6k6j64mN3k7N5p8R2N9p6P0j41J98k57
4609a28LK08j0k26K81k08R5p5j2k58L89m4J72r3j07l76M68J53k67o1k0L01j70
4632A5K07J01k27j73J67n4p8J74M5j84J46r0m02L34k22L22j30m8j20K85j49K66
4654A85j98l7j2J8J71n1Nm8j62L43j41k1k5l8j13N8l1j56J97j09J58J4N5M6j83
4679g5p9J06r5M58l05J1k73J71J13q2k0kK72j98K12k69L0L21j07j64l0k2L0m2
$$ plain form
4513 180 -397 -61 -136 -53 -207 17 129 -23 -44 160 259 -101 78 177 138 194 92 -5 312 79 32 -80 19
4536 19 210 8 106 -171 -11 296 87 -147 -207 -137 106 -250 -350 -203 31 -5 -189 -126 -31 64 -56 188 -201
4559 -201 29 194 181 80 60 67 -76 104 67 -145 384 -46 -102 98 88 41 -22 -18 56 90 361 -64 -111 -190 184
4584 184 -126 45 131 -194 -21 -143 -71 103 50 62 118 92 -72 -76 -23 -50 5 -73 19 78 2 72 -69 129 -128
4609 -128 -125 83 73 -153 128 -80 15 -60 -72 -330 59 15 187 94 -13 -389 79 232 -35 -96 -116 185 15
4632 15 222 323 96 -77 90 36 -42 132 177 -7 139 49 -353 -19 -241 81 -49 -97 -217 68 -81 185
4654 185 -13 -50 -62 -44 127 76 81 33 -129 214 73 52 27 -11 -124 -66 -97 -253 -56 -165 -7 7 62 108 -75
4679 -75 -154 -48 -143 315 10 21 -252 -81 32 -50 -70 -72 200 2 214 -55 -25 296 189 25 -5 -27 3 -39
4703c9J39j44j87J01L8m9%M8p5J26R2o5j47K35j0p3l7K70k00K17j59k27K76j28
4727Bp4K35l52L13k62K38npn0o5o8j0J71J3K31l08K40l50R8kK02l07oJ08oQ6j57
4754i2M2l9j60L40m0J34k55O1L4J3j07j02J29k14L43j44K64p3l95J98JO4o3J02
4778D1j29J46k03J43j25LL6%J27N7j95K59k6j69J76O0J95j53l42o9L0l0K59q8
4802Cr6L81n07J28J43l49K18j0K6p2r0K16J13p6K1L1j21R5J31p8k5j17K9P0J45
4827B09k35n3J78k23K71R4k78j22M34j86k79K60k67K46K1k18L0R6r1R2L6K4j37
4850i8l8K3J81j03K80j83j9j94K59j75K53M1j88M2l4n5p5OK04l12J62m2q4M77
4874C28k98q2m7J57j19K60r2n9p4J95P9n14L52j3m1j96P9n6J76J85o32N12p7%
$$ plain form
4703 -39 100 -44 -231 -130 -92 -141 -141 -93 -168 -42 50 -15 -162 73 63 -10 -47 223 23 240 81 -146 130 2
4727 2 -72 163 -189 124 -138 100 95 88 38 -27 -95 -105 66 79 310 2 242 -108 -10 -12 190 -117 -123 -15 -21 65 -92
4754 -92 -50 -89 -249 91 51 185 -70 -9 25 38 -69 -171 -42 -256 87 -57 207 134 -261 -63 -62 2 -61 41
4778 41 -88 58 -145 -2 -127 -124 -88 -88 39 96 -99 160 134 -35 141 201 396 243 -99 -168 -138 -168 91 3
4802 3 -93 288 -219 -91 52 -297 -79 -89 -63 -135 -225 -9 104 28 49 80 -41 54 185 107 82 -35 -6 64 209
4827 209 -26 -79 99 -124 147 241 -37 -159 275 89 -190 70 -197 49 70 -148 -118 -22 -113 -21 15 39 -98
4850 -98 -136 -113 68 -35 245 62 43 -151 108 -67 186 227 39 81 47 -8 -83 -77 127 -185 -23 -65 -149 328
4874 328 30 -52 -99 58 -61 199 107 48 -26 169 248 -266 86 73 32 -164 -85 -141 35 220 -412 100 23 23
4898B3r8o3K56j51j27K65j73m8Q1L01l43K42l19M37l06O7J83k45q6K51Nk43J02
4921A1p7lK96j97J76K3l21L53j58m4j88J09p7Q8o4j81J74Q3r4k9J31j79K24l82
4945c26N77l58J17L87m27r7M8O1R9J61j5k00J37q0k82L71k18O3K67n97L55q9J55
4968A09J3Qn1N1j25l3k19J22J26k03Q5R0j51L00k25J29N2j53k1LR5q2k3J81Q3
4993A61q5R5k41O0J60j72n8K75n34K11k5R1P7j10K32k44r7J46K73j31k15M2J0
5016g9o8O1K40j17k5M8j72o5L48l66J28o8K46q1K9p6Q3j52rP0q5J52j04J06j51
5041a07j9J02J56l20K64p8O7m8O8q8Jj5nQ6p6l1o0M14j68j71QN8j6m0l5M2Q6j96
5069a21K90j98N7q9Q9K8O3j79J96j64j76K71j09K21j44j11K73k74K02P0j10r1
$$ plain form
4898 23 -75 -138 118 -33 -160 105 -68 -116 -35 266 -77 165 -154 283 -23 44 227 -18 -104 147 152 -91 11
4921 11 -66 -69 227 30 206 229 -92 261 103 59 -129 -20 -97 -9 -73 -254 -80 3 -91 -120 11 -168 56 -326
4945 -326 251 -107 10 397 -30 -127 -79 -18 81 242 227 27 164 84 -198 173 -45 18 285 -312 43 -46 109
4968 109 122 130 79 130 5 -28 -247 -125 1 -202 -117 -27 -178 122 -103 26 78 -75 -96 -93 2 -80 -103 78 161
4993 161 76 171 -70 -10 150 -22 -80 195 -339 -128 -153 -62 15 -95 137 -107 -204 -58 215 84 -131 -89 -79
5016 -79 -147 -86 154 37 12 60 -112 -177 171 -195 -67 -135 111 30 59 -17 66 -86 -95 -25 -110 42 -62 44 -107
5041 -107 -126 -24 132 -188 76 -2 65 17 85 -3 -2 -17 -22 64 -12 -43 -103 311 143 -28 -20 38 22 -18 -53 -11 75 -121
5069 -121 169 -29 28 -61 28 56 119 -60 136 -28 -204 67 -42 179 35 -76 197 -77 125 195 85 -6
5091fm3j35J01J91k52j23Q5j23L8L61j06j03M7%K28k22J27j09j09P0K25j76K38
5114B04k68J71p6j82J36Lr8K06j51m7n9N7k5K39k10L2K09l11J45k35J83o1K9J08
5138al17pL65J08j98O7pM28l73N4q7rQ0o3j9n4mKk94J72J91j26K7OK30k11J10
5165G0p2J16j1q0r4m3J4J1l9J19J35j36Oj07kL48r2j93J51o3K84l96K07l74L89
5190A48k09r6M18L3k04l7j40J84j17R5o5j08Q5L1j49J82R5k12M7P8r1l3R5j34
5214a04j23K09L8L17l07p4J05j54J72O1O2l25j45L72n7p7O9k87L97k80L4J11N8
5237G2Q0k55O7K10j87l7K44J54m54L20k11Q2j65q2J36J24J6k08R2k36K10J6j17
5260a29J75N8k00J06k83K80l7j75L40j02j29j69J05K94k25l1K30k27K19j43J93
$$ plain form
5091 -6 -49 -184 -83 108 -144 -267 -182 -305 -267 94 -12 -115 -68 -68 160 -62 65 -44 -153 -83 142 -34 204
5114 204 -64 107 31 -151 -15 -12 -110 96 -55 -102 -161 -104 -129 110 -100 -68 141 -170 -25 -260 -77 -138 -109 -1
5138 -1 -318 -325 40 148 -50 17 10 438 65 119 32 23 103 40 21 -33 -37 -35 -329 -157 34 -92 -65 -59 171 -40 70
5165 70 -2 114 103 23 -71 -114 -100 -89 -128 -9 126 -10 -4 -111 -113 235 143 -50 101 38 322 -74 133 -241 148
5190 148 -61 -157 261 294 90 53 -87 97 -20 75 10 -98 -13 18 -131 51 146 -66 -19 59 -32 -65 30 -104
5214 -104 -227 -18 20 337 30 -44 61 -93 79 140 202 -123 -268 104 47 -30 39 -248 149 -131 -97 14 72
5237 72 152 -103 -36 174 -13 -50 194 348 -106 214 3 85 -80 -162 -26 98 114 -94 -2 -238 -28 -12 -129
5260 -129 46 104 -96 10 -273 7 -30 -205 135 33 -96 -265 -160 134 -91 -122 108 -119 100 -43 150
5281A50m25K84j03J02j13lP6k1L4K92j26nj35j0j87M7J56k75L23k01J36j89J84
5304ik7l7j90L3R4K38j08L3K9j39n8J3R9Nn7J76j28q0n9K2J61nj64K50k89J97
5330@N8N8J8J9K6j41J5j07J89N8k2j52J48p2R6l35Q8p2J58k69M08m8N1k11k51
5355b90J56Q6j1P8k19L06n7m5j34M4K05k14K06j53J71j16Q3j48J43p3Q9P7O2l59
5379a13J14P4K07Mq3k85K1L0P8j0m9j72L04l58Q9L8k00K96J52%j72Q2j29N5M6
5404A9J68p8o3L7QO3r4j6K23q8j61P3oj19Q6j60N8l00K75M0j38J84n6J10j32l9
5430a06N4nk8M4J48q4J3j91P9R7o0J44p5l3J65k36o7L07j4l29M3M51l38k98L23
5455Dj96J40O2Q6n4j44j87L18j87J12k3kK9RJ05j42K84k43L61j51L3j02j3j94
$$ plain form
5281 150 -275 9 -94 8 -105 -108 -32 -53 -19 273 147 142 7 -3 -190 -143 13 -262 61 -140 -4 -193 -9
5304 -9 -36 -73 -263 -230 -136 102 -6 27 56 -83 -141 -128 -29 -24 -81 95 -33 -113 -172 -150 11 6 -158 92 -197 0
5330 0 58 116 134 153 179 38 53 -54 135 193 171 19 167 95 191 -144 -56 -128 30 -239 169 121 172 -39 -290
5355 -290 -134 -48 -59 19 -200 106 49 4 -130 -86 119 -95 111 -42 129 13 96 -52 91 18 107 184 246 -113
5379 -113 1 75 282 286 203 -82 -61 -31 47 37 -12 -184 120 -238 -149 -111 -311 -15 137 137 -35 47 -82 -27 19
5404 19 187 109 46 83 91 154 60 44 267 179 18 91 85 -34 52 -108 -50 -350 -75 -35 -173 11 -45 65 -67 -106
5430 -106 -52 -57 -85 -41 107 23 36 -155 -76 21 -39 105 30 -3 162 -74 -141 166 152 -177 -134 317 -21 -319 4
5455 4 -192 -52 10 96 42 -102 -289 29 -158 -46 -69 -71 -42 -33 72 -70 214 -29 332 181 214 112 99 -95
5479i5j0Q3P2j58q9K82j36P1k30R0j38K0J04J40j5jl9M3j73L42o4n13J41J77J04
5504Hk45K58nj78K54j30J90p5k8j50N9q7M15j50j45K2r0K03k44N5j19K07O9l0
5528F4j98L94j86j25R2K71m40K14mo9j62L58n8P5r3j87o6J06k5J06j56L48l48
5551h9m6j10J72j50P3K19j06n5J01j10j40J83R1j33K38k71N5K32j29q3K24j98
5573c2P1n3Q2k16J43K4M9K32j23j58o5n8J66Pq0M0N5q8J25j21m9p0J3L2j2L11
5599B25l13K99j97k86K87K52k70n5K59q4K8l21K7O8P7M8q8K19j27k49J22q9L1
5622a37kp7M14q4k65L4j71L86l6P3j34J53k14N8J25k53k4m0J74o7P1R8l3j82J37
5647DJ1p6q8J32k2M1k0o6K41j69l7j1M9Q3k93L97m13K76J00k59L90k43j84J66
$$ plain form
5479 -95 -105 -22 50 -108 -197 85 -51 20 -210 -120 -258 -238 -134 6 -9 -10 -49 -6 -179 163 99 -414 -273 -96 8
5504 8 -237 21 16 -162 92 -38 152 77 49 -101 -42 -129 286 136 -9 13 -77 126 -118 -63 -182 25 94 64
5528 64 -134 260 74 -51 41 312 -128 86 82 13 -149 209 151 226 133 -54 -120 -14 -39 67 -89 259 -89
5551 -89 -135 -245 -73 -223 -150 69 -37 -92 9 -101 -241 -58 33 -100 138 -133 -78 154 25 -58 166 -32
5573 -32 39 -14 68 -148 -5 19 68 300 177 19 -46 -104 62 69 -11 29 84 -4 121 0 -49 -119 -106 -74 -86 225
5599 225 -88 211 14 -272 15 267 -3 -58 201 117 145 -176 -149 -81 -4 44 -44 175 48 -201 -79 -168 -137
5622 -137 -139 -216 198 114 -151 -117 -288 98 62 135 1 154 -60 -2 123 -130 -154 -194 -20 -87 -16 82 49 -133 4
5647 4 15 -61 -149 -17 -39 2 -18 -84 157 -12 -49 -60 -11 72 -221 176 -237 39 139 -120 270 27 -157 9
5671Ij70jjQ9M3J58k26m8L17k86j6J7r8J26K23K8l61N1J18J6P7j47P2pj21J81
5697D3J64l53K57k21q9OO2L81m54Q5J9M43M0l92r9j35K62j75l7k3L49k31J58l4
5721B6n0K28k03j68l7L21k0P7l8Qj79J03MJ29k44QJ8J32k34K61j70K1J23k42L8
5746h8K48k61k8J16N7r0K21l16L11k21NK63k46K50k69J48J6P7k35J51j18L3P6
5769A00n2P9R4j31R2l16O7o2J36q3j96M17j08J01p8J48q9k00l61M10k7k3J62m9
5793C1j27M14k26j52L07j40k82K09J28j9j28J1K44m63K39P6l38J96P6J02j08l28
5815b78J93K55k20K08j18j52K4k4q5J77p3K72j06N5k58L23j68L7J53p9k83J7K
5838a28l7K55O4l80J89P1k24J45j08J94J4j20K5n7O8o2R9J0j75L81J23n09K19
$$ plain form
5671 9 -161 -162 -163 -74 -31 127 -99 -147 170 -116 -132 -115 -213 -87 136 164 -197 -146 -28 -12 65 -82 -10 -17 -138 43
5697 43 207 -146 111 -110 -199 -193 -131 250 -204 -119 -100 343 383 -9 -108 -243 19 -156 -193 -216 133 -98 60 26
5721 26 -24 204 1 -167 -204 117 97 174 136 144 -35 68 72 201 -43 -35 -17 115 -119 142 -28 -7 116 -126 -88
5746 -88 160 -101 -129 -13 44 -46 175 -141 170 -51 -46 217 -29 221 -48 100 116 193 -42 109 -9 24 100
5769 100 48 127 221 90 182 -134 -67 -129 7 -76 -272 145 37 138 60 208 119 -81 -442 -32 -59 -82 80 31
5793 31 -96 318 92 -60 247 107 -175 34 162 143 15 26 270 -193 46 122 -216 -20 56 158 50 -278
5815 -278 -85 170 -50 158 40 -112 -88 -112 -197 -20 -93 179 73 128 -130 193 25 62 215 136 -147 -130 -128
5838 -128 -165 90 154 -226 -37 34 -190 -45 -153 41 55 -65 -40 -97 -29 -91 8 18 -157 224 347 -162 57
5861E7M0k54L90l74J52L5j32L02k19j41K4J83l74J70J60K4RJ3k7L8l13J71L3j43
5885a76K17o2J18pP6k11j0R3l02K29P4k19M05j5k01kL46m35j9J32K63m30K54l57
5909b39L10k77J25K57k15On1k8l8L2M9O2Q1J85j99j9j1o9J41j34J81j94M3m5j02
5934a49R9m2N2K7j43k8P7M0J86q1j50j73K32K32n9k61O0K60o2j03J50l1l0o2j81
5959a40K04k21M17k64p5J83r0O8k28N6KJ71n1J92p6j49k00K15J24N2k21N1k5r8
5983a03p3J93k07O9K22Q7l0j01j07M9M8K1l07P0mM6r6J62J71k17N2J36n0o1P9
6008D9l8k27L77j07p1M9r5K47j65l08J88K24l4o3K0J3Q0j15q3J51K72k91J66k36
6032Cj00n7K53l08L07L8j08j63j25J79q1L7K86j44K53m16l0K76k9l85K61J64k15
$$ plain form
5861 57 97 -157 233 -141 11 46 -86 216 -3 -144 -120 63 -311 -141 19 43 52 65 38 76 -237 -66 -33 -176
5885 -176 41 -21 97 90 166 -45 -55 38 -264 -35 39 -180 225 210 9 7 353 -82 -101 31 294 -136 118 -239
5909 -239 71 -206 -81 176 -39 -33 -84 -112 -150 -118 -69 -7 74 259 60 41 30 -39 102 -32 149 -45 -2 -47 -149
5934 -149 -50 -92 -40 -13 -156 -184 -107 -67 119 38 -112 -285 -53 179 120 -141 -81 179 117 14 164 133 103 41 -140
5959 -140 64 -157 260 -4 -79 104 14 82 -146 -90 -88 83 32 224 148 -1 -201 14 138 190 -31 20 -5 -103
5983 -103 -176 17 -190 -121 101 188 158 57 -50 -1 47 68 -239 -169 -173 -127 -223 -61 110 -107 -55 81 31 -30 49
6008 49 11 -216 161 54 -17 32 -63 184 19 -289 -101 123 89 26 46 59 139 24 -59 92 364 73 239 3
6032 3 -97 -154 99 -209 98 136 28 -135 -260 -81 -162 -125 161 17 270 -146 -176 100 71 -314 -53 111 -104
6055a04M68j71P2j27j56K32m79L85j21j22J06j75J70p4k9J34Q5j13J07l78R8J26
6077f6o8K47M0l50J60kQ5q4J34j64L5J76J8k47J9K53o1l32J99J29k16N0J14k24
6101a55K99k59lJ42k17L27k17j15L01j75K02k00J3R0jL4j30J43L0l5J94j47P1
6124A92r3l6J75j87J40k71K86j63j88KQ6J38k48o6K47L0j07R2K8O6k03K77q3R5
6148B09q4k34K9K91j79j62J51k0l14L62j06K2KJ66j15O5l09O0j06J27J29J9OR5
6172A04Jo3r4J46J7j09L6K33k77n8J82K25k92nm0R6M9k64J94r7l5jK70n6k18J26
6198G0l94J91rN6j34J35k6J40j6M7j79J76j68j1J98mq4O1n6L3j56K26j46K30j49
6223C1O8K5n0p1n2M9l3j5j57K46k94K29M2R9k76J17q7J41l3j58J59j73J0K40R5
$$ plain form
6055 -104 364 193 265 138 -18 214 -265 120 -1 -123 -17 -192 -22 -96 -125 9 94 -19 88 -290 -192 -66
6077 -66 -134 113 153 -197 -37 -39 46 -38 96 -68 -33 143 161 -86 -67 186 125 -207 -8 121 -95 -45 69 -155
6101 -155 144 -115 -118 24 -193 134 -83 -198 103 -72 130 -70 -57 33 32 66 -64 79 109 74 268 121 192
6124 192 99 63 238 51 191 -80 206 43 -145 -143 -57 81 -167 -233 14 44 -63 29 57 123 -80 197 114 209
6148 209 125 -109 -80 211 32 -130 21 1 -313 49 -57 -35 -33 133 18 83 -226 -166 -272 -145 -16 3 9 104
6172 104 105 42 -52 94 111 2 38 271 -6 -64 118 343 51 46 6 102 151 -113 81 -16 -51 -52 218 162 -56 70
6198 70 -324 -133 -142 -86 -220 -85 -111 29 13 60 -119 57 -111 -122 76 72 -12 49 -7 26 -130 96 -50 180 31
6223 31 99 124 74 3 -49 0 -33 -48 -205 41 -253 -24 18 117 -159 -42 -129 12 -21 -179 -20 -193 -183 57 152
6248A52n6KL7k27K61k46K17l58K81ql18J43j8J85q6J48m61p7L43j37L72j62Pj97
6272b03L30j72Q1M4rP7l07K54k56J75r1P8J52N2j46l4Q8M1j58Mo0q9r2K46p6Q
6298f3K5P4n0L9l17L25J07k59p0m3J79PK1j79K46j60OJ35j00j19J54p6k38L45
6322a1Nj88K36J19k82j1j64L55j29o7N1J87k23J15o5J68j69K19k86R7K25k50J79
6345A11k66K42k26L11k59K85J78m79K22j26L4k05K14K6k1l4N5k49n0L00k8n0q1
6368i6K37o5r1n2J52p5p1J48Q8m5l53l7K21j21K26j42J43j79K36k26K42o6j69
6391i5J90k12L52l4l75lQnK86l15K21j51L73l41o0J09K49k67k7L86l21K22j97
6414gJ97j31j24o7Q7kJ1J39j5j25M22m60j79K97K8k55k7K14M0j21K57P7l89Q5
$$ plain form
6248 152 96 98 135 -92 169 -77 140 -218 63 55 -263 -120 -138 47 -39 109 -352 -429 -86 -223 149 -13 -6 -203
6272 -203 127 -45 36 80 71 148 -159 95 -161 14 -77 1 153 205 59 25 113 154 -4 0 -60 -149 -241 5 -71 -63
6298 -63 -38 36 -14 25 -292 33 140 -119 -189 -232 -53 -46 -25 -204 42 -118 -112 23 -77 -196 -42 -118 -356 -11
6322 -11 -6 -194 42 161 -121 -132 -296 59 -70 -137 -86 101 -122 -7 -72 96 -73 146 -140 -43 182 -68 111
6345 111 -155 87 -139 172 -87 198 376 -103 119 -7 27 -178 36 62 41 7 62 -187 -237 63 35 -15 -96
6368 -96 141 76 -15 -67 85 10 -61 87 175 130 -223 -260 -39 -160 66 -76 67 -112 124 -102 140 74 -95
6391 -95 95 -117 235 201 -174 -177 -169 -174 112 -203 18 -133 240 -101 -161 -52 197 -70 -97 289 -32 190 -7
6414 -7 190 59 -65 -132 -45 -47 -36 103 88 -37 385 -75 -254 43 71 -184 -211 3 43 -78 179 256 -133 -48
6438d8J3O6J07Ln0k0o5j28K27j51k9p7K87k26K52pk19P6o0Lr4J24l22L65k09n4
6464b36K51j95L3O8J87j30j21J94l56J38J32L30j7l63O1j0J06m7LP5j54J83J71
6487C03o25L00L25l44K41l41J80Qj47j23K77L9p2Lo1J72%m8lJ81k17Q2k84J73
6511A9Pk88K91l1J63m33K32j04M8K86k64J35om5r2Pm0K0K15m05L58j28J92J11
6535B48M4j83m50R5N68n34L19k1J78j68o9J8k62n2p5m9N84l30M5q0J70j00l51
6558d55M59k19R1L80k34R7l38M18r5n3K46m4N7l58j29L82k42n7J74j63L39k84
6580b8j55MK71j2%j48J52k17K51Nj10J77N2l00J22k30K73J16k45J05M9L5l05K25
6604H7p2J9K4j05Q5q5J50j35J11k98K78Mk93K23j01J75r8k8K12k78mJ65j61K7
$$ plain form
6438 -48 -35 31 138 141 91 71 6 -122 105 -46 -75 -152 135 -91 161 154 -65 11 -49 -46 -140 -16 -338 27 -182 -236
6464 -236 15 -180 -147 -79 108 -22 -143 51 -305 -167 -35 295 278 -85 -24 -34 72 25 28 103 -51 132 303
6487 303 -322 -22 303 -41 200 -141 39 47 -100 -223 54 93 21 24 -37 135 135 87 84 265 48 130 -154 19
6511 19 26 -262 29 -2 161 -272 -40 -144 -96 190 -74 61 55 10 -82 -75 -115 -95 120 -285 73 -55 137 248
6535 248 292 109 -341 -246 322 -212 107 86 264 96 27 45 -217 -269 -344 -393 191 -139 -94 -174 -4 -104 -455
6558 -455 4 -215 -124 256 22 119 -219 199 104 51 297 253 310 -48 -177 205 -37 -94 80 -83 256 -28
6580 -28 -183 -179 92 80 80 -68 84 -133 118 123 13 190 242 -58 64 -166 107 223 -22 83 132 167 -138 87
6604 87 15 34 58 -47 38 -47 103 -32 79 -219 59 63 -230 -7 -108 67 -31 -59 153 -125 -129 36 -125 -98
6628i8L20k71K43k32J0MN3J95j99j21j4J14L00m06pj79J01K32J35j71j92M13J
6651B31k64J49J93l34K8K1q1j25J29J25l0J15k34J8K05l4j38J7q7K4K60k81j22
6674b15L86m3r8j98M55j76j84O0l8O5J21k19j57L25p9j81J14J01mj33Q0Kr1QP3
6699b6Q7j97J5k3K14J44m12K42M5j83J56P5j64J2J67j29J23J03n02L67k7J1j8
6722H0m9j45k01L42n2K05mj24J4jL6J98k57n3J27j60j38p5K23K71j26j30K5j46
6746a40Q1j24L09M1j39j21j10K16J75p5l11K03l69L96J90k70J0j26J45K2k9J73
6768A47q2l9M8L4k56K43j5j63J73k42K1J23O2J1j36q3j35L97k12J43k06J30K10
6791A73k21O4JlL4k22l4J94J94l04K41j82j58J90j87K94Pn2J75o4j52l00L15n
$$ plain form
6628 -98 222 -49 194 -38 -28 -24 29 224 25 -96 -110 4 304 -102 -109 -288 -187 45 180 9 -183 230 231
6651 231 -33 116 309 -25 3 24 -57 -182 -53 72 42 157 -77 -59 146 112 -26 -9 -96 -72 188 -93 -215
6674 -215 171 128 30 -168 287 111 -73 -13 -51 14 135 -84 -241 84 5 -176 -62 39 35 -98 -18 -16 -107 -99 -26
6699 -26 61 -136 -121 -144 70 214 -198 44 89 -94 62 137 -27 -15 152 23 146 249 -253 114 87 98 80
6722 80 31 -114 -315 27 -25 180 176 52 66 65 101 299 42 -11 116 -44 -182 -257 -34 237 111 -19 6 -140
6746 -140 -59 -183 126 167 28 -93 -203 13 188 113 -198 5 -364 32 222 -48 -38 -164 -19 3 -26 147
6768 147 65 26 74 108 -148 95 80 -83 90 -152 -131 -8 54 65 -71 -154 -289 108 -104 39 -167 -37 173
6791 173 -48 16 17 14 48 -174 -208 -14 180 -124 117 -65 -223 -33 -220 74 81 29 204 140 -12 -312 3 -2
6815bl1J8J3j07n4K26O1j14k31J30J94N9l3j07j10J63j71R8J34j33J47j63J22
6838A09m4k74J44J65q9N3j45r0J46k2N5j11L9k55L42j11L71k69j68K74r1k09L57
6861A77k55q3K85P9j42q2Q5l90K1K71L15m62L13K5r6n6k16J26Jr7K35l02K6J53
6885f9j48K04J36p7k2m2J82m59L37k03K90J94l63K19k70K76m04L42p3qk35n0m
6908b47K28k1o1J09L8r1K77m18K78j37R1k43L11l7Pl36N20m22O8l1J48P6m5j0
6932E2n1J38k37J92n5k1M9JJk9j74R2k36J96Q5K04k95oJ03n4j9n3L24j08j37j28
6958a66L24m0L7p6j39n0Q2l6J60j26K54j34j28m9O6p0J13q0J55j02r4P7l03J07
6982b18R6K64q3Mj88K16k65J99pp2J68j15j40Q9k32L51j95J20J92k16Q5Q2j61
$$ plain form
6815 -2 -33 -15 -2 -109 -163 63 124 10 -221 -91 103 162 129 22 -88 75 -96 2 136 3 150 -13 109
6838 109 65 -209 -65 100 11 64 -81 -171 -25 -47 8 -103 -64 -319 23 -88 283 14 -154 120 29 -180 177
6861 177 -78 -161 124 203 61 -21 64 -326 -305 -34 281 -181 132 157 61 5 -211 -85 -84 -181 54 -248 -222 -69
6885 -69 -217 -13 123 46 24 -18 164 -295 42 -161 129 323 -40 179 -91 185 -219 123 50 42 -193 -243 -247
6908 -247 -19 -40 -101 8 46 -45 232 -186 92 -45 46 -197 114 77 84 -252 268 -154 -86 -117 31 107 62 52
6932 52 1 139 -98 94 39 18 67 68 69 40 -134 -42 -278 -82 3 207 -88 -94 9 -45 -64 -117 207 99 -38 -166
6958 -166 158 118 155 79 -60 -110 -28 -64 96 -30 224 90 -38 -87 -21 -91 22 -58 97 -5 -99 -22 -325 -218
6982 -218 -122 142 59 63 -125 91 -174 25 18 -54 114 -1 -141 -52 -284 67 -128 -8 184 -32 53 135 -26
7005b6L0J49l17q0K67J24k1K3m94L24n9Q7r0J50J32k49j02J95m2K7k7L1%j25J78
7030H5m3K4r5L3J45n0l6J6J9J99k83O9j61J00l8k56K11J3P9k18l3J88j49P6j9
7055a24J06j77J02k07L38j07K3j08L31k35J80lq3k07J60j61L19j43j35R7j16J17
7077c3J5J27j73m9K52l03Q4k3P9m7r3L0qJ9L92l84J22o1L41k36r6R3J26k39j90
7102b55M87m30J10n3K06K5k1k02K20k95l8J96k2p7O6L19j57j5Q8J3j09Q0R4m03
7126a73J50n3j54J41J02oj68L21r2l07J27l9J07j18M64k55j15K01j08J06j45j09
7148a23j50K80o1J20j65J36R6j84O2J86j37j94P4k6j1L1K47j43j70q7K22r4J00
7171Il0L1M5k06M9K16l00K50k20J13K84l83Q7k05L67j60Q8n2M0R2k88J45K00j66
$$ plain form
7005 -26 4 153 -164 -244 23 147 126 149 -345 -21 -80 7 -83 67 199 -50 -152 43 1 28 1 32 32 -93 85
7030 85 42 66 -29 4 149 99 63 79 98 297 14 83 -78 22 -16 -272 -61 -48 31 -187 -220 -32 -181 -105 -124
7055 -124 -18 -195 -93 -300 38 -69 -46 -154 177 -58 122 119 36 -171 -11 -172 147 4 -131 -34 -150 -33
7077 -33 -18 109 -64 -113 139 -164 -80 -103 -24 -71 -164 -134 -142 -123 269 -115 7 -54 287 51 -45 48 174 -65 -255
7102 -255 232 -198 -88 -141 65 90 69 -133 87 -208 -246 -50 -72 -149 -83 236 79 64 152 165 56 136 230 -173
7126 -173 -23 -76 -230 -89 13 7 -161 160 68 -239 -112 -151 -44 -162 302 47 -68 133 25 131 -14 -123
7148 -123 -273 7 -54 66 -99 37 133 -51 11 197 60 -134 -60 -86 -97 -66 181 38 -132 -219 3 -91 9
7171 9 -21 10 55 -151 -102 114 -186 64 -156 -43 241 -142 -55 -260 107 -53 35 -17 23 115 -173 -28 172 6
7195FK7j07j7R3L7N7J7j83j0j47J17q5J87o6J40n2j74j6K23j80J55n0k26L91J83
7220C20k13j59O7l44K68M9P3J77l50K8L43j36j25J4j37K10k57K08L8j22O2k52
7242b38K72k25K93j54j8L9K4J45Lj64j06J37k1K42l50j34M47k58O8M5J22l08M2
7265i7L50l30MN8L61l70L1J40j34Mq0k14J88P4j39K23k9l8j27L42k09J19j79J28
7289G6J07j10j37J50R0k07M0J25j78l5J97k26l9R2K5N2j97L81l0K9l06J43k0O6
7313H8l3m50M29J58k5j87J1k02J94K69j65n7K39k46K9k1j75L68l96K93j37k1J31
7336I4k13M5K13k70O2J7N3j36O9M6r9J58o7R6l1J04k74J41K05o7k55K45l41K79
7360G4k19K13j52J43j50J07J98l99K73n3l8K73k32j30j68J97QJ79J3j40K6k3O
$$ plain form
7195 6 33 -74 -91 2 39 96 113 -70 -80 -227 -110 -195 -8 -74 66 14 -160 -176 47 -133 22 -28 -254 137 320
7220 320 107 -52 15 -329 -61 -12 61 238 -112 -84 259 123 -2 12 -125 85 -172 36 74 -48 14 -238
7242 -238 34 -191 102 -52 -70 -31 -7 138 141 -23 -129 8 -13 229 -121 -255 192 -66 2 47 169 -139 -97
7265 -97 253 -77 -73 -15 346 -24 7 147 13 17 -63 -277 -89 -15 -154 69 40 2 -125 217 8 127 -52 76
7289 76 183 73 -64 86 176 -31 9 134 -44 -79 118 -108 -147 -55 -30 22 -175 206 176 205 -101 42 22 88
7313 88 55 -395 34 192 167 -20 -9 -211 -17 252 87 30 269 23 52 31 -144 224 -172 121 -16 -37 94
7336 94 -119 -74 139 -131 -69 -52 1 -135 -66 -20 -119 39 -28 68 37 141 -133 8 213 146 -109 136 -205 74
7360 74 -145 68 -84 59 -91 16 214 -185 88 35 -3 270 38 -92 -260 -63 -55 124 137 -3 23 0 6
7383Fj49O2J37k30L02r0K0O4m07L34j46k2M45m06J21o9q5J37j63K63l6J13k00
7406Am1K75j12l38L28k00J35Qj22j7J76q8J63l88J00J7R3L13k38l0j46K7J92j93
7430h5o5K25J9k93J77n4J17Q1nl39J78Q7N5K0j68P9o1n3n6J30j3J51j71j23N5
7455a12J23J4k04J53J47o34N24n0K37l50L15p4O3k68R2P6J10l64K32J5O6k35K44
7478A20J14J19n10LJ26K52n8j42j77l3Q8J83P9j96O8L9j67J17K55k34N3J24k70
7501d7k7J48l48J51j3K05j10K00j4m35K56k5J97k25L5J22Pj20K54k92j4P2P8o2
7525gq2J39K56k87k49L62m6l63K03L9q9L3J30K7K25k65Oo0J36k61l7lK26J01j99
7550f5J19M9m1k39J55j45L66Rj51n8K76l94L6j82J24L02r4M3nN7K18j92k48J24
$$ plain form
7383 6 -143 -81 56 -174 128 38 58 122 -285 49 -97 -119 326 -80 41 -28 -113 24 -139 124 88 201 1
7406 1 -40 235 123 -215 113 -87 48 56 -66 -83 93 5 168 -220 -120 -103 -10 303 65 35 -111 -84 108 -85
7430 -85 -150 75 94 -199 -22 -76 41 122 117 -222 -44 43 98 118 -50 29 -32 -85 -141 -11 -24 127 -44 -167 -112
7455 -112 11 25 -179 -26 121 -513 11 -39 198 -152 163 89 152 -116 -24 52 162 -202 30 45 111 -124 120
7478 120 234 353 -157 -154 -28 224 166 24 -153 -186 -98 85 164 -32 36 75 -92 25 280 46 99 223 -47
7501 -47 -74 74 -274 -123 -136 69 -41 159 145 -290 -34 -59 138 -87 -52 70 77 -43 211 -81 -95 -23 55 -7
7525 -7 -89 50 306 19 -230 132 86 -277 -74 -35 -124 -91 39 66 291 26 32 -28 108 -153 -190 -193 33 134 -65
7550 -65 54 103 62 -177 -22 -167 199 208 57 -1 275 -119 -83 -265 -141 161 67 110 105 162 380 188 -60 64
7574F4k11L91l23l5q1J48N8Jrm4K4o5K9j33J26J36k44L39j84j10K43K5r9J33j11
7599F8R8O8m38K26r1K79k39J5J11n2j87L34m88M57j03K6N5j9m0l7j69R2J56l07
7623a85Q8Q3j10J62m3J18j41p9J79P4J32m41K87j29j03N8j39J61K02j96J12o6
7645B4l13L51j6J18j41K03m27J41K37j41K17m21J89M5l27L26J54q2m7p5j76N20
7667C59j90j33o6j5J0J11k7Rj54J50j79J85jl06L35k26L40j98j12l8rM56l20j98
7691b17J23Q3K64k92J7R4m5J88k28k4K2L5J11k36L6J56RJ16k75P8q2j17L58j04
7715G0P2j89j27Q1K1k37J91J57jn1K0J08M0nO1k77L9j14J96K44k55P1k28l1L16
7740A72R0j55j94J73K9k60M0j45K28m1J05n8n8N9K46j23m9k5j25q6J8K44q9j76
$$ plain form
7574 64 -147 244 -79 -114 -195 -47 11 12 3 -41 -17 -82 -53 -186 -60 76 -168 171 -13 -123 120 145 46 179 68
7599 68 166 234 -204 22 -69 210 -29 -14 97 45 -142 192 -296 161 58 84 139 120 80 43 -126 -34 122 -185
7623 -185 -97 -14 -124 38 -5 113 -28 -107 72 146 278 -163 124 -5 -108 -50 -189 -28 174 -22 90 24
7645 24 -289 62 46 164 23 226 -201 -60 177 36 253 -168 21 66 -261 65 219 137 90 15 -161 359
7667 359 169 36 -30 -45 -35 76 49 58 -96 54 -125 60 59 -247 88 -138 202 4 -108 -146 -155 301 -19 -217
7691 -217 -94 -11 253 -39 -22 72 27 215 -13 -37 -15 20 131 -105 -69 87 96 212 -63 15 -67 -184 174 70
7715 70 142 -47 -174 -93 -72 -309 -118 39 38 -13 7 115 155 150 211 -66 -27 -141 55 299 44 115 -113 -144 172
7740 172 262 107 -87 86 115 -145 -105 -250 -22 -63 42 -16 -74 -15 231 108 59 34 -91 -177 -159 85 -4 -180
7764a80J79P8m2j47k3j09L94j80p7o9K4J29kM1K13n3l21K09K40k32k22J4j26J73
7788h9J54k7L5k29L28k58L39j96l5L2j45J02k4J99j59o4m7ol5J88p5l6j76M9J34
7813d1J31l04J81j52K13r0K2J64k02J28k10J09j27J35R2k6K42k08J01k83J55j10
7835h0n3K86Q1j59o4j00K10k49L61k16l3O9J00l17K68J3j42j6J79r5m7j07O6P6
7859C1MJ00J51j98J48l50J77L4j56K51q3q7J22j58R5j79M03k53nJ07k48n9J76
7882B3j21J09K04l79J38P1J20j16o1L49l36p4j57K27O4k09K64k36n1J75j4Q6L3
7905A09R5k69J90j12j7J51k03m6K94l72j07K58J14j65o7J01Ok86O8N03rL2l09
7928d1j65L21j37J62j91n2R7q0M3p3L04l44r1K91l0J23j00j46J84K3k44k3K63
$$ plain form
7764 -180 -1 77 35 -112 -135 -244 150 -30 -107 -176 -152 -23 -25 16 229 176 -145 64 304 72 -150 -136 -262 -89
7788 -89 65 38 73 -156 172 -86 253 57 22 54 -91 11 -13 186 27 -37 -84 -90 -125 63 -12 -48 -224 -175 -41
7813 -41 90 -214 -33 -185 28 -62 -40 124 -78 50 -160 -51 -178 -43 49 23 265 57 158 -125 30 -80
7835 -80 -133 153 234 75 11 -89 121 -128 233 17 -16 53 153 -164 104 117 -25 -41 138 43 -4 -111 -45 31
7859 31 35 135 286 88 236 -114 63 97 -59 192 109 22 144 -14 81 -98 305 52 47 154 -94 -153 23
7882 23 -98 11 215 -164 -26 45 165 49 -12 337 1 -73 -230 -3 61 -148 116 -120 -171 4 -10 76 109
7905 109 204 -65 125 13 -4 147 -56 -102 192 -180 -287 -29 85 -80 -147 -46 -40 -326 -258 245 236 268 -41
7928 -41 -206 115 -22 140 -51 -103 -6 -86 -43 -116 188 -156 -247 44 14 137 37 -109 75 98 -146 -169 94
7951I4j35P6o7J71k55K31j64j35J47J39P3p4o1k6j33o1K10j32k40P3L32p6j01
7974a14K7J92k09N0m6J44Q5q7L8j97K67k06J36l4j39J03K1j04Q1j05K02J80l03
7997a8J18j29J13kK8j09J58k74J66J0n1K74m26m8J83k6R8l22K10J30k29p7L46
8020A23l06Q5l9L3J07p3Q1n6J59J19r8l7Pj18m8O6K12l53O1J44L9j85r6O3N1J30
8046G1J1M9j25J87n6l28M69m58m3L07j50j10N3P9J25m6j97J47k62J45l1J08K8
8069b7K13k80K28kj67j47J6M02j60k31K78p4j66J8j18K57J43j21j16M36k98N9
8091A43P9j68l48L64j61k08J61lK08J8L2M7k83L19j03J28j6m10q3L3L24K5nK3
8115A16K4j17P3n5R7k12J40j0k8p6NL58j34k38J65l8J2m1j8k25l7l8L95p4m2k60
$$ plain form
7951 94 -41 35 -32 139 -116 115 -49 -184 -37 102 175 101 40 14 -119 -180 30 -102 -342 -269 63 -13 -114
7974 -114 -87 105 -104 -54 -100 44 129 42 80 -117 150 -56 80 46 -93 10 31 -73 8 -97 105 285 -18
7997 -18 100 -29 84 82 110 1 159 -115 51 61 10 284 -142 -190 -7 -33 65 -257 -47 83 -146 -223 123
8020 123 -183 -98 -137 -104 3 -70 11 -45 114 233 135 98 105 -13 -61 5 217 -136 -75 69 108 -77 -173 -110 -59 71
8046 71 82 131 6 193 137 -191 278 -180 -223 84 -66 -176 -123 -44 81 35 -162 -15 -277 -132 -163 -55 -27
8069 -27 186 -94 134 132 -35 -182 -166 236 76 -155 123 49 -117 -99 -217 40 183 62 -54 382 84 143
8091 143 222 54 -294 70 -91 -299 -138 -141 67 85 117 164 -119 200 97 225 209 -201 -284 -251 73 98 93 116
8115 116 140 23 96 41 138 -74 66 56 28 -48 -43 315 181 -57 108 70 82 41 23 -202 -239 -277 118 44 2 -258
8141b58M13j41k04R8j14K04j78J1J28p0N0m3J38j08j78k6K01J74n5L1J24n0k39
8164i2J66o2J4M4k30J52r2R7Q8jq5O6K2m8J54j37M4j28K28k63P9k1O5o9j75N3
8190a31N
$$ plain form
8141 -258 155 14 -190 -92 -206 -2 -180 -169 -41 -111 -61 -104 34 -74 -252 -278 -77 97 42 73 197 147 -92
8164 -92 74 12 26 70 -160 -8 -100 -3 85 84 -1 65 87 39 193 56 100 -28 200 -63 16 -5 60 -9 -184 -131
8190 -131 -126
8191a26
$$ Imaginary data points
##PAGE= N=2
##DATA TABLE= (X++(I..I)), XYDATA
0@%%%%%%%%%%%%%%%lJ1j6J6j6J6k1K9l2L3m1M8n6O5p3Q6r6J07j22J38j55J75j98
38a05K20k44K72l02L34l69M08m52N00n50O04o65P33q06Q89r82J084j202J337j491
58g87J671j886K146k466K874l411M155n251P022j0330J8438p0986q0830K17422
72G7781l4069j55016J10456Q7167j36403P282J11106n6829o6841O9460K2478l6857
84b85M946L658j6642Q621n455j2825J4547L268j2218K0089J0095k7502l177K4638
98A1758o145j4139J1254P636j0763l404O399k744r438L241J1570j180k252J1719
112A3512l225j3051J3745O166k3188N698J8406k4668n172L2605j9533l3783L3331
125H43J4247l7391J0375K5455k7141k715L2779j4817k4636J8130R296j0536J06
$$ plain form
0 0 0 0 0 0 0 0 0 0 0 0 0 0 0 0 0 -3 8 -8 8 -8 8 -13 16 -16 17 -24 24 -32 33 -40 46 -50 57 -65 73 -82 93 -105
38 -105 115 -129 143 -159 175 -194 214 -238 262 -288 316 -349 384 -422 467 -515 569 -633 704 -787
58 -787 884 -1002 1144 -1322 1552 -1859 2296 -2955 4067 -6263 12175 -58811 -139641 77781
72 77781 43712 -111304 -848 86319 -50084 -42802 68304 11475 -55366 14094 36572 -285
84 -285 4661 8319 -8323 298 -5157 -17982 -3435 -167 -12385 7704 17799 -9703 -12880 11758
98 11758 5613 -8526 2728 10364 -399 -3803 2596 -148 -9586 -6345 5225 4045 1793 13512
112 13512 10287 -2764 10981 17147 -6041 -343 18063 -6605 -11777 20828 1295 -32488 843
125 843 15090 -22301 -11926 13529 -13612 -16327 16452 1635 -23001 -4871 4425 -6111 -6005
138f005J10K938Q443p534j199J5361j3743j2971L2282M834l7277J1778L3217k5803
152D431j9533K8721l275k6636K0261J7090k7565m897K4417p858j9039J1368Q115
165E600j2910J587J2735m832j1602M813R050p084o651J0995O672j1252l88R054
179E787o973n797Q803j569p079R473N031r948k063N478j005n79j489P31M707l902
195c94n041R516l593j6196J3359J6126j8798m765K3528n226j6371J4772N603j7894
209e374O222J5003j2997r309R809N25p554R82J304K59J203j557K237J659q000
224e588J068J1390p442j1632J2564L036j5848N398J0082j2878J366J6416q470
237e38q305J6945J259j2663O595P162p875j091L694l031k260j477M87M553m915
$$ plain form
138 -6005 -5895 -2957 5486 -2048 -3247 12114 -1629 -14600 17682 22516 -14761 -2983 30234 4431
152 4431 -15102 13619 10344 -16292 3969 21059 -6506 -11403 13014 5156 -13883 -2515 5600
165 5600 -7310 -5723 7012 2180 -9422 -4609 4441 -2643 -9294 1701 8373 -2879 -3267 5787
179 5787 -1186 -6983 1820 251 -6828 2645 7676 -2272 -4335 1143 138 -441 -1930 -1199 3508 -394
195 -394 -5435 4081 488 -15708 -2349 13777 -5021 -9786 13742 8516 -7855 6917 12520 -5374
209 -5374 848 15851 2854 -6455 3354 3879 -3675 -2693 -1389 -1130 73 -1484 753 2412 -5588
224 -5588 -4520 6870 -572 -12204 360 3396 -12452 -7054 3028 -9850 -8484 7932 -538
237 -538 -8843 8102 9361 -3302 3293 10455 2580 1489 5183 2152 -108 -1585 -1098 3455 -1460
252a460n360J0972K010j2363N744Q311j0673J265R572j0722n508J3379m861j0689
266a0383R435K678p287N820K378o586N999L191p039N488L762j2557O245J0124
280A1268j7621l704J9092r289j4059J8564L77j9442J4161J1966k1511J197K0244
293A1243j0488j0750J4968r57j0820Q308L273q452L207M647l334J655J186l396
307B90K569L309l701j347J450Q70K04l854k044M634j825n304M488p05p131P488
323f09K677j1789N074J0072j2077m63J5642j1704r306K1831k278k1523J6717J1408
337A3672k3086M722J9641j9199o596K5603q824j9019J9939O070k1391Q120J2005
350A1657j6950L56J4913j1647q109J4177k998j0213R518J945r929P397O863r574
$$ plain form
252 -1460 -6820 4152 6162 -6201 -457 7854 -2819 -1554 8018 -2704 -8212 5167 306 -10383
266 -10383 -948 1730 -5557 263 2641 -3945 2054 5245 -1794 3694 7456 -5101 1144 11268
280 11268 -6353 -10057 9035 -254 -14313 4251 4628 -14814 -653 11313 -10198 -9001 11243
293 11243 755 -9995 4973 4016 -6804 1504 4777 -3675 -468 4179 845 2500 3686 290
307 290 2859 6168 2467 1120 2570 3440 3644 -210 -2254 2380 555 -4749 -261 -966 -8097 -609
323 -609 2068 -9721 -4647 5425 -6652 -7115 8527 -3177 -12483 9348 7070 -14453 2264 13672
337 13672 -9414 -4692 14949 -4250 -10846 14757 5933 -13086 6853 12923 -8468 -348 11657
350 11657 -5293 -4937 9976 -1671 -9780 4397 1399 -8814 704 2649 -7280 117 6980 -2594
364b594L92P812m897j610O035m740m630Q661R7j0875L318R058o938n451R798J351
380D787r954M044R024r212o615J0670O40j1418L991O044q456J048Q315o639k951
395f682J0918r45o673P303J534n728N325N09q156N319L707r843K827P689j0996
410c892l00J2909q573q765J5256J4j4737R223O662j5429K417J3779j2708q459
424a2603J5469J49j3125P139P956q959L10Q980l635m537N806J831m624l67K386
439B176j332j382R30j0j372p30K961l19l604J158L529j731j530J118j097J346
455A11J004l928J306M008m670n19P239m141n105J0285M4j0695P157N832j1530
470c602K476J0260j0865m701J4118m215j1881Q885L943r640K664M457o410J553
$$ plain form
364 -2594 -2202 5610 713 -897 5138 398 -4232 4429 4526 -6349 -3031 6027 -911 -6362 3436 4787
380 4787 -5167 -1123 7901 -1311 -7926 2744 3384 -8034 -4043 2001 -6455 -5407 2908 -3731 -6682
395 -6682 4236 3291 -3382 3921 5455 -273 5052 5561 -2595 2724 6431 -3412 -585 7104 -3892
410 -3892 -4192 8717 144 -8621 6635 6649 -8088 1135 7797 -7632 -5215 8564 -4144 -12603
424 -12603 2866 3015 -10110 -2971 4985 -3974 -3664 5316 1681 -2856 2950 4781 157 -210 2176
439 2176 844 -538 392 382 -990 -1720 1241 922 -2682 -1524 2005 274 -1256 -138 -1235 111
455 111 1115 -2813 -1507 2501 -2169 -2688 4551 410 -4695 5590 5634 -5061 2096 7928 -3602
470 -3602 -1126 9134 -1731 -6432 7686 3471 -8410 475 4418 -5222 -2558 1899 -4511 -2958
484b958M531n735M71N459n307j3P682n472l460R465k183p152Q387N93r477Q230
500C061N577j4002K739J3246j0740o416J3922k796j1193R911L289j2058L043P105
514D688p518k139N489k583j359L168j720m70J891m72J210K042k399j9M034j872
530A971l079J588J378j089o09j0P75K13j144Q86P50l080P97M377m516l247O217
547B178k293o903O197K928j0159K595J1662p929o282J2382R00j0217O532O041
561G632r604J709Q315p152m085Q224l090n622O228J19n473L896K521m270M67J528
577A343k557R97j83l155J704J803l655j14K327j825K89K550k56J04K054kK08m5
595A587q29J448O7k371K139J016m056O65M222m418l265P032O0o353L629L860o166
$$ plain form
484 -2958 1573 -4162 -3691 1768 -3539 -3552 4130 -1342 -4802 4663 2480 -4672 3715 4308 -5169 3061
500 3061 8638 -5364 -2625 10621 -119 -6535 7387 4591 -6602 3309 6598 -5460 -2417 4688
514 4688 -2830 -4969 520 -2063 -3422 -254 -1974 -2444 -553 -1025 185 2227 -172 -191 3843 1971
530 1971 -1108 480 1858 769 160 150 925 1138 -6 880 1630 -1450 -653 3724 -792 -4039 2178
547 2178 -115 -7018 -821 2107 -8052 -5457 6205 -1724 -8006 4376 5276 -4941 1591 7632
561 7632 -1972 -263 8052 900 -3185 5039 1949 -3673 2555 2674 -2799 1097 3618 -652 -185 1343
577 1343 -1214 -217 -400 -3555 -1851 -48 -3703 -3817 -1490 -3315 -3026 -476 -732 -628 1426 1424 1632 1587
595 1587 758 2206 2273 -98 2041 3057 -999 -334 3888 -530 -3795 3237 3297 -3056 573 4433 -1733
612a733o10M529m547k424O275j495n074N070J182m900L279K572m544K474M334
627D388m332m14L875l267j311M420k825l335N193K97m346J913J035l757J780K674
643A988l843j082M121o99l391P54K600j462k357M089K234m979R5O206k380m990
659c096M753J877n048K501L036n085O33M926m992k058O393k850n631P108Q01q621
675e353L885N144q758L88Q587o606l644J0655l011q505R457L119j1319M567R184
690G790r932j560J0545n322o158Q013n7p566N224L832o516J025M408l347k438
705b059K818o51k166Q97P68l94r66l30J310k09n52J563L87o74J574Q64k316K76
723A40K036k050j09K060j655j214K940j594k506L231M63l682K544K725n290P0
$$ plain form
612 -1733 -2343 2186 -2361 -4785 1490 -5 -5079 -9 1173 -3727 -448 2124 -2420 54 4388
627 4388 56 -358 3517 250 -1061 3359 534 -2801 2392 2689 -1657 256 1291 -2466 -686 1988
643 1988 -1855 -2937 1184 485 -2906 -2152 448 -1014 -3371 718 2952 -2027 -1932 4274 1894 -3096
659 -3096 1657 3534 -1514 987 4023 -1062 -429 4497 -495 -2553 3840 990 -4641 2467 3268 -5353
675 -5353 -1468 3676 -5082 -4694 3893 -2713 -6357 4298 1287 -7218 2239 5358 -5961 -1394 7790
690 7790 -2142 -3702 6843 1521 -4637 3376 3319 -4247 977 4809 -1707 -682 3726 379 -2059
705 -2059 759 108 -2058 -1161 -393 -787 -1753 -2083 -773 -982 -1534 29 416 -258 1316 2180 -136 140
723 140 2176 126 17 2077 422 -792 2148 554 -1952 1279 1742 -1940 604 3329 -1961 -1891
739a891M159l659k560M576j775k560M440o37m060M548J710n121L386L277m582
754g49J080L850m622oL907l901p94N224l999l059O622j640o431N945K466p615
770c722K355M982o490j245O781m263l935O523K70n650L487L793m533N50M036k383
786E56q42L107j690j331K477j188k065K868M31l317J571J680k445n30J243p17
802a92j328J433J6j877J52J406j566j179L076K30l108K347L431l868j305N930
818C598k246m216M917J401n873K675M412n936l15N503l292l204M674l2m534L442
834I74N00m415K375K134n013J509L497l915j78M993l470k256N256p93m029M529
850A698J738n143K421L430n411o66N349k401l675M128J423m057O50K443j880k024
$$ plain form
739 -1891 2268 -1391 -3951 625 -1150 -3710 730 93 -3967 581 2291 -2830 556 3833 -749
754 -749 331 4181 -441 -447 3460 -441 -1235 3989 -10 -3069 3553 1913 -4518 1427 3893 -3722
770 -3722 -1367 3615 -2875 -4120 2661 -1602 -5537 986 1256 -4394 -907 2886 -1647 -1097 2939 556
786 556 -286 2821 1131 -200 2277 1089 -976 1892 2323 -994 577 2257 -188 -718 525 -192
802 -192 -1520 -87 -71 -1948 -1796 -390 -1956 -3135 -59 171 -2937 -590 2841 -1027 -2332 3598
818 3598 1352 -2864 2053 3454 -2419 256 4668 -1268 -1583 3920 628 -2576 2098 2066 -2468 974
834 974 1474 -2941 -566 1568 -3445 -1936 1561 -2354 -2532 2461 -1009 -3265 1991 1198 -2831 1698
850 1698 3436 -1707 714 4144 -1267 -1933 3416 1015 -2660 1468 2891 -1166 -516 1927 47 -1977
866a977J206J166j328r20J477l11j721Q17J242j495J35L299j252j487L116l44
882A623k793K176Q82k505K160J267l510J646K567m872NN255l548l919O851n10
898B775o819M161K972p317R75N715m545k034O357k031m614M967J328n086K591
913f05L504l558kL456k096j882K566k69j941J471J268j678RR88m01j171j34R05
931D30N3j613P04Q41j523n32K053j576q84K937m30k216K803J357m044J885K744
948B989l649m67M154k509j905M068j749l729M506O87n455L017L422n396m82N203
964B705l473l672M528O4l388J938J902k588N90K275j466k44J601K25l16L91L9
981A111M72m59r83J193N21k149K02K324j186j357J195j1r05j29o3l29J40q48k23
$$ plain form
866 -1977 -771 395 -933 -1853 -376 -687 -2408 -1591 -349 -1844 -1709 1590 338 -1149 1967 1623
882 1623 -1170 1006 1888 -617 1543 2810 -700 946 3513 -1359 -1354 3901 353 -3566 3285 2775
898 2775 -4044 117 3089 -4228 -3253 2462 -2083 -4117 2240 209 -4405 562 1890 -3196 -605
913 -605 2899 -659 -661 2795 699 -1183 1383 1114 -827 644 1912 234 243 1231 830 -341 -475 430
931 430 483 -1130 -426 415 -1108 -1640 413 -1163 -2047 890 460 -1756 1047 2404 -1640 245 2989
948 2989 -660 -1127 3027 518 -1387 2681 932 -2797 1709 2396 -3059 -42 3380 -2016 -2498 2705
964 2705 -768 -4440 88 152 -3236 -1298 604 -1984 -1394 881 -585 -829 772 997 681 1072 1111
981 1111 1583 1124 141 1334 1855 -294 -92 2232 1046 -311 884 873 -32 -161 -224 -553 -413 -1261 -1484
1000a484R35p13j633J881J028k019O91K226j736J62K232j360j005K244l11j134
1016DJ253l24j226J462m73j458K143N2k845J806J790l751M61K873k507j540L229
1033I49j011k431K502j66j900J932J178k295J442J546k005N28J881j516o84K013
1049A963j129j517J983L6k399J034J428k024k37J050n03o89P5J44n01P64o32m80
1067a634Q16r9k95M27N10J35R0p7Q79L10j228R87R92p65n56J330n82o57Q77r51
1087E09n66J538j646r57K307j119k191K632M73l502K127J852l805M95M221l129
1103g61k718N354j364l824L840J516m293K045L184m061Q0L599k467j841M357j016
1119A630m367L669J411n013J641L168m152l20M144k289k609L981o9k956K112J624
$$ plain form
1000 -1484 -549 -1262 -2895 -1014 14 -2005 -1314 912 -824 -662 1570 210 -795 1449 1138 4
1016 4 1257 933 -293 1169 696 -762 1381 1433 -1412 394 2184 -1567 -1106 1767 -740 -2280 949
1033 949 -62 -2493 9 -157 -2057 -125 1053 -1242 200 1746 -259 269 2150 634 -50 1963
1049 1963 834 -683 1300 1336 -1063 -29 1399 -625 -862 188 -315 -1004 -929 -785 -1286 -522 -1154 -1634
1067 -1634 -818 -917 -1212 -785 -275 -140 -50 -127 752 1062 -166 821 1813 1048 492 1822 1240 583 1460 509
1087 509 -57 1481 -165 -1122 1185 66 -2125 507 980 -2522 -395 1457 -2348 -1853 2368 -761
1103 -761 -3479 1875 511 -3313 527 2043 -2250 -205 2979 -1082 -1002 2597 130 -1711 2646 1630
1119 1630 -2737 932 2343 -2670 -1029 2139 -2013 -2333 1811 -478 -3087 894 825 -2131 -19 1605
1135A605k419N78K056j603n83J777p54o92P74N11j059J58R91k22j698Q68J444
1152A732k073p10K575j352k647K788L66l652J620K271l207j63L782k262k438N007
1168A637l81m071L708K419m742O79M157l232j770M136j361l095L553P57m175K328
1184E47K392l958K47L110k666j731L425j002k598J918N97k170J358J077j935O72
1200g17J517j299j42J574m94n32O86K24k11r6q6P5j80k73O77n74r33O75K58j223
1220a074N69P66r39k41J117o63n86Q73p3l59N65K8m14L79M82n44K43P20m93N68
1240I24O16r89K59J265j578p85J786q48j852J404O62k318N11J304j230l95J618
1257C54j006n11J247p59q86J847q36q38J498n0q66Q65L53q29P32N94n50P81J85
$$ plain form
1135 1605 -814 -236 1820 217 -366 1411 657 -35 739 1250 191 349 1340 1118 -580 288 1732
1152 1732 -341 -1051 1524 172 -2475 313 679 -2973 -1353 918 -2289 -2452 1330 -932 -3370 1637
1168 1637 1256 -2815 893 3312 -1430 -751 3406 174 -1596 2540 1179 -1916 1637 2394 -1781 547
1184 547 2939 -1019 -772 2338 -328 -2059 1366 364 -2234 -316 281 -1889 -531 546 -1389 -717
1200 -717 800 -499 -641 933 439 -93 593 817 606 510 424 499 319 46 723 149 -784 -109 149 -1074
1220 -1074 -505 261 -678 -919 198 -465 -1051 -178 -251 -610 -45 -17 -431 -52 430 -114 129 849 356 924
1240 924 1540 551 810 2075 497 -288 1498 650 -1202 202 864 -1454 -943 361 -869 -1264 354
1257 354 -652 -1163 84 -675 -1561 286 -550 -1388 110 60 -806 59 412 -417 315 909 359 1140 1325
1276A325p82L45N94j233j21O70r14j59O05r38n52P53m5m90O68K28m25O35K22n70
1296a84O49j54j219J266Q38k094K42K295j561j080K220J80k185J366Q10j509J30
1313A0J073j048n37J16l92Lj38o79Q82J01j561J358J500j478j00K017n43j357
1331g73J821Kj823J190P18j420P12J051j581O02J044j123n17J479o92o55J113
1348A148m63j430L60L71j224J32L90n57M71K46q1L1J87r8J58P11q30P20N49m10
1368C81m62N28l91R0O41j229M24J342j316r81K807j077k975K545J733l647L28
1385a259L420l069k018L918o42l030K943J146k755R24K667k733j71K744j581j218
1401g14K257J91k236J262O41k114L48J638j373q29J394m58j200R67k2p93J1P75
$$ plain form
1276 1325 543 888 1482 249 128 798 -116 -275 330 -608 -1160 -407 -452 -942 -274 -46 -471 164 386 -184
1296 -184 465 311 -908 358 1196 -898 -656 1639 78 -1002 1218 1398 -787 579 1389 -120 10
1313 10 1083 35 -502 -386 -778 -775 -913 -1592 -710 -609 -2170 -812 688 -790 -890 1127 584 -773
1331 -773 1048 1050 -773 417 1135 -285 427 1478 -103 499 1543 420 -97 1382 690 35 1148
1348 1148 685 -745 -385 -14 -1238 -1106 -716 -1273 -802 -556 -637 -606 -419 -517 -359 352 -478 242 791 381
1368 381 -81 447 56 146 787 -442 -18 1324 8 -973 1834 757 -2218 327 2060 -1587 -1259
1385 -1259 2161 -908 -2926 992 350 -2680 263 1409 -1346 -422 2245 -488 -659 2085 504 -714
1401 -714 1543 1734 -502 760 1401 -713 -365 1273 -100 -929 465 7 -1193 -226 -248 -1041 -1030 -255
1419b55o75j33O72k74m44O38N42p94Q1J202m95p42J956J50k096J218J655j869
1437C37n20K290r04j878K296j55l107J231K022k731k24K663j421j365J893o5j861
1454a499J481O06j537Q77O34j197Q8P91j091k47J740o52n03J605j82j825J652
1471G41K13j693P10J411j300j135J339l36j403K78J067r54K63J200m90j93N26
1488B44M75j148K96J276j157m94J820m37k359J729R17j641L31J626q36q34J590
1505A398o63j215J102j01j360Q95L28j743M43J044k088j90K161r18j295K624k7
1522C95j930K032R09k451O84K238k040o06K108p17j683J961j6j593J173Q61j055
1539B70L99O2j92r5K7m80j75M1p10L22O06j092J05R86l97o13J047K8l59J063k43
$$ plain form
1419 -255 -930 -1063 -391 -665 -1109 -471 71 -723 -642 560 65 -677 1279 1429 -667 551 2206 337
1437 337 -183 2107 1203 -675 1621 1466 -1641 -410 1612 -1119 -1343 1320 -101 -1466 427 362 -1499
1454 -1499 -18 588 -949 -72 562 -635 -547 244 -847 -1094 646 -6 -509 1096 914 -911 741
1471 741 954 -739 -29 1382 82 -1053 286 -50 -1453 -1175 -108 -1062 -799 401 -89 -282 244
1488 244 719 -429 -133 1143 -14 -508 1312 875 -1484 245 1162 -479 -148 1478 642 -192 1398
1505 1398 735 -480 622 521 -839 56 384 -1359 -916 128 -1960 -2150 11 -907 -2202 422 395
1522 395 -1535 497 1406 -1045 -361 1877 -163 -769 1339 622 -1061 900 884 -709 464 1325 270
1539 270 669 731 539 444 471 -9 -184 -143 -853 -531 75 -1017 -912 74 -323 -936 111 139 -220 843 600
1560F00q87Q17L83j398M16Q71j147l61J206o28l03L82j05j39K49k80K12N57q26
1579c81n39P06k69n87R97l71k52O88M13q56M16Q22p94P85J73m83M21M91j195M6
1599B31J109j654k32J821q03j892J897M52k101N17J499j422m50J725q01j407J244
1616b67K43j430P81J011j429L48J680j184l88J333r2o37N26O44p54K8M06l75m31
1635A3J61j33N6l00K13jm48L15J68n51O65L04j091K98J040o82q67J359j76j368
1655a025J064Q17j660N38J169j009kJ334p39j107J475J31j882Q40R21j385n86
1672a106J372p46q07O95L89r32O64L90k81L20L91k44j84J146n98p66Q20K67p67
1691B3J91L27k19l88O79O7o08N47P3l56n65O33k6o16RL61j070M2P49r00p0R29
$$ plain form
1560 600 -287 530 913 -485 -69 802 -345 -706 500 -128 -431 -49 -154 -293 -44 -324 -112 445 -381
1579 -381 -920 -214 -483 -1070 -73 -444 -696 -8 405 -451 -35 787 -7 778 951 468 889 1380 185 231
1599 231 1340 -314 -546 1275 472 -1420 477 929 -1172 -655 844 -578 -1028 697 -104 -1511 -267
1616 -267 -24 -1454 -673 338 -1091 -743 937 -247 -635 698 606 -31 495 1139 385 413 819 444 13
1635 13 174 41 97 -203 10 9 -439 -124 44 -507 158 462 -629 -331 709 27 -840 519 343 -1025
1655 -1025 39 856 -804 -266 903 -106 -108 1226 487 -620 855 986 -896 -56 865 -520 -1106
1672 -1106 266 -480 -1287 -592 -203 -1135 -471 -81 -362 -42 349 105 -79 1067 469 -297 523 790 23
1691 23 214 541 322 -66 613 680 72 619 692 336 -229 404 378 -238 -229 132 -938 -896 -147 -1047 -1117 -188
1713a88n70l88J401k85j072J155J056j701N63J383j654j79J765j102j193J724
1729G15M7j471J097Q34j566L80J020j166l73J468p71j213J130q1q85O81N05r43
1747e92lJ449q77k65R23N9r13N78M82o46k78N26%n34j57L17l78j34N84p4m50L08
1769g5L55q89O4P70q85k15J185q60r62J728o8j834J450J180j891O52J918j636
1787a3l81K051n11j733J484K20j150J96O69j171R7N68o08n09R94j24o47Q72l01
1806Cm72L55L46p92K0P79q48J62O94o92QO67l24pM41r8n6M22J16p80K71K67o14
1829a32K67r3l75J59K69o57j94Q23n29p0N64K27o07L84M60n48m08P41L54p12l7
1850a14N77l25q2K67Om81P12L32o50m12R22k65r10P15j78o54L07M53r49k62Q87
$$ plain form
1713 -188 -758 -1146 255 -30 -1102 53 1109 -592 -29 1354 -300 -479 1286 184 -1009 715
1729 715 762 -709 388 1222 -344 36 1056 -110 -483 985 214 -999 131 50 -835 -154 351 -592
1747 -592 -595 854 -23 -288 635 694 -219 359 841 195 -83 443 443 -91 -248 69 -309 -443 141 67 -383 -75
1769 -75 280 -609 -545 225 -660 -875 310 -550 -1512 216 148 -1686 -236 944 -947 -295 1623 -13
1787 -13 -394 1657 1146 -587 897 1117 -33 163 832 -339 -242 326 -282 -791 203 79 -568 304 3
1806 3 -469 -114 232 -560 -540 239 -609 -447 247 -445 -437 230 -94 -101 340 242 186 608 724 -56 215 482 -132
1829 -132 135 42 -333 -174 95 -562 -756 67 -462 -532 32 259 -348 36 496 -52 -460 281 635 -77 -114
1850 -114 463 138 56 323 329 -152 560 892 242 -170 752 487 -423 292 114 -540 -233 220 -729 -991 -104
1871a04l84k91R37n49p09J310K92j469Q88R39j146q7J165m45j030J061L85j105
1889c42K94J001r65r9Q31O5q59M76j67k78n8K24m45J3J66j43q2L46o21K43N04
1910A04j8o37M25Q01m38n88Q64q8q70N93P45p97l25Q93l50o51P22j15p14L88P80
1931G24j120K85M70j028mJ126r87n83J188j67q43J030K51q74L85J119r04J0R45
1950A023m55p98J138m58p84O75L67j135K65P66r54o1N88k53m97Q06m45m71N18
1969a65K71q93J26R56o08m40R03Mn56r6P73m7m96O12O91q35m42J236q27n96R81
1990E52j81q85L64N38q58K49P39p83k40Q51l13q97R75L35r57M37O54j540M66J028
2010E34q17n39J464O8j081R26K52j507Q77Q73j138r7O09j74q23P41J21j176M70
$$ plain form
1871 -104 -488 -779 158 -391 -1100 210 502 -967 -79 860 -286 -373 792 347 -683 378 763 -342
1889 -342 -48 953 -12 -111 720 785 -74 402 235 -43 -101 123 -322 -309 -143 -286 -368 -22 -643 -400 104
1910 104 86 -551 -126 675 237 -351 513 425 -445 148 893 96 -229 664 314 -337 385 270 -444 -56 724
1931 724 -396 -111 359 -669 -673 453 -534 -1117 71 -96 -939 91 342 -532 -147 972 68 78 1023
1950 1023 568 -230 908 450 -334 341 708 -427 -162 604 -350 -411 177 -76 -573 233 -212 -683 -165
1969 -165 106 -787 -661 295 -313 -753 150 154 -402 -498 275 228 -268 344 1035 200 -242 994 167 -429 552
1990 552 371 -514 -150 388 -470 -221 518 -265 -505 346 33 -864 111 446 -511 -74 580 -960 -494 534
2010 534 -283 -822 642 710 -371 555 807 -700 177 1050 -88 -185 424 250 -573 168 289 -887 -417
2029d17P46p77Q9N73o04J18J1N77m47k17N30J52o35K95M72o80O2O41k3o08M04
2050B62J85n33L44J15k58J60j05k86K60J25m50m17O64k74m41K38N42p58K33L67
2070b7k23l27M89j04J42L01m2n8m6L5K3J15Q3l61K94on34N03P1j00k48M78j78
2093B80o02K41o1r8j15J28r9l47N10k36K84J7J24K92N3j58k68K73K39k07k04K16
2115B62j62k41J59K18m19r0M20lp13P60J02n64J30L30n02j93O16l57m24O50J56
2136A35o10J94P20p70j0R75m11j40L50o9l76L38m7k99q3M98n69K70K36m20r7L71
2158A86j47l87M60k47j0j22r6o6K64J33m15K58M54k77j24L71n1p6q1J92rQ5p3
2181B22mj78K6J25j34j69K66j20l28L98j04k98J42J78j35k42N68k08m42N51N6
$$ plain form
2029 -417 329 -448 -359 214 -390 -272 -261 316 -131 -348 182 334 -301 -6 466 -214 -152 489 466 -142 262
2050 262 447 -86 258 373 115 275 170 -116 144 269 -181 -598 66 -208 -649 -411 131 -627 -394 -27
2070 -27 -250 -577 -88 -192 -50 251 209 151 105 140 163 278 361 0 294 288 -246 257 328 228 -20 458 280
2093 280 -322 -81 -142 -240 -355 -227 -326 -673 -163 -399 -115 -98 26 318 371 213 -55 218 457 250 46 262
2115 262 100 -141 18 236 -183 -273 147 144 -569 191 293 -271 -141 189 -313 -506 110 -247 -671 -21 135
2136 135 -475 -281 439 -331 -341 634 223 83 433 364 -12 326 279 -20 -103 395 -174 96 332 -88 -185 186
2158 186 39 -348 112 -135 -145 -267 -363 -429 -165 -32 -447 -189 265 -12 -136 235 184 108 27 219 210 295 222
2181 222 218 40 66 191 57 -112 154 34 -294 104 0 -298 -156 22 -113 -355 213 5 -437 114 170
2202A70l70M34j66m06N30M44o93m92J131j29r43J002J82r32J63O28r54k81J286
2221F04r30m41J164m23r86Q23M58j093L91J150r86l08J218k77q08O20J8l99L3
2240a72O60n32l3L86O2n91N30K04n35M27j05l73l00N86n03k10L63M28o75L5M36
2261H8k06k74L69n8k60L94K63n23J26O97o76j46L78J38l16N09p7o68L70M27m37
2282A18l84L86j89m76O84K35j090N55L64m42n11O55N2m79L82J37J0k46K31J0K7
2303B9Q1o5j72M50K4l46K07m1l74J65R2j79j16K43J19k13J33J9k39P2K90o23J64
2326b80K15j2k05K25l7j24M35q6j62k32M49K3o6K04j75m58P70o9n56J17K93l62
2348i3J37K05j60m15m4J46J49K42n74n9N02j6l81J47M84l65j94L23J41j74p3L02
$$ plain form
2202 170 -200 234 68 -338 192 636 -57 -549 582 453 -490 512 694 -238 -75 553 -401 -682 604
2221 604 -326 -767 397 -26 -1012 -189 269 -824 -433 717 -269 -577 641 364 -444 176 194 -205 -172
2240 -172 488 -44 -77 309 371 -220 310 514 -21 406 301 -72 -372 214 -289 -499 -136 292 -383 -348 88
2261 88 -118 -392 -23 -81 -341 53 316 -207 -81 616 -60 -206 172 310 -6 503 426 -242 128 555 118
2282 118 -266 120 -69 -545 139 374 -716 -161 203 -239 -750 -95 -43 -522 -140 -3 7 -239 -8 2 29
2303 29 110 45 -127 323 347 1 208 167 -207 -42 50 -129 -245 -2 117 -96 37 56 -183 -111 179 -444 -280
2326 -280 -65 -77 -282 -57 -94 -218 217 131 -31 -263 186 209 143 347 172 -286 484 415 -141 -24 269 -93
2348 -93 44 249 89 -326 -370 -224 -75 167 -407 -466 36 20 -361 -214 270 -95 -289 34 175 1 -72 230
2370B30Mj54K54j89L66l39k00j29L80p3m41L86K8l00O0J28j80N5p3J29J12n13
2392d59L74L8j14J12L19m52q4L47j78m9K70m9n2J38J20q4q5J94l02J68N9m60K19
2415a0j86p4N8J61r0l65M21K01m66K59J81k16J85J91j87j92J29j64k03O90l85
2436f2J81M77j59l47K17N3k75k48N25l05j96P1J65m60J07K73l68K99r5l05J81
2457b71K59j9k34J34J37j59N4M57l39r6L44J53p39N27J59j53k38O53l05o24K46
2478e4M08o48J69L39l11l73N39j09n04K73L45k92J22K58k68j10M13j13l95L34
2498B3K62m36Q4N97m95n1L54j85p64P55K25o07K50L09o42K6L51k69k44K77j08
2519b88N4K00M54n59J35K36m34NN43lp16O42q6j44j84N57l57R2N6P0m40L26M34
$$ plain form
2370 230 234 80 334 145 511 172 -28 -157 223 150 -291 95 123 -177 -117 11 -169 -114 -187 -58 54 -459
2392 -459 -85 -47 -161 -49 270 -182 -266 81 -97 -146 124 75 23 161 281 197 112 306 4 172 231 -229 -10
2415 -10 -196 -270 -212 -51 -141 -506 -85 116 -350 -91 90 -126 59 250 63 -129 0 -164 -367 323 -62
2436 -62 119 596 437 90 307 360 85 -163 362 57 -139 -68 97 -363 -256 17 -351 -52 -147 -452 -271
2457 -271 -12 -31 -265 -131 6 -153 -99 358 19 -77 267 420 -319 208 367 214 -24 629 324 -300 -54
2478 -54 354 -294 -125 214 -97 -470 69 -40 -544 -271 74 -218 -96 162 -106 -216 197 84 -311 23
2498 23 285 -151 -67 530 35 -16 338 153 -611 144 369 -238 12 321 -321 -295 56 -213 -457 -180 -288
2519 -288 -234 -34 420 -139 -4 232 -202 -197 346 343 -373 269 183 39 -145 412 55 147 203 273 -167 159 593
2542E93p45J55K81l34l75N46l65k24L03N8k92M93k33n2K84q0k21J18J87m3j04
2563e0J53m9J11l6J67J29m79L81r0n63N84l1l08k8M31n61k8K10R4k51K55j74M5
2586h8q5K18k45R4N41n52l5Q8J77j30jN1j18J01J42m7j04L47j67j44j11K95k75
2609d8j91M09l43j72L68k0k85P8M35n45L05K93m87j37O25k29l60L75K19j51j10
2630B9K74k12j55N67l62m93L43K75n43j08L83N8l13J29K6k38j0J44l2r6J71P0
2652i3J09j11j18K12J52j52j79K15k84N82l14m0nl2K02J4MK4n9m7m9k35L27m31
2676c08K01J2j6K7j17K34j4J44%J08m22M4Rj59J74J17j88p2L69q2L5m72M36J95
2700B55j39k6k6k11j41N17l82q0K71k13l10J75N83m85q5L98j09Q4M3J3n19M65
$$ plain form
2542 593 -152 3 284 -50 -425 121 -244 -468 -165 -107 -399 94 -139 -191 93 13 -208 -90 97 54 -50
2563 -50 103 54 165 129 296 425 -54 327 237 -326 258 227 -81 -109 322 -239 -267 -57 37 -214 41 -133 -88
2586 -88 -173 45 -200 -106 435 -117 -152 -64 113 -17 -18 33 -85 16 158 111 7 354 187 43 -68 227 -48
2609 -48 -239 170 -173 -345 23 3 -282 -204 231 -314 -9 284 -203 -340 285 56 -304 71 290 139 29
2630 29 303 91 -64 503 141 -352 -9 266 -277 -385 -2 56 -257 -128 -102 -340 -350 -206 -238 -334 -163 -93
2652 -93 16 -95 -213 -1 151 -1 -180 35 -249 333 19 -21 -26 -58 144 158 162 186 127 80 31 -204 123 -308
2676 -308 -107 -95 -111 -84 -201 33 19 163 163 271 -151 -107 -98 -257 -83 34 -154 -226 143 61 96 -376 60 255
2700 255 116 90 64 -147 -288 229 -153 -233 38 -175 -485 -310 273 -212 -297 101 -8 76 119 132 -387 78
2722G8J64k17P0mJ27k76K0K16p8j27N37k22m6J23l51p2K38l6k95j64R6m0l7L15
2746A9k54K08J04p7q5p7L26m42L48K29l27l4J81P3l09N10n06k2J46K17j13k80
2768a65L29m45K43k13N57m42J48J56m52J28K65J02m15L28j35l64K65J08J11k05
2788i6L09j93R2j42J97m15K38k09R4L06Ml61J98k77J47l7K85l67n8J90j2%k58
2811c65L65Qk88L79Om19J83K27K0l59N50J2J5j04j11M3m8J53j77J8m2p4l11M44
2835A25J0l30m3J66J35Q8J53n42j1L96l50R6L4J17l13R7K82k94o3L12L3j00%M21
2859D19l72J08m2k20J64J37j24k56J99K42l90j29R2J14k62K86L64m26K03M0n7
2880I0j67K99k86Np1K43j81K09r9L10l10N59k50k40pr3K40n5K1k84O3K1o9j07
$$ plain form
2722 78 242 25 95 91 218 -58 -38 178 100 -27 510 288 242 365 14 -58 180 144 -151 -315 -219 -259 -296 19
2746 19 -235 -27 77 0 -85 -162 164 -278 70 299 -28 -62 119 192 -117 393 -113 -135 11 228 115 -165
2768 -165 164 -281 -38 -251 306 -136 12 168 -284 -156 109 211 -204 124 -11 -375 -110 -2 109 -96
2788 -96 213 20 112 -30 167 -248 -10 -219 -125 181 185 -176 22 -255 -108 -145 140 -227 -285 -95 -107 -107 -365
2811 -365 0 8 -280 99 105 -314 -131 96 116 -243 307 319 334 230 119 162 114 267 90 108 66 -8 -319 125
2835 125 135 -195 -238 -72 63 151 304 -238 -249 147 -203 -107 -73 44 -269 -172 110 -184 -247 65 98 -2 -2 419
2859 419 47 155 113 -107 57 194 70 -186 13 255 -135 -264 -172 -58 -320 -34 330 -96 107 147 90
2880 90 -77 222 -64 -59 -130 113 -68 141 42 352 42 601 351 111 104 11 251 196 217 -67 -4 17 -52 -159
2904a59J6j6M2J24k00k59L04K21j27P9j24J16j81K71j26K48m12O0M28k73K11k00
2926D3K05l13K76m05K03n6K3j14K06m0O5k28J90N2k93P4j20K29m02L13l3J23M8
2949D6o8K1Q0O5k41K53j04Q3R4k59K51Mm2j99O1J18l73K51M8Qj5l99K08N5Q8l30
2975b96K50j1o5K32J59j45J93k54J01J20k43L21m07K07o5l31J00L28k9l87K73
2996E1k14k08J66M7K16l0j78K4j25J45o8R4p7Rq3M20j70O5q4l1L62k10P3P8q3
3021A89j88O5M9j13Q7ok79P8J8Q1RJ11r1q7OJ1q3j4Q8K1j65L2N2j4J65Q7k01J99
3049A07K27l59J08O7j49L4N9l2l16L05J74m04L35Q8l45j84J39J3j68K33R2N7l15
3072b34L00n8j05K77l60Q1K42L34l93o9J75j85j02qL06l3mO2n29K42K67j73l13
$$ plain form
2904 -159 -143 -159 -117 7 -193 -452 -148 73 -54 25 -99 17 -164 107 -19 229 -183 -123 305 32 243 43
2926 43 248 -65 211 -194 9 -47 -24 -138 68 28 93 -135 55 107 -186 -112 -232 -3 -405 -92 -125 -2 46
2949 46 -22 -1 79 144 -97 156 52 135 229 -30 221 225 183 -16 45 163 -210 41 89 97 82 -317 -109 -54 34 -296
2975 -296 -46 -57 -122 110 269 124 317 63 164 284 41 362 -45 162 97 -234 -134 194 165 -222 51
2996 51 -163 -371 -205 -158 58 28 -150 -126 -251 -106 -174 -80 -157 -148 -231 189 19 84 0 -31 331 121 194 272 189
3021 189 1 66 115 2 89 83 -196 -118 -100 -19 -10 101 10 -77 -71 -60 -143 -157 -69 -48 -213 -181 -129 -143 22 109 -92 107
3049 107 334 -25 83 150 1 35 94 62 -254 51 225 -179 156 244 -101 -285 -146 -133 -301 -68 24 81 -234
3072 -234 66 8 -97 180 -180 -99 143 477 84 15 190 5 -97 -105 201 168 164 226 -303 -61 206 33 -280
3095b80M91m42J74J04Mm77M64J39j58j12J40k6l0l8r3j59L75J57l52N39j88q7
3117A45l92K59N1k75L13L32k19m7J19k00j15J13p9nj30R9qj61J87j06OJ49N4j41
3141e1K8J41j33J5K0L34m91k4L34J2l09N2j49K44j1j52J5j01K96k82O4j11K19
3164d0r7oJ98N6k10j15J24J94j20P2k6J66M6j72J00M2n3j82K44k01o7P7J23j16
3188C7K02j94j15J42j50l6P9j8J00k56N3N3n7l1J41j29L4k4J26J37j27n6J58J29
3212A98P4k27Q8j1j7j36k0l7k78M73j62L6k0L2J42j80K05j00k26j39M15j07l8
3235c5p1o8JL16q4J81j22k57M82j39j40k33J61P1m4j69O4K74j91l81M66l21J2
3258b27K42o2l2J87j49p9j48j9K34O1q4k5O8K3K82l59K58K86n36M00m36K18Kj73
$$ plain form
3095 -280 211 -231 -57 47 51 -426 38 177 19 -93 47 21 -9 -47 -140 -299 76 233 -119 420 232 145
3117 145 -247 12 63 -212 101 433 214 167 286 86 -29 84 5 0 -130 -31 -39 -200 -13 -119 -113 36 90 -51
3141 -51 -23 118 -15 0 20 354 -137 -161 173 185 -124 -72 -221 23 12 -140 -125 -226 70 -212 -148 -259 -40
3164 -40 -137 -143 55 111 -99 -214 -90 104 -16 56 30 196 242 70 170 212 159 -23 221 20 -47 30 153 37
3188 37 239 45 -70 72 -78 -114 -35 -53 47 -209 -156 -103 -160 -191 -50 -179 -145 -169 -43 94 -33 -89 69 198
3212 198 272 45 133 122 105 -31 -51 -88 -366 107 -55 -19 -39 -7 135 -45 160 60 -166 -305 110 3 -35
3235 -35 -106 -174 -173 143 59 240 118 -139 343 204 64 -169 -8 63 19 -150 -86 188 -3 -384 82 -239 -227
3258 -227 15 -47 -79 108 -41 -120 -268 -287 -53 8 -76 -101 -33 -10 272 -87 171 457 -79 321 -115 103 105 -68
3282f8J98j31R1M6j28l5m2L04k17j07j19J36k50K73j82O6J46l4M1m9J04J23q2
3305H4L4r0k09J27N9k11K40n3K15k10J53o2k9npJ07m59J89J03R8k05N7J30m16
3329c60J60K32j84K34r2q1J63L14k35k1p5J11j35p0K03j0m91M56q7j29J69lM6
3352A15q2l1J54k84J19J15k02J40j96R4j44Q5O0J04k15J68l4J73j79J30o8M8j71
3375a01J28k02L72l21J80J03j28K39l64j07K31j51L01k59m9K88m47K71K05m7k41
3396i9n1J53k95J95K58r9J28m57N24k32oL44k39j69J47O6n3k15K87l83K11l57
3418c42L10j32J42p3L4k5k5L40k19l60J95K22k1p2q3r0L51j98P5q5J55k36J83
3441D6mO2J22j05P7j11Pk5J06K9l1r4n9p4j31J77k00j5K48P3k34J28m0K5Nk0l3
$$ plain form
3282 -68 130 -1 90 136 8 -27 -69 235 18 -89 -208 -72 -322 -49 -231 -165 -19 -53 -12 -61 43 166 84
3305 84 118 28 -181 -54 5 -206 34 -19 196 -14 139 77 48 43 36 143 -316 -127 -24 74 -131 -74 56 -360
3329 -360 -200 32 -152 82 -10 -91 72 386 151 130 55 166 31 -39 164 154 -337 119 32 -97 72 69 115
3352 115 33 2 156 -128 -9 106 -96 44 -152 -58 -202 -117 -57 47 -168 0 -34 139 -40 90 22 70 -101
3375 -101 27 -175 197 -124 56 159 31 270 -94 -201 30 -121 180 -79 -128 160 -287 -16 189 142 -99
3396 -99 -150 3 -292 -97 161 62 190 -267 257 25 19 363 124 -45 102 168 115 -100 187 -196 15 -342
3418 -342 -32 -164 -22 -95 -61 -86 -111 229 10 -350 -155 67 46 -26 -109 -199 152 -46 29 -56 99 -137 46
3441 46 42 104 226 121 198 87 94 69 175 204 173 79 20 -54 -185 -8 -208 -223 25 98 -136 -8 -48 -23 -18 -38 -71
3468g1O7J03j29J02q3l1n3M05q2n3j48J12K7l3j13M4J9q1j69K06p8k31L18j13
3492f5K62j26K1k78J61L1j50r5Q2K10R2k25R8p1K61j93k55J99n2k0r8L2r9K24
3516e4J03j11JQ4J44k10n3K26j25J64j18K9j5k48J36j01K60j4j67rK26j08o8P8
3540E0k5J30r2k1Mk16K60K1k26q9K36Q3j09m2p2j2r9J57q5k5L56k12NR7l9r2K8
3567b9rL3k98L38j5Q0j75l9J9J22L2J02j53k65K51n6q2J67J51j10j31j99K28l5
3591g3K5K8O7q5K19o4k84L34j14q5jJ17L08k09m16J48J17n0K25m7k74M09l50J91
3615A36j32j40J55j86K04P1k04J04J1L5o5l4k52K63j75M11m75L32J00l03K08q7
3637b3K31l77J85j50l2J04j38N1N7P5q8Q1j79M3J03J60j43K05j24J83l45J2J30
$$ plain form
3468 -71 -4 99 -30 72 -11 -42 -95 310 228 175 27 139 166 133 20 64 83 2 -167 39 -39 -270 48 -65
3492 -65 197 71 92 -186 -25 6 -144 -239 -157 53 145 -80 18 -53 208 15 -240 -41 -93 -113 -211 -179 -278 -54
3516 -54 49 -62 -61 23 167 -43 -96 130 5 169 51 80 65 -183 -47 -148 112 98 -69 -78 148 40 -28 50
3540 50 25 155 63 42 46 -170 90 111 -115 -204 32 115 6 -36 -108 -120 -219 -62 -147 -172 184 -28 -23 74 35 -57 -29
3567 -29 -38 -5 -303 35 20 100 -75 -114 -95 27 59 161 8 -257 -6 -62 -144 23 174 64 -67 -266 -38 -73
3591 -73 -48 -20 47 -38 181 117 -167 167 53 -32 -33 84 392 183 -233 -85 32 -18 207 160 -114 295 -55 136
3615 136 4 -136 19 -167 37 108 -96 8 19 54 -11 -45 -297 -34 -209 202 -273 59 159 -144 64 -23
3637 -23 208 -169 16 -134 -166 -62 -200 -149 -92 -17 -105 -24 -203 -160 -57 103 -40 165 41 224 -121 -109 21
3660B1j12K56k81J36J76l78K39k5j7J36M7j90K62j76n4q5M3rK9L31l91j76K75
3683E7L4q8l4k24P4M2M51L2m01O5J1j05K48L7k07J01K41l13p1M3K1j3k23J78R0
3708D6k52K35k77L28l1m6j34J46R7l78L08l78L12k79K88M3nk41J66L32m3l73K24
3731H8L1P7l7j95mK04P7m76L16j02K52k13m1N2j91K77J04l39N5J19r3k2Q5p3j28
3756a77K23J27k60q0K39J63k10j73J67RL1j34K32j17P2j62Q5k3r5j55K29k8K9
3779hJ50p3k36L04r6L4k30KK90l45j15L46k9J05O4k68K40j34j3j19L35m6Jk10
3803e1M6J16L1k97M4K55k40Q5j89J50j78jR5J10p8p0j73M29j97N0J7L50p1j12
3827A21j63n2K87k53J82j05j65L38j10O7P1j89o3j30J03J81p8K5j57J74j5l54
$$ plain form
3660 21 -91 165 -116 20 196 -182 57 32 15 151 198 8 270 94 40 -45 -2 -11 18 349 -42 -218 57
3683 57 91 3 -31 -255 -181 -139 312 344 -57 8 19 -86 162 199 -8 93 334 21 -50 -7 14 1 -222 -44 46
3708 46 -206 29 -248 80 49 3 -131 15 112 -266 42 -336 -24 -303 -15 28 23 -218 -52 280 237 -136 88
3731 88 119 196 159 -36 -40 164 241 -235 81 -21 231 18 -23 29 -162 115 219 -120 -65 54 -39 -61 24 -49 -177
3756 -177 46 173 -87 -167 72 235 25 -148 19 28 59 -75 157 40 112 -50 35 12 -83 -238 -9 -37 -8
3779 -8 142 69 -167 137 41 75 -155 -153 137 -208 -323 23 -6 99 163 -105 135 1 -12 -131 204 158 159 -51
3803 -51 -5 111 142 -155 -111 144 -96 -11 -200 -50 -228 -229 -134 -24 -102 -172 -345 84 -113 -63 -46 304 233 121
3827 121 -42 -94 193 -60 122 17 -148 190 80 147 218 29 -34 -164 -61 120 42 67 -90 84 69 -285
3849b85J35J90r2n6L39j39l34L24k69O5J93j6j26K54k65L05j76k66M74m03K37
3870H9j76J47p1k05K22QJ9o0m3M4p8L65l64K24N4l48M21j52k49O7j9K4J07J2M9
3895H7J31l06o0J40k45L93r8K09m06J17J11k63K98j88K03o0j7j48J95j63L03k56
3917b3P7m4qJ07n9K4nj9N4j11J39jj10m6j49M41j29j1j16j74K90j71%N3j60MJ36
3944a1O4q4m1O8j27K18j04J60k63L12k38l77O52l3n7l33L11r7P6k99K10O0k94
3967b27J78O5J5j48PN3Q6k5j04J79j17K59k41J36l10K84j8k73L36k70J67l9K06
3990A99l12J93N7R9l5j10j71K50j43k3j18N6K41m28K18J31O2l13KP4N5q9j74L75
4014I6q4P9j22l9J35n3P5k14J89j18K43k25Q0j31j83J73J14L10k00l09R1P7P0
$$ plain form
3849 -285 -150 40 -52 -108 231 92 -242 82 -187 -122 71 55 -71 183 -82 223 47 -219 255 -148 89
3870 89 -87 60 -11 -216 6 14 33 -27 -70 -26 -104 261 -103 121 175 -173 248 96 -153 -86 -105 -81 26 38 87
3895 87 218 -88 -148 -8 -253 140 42 251 -155 -38 73 -190 108 -80 123 63 46 -102 93 -70 233 -23
3917 -23 54 10 2 109 50 74 69 50 104 -7 132 131 21 -25 -174 267 138 127 11 -163 127 -44 -44 9 -151 -147 -11
3944 -11 53 -31 -72 -4 -131 87 -17 143 -120 192 -46 -423 229 196 139 -194 117 20 96 -203 7 67 -227
3967 -227 -49 16 31 -117 -110 -57 29 4 -100 79 -38 221 -20 116 -194 90 72 -201 135 -135 32 -7 199
3990 199 -113 80 137 236 201 91 -80 170 27 4 -114 -58 183 -245 -27 104 166 -147 -145 -71 -16 -105 -279 96
4014 96 12 91 -31 -70 65 12 87 -127 62 -56 187 -38 42 -89 -272 -99 15 325 125 -184 -93 -16 54
4037E4q0O1o7O6L9j42k64M58j89L3J79j43k17K37j65M16p1k52j16M84n05M09l00
4060g5K89j49j12M8m97N53l00L00j11l4k1K81j65k0l81L12k94L88l06J39R0K69
4082B04j32q0p0J76j59J23N7k72M67k51J10j78M0N7q4L3n8Q6M3k40N2k49L62J46
4106A83m72J90K11j45j4Q3p5J4m8j97L99k8K22k93J72k97L33l30K25l41m1M44
4128A95k66K58m25K46k07J45k58J56J79j49J2KJ6K79k78M4L32l86M7J98l14J57
4150a7K08j35j72N4j3l6L5O1LK97j54N3j58J68j72l3J28k70N3o0J78Q7j43P2M7
4175H1j97J94K9M9j85N9j38l8N5J85j39K00j76Q8j83J51o6k40L49J16l50L34m10
4198b32L83k77J42N2p7k54K88k00K05J5n6j0P6No0K13j36j31j53P0J16K07l03
$$ plain form
4037 54 -26 35 -32 34 73 -69 -333 125 -64 -31 148 5 -212 25 -140 276 205 -47 -163 321 -184 225 -75
4060 -75 214 65 -47 1 -496 57 -243 57 -54 -88 -109 172 7 -13 -394 -82 -376 12 -294 -155 -65 204
4082 204 72 -8 -78 98 -61 62 119 -153 314 63 173 -5 35 92 8 41 -17 69 112 -128 -76 -325 37 183
4106 183 -289 -99 112 -33 -47 36 -39 -25 -73 -270 129 101 323 30 202 -95 238 -92 133 -208 -249 195
4128 195 -71 187 -238 8 -199 -54 -312 -156 23 -126 -114 -112 -96 183 -95 -51 281 -105 -58 140 -174 -17
4150 -17 191 56 -116 -62 -75 -111 -76 -15 -12 285 131 184 26 194 22 -11 117 -153 -100 -160 18 105 -38 34 81
4175 81 -116 78 107 156 -29 30 -108 -146 -91 94 -45 155 -21 67 -116 35 -31 -271 78 194 -156 178 -232
4198 -232 151 -126 16 68 -9 -263 25 -175 30 45 -11 -21 55 60 0 213 77 -54 -207 -137 -21 186 -117
4221a17K39j41RK29j00r4j80p1L12j55K04l04L1J64j65k8M7M1j31J96r0j01L9
4244a66L7K16p8J01K2p0k4j27L22p4p2r5o8J71pl69L48r3J4J36m7j39J35m6p2
4269d5k4J73l31L74k7j23O2m7j55R5L44k01k33O5J08j37K21j97M8J21j88JR0J05
4293I9%j06l0j01J46j05N0L5n7Q9j34J99R7k0o0o6k07K71jn5pJ65k51J61P5j27
4319F0j1k03J44L5J1j16L02l63l7K03q1R6q4R4r1k21M35l85K63j97L7J15j26O1
4343e9j9J13J79l09j14K48k7K37J50l61k7K36m15M1r9K93l30J33L28k85L8Q5P4
4366A10l57J88R9Kj72J26o1k6K92l15J92k29M74l36m4K35k69K8K17K8l77J58J07
4389G0J68j21K8k77L2O1j27QN3K36m10K52K48Lj64Q2N8k52N1j27P0k2J2j69K74
$$ plain form
4221 -117 122 -19 -10 219 119 25 -155 -226 86 -69 135 -169 -138 26 -139 -167 -120 -79 -210 -14 -104 -205 -166
4244 -166 -129 87 9 110 132 62 38 -89 233 159 87 -8 -76 95 88 -281 67 -26 -12 124 77 -62 73 27 -45
4269 -45 -69 104 -227 147 120 -3 59 12 -143 -48 296 95 -138 -73 35 -102 119 -78 -30 91 -97 -96 -6 99
4293 99 99 -7 -37 -138 8 -97 -47 -12 -69 20 -114 85 182 162 102 36 -171 100 99 44 37 202 -49 112 187 60
4319 60 49 -154 -10 25 36 -80 222 -141 -178 25 -56 40 -44 50 -41 -262 173 -212 51 -146 -109 6 -120 -59
4343 -59 -78 35 214 -95 -209 39 12 249 399 38 11 247 -168 -127 -226 67 -263 -130 198 -87 -49 36 110
4366 110 -247 -59 40 42 -130 -4 -65 -91 201 -114 78 -151 323 -13 -57 178 -91 -63 154 182 -195 -37 70
4389 70 238 117 145 -132 -100 -39 -166 -158 -105 131 -279 -27 221 224 60 142 200 -52 -1 -128 -58 -80 -68 -237 37
4414C7O2j20J8M2j89K54M3K21l06k2M4J16j92k45M00l45Q2L10l23J10N8j08j03
4437a56J10J23j6j42J73j36j68K92j50K55j84J9J22l40K82Qj99L0J07O0j82l3
4459a25K17j78q5K31l82L84o9L5o3j6K85j03j38K60j46K6p3K03p2k72J6J07K3
4482F5J41l9j77n8J68j02k15j21L54j21o2n3k5M10k67j6n9K3O7M4Jl7J90j39J14
4507H6P5j64J7n7K47k6k35J90k71J98l69J87N2J99Nj20j76J4K34j04p6K31j48
4530a1q2J24J23J33m27K58o2n5J96p3k32K69QR3p4m21K71p5j69K82J46k20Q2k08
4554a24K60k76J63j43k35K67L2J26J12k09p3K26j37Nk65J41j8J05K38k24P6j02
4576e5Kk4J06j52Q2M8K92k52j59K47q9J37l81K17m58L06n2P2J31n3L23l24J33
$$ plain form
4414 37 99 -21 -3 39 -150 104 147 368 62 40 84 200 8 -237 163 -182 -100 210 -113 -3 55 -53 -156
4437 -156 -46 77 61 -81 92 -44 -212 80 -70 185 1 20 142 -198 84 92 -107 -77 30 90 -92 -125
4459 -125 92 -86 -171 60 -322 62 -7 28 -35 -51 234 131 -7 253 107 133 60 263 191 -81 -65 42 65
4482 65 206 167 -10 -68 100 -2 -217 -338 16 -105 -167 -220 -245 165 -102 -118 -177 -154 -87 -43 -42 -79 111 -28 86
4507 86 161 -3 14 -43 204 178 -57 133 -138 60 -309 -122 -70 129 134 14 -162 -148 86 -18 -94 137 -11
4530 -11 -93 31 154 287 -140 118 56 1 197 124 -108 161 169 262 188 -233 38 -37 -206 76 222 2 84 -124
4554 -124 136 -140 23 -120 -355 -88 -56 70 182 -27 -100 126 -11 -6 -271 -130 -148 -43 195 -29 47 -55
4576 -55 -53 -77 29 -123 -41 7 299 47 -112 135 46 183 -198 19 -439 -133 -185 -113 18 -35 288 -36 97
4599I7J38k40Q9j16j7J07j46L10m44L17m67L26K39n7q5j48J27n3L3J12q7j62K28
4622A01k13p4K87jl50M1R1k8K1J05K33m14K03l2P1R8j87k37J71J38r9L06j20n4
4646E7n8r4oJ64J29j56j30r4J51J72k98K70n2j31j40J79J5L6N0q5K85j48kR4m88
4671b80l9N56j07j21J89p2j6l00M4k8L54n59K86j2O6J17l3j87J34oj70pJ44J00
4695E3j38J04M2l5j33K47j39J42j11P1j3N9j19J1Mr6j41K44j23J7l6N8q7J3L58
4720B52j56j39O0j52N9o2J75o8Q7k13L58k21k18L94j28J13j85J17k11L43j29l4
4742D2Q1j72K48l51J26J46O%R5N4n01K83j1k12k5K19M5j8q2JM1q5L32j91J15k60
4768g4K64k90j8K47j71J3j48J34J19j45J60j55N1M14m38K5j06L19q6k76P0N2q2
$$ plain form
4599 97 235 -5 84 -32 -49 58 -88 222 -222 95 -372 -46 193 136 51 -97 30 -23 10 122 35 -127 101
4622 101 -112 -186 101 100 -250 -209 -118 -146 -125 -20 213 -201 2 -30 41 139 -48 -285 -114 24 -75 231 111 57
4646 57 -1 -95 -101 63 192 36 -94 -188 -37 135 -163 107 55 -76 -216 -37 -22 14 64 -21 264 116 114 208 -280
4671 -280 -319 237 130 9 198 126 110 -190 -146 -174 180 -379 -93 -105 -39 78 45 -142 -8 -14 -184 -191 -47 53
4695 53 -85 19 61 26 -107 140 1 143 32 103 90 149 30 41 45 -51 -192 52 -71 -54 -90 -32 -119 -106 252
4720 252 96 -43 17 -135 -76 -138 37 -31 56 -157 201 -20 -238 156 28 141 -44 73 -138 205 76 42
4742 42 123 -49 199 -152 -26 120 126 126 221 275 -226 57 46 -166 -191 28 73 55 -27 -26 15 -70 262 71 186 -74
4768 -74 190 -100 -118 129 -42 -29 -177 -43 76 -69 91 -64 -13 401 -37 -12 -118 201 115 -161 -91 -39 -121
4791a21L3J99l55K13j03o7L13p4O3P6Ll6Kk14M9n9K11l41K51q3N3J3o2j62K10
4816A2j40Q1p0P1R6l6J19j74o4P7p2J73J20j28k35L02j88O7L8j23N9J67l27K82
4840A07j31j2j0k8j37K69j3j29J86k21N9j12O6Q7o3K1k6J25J85l60K39k27L83
4863B58l47O6J05j13O3k06J82J43j27r5L63q0j02j52j8L8m24L09J05p2O9j50m2
4886b27K12k33K30n6J02r5P4K35k16J21l4l14J80Q1Q2r1m4O8j44J90l25K59k02
4909a47K68NO2k56L89l77m5m1m1K1k2K9O7O8k59K98Nj19L1P6J73k66P0k4J61o2
4935F4j5J17n3no6jl49L04l6l7J30M8mM1j7k44K37k66j66K46m4J16L6P6p7J70
4961B05l70j2K27q1K17k18J03J32l16J15m9M1L6K25k40j73o1J76m0O6L5r5j70
$$ plain form
4791 -121 -88 111 -244 -31 -134 -201 112 38 101 177 180 144 146 -68 -19 -78 133 -208 43 -40 13 26 -36 -198 12
4816 12 -128 -47 -117 -46 50 14 133 -41 -105 -28 -100 73 193 65 -170 132 -56 11 49 -74 -15 152 -175 107
4840 107 -24 -36 -46 -74 -211 58 45 -84 102 -119 -60 -172 -106 -19 -82 -61 -87 38 223 -137 102 -125 258
4863 258 -89 -23 82 -31 32 -174 8 151 24 -71 292 212 110 -42 -60 -22 -446 -137 -32 -104 -35 -185 -227
4886 -227 -15 -248 -18 -74 28 -67 7 242 26 147 113 -201 -21 60 142 51 7 75 -69 121 -204 55 -147
4909 -147 121 126 188 -68 321 -56 -101 -142 -183 -162 -184 -155 -88 -20 -279 19 24 -95 -64 12 185 -81 -11 -35 126 64
4935 64 49 166 113 108 42 41 -308 -4 -40 -77 53 101 97 138 121 -123 114 -152 -318 -72 -116 0 36 112 35 205
4961 205 -165 -177 50 -31 186 -32 71 203 -113 2 -47 -6 30 255 15 -158 -219 -43 -83 -17 18 -77 -247
4984b47L4n8M91j30k16m3K78j16K63n16K19K06q5K63k87J28k4l38K41k14Q2j1
5006h0Rl3L07l25J10l00J54K72j65J20l5m6J05j56R8J33r5R4j21K0m9J42n2J58
5030B65j58j94L03k59j53K02J07J11j09k90P8N8P0k46K14j32m7J8L4L32k83K41
5052A62k31K9j25M23j68j97L05q7N7j54P0j52J32J17Mr8lJ08l20L19j75K63j2
5075B67k61qj29P6K18j75j63J47J85j05K63j60k94R9J07j19J42k82J07J43J37
5096A95m1l29J4J70qj02K11kk20K89j21q1N6j17k09L77j30j12O6O9j62K82J72
5119B67j80Q9K2l71K85J6J13l87J13K47k79J97q3m7j81K87k88K88l84L33k47K45
5141E5j30k24K74k24J73N2r2J32l0RJ38j95pL02k04o6j65L08j0K8R9k03l5l42
$$ plain form
4984 -247 -213 -271 220 90 -126 -169 109 -7 256 -260 -41 165 80 343 56 184 160 -178 63 -151 -69 -80
5006 -80 -71 -104 203 -122 -12 -312 -158 114 -51 69 34 -12 93 -63 35 168 73 167 46 66 17 159 107 265
5030 265 107 -87 216 -43 -196 6 113 224 115 -175 -97 -39 31 -215 -1 -133 -180 -162 -128 204 -79 162
5052 162 -69 -40 -165 258 90 -107 198 111 168 14 84 -68 64 181 185 87 84 192 -128 191 16 279 267
5075 267 6 -2 -131 -55 163 -12 -175 -28 157 52 315 155 -139 -40 67 -52 90 -192 -85 58 195
5096 195 154 -175 -161 9 1 -101 110 108 -112 177 56 -25 31 -86 -295 82 -48 -160 -94 -25 -187 95 267
5119 267 87 176 198 -173 112 128 241 -146 -33 214 -65 132 49 2 -179 108 -180 108 -276 57 -190 55
5141 55 -75 -299 -25 -249 -76 -24 -116 16 -14 -5 133 -62 -69 233 29 -37 -202 106 96 124 223 20 -15 -357
5165c57N32k02J15J3j8j14k36M52k21L9O2j2Mok6j44l0L46m0k01J01j70K46O8
5189B01k13J52j49O5k0O3k1j93J84j06J99K2J43j89k19nN5j14M7O6p7J00K39l48
5213a18N0n0L2J37L8N6m03M14J70j70j46O3q8M3j8k91R6j8J24q4K39q6O9J57m09
5238a93J86J61l03M3oJ48mJ76j21K78j66j21L6j02J72l77J94r2K43k23L9L49J1
5261C28j68J0%k60K40k7j92R2j5p9O7LRJ7L7j45R7l8J26j59j43R9J54r6P5l2L5
5288C5K19j71k23M69k99L1J31j93k3j39K26j27r8K53k89J05r8J48j05J60J73j34
5310E1J4k35R0N8J05k8j89K0K40m5k49M52k33j04J99j75J95k75J89j47N4K4n5
5333d4j15J10j55M8m1J96m2k24K5K89j70K20J02k37kJ25j51OK60k0mko5J78m12
$$ plain form
5165 -357 175 -27 88 101 83 -31 -267 185 -36 3 65 53 57 51 25 -119 -149 197 157 -44 57 -113 133 201
5189 201 -12 140 -9 56 36 99 78 -115 69 -37 162 184 327 138 -81 -86 -31 -145 -98 -32 -109 -9 230 -118
5213 -118 -68 -118 -86 51 89 145 -258 156 326 156 10 73 -15 28 10 -281 -185 -203 -79 -163 76 -10 59 216 -193
5238 -193 -7 154 -149 -106 -112 36 32 208 87 365 199 78 114 12 184 -193 1 -91 152 -71 -32 317 328
5261 328 160 170 170 -90 150 123 -69 23 8 -71 -4 -1 8 25 62 -83 14 -24 102 -57 -200 -101 53 -43 32 0 35
5288 35 254 83 -140 329 30 61 192 -1 -24 -163 63 -64 -162 91 -198 -93 -191 -43 -148 12 185 51
5310 51 65 -170 -80 -22 83 55 -134 -114 126 81 -168 284 51 -53 146 -29 166 -109 80 -67 -13 11 -44
5333 -44 -159 -49 -204 -156 -197 -1 -43 -267 -242 47 -123 97 199 -38 -40 85 -66 -60 200 180 176 174 109 287 -125
5358a25K57q1k02J1L61j51j44J17j22K68k39M8r6J3J5m9J43N2p4N5k8J48k04L21
5382B94k54M1n5N2N8j96K31j74k0n1j10J93L1J63l46M21k92Q8j13J33k89P0J97
5405G2Kj25j13o1K27K21m42M22N5k29j79L73l44J00j97L78k63J75O7l41L88k45
5427e9J06L7l5l19m1M36Jj78o0j89K87ro9j92K13K3J9K9p9n9K28k46k6L64L3k06
5453Ik45K74O1l58L78j71R4q4l4J73p5O6J65k79Q6m12M33j84J7m9K57p9J06j51
5477bQj87K95R9j17k65J63n7j2K91k96J52k00j7L95j41j83J11k15J64j67L52m11
5500b40J95n4K6q2J13j93K75J86q8J26l88J52J59k71N66m79m0l0J62n6M7j71m0
5523a25j04J05J89O6k89K18k98J90Q7j82K21L9k15j83K65oL16k20K1K5Rj30R6
$$ plain form
5358 -125 132 51 -151 -140 221 70 -74 43 -79 189 -50 -2 -98 -85 -70 -119 24 76 2 57 29 177 -27 294
5382 294 40 81 26 78 136 -60 171 -3 -23 -74 -184 9 40 203 -143 278 -14 74 -39 94 -195 -125 72
5405 72 74 -51 -164 -225 2 223 -219 203 258 29 -150 223 -121 -21 -218 160 -103 72 139 -202 186 -59
5427 -59 47 84 49 -270 -311 125 126 -52 -112 -301 -14 -23 -92 -284 -71 -48 -29 0 -79 -138 90 -156 -182 182 215 9
5453 9 -236 38 99 -259 119 -52 42 -42 -76 97 22 88 253 -26 60 -352 81 -103 -86 -135 122 43 149 -2
5477 -2 6 -181 114 213 96 -169 -6 -63 -75 216 -80 72 -128 -145 250 109 -74 37 -178 -14 -181 171 -240
5500 -240 -45 -99 -73 -155 -42 -235 40 226 138 264 -124 28 187 -84 482 3 -37 -67 95 39 86 -85 -125
5523 -125 -229 -124 65 131 -158 60 -238 -48 39 -143 78 117 -98 -281 -16 -22 294 74 95 120 129 -1 95
5546I5m2j44J52J15P2j39n8j77J68K78k67Rj09o2M1j86J41J74j42N5J06j98J00
5569a8j12O1K09L2l42J82mj19L07j89m9K97j92M9j35J88o8Q8j0n7K9j66j63L71
5593A89k53K03J13l82P0p9K95j80N5L5m7j85K60o4j52J18qK44k03j78L85k69J97
5616A64m4k55K12lj39j80M84k73oqJ95k09L5o4K8o4K38p7j34K11j80L3K36n2o7
5641H1j70N6K00l81L31j95J15j59P6oJ13k05M6n3J38q9k37L22K02j24O1j21p0
5664f9rN9J06K80m98K6L49l25J05q5K21J5j20j5j72M1J36l65N65k77p3O6P8j08
5688f9k4l7p4j38K44K14j13p9R3kj6k41QJ97K81l96K08N6k56J98l77M47j20P2
5712G6J23j4k70Q8J75k86j2K10O7q3j63J33j97j01J09P5J00m3M7J63k56N9j12
$$ plain form
5546 95 53 -91 61 176 248 109 51 -126 42 320 53 62 -47 -109 -68 -254 -113 61 -81 -26 80 -118 -18
5569 -18 -130 -69 140 172 -170 12 8 -111 196 7 -42 255 63 112 -23 165 97 185 175 118 147 -19 -182 189
5593 189 -64 139 252 -130 -60 -139 156 -24 31 66 19 -166 94 30 -122 -4 -12 232 29 -149 236 -33 164
5616 164 120 -135 77 74 -65 -245 239 -34 -40 -48 147 -62 -27 -91 -63 -127 111 34 -100 111 -69 -36 200 148 81
5641 81 -89 -33 167 -214 117 -78 37 -122 -46 -52 61 -144 -98 -151 -13 -102 -339 -17 185 61 122 1 -69
5664 -69 -78 -19 87 367 -131 -105 244 -81 24 -61 160 175 55 40 -132 -91 45 -320 245 -32 -105 -39 39 -69
5688 -69 -93 -130 -204 -342 -98 116 3 -76 17 15 -1 -242 -234 -37 244 -152 56 112 -144 54 -323 124 4 76
5712 76 199 185 -85 3 178 -108 -120 90 157 74 -89 44 -153 -254 -145 -70 30 -13 34 197 -59 0 -112
5735a12J52PQ0kk2l54L63r2o6j47O9q3J35J46r4k8j32k3j6J16K50l77O8J45M5
5760B8K43J0q3m40L11j99K81j10m9J08k93J66J09j19L98k91K34m47J71m6r7J92
5782G7Q2r2j83Q4j92O5J44K49k02J40j34J9k19L0p6L22k07J3q8L93j55k07J14
5805b3J58m6J02j63Q0ql41J55kLJ44j01J98k79K6L30J14n26J0L93k08k04Q3No9
5830a69M6R5NR2Qq6n7l5M00l79M4J46j26q1M26q4k62Q2l3l7j62K33j22K7o1P5
5856a5l3J35j59J96o4l16l6L36R5j84K22k11K24j68l14M95j10n9j86K68l56K10
5878c0K54k88J53k20K36r3K0nR7j8Lr1j57K9K9k9L24l70J63lR1O0j94j43K13j67
$$ plain form
5735 -112 40 47 127 125 103 -251 112 20 -46 -193 -124 -207 -72 74 -20 -48 -180 -203 -219 -103 147 -230 -162 -17 28
5760 28 271 281 198 -242 69 -130 151 41 -8 100 -193 -27 82 -37 361 70 304 -143 28 -18 -115 77
5782 77 159 67 -116 -32 -224 -159 -15 234 32 172 38 57 -162 -132 -208 114 -93 -80 -168 225 70 -137 -23
5805 -23 135 89 191 28 108 100 -241 -86 -88 -85 59 -42 156 -123 -97 233 347 -179 -169 224 16 -188 -105 -100 -169
5830 -169 -123 -28 -23 69 77 -9 -66 -101 299 -80 -36 110 -16 -97 329 245 -17 65 32 -5 -167 66 -56 -29 -90 -15
5856 -15 -48 87 -72 124 60 -256 -292 44 139 -45 177 -34 190 22 -292 203 93 34 -152 116 -240 -30
5878 -30 224 -64 89 -131 105 12 32 27 124 106 109 18 -139 -110 -81 -110 214 -156 7 4 95 155 -39 -182 31 -136
$$ [...]
8191G0
##END NTUPLES=NMR FID
##END=
