##TITLE=1H_L6-TMS-J(f7)
 CDCl3
 8 sc, 
 14.02.2022
##JCAMPDX= 6.0         $$ Bruker NMR JCAMP-DX V2.0
##DATA TYPE= NMR FID
##DATA CLASS= NTUPLES
##ORIGIN= UXNMR, Bruker Analytische Messtechnik GmbH
##OWNER= root
$$ XWIN-NMR		Version 3.5
$$ Mon Feb 14 10:47:34 2022 Russian Standard Time (UT+4h)  she@DPX200
##.OBSERVE FREQUENCY= 200.131346
##.OBSERVE NUCLEUS= ^1H
##.DELAY= (6, 6)
##.ACQUISITION MODE= SIMULTANEOUS
##.ACQUISITION SCHEME= undefined
##.AVERAGES= 8
##.DIGITISER RES= 18
##SPECTROMETER/DATA SYSTEM= spect
##.PULSE SEQUENCE= zg30
##.SOLVENT NAME= CDCl3
##.SHIFT REFERENCE= (INTERNAL, CDCl3, 0, 15.7039)
##AUDIT TRAIL= $$ (NUMBER, WHEN, WHO, WHERE, WHAT)
$$ ##TITLE= Audit trail, XWIN-NMR		Version 3.5
$$ ##JCAMPDX= 5.01
$$ ##ORIGIN= Bruker BioSpin GmbH
$$ ##OWNER= she
$$ F:/spectra/data/she/nmr/H-F/1/audita.txt
$$ ##AUDIT TRAIL=  $$ (NUMBER, WHEN, WHO, WHERE, WHAT)
(   1,<2022-02-14 10:46:16.98 +0400>,<she>,<DPX200>,
      <created by zg, POWCHK disabled, PULCHK disabled
       configuration hash MD5:
       00 E9 B6 7A A2 85 ED C7 34 08 36 98 17 FE 4E 26
       data hash MD5: 16K
       7F AD CE AA 71 E9 44 32 37 1F 41 5E 37 F3 E4 0D>)
$$ ##END=
$$ 
$$ hash MD5
$$ D8 29 D7 23 36 31 B8 CF 07 44 54 02 A4 F0 CA F8
##$RELAX= 
##$RELAX= 
##$RELAX= 
##$RELAX= 
##$RELAX= 
##$RELAX= 
$$ Bruker specific parameters
$$ --------------------------
##$DU= <F:/spectra>
##$EXPNO= 1
##$NAME= <H-F>
##$PROCNO= 1
##$TYPE= <nmr>
##$USER= <she>
##$AMP= (0..31)
100 100 100 100 100 100 100 100 100 100 100 100 100 100 100 100 100 100 
100 100 100 100 100 100 100 100 100 100 100 100 100 100 
##$AQSEQ= 0
##$AQ_mod= 1
##$AUNM= <au_zg>
##$AUTOPOS= <>
##$BF1= 200.13
##$BF2= 200.13
##$BF3= 200.13
##$BF4= 200.13
##$BF5= 200.13
##$BF6= 200.13
##$BF7= 200.13
##$BF8= 200.13
##$BYTORDA= 1
##$CFDGTYP= 0
##$CFRGTYP= 5
##$CHEMSTR= <none>
##$CNST= (0..31)
1 1 145 1 1 1 1 1 1 1 1 1 1 1 1 1 1 1 1 1 1 1 1 1 1 1 1 1 1 1 1 1 
##$CPDPRG= <>
##$CPDPRG1= <>
##$CPDPRG2= <>
##$CPDPRG3= <>
##$CPDPRG4= <mlev>
##$CPDPRG5= <mlev>
##$CPDPRG6= <mlev>
##$CPDPRG7= <mlev>
##$CPDPRG8= <mlev>
##$CPDPRGB= <>
##$CPDPRGT= <>
##$D= (0..31)
0 1.2 0 0 0 0 0 0 0 0.06 0 0.03 0 0 0 0 0.0002 0 0 0 0 0 0 0 0 0 0 0 0 
0 0 0 
##$DATE= 1644821176
##$DBL= (0..7)
120 120 120 120 120 120 120 120 
##$DBP= (0..7)
150 150 150 150 150 150 150 150 
##$DBP07= 0
##$DBPNAM0= <>
##$DBPNAM1= <>
##$DBPNAM2= <>
##$DBPNAM3= <>
##$DBPNAM4= <>
##$DBPNAM5= <>
##$DBPNAM6= <>
##$DBPNAM7= <>
##$DBPOAL= (0..7)
0.5 0.5 0.5 0.5 0.5 0.5 0.5 0.5 
##$DBPOFFS= (0..7)
0 0 0 0 0 0 0 0 
##$DE= 6
##$DECBNUC= <off>
##$DECIM= 32
##$DECNUC= <off>
##$DECSTAT= 4
##$DIGMOD= 1
##$DIGTYP= 9
##$DL= (0..7)
0 120 120 120 120 120 120 120 
##$DP= (0..7)
150 150 150 150 150 150 150 150 
##$DP07= 0
##$DPNAME0= <>
##$DPNAME1= <>
##$DPNAME2= <>
##$DPNAME3= <>
##$DPNAME4= <>
##$DPNAME5= <>
##$DPNAME6= <>
##$DPNAME7= <>
##$DPOAL= (0..7)
0.5 0.5 0.5 0.5 0.5 0.5 0.5 0.5 
##$DPOFFS= (0..7)
0 0 0 0 0 0 0 0 
##$DQDMODE= 0
##$DR= 18
##$DS= 0
##$DSLIST= <SSSSSSSSSSSSSSS>
$$ [...]
##$SUBNAM2= <"">
##$SUBNAM3= <"">
##$SUBNAM4= <"">
##$SUBNAM5= <"">
##$SUBNAM6= <"">
##$SUBNAM7= <"">
##$SUBNAM8= <"">
##$SUBNAM9= <"">
##$SW= 18.0517287032376
##$SWIBOX= (0..15)
0 0 2 0 0 0 0 0 0 0 0 0 0 0 0 0 
##$SW_h= 3612.71676300578
##$TD= 16384
##$TD0= 1
##$TE= 0
##$TE2= 300
##$TE3= 300
##$TEG= 300
##$TL= (0..7)
0 120 120 120 120 120 120 120 
##$TP= (0..7)
150 150 150 150 150 150 150 150 
##$TP07= 0
##$TPNAME0= <>
##$TPNAME1= <>
##$TPNAME2= <>
##$TPNAME3= <>
##$TPNAME4= <>
##$TPNAME5= <>
##$TPNAME6= <>
##$TPNAME7= <>
##$TPOAL= (0..7)
0.5 0.5 0.5 0.5 0.5 0.5 0.5 0.5 
##$TPOFFS= (0..7)
0 0 0 0 0 0 0 0 
##$TUNHIN= 0
##$TUNHOUT= 0
##$TUNXOUT= 0
##$USERA1= <user>
##$USERA2= <user>
##$USERA3= <user>
##$USERA4= <user>
##$USERA5= <user>
##$V9= 5
##$VALIST= <valist>
##$VCLIST= <CCCCCCCCCCCCCCC>
##$VD= 0
##$VDLIST= <DDDDDDDDDDDDDDD>
##$VPLIST= <PPPPPPPPPPPPPPP>
##$VTLIST= <TTTTTTTTTTTTTTT>
##$WBST= 1024
##$WBSW= 4
##$XGAIN= (0..3)
0 0 0 0 
##$XL= 0
##$YL= 0
##$YMAX_a= 121637
##$YMIN_a= -208035
##$ZGOPTNS= <>
##$ZL1= 120
##$ZL2= 120
##$ZL3= 120
##$ZL4= 120
##$ABSF1= 10
##$ABSF2= 0
##$ABSG= 5
##$ABSL= 3
##$ALPHA= 0
##$AQORDER= 0
##$ASSFAC= 0
##$ASSFACI= 0
##$ASSFACX= 0
##$ASSWID= 0
##$AUNMP= <proc_1d>
##$AZFE= 0.1
##$AZFW= 0.1
##$BCFW= 1
##$BC_mod= 2
##$BYTORDP= 1
##$COROFFS= 0
##$CY= 11.3945322036743
##$DATMOD= 1
##$DC= 2
##$DFILT= <>
##$DTYPP= 0
##$F1P= 2.36226072786647
##$F2P= -0.459571619588291
##$FCOR= 0.5
##$FTSIZE= 0
##$FT_mod= 4
##$GAMMA= 1
##$GB= 0.15
##$INTBC= 1
##$INTSCL= 1
##$ISEN= 128
##$LB= 0.24
##$LEV0= 0
##$LPBIN= 0
##$MAXI= 10000
##$MC2= 0
##$MEAN= 0
##$ME_mod= 0
##$MI= 1.114404
##$NCOEF= 0
##$NC_proc= 0
##$NLEV= 6
##$NOISF1= 3.799351
##$NOISF2= 2.8
##$NSP= 1
##$NTH_PI= 0
##$NZP= 0
##$OFFSET= 15.70392
##$PC= 1
##$PHC0= -16226.86
##$PHC1= 10.20079
##$PH_mod= 1
##$PKNL= yes
##$PPARMOD= 0
##$PSCAL= 0
##$PSIGN= 0
##$REVERSE= no
##$SF= 200.130013532006
##$SI= 16384
##$SIGF1= 3
##$SIGF2= 2
##$SINO= 400
##$SIOLD= 16384
##$SREGLST= <1H.CDCl3>
##$SSB= 0
##$STSI= 0
##$STSR= 0
##$SW_p= 3612.71676300578
##$SYMM= 0
##$S_DEV= 0
##$TDeff= 0
##$TDoff= 0
##$TI= <>
##$TILT= no
##$TM1= 0
##$TM2= 0
##$TOPLEV= 0
##$USERP1= <user>
##$USERP2= <user>
##$USERP3= <user>
##$USERP4= <user>
##$USERP5= <user>
##$WDW= 1
##$XDIM= 8192
##$YMAX_p= 0
##$YMIN_p= 0
$$ End of Bruker specific parameters
$$ ---------------------------------
##NTUPLES= NMR FID
##VAR_NAME=  TIME,          FID/REAL,        FID/IMAG
##SYMBOL=    X,             R,               I
##VAR_TYPE=  INDEPENDENT,   DEPENDENT,       DEPENDENT
##VAR_FORM=  AFFN,          ASDF,            ASDF
##VAR_DIM=   8192,          8192,            8192
##UNITS=     SECONDS,       ARBITRARY UNITS, ARBITRARY UNITS
##FACTOR=    0.0002768,     1,               1
##FIRST=     0,             0,               0
##LAST=      2.2672688,     0,               0
##MIN=       0,             -208035,         0
##MAX=       2.2672688,     121637,          0
$$ Real data points
##PAGE= N=1
##DATA TABLE= (X++(R..R)), XYDATA
$$ [...]
1844H24j92l71R55J96l00K41m18O2k50m29k61q9k6k84n3L98l80M36j41j41O97
1865D74l64o14P9J186j249p51P38J40j171k25J300n26J9L49N26N50n7j42J006
1884A268Q7r90J13J074m99j083Q09K00j147o6O06r7m10P90k53j19M90l15n02Q
1904c6R0r65j42L97o25J33q0L5N77J22p73R08J364q34l80J612K13j256J88Q81
1924A429p25m55K7r0n5J33p33M66Q64j581j36J735o71q22J163L04j207K09M27
1943B82p42j70O93o19l96R20k23p82J059N65q27K22L02j90P0j38m03M95n6j133
1963a071K20J160j290q85J764P13j321O68J098m21m40O30M64l74K80n85K76K05
1981A091q95k82M47m82q57P18J23n14L91J35o70L12M81p31k56R07j88r85P53N43
$$ y = [824, 632, 261, 1216, 1412, 1112, 1353, 935, 997, 747, 318, 57, -32, -58, -342, -395, 3, -377, 59, -82, -223, 474, 110, -504, -425, 761, -488, -1239, -501, -361, -1532, -1757, -457, -983, -964, -615, -89, 461, 404, 262, 1268, 1355, 365, 478, 1552, 1053, -30, 779, 979, -168, -234, 372, 275, -135, 655, 402, 283, 773, 458, -44, -36, 54, -911, -1053, -656, -1281, -1148, -1228, -1193, -616, -494, -1267, -359, 1005, 171, -209, 1403, 1616, 360, 548, 1429, 704, 249, 276, 186, 131, 264, -469, -3, 861, -720, -856, 879, 208, -614, 549, 853, -354, -145, 282, -460, -630, 63, -556, -952, -32, -255, -1037, 22, 587, -240, -18, 284, 94, 164, 26, -377, 118, 62, -1071, -851, 309, -981, -1866, -102, 611, -710, -42, 1056, 635, 195, 825, 1289, 915, 1195, 610, 886, 1091, 196, -86, 361, -121, -978, -260, -137, -651, -260, -125, -795, -483, -2, -733, -989, -82, -270, -1255, -502, 41]
2001D1q91l6Q73Q8j52J87M90L76K43p56N80O76q87q76J035m14j220M99N17p35
2021c62o21N28j40l69L16K97j4K66K21l47N56R1r10K50K27m91k32O24n63J6P63
2042A06l42j79O94K64o60P39J001j177j71P90m19j088N21j98JK1k61M04J74m77
2062b57r1J009l59r71O68Q23j073j56L49K4j052M81J36k88n0N44K22K10n6K0L25
2083D58J81j29j0l0j83J80k02o97K10M71r29n47J215P6n98M09J198j54q61M38
2103D96N28o86m76N37N1n87J35j08J99l46m24J84M49l42n42J018k3m22p6M72m66
2124d29K00k18j33qK36L4k15P68N0l32J73R41n5p3j61J87K89m57p67N11K2r38
2146c75k02N48j06r56L16L35R6p23M92L46p4k53M89P3j20r5J0K08l5l13K17N69
$$ y = [41, -850, -886, -13, 75, -77, 110, 600, 976, 1219, 463, 1043, 1719, 832, -44, 991, 577, -643, -144, 373, -362, -983, -455, -595, -964, -648, -351, -365, -99, 122, -225, 331, 422, -488, -238, -11, -502, -734, -110, -673, -657, 106, -236, -415, 279, 543, -117, 622, 1623, 446, 275, 1065, 646, -442, 79, -119, -118, -97, -358, 46, 220, -257, -348, 661, 302, -669, -1, 822, -251, -407, -58, -34, -1086, -605, -469, -757, -807, -263, -41, 169, 113, 133, 458, 639, 510, 500, 470, 287, 467, 265, -432, -222, 249, -680, -1227, -12, 64, -534, -125, 1073, 919, 58, 496, 1024, 338, -138, 399, 450, -137, -2, -110, 89, -257, -681, -497, -48, -390, -932, 86, 63, -359, -435, 37, -429, -229, -447, -580, -588, -352, -318, -533, 235, 285, -47, 126, 1067, 1012, 939, 778, 965, 1254, 797, 30, 541, 563, -375, -577, -29, -135, -1091, -775, -440, -344, -1067, -575, -229, -303, -556, -67, 6, -114, -209, -199, 9, -26, -339, -122, 447]
2168D47j12j03o6O01q1k28o9R4K53m17m52P52k66o93n49Q09m07m42P3Q72p37K35
2190d86N36J41K03m74K9Q31m26o36L56K31k42o36K83L7r1k46L64J1R6m9L78J12
2212C22m5j61j66Q44o51j89J20K87m88k54N02k54J68N0j09N18%o05L33K64J35
2233F21r23P8M16o69l97N09J21l76r0K99K16p3r3J77P41j61n81Q42K6n64m42M06
2255H3o0j43j90O6M55j84M2kN61J16l80j3J07p3m85M67K1p60L6o2P6j53j26k13
2279h14M16L1m45M84N99l98l04M96L02n13J45P9l1L1k8l06N89K23m05L96K01k55
2301D93k92O89k20k22k82q6L4k22m02l12Q13o44l69K15P49l48l97N74L76j63K72
2322B56K01l55M48o60Q2K84J9m41j5M89o16n0L48J47r0r2K67N3j59k45o2M31J4
$$ y = [447, 335, 232, 166, 767, 686, 458, 389, 483, 736, 319, -133, 619, 353, -340, -889, -80, -487, -929, -856, 16, -721, -486, 50, 191, 394, -80, -51, 780, 354, -282, 74, 305, 63, -573, -290, -253, -344, -590, -226, -215, -119, -168, 210, 322, 277, 116, -50, 794, 143, -46, 74, 361, -127, -381, 121, -133, 35, 85, -24, 494, 494, -111, 222, 486, 621, -302, -224, 192, -477, -874, -365, -244, -620, -710, -411, -195, -268, -361, -184, 557, 396, -185, 657, 683, 119, -323, 83, 23, -120, -310, -244, 211, 27, 69, 67, 628, 744, 364, 351, 458, 385, -100, 367, 388, -372, -336, -398, -322, -475, -601, -814, -398, -367, -812, -328, 271, -127, -431, 65, 367, -146, -1, 78, 47, 78, 50, -256, 333, 556, 151, 547, 748, 493, 201, 890, 670, 448, 166, 80, 114, -108, -510, -822, -9, -653, -1022, -807, -58, -406, -803, -229, 147, -16, 256, 457, 102, 550, -110, -28, 256, 275, -166, -181, 308, -308, -358, -10, 137, 47, -45, 222, 275, 116, -129, -191, 240, 254]
2345B54j203P50M28m48n34R17j14j57K85O8o2L40l58J58J42r6p06K11M20n99m35
2366g39M12j50j61PjL14J65M3K24P4K29j57q7L98j58m69L16J87m39o5J65M41n92
2389d3J92J8J43J45o16k5R10q71k19K09J97m54o03N73r5O7n1K63qJ30j56M31L22
2412D59j40l38N04nm77K93r2j08q6M7l19K84K46m45J86N10j89l86M36J61n18k37
2434b14O33j01l64l48J99J43l03l61L01M92l13l54P54J32k81J9M65m65k19K25
2454D0K42l73K9M8k9M27j07l58R4J07kj87K68l6j59o1j97K67K4l25k43N91q7m88
2478e15J13O45l00k49N88K69l06k13K64L20l54l09J97J67m88m05M73J94o32j83
2498g24O79j03P3O7l8J29p8J75J64j99R2k79P7L12q8m37L01L43l24j42K49j49
$$ y = [254, -949, -199, 229, -219, -753, 164, 50, -107, 178, 246, 184, 524, 166, 324, 466, 370, -336, -125, 295, -304, -739, -327, -477, -638, -631, -632, -318, -153, -110, 114, 188, 417, 260, 173, 571, 413, -56, 260, 447, 8, -57, 108, 549, -43, 149, 167, 310, 455, -161, -186, 724, -147, -366, -157, 40, -414, -1017, -444, -539, -472, -523, -260, -268, -138, -294, 137, 459, 319, -19, 485, 480, 3, 296, 204, 96, 10, 57, -262, 22, 268, -177, 9, 519, 330, -56, 380, 541, 23, -214, 419, 318, -46, -394, -195, -52, -355, -716, -415, 77, -236, -590, 164, 296, 15, 34, 499, 34, -185, 40, 282, -91, -62, -14, -43, 384, 277, -81, 13, 120, 118, -69, 199, 163, 4, -57, -254, 13, 37, -288, -531, 60, -27, -515, -402, 243, -57, -306, 282, 551, 245, 32, 296, 616, 262, -47, 150, 317, -171, -576, -103, 91, -541, -724, -45, -148, -75, -8, -46, 83, 5, 180, 344, 145, 237, -42, 35, 347, 259, -178, 123, 466, 142, 0, 249, 100]
2520A00K52k99n6M06m50o93K74P58r08o39Q11M56q51n3J048k58j12J96K87M59
2540G28m53j94N65M1n02L8K92k20m58L51J4j75l26K01L0r6M41p70p4O28L8o49
2562e50O2N14l19m41M79J35k56k69N85J99j25o6M61N24o81r0J57K61q20K31R6
2583H7k89k8m8j2R5L0J17R2Q0J28k78N2J84J9M1k80m2j9j03k6L42j54j88k08L63
2608d5J12n32M13L65k43l87N90L76p58k92M58K00m79j24L58L54n53j26N58J8q08
2629e45M17Q44p47QJ71Q9l42J44k14j37K24K43n10J60M00J3l68Q2K24m3k66K82
2651A29R6K1l93o9M30n0r13L69P01o09n05P39J10m51J33N32j11l96K38L04k6l50
2673g1K93J41Nj24l47L39k91j4J94O9n32J11R5l83M47k8m3j51L22k04l96L56N91
$$ y = [100, 352, 53, -3, 403, -47, -740, -466, 292, -616, -1255, -444, 12, -839, -892, 156, -102, -214, -18, 269, 728, 275, 81, 646, 687, 185, 223, 515, 295, -163, 188, 202, 27, -299, -98, -68, -164, 277, -493, -567, 61, 99, -550, -488, 26, -293, -734, -255, -120, -376, -645, -60, 139, 14, -52, 409, 933, 252, 162, 319, 580, -240, -9, 87, -202, -230, -278, -290, -195, -165, -48, 44, 124, 252, -26, 26, 210, 229, 270, -10, -52, -71, -174, -200, 142, -12, -200, -408, -45, 67, -465, -52, 313, 70, -317, 273, 649, -109, -401, 57, 257, -222, -346, 12, 366, -187, -313, 245, 263, -545, -128, 716, -31, -23, 148, 237, -105, 39, -175, -312, -88, 155, -355, -195, 205, 218, -150, -68, 156, 113, -153, 129, 225, 246, -147, -216, 214, 164, -749, -380, 321, -288, -793, -54, 56, -395, -262, 270, 159, -237, 1, 305, 279, -71, 222, 363, 368, 244, -103, 236, -55, -69, 125, 194, -338, -227, -132, -515, -68, -96, -139, -290, 32, -172, -568, -212, 379]
2696C79n69M2K37K88j77p4J90L32j91n68N36L24n53l78M57l9r67L21M24l82m49
2717h17M99K27k81J88j45nJ60J19M3J90Q2p8m5o2k09L75k36K81p3K45l84k01M31
2740C04k7l82M2L66l35m70L01J34m21J26RK03M6j29N58k62q3n7K89J33l56Q1N87
2763F57m11m11M14O2n38l6J61k5j78M02j96j91L29j41K56j52K8N2p2j64K14r8
2785c8j00j03N61n4n64L87L43n39n6L69J67k76k40M85j85l64K2J17Q3n11L91J04
2807aJ05l12J60L67k79k2J45R5m93K52j15j85O2K75j14j7L22l94m2L08M2M0k16
2830a7j1K79k68q5L56K65k78m52J75M52o43k19P25Ln41j89P50l51k02J40L01m93
2852c03K10n0J56J93j99J69l2r3j03M20l11R4J10j86J37l5O7j28J04k13K8j37
$$ y = [379, -190, -148, 89, 377, 200, 126, 316, 648, 457, -111, 425, 749, 196, -182, 275, 236, -731, -410, 14, -368, -817, -318, -91, -372, -184, -329, -334, -174, -55, -12, 178, 260, 182, 137, 75, -134, 241, 5, 286, 213, 458, 74, -127, 304, 277, -105, -63, 303, -32, -502, -201, -67, -488, -362, -353, -150, -104, -233, 325, 63, -20, -77, 212, 345, -11, 70, 657, 246, -165, 249, 311, -227, -263, -102, -127, -305, 97, -99, -290, 39, -102, 154, 2, 30, 82, 10, -154, 60, -38, -138, -241, 320, 266, -298, 89, 432, -107, -163, 206, 373, 97, -143, 342, 157, -207, -185, -68, 15, -496, -105, -1, 104, -208, -48, 319, 40, 18, 163, 258, -235, 17, -98, -283, -221, 54, -60, -77, 245, -149, -191, 117, 159, 199, -17, -28, 251, -17, -102, 254, 519, 241, -211, -36, 416, -227, -446, 279, 282, -259, -448, 302, -49, -251, -111, 190, -303, -93, -143, 13, 206, 7, 176, 144, 51, -52, 368, 57, 151, 261, 75, 212, 177, 244, 116, 220, 7, 35, -102]
2874a02l68N60J4n82J52K98k13j10M13M70m73n24M99L32j81j66K30K48p96M64
2894A65L76m61l03L01K4J25m27L08J14l92j05j2K55j0J41o2j94N9J17J50k29j53
2916b13N12l10j19M57j03l63J09N53l40n57N31J05l65q5J36K08m73k05L48R5k07
2937b86mN13l08l83K24M73l03j39K42J79O5k19j14K16j57l6K49j78J47n7k41J50
2959C3K51k48j71k70M30j94p7k30M57K53n77J98L46j52q6L72K46n88J37L09k24
2980B15o17L70M73m80J6N1K33m23R5J0K30J02m64pM36k16q6Q3J50j20j45J48k64
3003b10L97k61Ml08P28m7m37K12m1J41l97L42L12m84j64Q6M64k49p1K15K48m08
3025G2k28O84m08j98K16r3m5q3l7O1m7j72Q2O7K0j16J40J00k39J01p1L27J79k00
$$ y = [-102, -470, 90, 104, -478, -326, -28, -241, -351, 62, 532, 59, -465, 34, 366, 185, 19, 249, 497, -299, 165, 541, 80, -223, 78, 102, 227, -200, 108, 222, -170, -275, -287, -32, -42, 99, 37, -157, -98, 19, 169, -60, -213, 299, -11, -130, 327, 224, -139, -30, 523, 183, -374, 157, 262, -103, -188, -52, 156, -317, -522, -174, -79, -286, -290, 223, -85, -468, -244, 229, -74, -213, 29, 208, 273, 54, -60, 156, -1, -37, 212, 34, 181, 124, -117, 33, 284, 36, -135, -405, 25, -169, -246, -476, -19, 234, -343, -145, 201, 49, -37, 335, 581, -7, 130, 439, 215, -402, -32, 441, -39, -23, 28, 261, -162, -67, -57, 173, 275, -189, -196, 240, 24, -62, 21, 171, 51, -94, 54, -210, 187, -74, -70, -378, 350, 303, -134, 78, 37, 178, -219, 123, 435, -49, -213, -127, 337, 88, 17, 232, 480, 72, -156, 528, 120, -78, 138, 45, 0, -83, -120, -59, -106, -278, -196, -129, -109, -225, -85, 15, -224, -123, -194, 133, 312, 112]
3049A12J72k79M96j90n38K03K91k64o4K68k0m25j58L64R9l55p3M11k58k87Q0O09
3071A94j7n57K03N77J8l93j7J70j15o4J98J70j10l50k1J50N6j86p2KP0J4k6L9
3095f7j42M47l93K68Nr9k59L99O0p6j47L33P9n00J72K12K18o29L6K63j09m41J39
3118b31K79j53l05K69MJ7j36J73J23m5q6L50k30j4M7k4nM78n24N6J06j9m0Q6J47
3143C23j65j46r4J19O4j79j35J05Q8n4k09L50n9l27J20K38j28k28K26O1P2k34
3165a92QK53L7k55M76j42Q5p1j54J32N4k98L06k57J65o4j1J99Lk29R2L4K3l05
3189a11J7j78L08j06j59J5J52k65J41J75M2k27K1J24k51O4J36N50j38k51K00k08
3211E1K55m24K68J10k35Ppj7j4j88L39j22J01r8n6M3k47J27N1j04R6K74l84K56
$$ y = [112, 284, 5, 501, 311, -227, -24, 267, 3, -61, 207, 187, -238, -396, -32, 67, -288, -361, 50, -208, -495, -415, 194, 177, -380, -177, 400, 418, 25, 8, 178, 63, -1, 197, 367, 257, -93, -114, 36, 92, -94, -166, -164, -94, -80, -106, -67, -209, 238, -155, 113, 118, 19, -240, 159, 219, 143, -4, 329, 408, -92, 80, 292, 510, -119, -83, 180, 71, -370, -231, 48, -105, -410, -141, -137, -120, -256, -83, 40, -5, -91, 259, 29, 15, 62, 38, 33, 511, -13, 43, 149, 130, 90, 176, 323, 158, 12, -82, 37, 101, -78, -213, -108, -20, -74, -283, 67, 8, -319, -199, 39, -89, -317, -91, -30, 42, -192, -184, 69, 106, -149, 327, 185, 270, 199, 45, 177, 231, -67, 239, -18, 147, 83, 72, 271, 274, 45, 137, 171, 194, -111, -94, -272, 36, -70, -229, -214, -62, -327, -186, -11, 31, -196, -175, -51, -302, -238, -102, 448, 310, 59, 259, 51, 306, -118, 150, 260, 25, 32, 25, 8, -6, -194, 145, 23, 124, 26, -30, 13, -234, -107, -56, -160, -64, 210, -174, 82]
3235H2k84R2m3Q7M00j12k14J85n0l07M9K76j64k69L11P8k6n34L83J28j98j09K17
3258b2M1r3O9J09Q3P7o2o6M3J01q5nk35J74Mj5j27P3k68M1R2K9l67j0K70O2j78
3285b65j58L71M7N9k58L94j53j17L59j87J1n2J00J88j59J89k05K49k34j75J36
3306A40j88L8k36K85p6J21j76p7K66k5j25j33mL06m62J91J71L7k20J37J34k53
3328a49J05j0L55q7j51l58N91k01j68N0M63k91n24L25M37l02k36O4N2J15j23L60
3350C17l93j34K18j19M77k39k56N0K07l04J7kj54L03R9k36l3N02n76L52j2K80
3372C64m98J58J60j27j12R8J36k72p2N1N49l92o3l0J94j10j93J64J43J28k71M1
3394D6j90J06k76L64m1l4K51k6q1j78jK10K9j5l83J80j36L7J35k17M15l26l8j65
$$ y = [82, -202, -110, -153, -66, 334, 222, 8, 193, 143, -164, -115, 161, -3, -272, 39, 117, 91, -443, -60, 68, -130, -239, -22, 19, -74, -5, 104, 187, 264, 202, 136, 179, 280, 195, 190, -45, 129, 133, 118, -9, 64, -204, -163, -71, -42, -409, -419, -149, -87, -265, -423, -52, -5, 54, -204, 190, 37, -80, 279, 92, 103, 51, 151, 339, 180, 369, 164, 413, 179, 4, 140, -48, -10, -246, 39, -37, 84, -92, -169, 97, 72, -53, -186, -190, 116, -346, -155, 16, 53, -167, -30, 104, -149, -44, -54, 301, 214, 63, -295, 296, 95, -73, -23, 440, 149, -375, -50, 387, 85, -151, -87, -35, 80, -43, 317, -76, -210, 8, -111, 366, 127, -129, -79, 128, -176, -159, -161, -315, -12, 87, -149, -182, 320, -256, 96, 84, 364, -134, 24, 184, 57, -55, 43, 179, -93, -165, -114, 435, 43, -20, -50, 144, 34, -159, 5, 148, 276, 5, 46, -144, -38, -314, 50, 9, -25, 226, 200, 119, -59, -60, 150, 179, 164, -219, -39, -175, -138, -3, -220, 195, -131, -169, -334]
3418c34L62K14l87K76J7j20P4R5J66k39J26J16j56m53K87k61L57k41p3K5P3n6
3440a32k23K63K32k63J02j27O6k13K95p2o6J69k45k2M04p5k1K40J51l27R7J16
3462C49k96R0j75j60K33K6n11M69J42k81j20K47m6l4L9M9j9j57J69nK88m49J46
3485fj3J35k29p1K66k43L4K15k88O6M3o8m3K29J29l36J94K63j27k22J42Q5k54
3508i9K28R2j18N7j35J16J79k09j32K14K16m93kP1J98l05j4L0k24K47k8K07J9
3531A15j94m5O5K43j45q4L6R7j84J40J44j75J89j08k88J57R6QK2J69N0k27j24
3554d3J18l4p8K5J21m6M1k72J33p5k56K12J82j81j94P48j39k73R5l7m0J9k17K25
3578C4J3N1j58J09l2j6k5K70j86j62JL99q4j20j86K30J3l82J28O6j51J59j8J61
$$ y = [-334, 28, 242, -145, 131, 148, 28, 102, 197, 363, 124, 250, 366, 210, -243, 44, -217, 140, -101, -174, -149, -76, -132, -355, -92, 140, -123, -21, -148, -82, -295, 0, -72, -138, 31, -214, -236, 168, 93, 72, 312, 463, 136, 233, 349, 53, 143, -32, -192, 41, 67, -444, 25, 167, -114, -234, 13, -33, -67, -28, 21, 2, -155, 14, 9, 297, -152, -6, -19, 116, -113, -184, 82, -161, -127, 88, -200, -134, -91, -159, -202, 27, 156, -180, 14, 277, 150, -72, 70, 155, -99, 129, 221, 103, 160, 25, 141, 320, 111, -21, 193, 409, -84, -86, -15, 183, -122, -136, -106, -330, -83, -111, 96, 115, -79, -124, -59, 184, 39, -45, -9, 88, -96, 44, 188, 13, 202, 94, -194, -37, 59, 67, 89, 258, 308, 81, -43, 75, 41, -37, -12, 109, 63, 104, -168, -35, -110, -366, -154, 28, -153, -347, 401, 262, -11, 84, 47, 7, 26, -191, 34, 47, 98, -60, 49, 17, 1, -24, 246, 60, -102, -101, 298, 214, 94, -92, 138, 151, -231, -103, -37, -188, -29, -47, 114]
3602A14l5k7k22J47N6j97M60k81J16j13p7R3J13j16k32K90q7pq7L67Mk15n2J91
3626B03J66l41k91K23K89l02L4j33K54j86j25M5J47R0j12P2K82j9j45O3k8k01
3648a5J40K3J01m31J14n4J84k75K23l46J56p3K46K14j0j36j29R6K07j51Qj06J89
3671A75J46m57L36K87j51J28l4l94o8J45j04jm23K16K84k98L6j10J84Q1j82m8
3693b52j25M32k51P6K11q9rJ57J86k8l40J66k0M1o1k52K90j35J49M4R6k49K13
3716B50j62p7L22l51M4j17K67k16q1j69K41j0Q7l0N7j56R4NJ69j62j10L00pm30
3740b42M65L7k4l38j5K80O4o2r2K5K18k53j41J85l9l9k01J57J76k56mp9J06J10
3764C8j70J23k9K3j57J19OJ91p1OJ77o23K11L22k17J84k92L04k31L37j79j86K29
$$ y = [114, 79, 52, -170, -23, 33, -164, 296, 15, 131, 18, -59, 34, 147, 31, -201, 89, 2, -5, -92, 275, 279, 64, 12, 203, 369, 28, -263, -40, 249, -53, -19, -152, 102, -84, -209, -164, -17, 73, -39, 33, 315, 296, 151, 214, 186, -15, 125, 148, 249, -182, -68, -122, 62, -213, 10, -336, -180, -253, -7, 207, 197, 61, -68, 28, 235, 84, 92, -14, 175, 321, -136, 200, 487, 336, 464, 430, 36, -32, 113, 9, 8, -415, -199, 85, -213, -177, -287, -103, -22, -204, -252, -377, 55, -196, -120, 91, 2, -7, 150, 336, 308, -32, 134, 114, 155, 94, -158, 132, -3, 146, 190, 286, 37, 250, 88, 11, 333, -18, 26, -91, 176, -40, -121, -290, -49, -59, 28, -2, 55, -101, -7, -2, 167, 5, -105, 195, 188, -242, 223, 260, 236, -102, -117, 163, 227, 165, 73, 98, 316, 63, -78, 107, 68, 29, -172, -15, 161, -95, -99, -178, -72, 38, -132, -9, -38, -15, -172, -53, -47, 144, 73, 79, 256, -367, -156, 166, -51, 133, -159, 145, -86, 251, 72, -114, 115]
3787A15k62J30j53L74j63j4K99k96L9k12J05m9k2r8J18M81m12qK78m1j38p4K6
3810B3N5j27l9J26l31J76k65J37M23m48J73L15j90k75K18K21j62J53k23J79L1
3831A70o3L7m17O29n10J38L49j94Qm8M03n80J42k82L87k40Q7k32q2K52k38J44
3853a40J66j79O3J96j63J99K0k63n2K41mk29N11l39j32N00l80J66k59j84L80j15
3875Cj72J41N2J33l18r1J00K08k96J84J71k69L38k5r0l8j34j40L68J16k26j20
3897a05K67P7l43o3K06q6k56J46OK09j86K10k66M06n0k06mP2j83R0K90j68j40
3920g7J59k4MPk45j3K6J89k68K10nR0k37K60l6k47p5J38L14n57K38N9J53j49M8
3945c8J06Lj12j30L23L2l30K81J20l00K71k88r8K00j72qJ02K90j84n0LJ38m39
$$ y = [115, -147, -17, -170, 204, 41, 27, 326, 30, 69, -143, -38, -87, -109, -207, -89, 392, -20, -28, 250, 209, 71, -3, 23, 78, -49, -88, 38, -293, -117, -382, -245, 178, -270, -97, 218, 28, -247, -29, 192, 30, 183, -40, 139, 170, 107, 144, -273, 356, -154, -16, 333, 139, 147, 99, 502, -78, 64, -218, 169, -71, 16, -216, -298, -46, -284, -140, 26, -153, -90, 106, -57, 142, 162, -101, -153, 88, 84, -145, 366, 27, -105, 395, 15, 181, -78, -262, 118, 3, -169, -28, 24, 157, -161, -252, -152, 56, -240, -56, 115, -154, 184, 159, 69, 31, -103, -243, 125, 241, 15, -105, 162, 239, -104, -167, 39, -47, -303, -157, -151, 58, -128, 82, -184, 222, 172, -34, -38, 34, -149, -59, 231, 63, -77, 82, 58, 62, 69, -176, -189, -163, 26, -242, -32, -37, 53, -184, 76, 40, -207, -282, -144, 170, -387, -149, -90, 63, -86, -38, 68, 71, -41, -171, 152, 184, -146, 135, 255, -45, 226, -62, -160, 40, -132, -140, -38, 252, 68, 18, 21, 159, -280]
3968b80J01J72o8l9J05r8K75l27j39K52R2k87R9K32k16N5J9P1K00p4j72K61J9
3991B53k31K02j61p9j82K43j34ok2L55j04k39K11l05L35j32j47J28Q0k08o0N2
4013a51K85k25k82K17L22Rj43K48l87K61k3m3R8r6k40L26k86J18K2k69L36q5j54
4036a42P6m2K09j19r6K85j19k03j43M69m00K77R3J2J3l81J89J22oj07K88k93K50
4059B32m70M2q0L70k49K20j49O6p3K49j14N8l5p0P4k75J63N4j41J52K54j60M6
4082A64o3k17L1R4J80q5J5p3j82k79L06M6j10RK03n3L8o4k59L26r5k9J2l4K5K30
4108A36j71J36j08l7j4J7J71Q2p9J4j37p4J04k8L3k16K10k02R6K03l22L9J99j84
4132a32Q2J54L4j07k6J27j93J3r8J93l17J95K1qP1J11RL2J18k28Mj07J44O9j08
$$ y = [-280, -179, -7, -75, -114, -9, -107, 168, -159, -298, -46, 46, -241, -142, 90, -126, -71, -52, 19, 219, 145, -27, 234, 253, 22, 224, 63, -16, -198, 45, -89, -95, -117, 238, 134, -105, 106, -199, 136, 4, -143, -15, 65, -143, -203, -151, 134, -91, -373, -156, 166, 175, 32, 280, -107, 154, 131, 88, 186, 90, -150, 176, -110, 8, 30, -239, 97, 12, -142, -66, -108, 101, -18, -114, 171, 52, -151, -294, 175, -225, 52, 145, 157, 170, -211, -22, 100, 94, -13, 275, -18, 232, -238, -196, -276, 94, -155, 65, -84, -18, -91, 158, 44, 102, 67, -3, 71, -204, -41, 13, -128, 24, 278, 118, 164, 101, -116, -85, 9, 189, 104, 119, 46, -136, -415, -109, -63, -173, -164, 39, -14, 24, -40, -299, 27, -68, -97, -85, -119, -94, 136, -35, 101, -7, -44, -58, -41, 130, 212, 133, 147, 10, -64, 40, 12, 45, -171, 39, -163, -67, 136, -186, -147, 52, -132, -50, 104, 138, 31, 5, 132, -61, -48, -146, 47, -270, -75, -54, -62, 9, 120, 129, 161, 279, 51, 55, -52, 92, 161, 53]
4157E3J98k9k61m2R7j08O6lP9k7r4q6J86k1j13L3r5L69k32n6M2l5J1J79j43j92
4183b24K64J53k09L7j75L20l4j53j67J98P0N2l27P8J18j39K49k79M6l0L11L2l
4206A88k35k5K20j07J18r9k9J5j15j21J51n4j0J29n9m2j55R9J13m0j66M8j3J22
4230f7k8K8LL44l31j73K27m6n3K95j47k3J30k02J5K00Nl98J34K97l04L4nN7l5
4255d3j47K17J33k41j45m1L8Q8J34L01j32q8j02J96k00L67m93J70j76M08l04R7
4277C7K18j54j23k9k3P8K3k3k23K45N9j40J85k48J99j6j50k5J64j36k9j54K16
4300d9M3k41J89l6r1L33j90m4p1J28l11K58J46R4q4j47K03L6K9j37p0J11m8r8
4324d7m7R8J98m02L21j35p7J27j53mJ12j02J86K25k77j72J42J81j07j79K68k21
$$ y = [53, 251, 222, -39, -81, 16, -92, -26, -29, 50, 23, -71, -157, 29, 8, -105, -72, -167, 202, -30, -86, -44, -79, -68, 111, -32, -224, 40, 193, -16, 21, -154, 166, 132, -21, -188, 10, 80, 132, -195, -117, 1, -138, 111, -168, -122, -152, 159, 191, 188, -47, -72, 148, 41, 159, 60, 31, 46, -69, -190, -39, -93, -103, 26, -33, -75, -230, -131, -18, -58, -224, -176, -189, -67, -95, -67, -64, 280, -51, -224, 3, -43, -96, 199, 52, 29, 159, -43, -28, 172, 177, -221, -87, 210, -94, -60, -65, -8, -43, -190, 27, 160, -81, -226, -267, -229, -141, -7, 294, 162, 74, -28, 168, -32, 335, -158, 12, -164, 244, -60, 37, 255, 101, -22, -51, -74, 4, 27, 4, -219, 26, 85, -55, 130, -118, 81, 65, -85, -110, 54, -82, -111, -265, -49, -6, -247, -58, -94, -185, 148, -42, -86, -157, -29, -340, -82, 64, 158, 74, -73, 130, 166, 195, 58, -12, 99, 51, -47, -94, 4, 202, -200, 121, -14, -91, 36, -117, -121, -9, -111, 75, 300, 23, -149, -7, 174, 67, -112, 156, -65]
4346f5L3nJ01M1p2K41k49J49j81L0J45j46J0j61K94k65M3J45J41r4l38L66L3j97
4370aJ89l42J87J5l5k40N19m95K74k33K15O8k21l6j1j5J87j33K32N5k5L0k11K00
4394A73k70J52K05o8k07J09j40J69j3o2K79l05m1K59J19k06l48J44k3m8J96k65
4416a91J46Q3N5o9k50J72k1k03N05J29l44j47L43j12j44l6M3R9k88K80K59k99
4438A0L9J7L03j68n75M39j19R2J84o46J10L39j62J26R8p4K82o3o5J23j99M3l45
4461b11L92m6l38J20M08k89j88K60n6k51J86j54l1P0j06M47j24m1J68k29R0n7
4483B0k5R6k48k82O56k7j08j13O1P4j03N9q2J36L3k21J81k24J16o7q1j04L84j80
4507d9j43P6J43L2l99M23j43qj33L3J54j97M16ml70K7J50J8P6l95K37J20k16P2
$$ y = [-65, -32, -37, 64, 105, 33, 274, 25, 174, -7, 23, 168, 22, 32, -129, 165, -100, -57, 88, 229, 135, -203, 163, 196, -1, 188, -154, 33, 48, 13, -227, 292, -203, 71, -162, 53, 121, -100, -136, -147, -162, 25, -108, 124, 179, 154, 184, -27, 173, -97, 55, 260, 192, -15, 94, -46, 123, 110, 48, 327, 22, -19, 240, 359, 153, -195, -51, -74, -122, 74, -191, -45, 38, 93, 24, -226, -54, -75, -278, 227, 356, 12, -135, 208, 96, -48, -84, -41, 58, -230, 50, 309, 10, 49, 66, 369, 201, -374, 65, -54, 38, 222, -424, -314, 25, -137, -11, 87, 13, 295, 232, 167, 290, 91, 134, -211, 181, 135, -203, -83, 325, 36, -152, 108, 52, -199, -13, -167, -198, -128, -234, 213, 89, 48, 216, -13, 77, 20, -5, 91, -157, -439, 217, 190, 82, -31, 30, 104, 1, 60, -22, 114, 147, -74, 107, -117, -1, -68, -149, -253, 131, -49, -192, -116, 27, 59, -340, 83, -60, -68, -201, -168, -14, -211, 205, 201, -169, -142, 8, 26, 102, -293, -56, 64, -152, -80]
4531h0M11k65k38J24N5J9P5m8R1k82J63j12mJ2J48j72P2q5j77M15j89J29O1j6
4555A07P5j37J26j44J77l06K02O0m37M47k74N1L35k9Mk94J49k05J76j24k49L05
4577A5O5j40k91K78J71P3M3j59j4rj48r7M08kj08j34L32l42q0n7L43j60L4L6k54
4602a97J69M2o5j18J39n4O5o3j0P8L13l57k78N05q5j97N1J68J4l2q0J29Rr4k9
4627B3K22r2k34R8k17JJ64Nj70J41K1J53p3q0P9O6j83L9NQ7Q4L6j04Nj25J22k05
4654a32J39k3M14l19j65R4J3o8j18O7M8r1J83OM6J22l13j9j20L39j55k7J84j18
4678a3p7JOL0K3K0k60J87K69j63j3J34k12j64J63o6P3rL62k05j15j51L43j89r8
4703a24J4j16K84N4l40K49J15J03k80K6J62l08L94l06M5M8K50k55P1l21J76L29
$$ y = [-80, 331, 66, -172, -48, 7, 26, 101, 53, 144, -138, 25, -87, -91, -79, 69, -103, -31, -116, -293, 122, -67, 62, 123, 107, 182, 45, 171, 27, 204, -102, 100, 160, -277, 170, -104, -53, 282, 253, 257, -37, 112, -93, 83, -41, -290, 15, 80, -60, -351, -73, 98, 171, 214, 55, 41, 32, -116, -213, 195, 193, 85, -49, 283, -59, -139, -196, 147, -13, 21, 57, -197, -28, 14, -51, -169, -30, -84, -19, -82, -92, -14, 299, -58, -336, 169, 84, -113, -62, 106, 120, 88, 8, 137, 146, 52, 23, 245, 153, -81, 17, -200, -199, -35, -30, -200, -59, -38, 115, 42, -38, 41, 107, -76, -37, -32, 55, 139, 175, 71, 76, -49, 73, -132, 7, -16, 398, 79, -86, 8, 21, -47, -165, -98, -50, -141, 42, 48, 94, 216, -97, -116, -236, 103, -52, -79, 105, -13, -90, -89, -83, -53, -30, -10, -270, -83, 186, 23, 10, 144, -68, -232, -69, -135, -62, -71, 291, 86, -29, -180, 163, -26, -124, -110, -226, 58, 112, -228, 21, 136, 239, -41, -15, 147, -161, 233, -73, -28, 20, 270, 15, 86, -235, -59, 270]
4725B70j33j39r8J46n6K00k71L4J98j60k14L54l60K84l42L36j30K09j09l0n2J55
4747I2k13M46k72j93K60M7l43J87m5P4l2J12m4K0j3k15J15J32j20j90L55P2k00
4770C2J3K17j27k45J18K3J60k71K64j18J31j80k79M31j86J96k98Q7R5m39R8K67
4792a1k12K66r6k13P7L81m30M14j95k5r5J80J83n74N16j07J17l53K63k92O3Q8
4814e5J15K3j6j99j9kJ57K28m11J57o1L69n12J09K13O3j68n1J57k31k14L02K1
4837b5J56k15K64k49j45m8K67N5k31J13j09J13k3n5N1J42r3J8J71l7k53J7J50
4860C4J17j94J01k74M30j60k4p8Q9j43L5R5j40N2J9k5rJ04R7j53rj08L9K5L06
4885B26k75M8j98M85k87j55pJ11L08l03j40N00k97j65K89k98q5L27l8jJ62j31
$$ y = [270, 137, -2, -100, 46, -10, 190, -81, -47, 151, -9, -223, 131, -229, 55, -287, 49, -81, 128, 19, -11, -63, 92, -121, 325, 53, -140, 120, 167, -176, 11, -34, 40, 8, 120, 76, 96, 83, -132, -17, 115, -5, -195, 160, 232, 32, 45, 262, 135, -110, 8, 31, 191, -80, 184, 66, 197, 17, -262, 169, -17, 179, -119, -32, 63, -376, -278, -11, -223, 43, -53, -266, -189, 192, -238, 176, -19, -44, -139, 41, 224, -350, 166, 59, 176, -177, 86, -206, -143, -55, 60, 83, 67, -132, -151, -153, 4, 232, -179, -22, -83, 286, -226, -117, 96, 159, -9, -60, 97, -134, -348, -46, -25, 131, -84, 180, -69, -214, -262, 5, 60, -171, -58, -167, -54, -77, -132, -81, 61, -32, -14, 157, 120, -133, -116, 34, 151, -43, 58, -216, 214, 54, 30, -48, 41, -102, -67, 28, -112, -60, -41, -66, -75, 29, 126, -27, -36, -144, -105, -80, 226, -49, -1, -199, 286, -1, -156, -163, -52, 256, -47, -187, 313, 16, -149, 140, -158, -243, 84, 46, 45, 207, 76]
4907G6j83O1K31k64Q8J0M0l05K09P2p8K9o9j70O7J8K74j77L20m82P4L27j14k85
4931b31K94R2k0J33l17rK58k56J75r3j1j72K29J77j05m1k89K56k42J35L89k38
4953A14k41N3J8J53k2j03p9J75o1J11k20K95m12K89M0q5J3r5J81k05K21j61n1
4976g2K27j22Nm3j43m3o8N3k2K33j40n8K70j33l3n7J52l52K93J47K09k39j98L
5000a31L46K7k89r1L20j54k20K48l8j43K55j72J37k31k0K71l6l22K0L74l9J21
5022B33k3m8O2k15J7K48l86j4K72oL1p6j07O9k22L07j63o6P6J56q3J82j78p8K47
5047B35l30J90k99K47J22j88j39J09K46k33j16L57j99j7%m8M8J27k80J69K72m38
5069a65K13J5o0m7L0J39p5l0J06j14Qo5R6k27J65j16J34J65L1M8l81J55K10l10
$$ y = [76, -107, -46, 185, -79, 9, 19, 59, -246, -37, 35, -43, -14, -83, -253, -186, -168, 106, -71, 249, -233, -159, 168, 54, -231, 63, 155, 135, 268, -49, -58, 200, -56, 119, 26, 15, -157, 72, 249, 144, 103, -186, 70, -172, -37, 352, 114, -127, -74, -56, 97, 75, -28, -107, 68, 7, 118, -102, 193, -219, 70, 110, 25, 38, -57, 124, -81, 140, -21, -72, 155, 33, 38, -5, -148, -191, -259, -206, -228, 5, -135, -193, 77, -56, -89, -146, 6, -346, -53, 94, 303, 64, -134, -131, 215, 242, -47, -138, 182, 28, -192, 56, 18, -125, 130, -42, 95, -136, -156, 115, 79, -243, -223, 151, 112, 233, 210, 162, 224, 9, 26, 274, -112, -126, 146, 140, 171, 95, -12, 57, -165, 142, -21, -87, -11, 145, 62, 244, 66, -12, 235, -95, 95, -204, 43, 165, -23, -162, -53, 193, -40, -156, 201, 2, -15, -15, -63, -15, 112, -168, 1, 273, -165, 48, 63, 3, -44, -14, 125, 50, 20, 126, 12, 20, -45, 51, -176, -11, -127, 7, 172, 203, 251, -130, 25, 235, -75]
5093g5J20k85L24j64K53p6m98M53j3K4OL4k40M6J58k4J07j26r8J51j86q1J06L49
5117B65m22J88j20J90j53J00J54k57J51q9J42P4k51OO1j50M13m15J78k0k45K57
5139E7m5J82j86j57N2P5M1K01k55L23l72O3J36pq5J03j44J88l0l11J02K71j20
5162H2j13J75p5M6j6k34r2K03L4Nr8k7j12J80k03K32j78K58j01K01k64N7N7Jj56
5187a38l2N37j27j8j75j4J61j51j7MN2p7k14L52k90K06m2n7L7q6J70O4l43K53
5211E5j71J68R8J23m5k61o6J20l1o1K50j04kl2k12J96J45j52J7r8P1J97l30l7
5235a62M62j9k29j66N5M8Mj42J37J53k13J02N7p9j27K52N3j45p7M9o0Q2k11J18
5259e8K75j90j06l7K47j96m4J2j77L24K10n3j85J24k63QJ98n9J47o3l42J45O9
$$ y = [-75, 45, -240, 84, -80, 173, 97, -401, 52, 39, 63, 69, 103, -137, -91, 67, 43, 150, 24, -74, 77, -109, -190, -84, 265, -157, 31, -89, 101, -52, 48, 202, -55, 96, 7, 149, 223, -28, -22, 39, -111, 302, -113, 65, 45, -200, 57, 12, 194, 8, -149, -97, -22, 19, 220, -35, 288, -84, -21, 115, 108, 23, 126, -18, 170, 140, -171, -69, 202, 82, -31, 144, 69, 115, 99, -135, -227, -24, 10, 15, -83, -110, -222, -42, -245, -13, -191, 67, -34, 167, -97, -40, 17, 18, -138, -170, 367, 240, 222, 47, 33, 194, 43, 26, 30, 82, 5, -209, 143, -147, 59, 17, -40, -3, -89, 81, 145, -198, 55, -116, 52, 150, 273, 228, -33, -99, 21, -10, -71, 179, 75, 73, 41, -171, 25, 170, 18, 35, -63, 8, 205, -125, -162, 300, 281, 52, -114, -59, -11, -7, -149, -12, 141, -72, 30, 87, 8, -119, 133, 186, 41, -36, 13, -47, 35, -176, -58, 217, 27, -79, -116, 131, -65, -109, -97, -274, 50, 260, 207, 22, 146, -117, -109, 89, 30, 177, 114, -228, -83, -14]
5282a4O9P6k0m9L7n4m2l47L19j24K34p2j70K95k06j09J00P6J25O4l62L75k46J73
5306A28k71k12M60k33k63M19O0m05K64pP8O7j5j63kP8R2j57P1J08n4k04L4K5k07
5331c09K02J03j82j54M79j96k09J18J31Q1l7j42K24Q1r5j20J60k05j51K18M4j16
5353g5Q8K92m76J12N0J39j11k02M10k97j23M16p8r4o8k1l2n8L14j27m7k58K40
5376fQ9j78K14J07Kk51K17j83j30J18k08K37j51n0J38M48m27Q4l9J35j90J37j86
5399g3k0J67k7o3J61j11j27K68k5l45K60j4k14j15L17k04L01k03M4j59J58P7j44
5422i1l5m3M4J18q%P8m6oP0n1M0R4R8k58q8n4O5K7J2J2P9j42Q4j7L1R5j56k3L1
5452d0k63K00j17K78j93J67n0L08k90l5K8ok2N4l08M52q9p4J95k51K04j93M08
$$ y = [-14, 55, 131, 111, 62, 99, 45, 3, -344, -25, -149, 85, 13, -157, 138, -68, -177, -77, -1, 124, 188, -174, 201, -45, 128, -143, -355, 105, -128, -391, 28, 88, -317, -53, -60, 18, 85, 70, -93, -95, -17, 75, -82, -11, 97, 43, -161, -127, -102, -309, -107, -4, -186, -340, 139, -57, -266, -148, -17, 64, 27, -115, 109, 190, 95, -25, 135, -70, -221, -3, 41, -75, 13, 305, -171, -59, -9, 130, 19, -183, 227, -70, -193, 223, 145, 51, -17, -38, -70, -128, 186, 59, 12, -246, -6, 83, -95, 119, 226, 228, -23, 194, 11, -119, -1, -209, 28, -123, -173, -35, 413, -14, 70, 31, 166, -24, 113, -73, -93, 74, 47, -16, 145, 34, -93, 175, 150, -195, 65, 51, -163, -278, 39, -165, 136, -67, -23, -182, -24, 53, -91, -126, -169, -125, -7, -15, -15, 63, 17, 11, 81, 30, 70, 164, 262, 4, -84, -138, -73, -46, -34, -22, 57, -85, -1, -18, 13, 108, -48, -71, -40, -303, -103, -220, 58, -135, 32, -18, 290, 0, -35, -7, -13, -35, 19, -289, 163, 74, 0, 195, -56, 148, -45, 363]
5475C63o02K69J25J01m60Q7M0r9J35q6K5K9J87k57N6p2Q5L07m14K49j00j0k3K2
5499d3K92k27k13L29m8j99J18j41J65M3j48K44k90K01k05rM45k33K4j90k3K9l
5522h2j23r5L45N0l9J51J84k08rk77J13P8k44J19M7j46L13l04j56J57J4K2J69
5545G9l00L03k34N4K76n36N96m24J95P2o1l9J34j39K29l30k5K73k12K91l17N8
5567e7o1J35l1m1j90Q6k13L81R1j06j11M2K05k53p6J30pQ4k21K06r2L43l94Q2
5591f8K08j96J32j23L8J78j54r9L79l56J3J20O0q8N0J1n3j25j19J62J33k3k55
5614a75pK64k10K94n5Q8j23N2j27r5O7K17m63L46K0n7lk01K79k43p7K46k02J83
5638A8p6KpO5L2R6l4o1k05K54k07J29J17M4J39j45j42J97l48L43k45J11n0j7j55
$$ y = [363, -239, 30, 155, 256, -204, -117, -77, -176, -41, -127, -102, -73, 114, -143, -87, -159, -74, 233, -181, 68, -32, -42, -65, -43, 249, 22, -191, 138, 90, -109, 9, -132, 33, 76, -72, 172, -118, 83, -122, -131, 314, 81, 105, -85, -108, -79, -82, -205, -300, 45, 95, 56, 207, 391, 183, 174, -103, 10, 88, -156, -37, 10, -136, 177, -127, -283, -126, -112, -90, 79, -221, 82, -152, -98, 178, -358, 238, -186, 9, 81, 20, -19, 115, -24, 205, -125, -150, 123, -89, 202, -115, -57, -118, 17, -14, -55, -245, -159, -372, 9, 100, -6, -117, -75, 130, -123, -199, -69, -76, 8, -213, -7, -99, 244, -150, -68, 140, -56, 76, -47, -9, 169, 15, -84, 295, -61, -48, 72, 132, 44, 94, 105, 52, -73, -192, -30, 103, 80, -175, -182, 82, -128, 166, 111, 199, 76, 128, 1, -94, -27, 190, -273, 73, 93, 36, 33, -168, 111, -132, -209, 37, -165, 18, -58, -56, -63, 2, 34, 130, 96, 35, -170, 84, -123, 6, 123, 167, 306, 161, 19, 216, -132, 211, -34, 77, 27, 10, -145]
5663a45N2L85j21k34O2PO0jp6K66j78Q7j21P8r8o7J2o8J37K7j30J07r4N7J28k10
5689g8j1J06J71j38N7k08L49j38l47K32j84K69r0l09K73r2K9j0l7m9L23m44K69
5712e7rjK29k05n2Q9J2M7k5K20k50L26k13k38J68K26k15l7J8J96o3l53L57l25
5736a55J43K19m08K68j00K07k98J26k1j52K40k2J3q5O2J29k25l8K3K72l29O3l2
5759a00K00n15J39M95j58m10J71L70k77P3rj33n6K33n7M5p7L89k91k8L33k41l36
5782b40J39J20pj08K53n3k08kPM2J94k09K45k20JJ66k11J69m5L3k68L34r2J39
5806A79j98O2J09k53J48L0k5k06J83J55o3j68K47j38J11n9j50n8O8J69j50o8J51
5829G6j49P1j6J23r9r6j5J74j22k05K03L9m2pj03J81j31J75j67J8J12j4k17K38
$$ y = [-145, -93, 292, 171, -63, -1, 6, 66, 65, -11, 255, 77, 164, 43, 121, 23, -44, -32, -100, 37, 64, -66, 41, -53, 4, 132, -78, -89, 17, 188, 50, 107, -101, 248, 110, -237, -5, -189, 80, -10, -319, -46, -138, -109, -119, -156, -205, 118, -326, -57, -66, -67, 162, -43, -95, -6, 6, 53, 28, 248, -2, 324, 111, -127, 41, 267, 52, 15, 33, 229, 166, -187, 170, -155, -12, 207, -201, 67, -33, 174, -124, 2, -19, -171, 69, 47, 60, -25, 37, 166, -59, -97, -74, 198, -131, -68, -100, 100, -415, -276, 219, 61, -349, -178, 192, -85, -12, -21, -154, -210, 23, -34, 11, -66, 323, 32, 4, 337, 96, -240, -101, 19, 12, -96, 157, 104, -104, -106, -99, -57, 137, -72, 173, -47, -46, 120, -91, 78, 33, 66, -202, 132, 40, 179, -19, 43, 152, -101, 47, 77, 52, -154, 29, 184, 121, -47, 200, 62, 173, 114, -36, -94, -26, 143, -7, -75, 76, -73, -2, -18, 105, 6, -90, -105, 69, -53, -258, -55, -16, -58, -65, -168, 13, -118, 57, -110, -92, 20, 6, -211, 27]
5853B7J16k65K99j10j78K17P0j27k9O9P8j96k57N2J25jjJ34M8r8J25l07M49k91
5877e1J18k51J43J67l28M07l56J33j42J36L3J78Jq0j51k8J56On7n4j48M16m41
5900a93J04j24P9J61jN8k64K05j29K95J14j56k11Lm0K61n27J68R2J65J02k79j40
5923b57K53j55K05j17K45j21p7J88k50J69j99K16K10l61o8K20Q5j56p9K03Nj09
5945E0j35j07l4L51n7j86N2j4j40Q0m6j90K72M58j84j04j49k1L8L19k75K07J34
5968C19j87j79L74j51k36L9J44O8N1k48K67k12Nk51ML40j9k23K5J74l5j06q9M0
5992h6K69k52J13J54k87K39R7k07j10K23P2K6Nk22M3l4Oq9l1j5Rj32L8L74k35
6017c2n7L21j67j03L3R4l8j83K15j76R2J16j51l6N7k00L80k24KK40j53Q8n5j42
$$ y = [27, 143, -122, 177, 67, -111, 106, 176, 49, 20, 89, 167, -29, -286, -234, -109, -110, -111, 23, 71, -27, 98, -209, 240, -51, 67, -184, -41, 126, -202, 205, -151, -18, -160, -24, 9, 187, 188, 108, -43, -71, 85, 91, 34, -20, -168, 248, -193, -89, -213, -134, 27, 26, 84, -180, 25, -104, 191, 305, 149, -62, -59, -99, 162, -365, -197, -105, 60, 162, -117, -257, -4, -159, 46, -71, 174, 53, -24, 164, -86, 83, -116, 100, 310, -51, -119, 101, 186, 30, -49, 154, 159, 50, -85, -192, -226, 125, 68, -118, -66, -80, -220, -140, -186, -376, -104, 354, 170, 66, -83, -104, -66, 253, -22, 185, 319, 132, -47, 327, 176, -60, -21, 123, 191, 242, -6, 261, 49, 54, -197, -193, 147, 128, -95, -70, 104, 69, -37, -126, -86, 183, -69, 44, 198, -89, 150, 247, 40, -70, 153, 225, 251, 256, 34, 77, 43, 49, -40, -71, -86, -77, -209, -171, 203, -32, -89, 232, 65, -38, -5, 89, 51, -132, 83, -93, -1, 115, -36, -72, -15, -215, 165, -59, -57, 183, 30, 118, 63, -79]
6041g9J74j32j2J56k53J80O4K8k39J35J29l50m5J58J86n7p6K01k00j39J52j87
6063b06K78k7O5l5j9q0J58K24m68J73p1O7K13l32J21J02j13Kj36Q3O3L8j49K70
6087B21l60J65j71J52J31j54Q1Q7p6j60J30N5l2j77RK21%k74r0L70J1k65J15l84
6111c95M35l3Q4j47J59k43L1O3L3J5j56J64p8J71k86K39J53k63l79L70J70r1m6
6134c0K7P0l69J7M10o3j35M5j05k3J87j55L74j88j57L45m65K75k14J47J93P3j87
6157G2m5O9p6O8j54R6K4j49Q7Q4L4N9j26j9Q2j36Q1P3J17m50J76K94j64k4Pj7
6183F3P1k07K4O7J91k18j7M9P0p7l30L35K2J01l80K39m2j57Q7J48J0J87m17J45
6207c6N1j78K5K30k41J49o2k15L03o9P8j07J19L3r4p3k44K36K10j14q6J22N0J35
$$ y = [-79, 95, -37, -49, 107, -146, 34, 98, 126, -113, 22, 151, -199, -244, -86, 100, 43, -33, 168, -32, -171, -19, -206, 72, 45, 110, 75, 56, -24, 134, 358, -110, 63, -8, 59, 272, -60, 61, 163, 50, 52, -84, -1, 62, 100, -49, 221, -139, 26, -145, 7, 138, -16, 65, 152, 76, -84, 46, 101, 69, -108, -99, 122, 122, -152, -242, 128, 139, -126, -11, -395, 40, 7, 91, -56, 103, -140, -109, -46, -13, 2, -154, 10, -68, 103, -183, 56, 209, -54, -433, -63, 107, 16, -30, -3, 67, -302, -285, 125, 62, -73, -28, -133, -156, 31, -124, 250, 62, -95, 250, -215, 60, -154, -7, 186, 259, 72, 27, 96, 20, 88, -66, 30, 54, -95, -8, 76, 110, 169, 43, 24, 106, -30, 51, 124, 241, -209, -33, 261, 97, 73, 80, 63, 134, -73, -49, 18, 209, -9, -26, 23, 93, 16, -314, 21, 43, 144, -236, 3, -39, -196, -109, 39, 49, 236, -181, -36, 15, -163, -138, 92, -149, 0, -62, -277, 26, -43, 35, -72, 47, 80, -14, -87, -331, -95, 115, 1, -85, 37, 87, 222]
6231B22j60J59p0q5P4j45mK7p7k5K04k10j36L24n59L48J24j16K65j10j26L21j04
6254A41O7j20q6m2J75j56j26J95L5j70K33k39o1k8J7K69k49j20rJ58O3K5r2K62
6278A42k50J12J2l7n9N7K0J59o9J3j72O3J12J14k46J6J10k66L75j55o3j09j65
6301b86L22p8J03j89J03kp3k0K34J9J62j48j25k7M9l9j2K54j79k46Q5j27M39j94
6325B5j92R9J66k19R7K46m55K44J29o2l26L58k20N6O8J92l86J40N9J6J84l39K68
6348A48l33O2J69L5r3k94K85j31O8J38n7J06pm2j36j0J7L28l02l8J86q0K36j06
6372A49l22J01M1J39k77L4K19j96K63q4j36O7M5p5K91k10O3k01K25o8m9j10M07
6395C16r7j34K4n1k58L24K0kj24k40J31lO5J1j19J90j59K11l55K21Q6R2l8K6j06
$$ y = [222, 62, 221, 151, 66, 140, -5, -9, 18, -59, -84, 120, -90, -226, 98, -461, -113, 11, -105, 160, 50, -76, 245, 141, 208, 88, 2, -40, 135, -21, -147, 48, 83, -87, 146, -93, -154, -182, -165, 104, -145, -265, -274, -116, -53, -28, -120, 142, -108, 4, 16, -21, -80, -23, -3, 156, 87, 100, -72, -9, 103, 217, -29, -13, 97, -169, 206, 51, -12, -121, -286, 36, -42, 61, -128, -25, -27, -100, -120, 114, 133, 295, 147, 22, -5, 44, 5, -7, 247, 68, -178, -93, -220, 219, 25, -167, -68, 98, -121, -24, 222, -233, 11, 140, 78, -248, 110, -110, -54, 14, 206, -180, -40, 19, 35, 219, -120, 148, -185, -123, 46, 81, -12, -306, -21, -152, -84, 54, -3, 103, 96, 54, -82, -92, -75, 253, -49, -87, 99, 19, 255, 149, -173, -72, -31, 108, -169, -135, 84, -112, 151, 67, -69, -2, 43, -32, 259, 49, 112, -89, 136, 68, 19, -91, 316, 219, 85, 109, 58, -200, 124, 144, 142, 18, -222, -91, -94, -29, -18, -137, 53, -106, 105, -250, -29, 57, 149, 111, 137, 31]
6420C1O9J22n13L88N8k34K07j20k13R4R5k39J55K78nk72k0J36J09k71J03Q2K03
6443B43k25j29L33k87NM5Nj66J29K30l01K04k26j18K44j88M48m08K6L8l6L0J26
6466B2k35K43J42k48n0J36K6j36Q2J68P2m36K44Mr4L9K7K00j13k9k5J68j82j56
6490a31R1J28J15l28R7P9k12L54j9k47K94k28J44k39J47R7k04L21k56L26m3k88
6512bn0K46j23k10K35q4j63K06Q0j14p6K15l27q8K60Q5j34L18l37K04r5j04K04
6535A46o4L5k8j05K00j20K2l9l7k97K01Q4K07k94k9L65k97J20j62J81o0j59K18
6558H8k46M5o1M8J14J17k48J50K9j05O3k2K01n0j84m5N2Rn2J67o6N9N9j26j76
6583a80J97Oj10P4j40j8L2l3j3J52p5O6L7mO8J92l67K00j46J52o7J04l00k2K26
$$ y = [31, 100, 222, -291, 97, 155, -79, 128, 8, -205, -111, -16, -255, -100, 178, 173, -99, -119, 17, 126, -145, -42, 40, 243, 18, -111, 222, -65, -60, -15, -10, -176, -47, 183, -118, 86, -140, -258, -14, -202, 246, -162, -136, -98, -134, -104, 22, -213, 30, 172, -76, -126, 10, 36, -100, -18, 150, 222, -214, 30, 34, -60, -21, 6, 206, 93, 64, 39, 207, 25, -131, -40, 88, 203, -125, -28, 51, -161, 193, 174, -73, 221, -7, 137, -102, 45, 142, -62, 259, 3, 329, 286, -2, -52, 194, 71, -139, 96, 12, -151, 55, 135, 21, -55, 160, -167, -255, 5, 90, -44, 274, -63, 141, 46, -58, 146, 82, 117, 89, -16, 184, 64, 86, 47, 10, -287, -86, -2, 205, -89, -118, 247, -50, 70, -92, 89, 29, -130, 88, -158, -113, -174, -126, -12, 105, -143, 7, 36, -69, -6, -28, 173, 123, -61, -106, -54, -45, -97, 70, 4, 63, 122, -4, -180, 17, 23, -87, -13, -153, -171, -139, -172, -185, -33, -108, -42, -5, -9, 59, 251, -116, 84, -62, 90, 23, 127, -173, -195, 31]
6608C1l48J72K47j22k32L82l13K78l6l4j05J00l58M39M3q8Q5k68L15Q1m20N1J88
6631H8j48J34O1k85ll1K24j51J97J57l61L17j45j35K3Q4r8r6K18k87K50O9k1k3
6655C8k4K4j57L46j78Q1l3J03k55m9J90l60L38P0j79N8j8m0q7R8j28J98lO3J33
6680B29m18K93j49k1m8MK03j07J64k63K34P2r5k3R6o8r4j06J03j20j69K84j00
6703i9m2M4j73J68l8J25n2J70K0j23j44K08O8j32N0J08r7p0r2R6O5q1l7K04m01
6728b55J72P8P9l18J06R7J53j90K51k0j71r0K3j31M92k62KK45k31o1p7o2K03k12
6752a79k0K36n6j10L33l84M51m23Q5n2o1M30j67J4j65K46j74P5k36K7J77k9L20
6775C38k98m6j55RK21j03qP9R6l22J76K61k11k8J65k40k9J19p2J1J88k95K54k00
$$ y = [31, -317, -145, 102, -20, -252, 130, -183, 95, 59, 25, -80, 20, -338, 101, 144, 56, 141, -127, 188, 269, -151, -100, 88, -60, 74, 135, -150, -153, -184, 40, -111, 86, 243, -118, 199, 54, -81, -58, 26, -72, -168, 50, -237, 13, 82, 61, 38, 14, 38, -119, 227, 49, 130, 97, 200, -55, -104, 86, -274, 64, 134, -45, 13, -5, -45, -132, -34, -162, 36, 33, 96, 229, -189, 104, -45, -66, -114, -110, 93, -14, 150, -113, 121, 193, 98, 75, 171, 103, 9, -97, 6, -114, -283, 1, -99, -141, -97, -270, -102, -140, -15, -67, 103, 123, 0, -144, 64, 132, 0, 50, 158, 61, -9, -101, -5, 60, -21, -58, 146, -255, -83, -5, 74, -244, -138, -41, 112, -78, 173, 153, -18, -108, -85, -216, 276, 14, 16, 261, 30, -31, -108, -170, 33, -179, -199, 37, -19, -129, 204, -180, 271, -152, -67, -119, -180, 250, 83, 97, -68, 178, 4, 79, -157, -130, 47, 18, 338, 40, -6, -161, -152, 69, -34, -42, 37, 133, -189, -13, 248, 37, 9, 174, -66, -95, 24, -48, -37, 151, -144, 110, -90]
6799i0n3J43K68k14K14r7Q9k79J51k46L5R8j81O1p2m2J34J14k51K73o6L54n35
6822a92L60r3n9O8k23J95j56LJ6J21j75J41j6k75M92k00k61J14O8O2m7M7pk52
6846b69L83p7j56L13l12j57L59Q8R2k02o6K72K4k05k13p7L26j3j73j1q7J77L4
6869E0o6R2n3k07J80K30j46j45M6L03j51k73R6K41k93K84l51RK35o1K10N2m75
6892a93R4J06k01N0j65qL06j6J6l24K46l1J37J39j18j16J39r3M6q2Q4L02k67L2
6916H3k36N0K35j05Q7l7m5j13o9L17K9j51k76M00r3k6M0J35j00l4r5J68Q6j92
6940E8k05J45O1j61J15r6K38j87l5J30oR0j14L7m6r1P4J06j42k8j43O7J16J27
6964A10O3k16L0q3J26K21l30L09j60p1J20jj86J65j77j4K03j07R6j83N2m0Q0k55
$$ y = [-90, -143, 0, 268, 54, 268, 171, 260, -19, 132, -114, -79, 19, -162, -101, -173, -215, -81, 33, -218, 55, -11, 343, -192, 168, 75, 16, 84, -139, 56, -100, -97, -81, 40, -135, 6, -10, -285, 207, 7, -254, -140, -72, -10, -57, -10, -17, -269, 114, 37, -119, 194, -118, -275, 84, 172, 264, 62, -4, 268, 292, 87, -126, -203, 123, 110, -63, -74, -161, 16, 50, -16, 76, 23, -184, -4, 226, 80, -65, -19, 284, 133, -140, -44, 197, -96, 188, -163, -154, 81, 20, 230, 282, -193, -99, 7, -194, -144, -309, -317, -11, -27, -11, -335, -89, -120, 17, 156, 38, -78, 61, -32, 14, -68, 16, 318, 51, 83, -153, -103, 132, 27, 114, 77, 32, -81, -150, 167, 196, 45, -231, 169, 76, 50, 90, 225, 125, 91, -4, 164, 250, 58, -147, -2, 59, -102, 13, -83, 155, -32, -67, 63, 57, 147, 33, 70, 24, -67, 7, 113, -29, -57, -200, -133, -17, 110, 173, -43, -13, -96, 30, 251, -79, 230, 70, -1, 119, 118, -68, 97, -80, -94, 109, 2, 98, -85, -33, -73, 7, -248]
6988b48K02J34r1j17P2P4J42j55m0O9m5j21L02l09O2K81k43N8r0K44r9R1L2j86
7012A9P5n2R8J4l25K18j04k4N8j32R1J43k56q0K30n0J0J5J16L45n74K66j08J34
7036A27o2j73J65l1j05J53p0K39l31j31J46J04j77K87lk79k1J45k43J16O9R4J18
7059A37j21M9k37M25l83J06K2K01j33j84L27O2l62qm6K16J89l23k91J96J53M5
7081D0J28R7k75M3k46K28l7J52k4k11J16j1O3j1Mj34L3Q3J84k52j3m8J56Jl3j59
7107a26ML5J44j14M4O8O3l9m8R6o5k50K51o4q3o0p1O5K31j25J82j05N1j61R4O0
7133G7k63L43j79K06j21p0LJ07q0l2P5m6p4j84M26j84j72L30r6L3k89O8l8K10
7157E0k03K22j30J6r8J21m0r1K06j51J66J49l64O8j10J51J44l2m8j6L3l5j92L32
$$ y = [-248, -46, 88, -3, -120, -48, 26, 168, 13, -27, 42, -3, -124, 178, -131, -69, 212, -31, 27, -63, 181, 82, 173, 205, 19, 94, 42, 140, 154, -171, 47, -57, -81, -23, -155, -64, 79, -177, -257, -27, -77, -67, -52, 64, 409, -165, 101, -7, 127, 65, -108, 57, 26, -79, 74, 4, 243, -88, -219, -73, 31, -146, 141, 138, -141, -162, -17, -260, -144, -75, 19, 137, 16, 65, -172, 253, -130, -24, -2, 199, 66, -118, 209, 271, -91, -99, -145, 71, 260, -63, -354, -158, -5, 40, 168, 265, -10, 33, -213, 15, -22, 130, 106, -105, 11, 0, 63, 52, 56, -78, -45, 38, 222, -30, -43, -91, 65, 66, 33, -126, -122, -87, 57, -57, -13, 55, 118, 79, 31, 127, 62, -188, 63, -1, -84, -144, -215, -150, 81, -44, 138, 33, 84, -77, 17, 77, -186, 157, -22, 184, 63, -7, -4, 103, 23, -9, 66, 20, -54, -238, 188, 4, -168, 162, 66, 99, -190, -122, -160, 50, -153, 69, -61, -45, -143, -22, -62, -153, 53, -98, 68, 217, -147, -79, -189, -38, 106, 74, 26, 10, 43, 8, -184, 148]
7181A48k6j22J88k53k1j53L35j75J64j05O0l32K67J26m3n7M8L70l27k92K49k35
7203a86J87K9l3J15o7m1%Q7p6l5J68j66j46R9L07l75J83K9j31J89l86K74j07K75
7227A93L1j27j13K56j94J65p0k2j26o4m2j42M34O8j60j47J0m1n8N9Q1N3n9K54
7251B39j87n0j29L77k93J82k88K80j43K47m31L53r0p1N6k65K07j37O4K65k10m6
7273g0j90K81j58o5K52j38j28K01j19R4R6j06K67o3j70R4q4j6K1j74L28j77q7
7296a11K75m0k20Mk52N14p0Q7j52k37J50j7L2J12n5L20k71P9pl17J21K41j24j96
7320a34O8J05P8r4K7j08J43l84L99r7j09Q3J29l16rK10N0K3j48J37J9j0N6l45
7344b27K61q2J2m17L06K20m8j7j80L0m5K0J9J36Q0j38N8j08M0j1J89r5o6L4J79
$$ y = [148, 122, 0, 188, -65, -86, -239, 96, -79, 85, -20, 40, -292, -25, 101, 58, 1, 49, 419, 92, -200, 49, -186, 1, 30, -3, 112, 45, 4, 4, 91, 15, -20, 148, -18, -164, -65, 242, -133, 50, 79, -52, 137, -249, 25, -82, 193, 224, 97, -16, 240, 46, 211, 141, 119, -7, -71, -113, -255, 179, 247, 87, -60, -50, -91, -149, -90, -9, 44, -15, 239, 52, 2, -127, 250, -43, 139, -149, 131, -12, 235, -196, 157, 67, -4, 52, -213, -6, -143, -79, 186, -24, -70, -260, 21, -137, -202, 50, -88, -216, -15, -134, -40, 56, -50, 217, 154, -16, 78, -6, -22, -1, -175, 153, -24, -111, 164, 124, -96, -92, -344, 170, 100, 187, 35, -202, -52, -69, -37, 75, 20, 340, 69, 148, 141, -176, -55, 186, 62, -134, -66, 39, 117, 23, 50, -58, 85, -299, 100, 3, -106, -23, 106, -210, -219, -9, 41, 64, -84, 53, 72, 62, 118, -227, 34, -48, -36, -453, -147, 73, 25, 8, -172, -142, -187, -167, -148, -12, 68, -70, -12, -120, -80, -91, 98, 3, -63, -29, 150]
7369A50k81J50j15J33j6k18k29L05L01k93K4K40j02L4j2k4L05l56l8O1l9K7J5
7392B2k57P6L26n68L78l4J43jl5Q4l41J17k5J27n8k8n6K94j52K05j5l4m6r9m3
7417b0J43O9j92J09j89J06r2k5R9n5Q7l8q6Q0N7j77K61l2r1j46J58j45NL70j7
7442B39k53P8j8k3Nm8O0P3q1O1n3j37K18k61K40j46j37j53M96J9m01K19o9j3Q9
7467DK6j14j8K01k97J06J69K01j46O9j32q0R4L3k90L99j00j37k5p1O5k82N10p1
7491A14j0m8J04j92r8O0Q1j08O4p1J99%j90J55k55J71L9J08j51J23j31pj2Q6J28
7516A59m23L99O4l20J23L1L8j28L45l33M6l2L8k4j10J91j26M10k55l5O2j14j33
7539a27J10j8p8qO5L5M0n9r4L12k10Q3k7k24K07k31M1j04J32K53j38j24L02k34
$$ y = [150, -131, 19, -96, 37, 21, -197, -426, -121, 180, -113, -89, 151, 49, 83, 71, 47, 352, -4, -42, 19, -20, 7, 22, -235, -159, 167, -401, -23, -57, 86, 85, 50, 134, -207, -90, -115, 12, -46, -74, -130, 164, 12, 217, 202, 168, 122, 23, -20, 123, 192, 0, 109, -80, 26, -66, -91, 8, -47, 40, 2, -84, -4, 53, -124, 137, 105, 14, -132, 26, -119, -114, 256, 239, -14, 64, 46, 23, 28, -20, 40, 113, 32, 93, 40, -97, 121, -140, 100, -46, -183, -336, 160, 179, -222, -3, -72, -85, 4, 30, -84, -102, 99, -198, -92, 77, 278, 132, 201, 69, -11, 83, 116, -174, 225, 125, -12, -37, -108, -43, -325, 185, 114, 104, 56, 160, -32, -130, -70, 11, -97, -33, -104, 95, 95, -95, 60, -195, -24, 15, 123, -28, 95, -36, -43, -55, 31, 159, -264, 135, 199, -121, 2, 33, 71, -57, 288, -45, 1, -31, 7, -17, -127, 64, -62, 348, 93, 58, 120, 6, -127, -17, -35, -113, -121, -56, -21, 19, -40, -134, 178, -32, 51, 24, -200, 7, -224, -183, -287, -155, 98, -40, -164, 138, -96]
7563i6L3rP1m8K72k62K30l10J95n0k85K20N9O8j31J18l16M33m2j00P5k58J43j06
7587i6P0j90K65l0J5P2K33l91J22m4j47Q1L4M7j63K25R8l22J09j1J62j19p4J24
7611G0m69L51O2nr2j06K96l50K48m3lm1n4K3L2Q2j80J85Kk98M44k88K81k70K98
7636A75k64m9O4m2K91j06m4q8Nn0J29j79J5O7J31j50K3n1K68J66l23r4R5J34k57
7661a34K57j87J57k6k63L46m00K10O7j87m3J09J5Ok8j3JK56k75l6J18J47l00L32
7685A29m0k81K31N4m9n6m6P5J34j83o4K22L7j42r6J27J9o6N9n9P2o4p5M2J44k05
7711h1O3N9J17l38L34k02K14l04O7K33l07K87Q5j92o4r7J47K86n08J98j52K04
7733D9l7J60r6J34k64M8q6M34m33q2K52J18k0r3M7k20N0J17l15J66P2k23J41J05
$$ y = [-96, -63, -72, -1, -49, 223, -39, 191, -119, 76, 26, -259, -39, 20, 88, -43, 75, -241, 192, 150, 50, 125, -133, 10, -96, -26, -216, 49, 19, 34, 106, 339, -52, 70, 26, -121, -40, -6, 41, -122, 103, 201, -121, -12, -23, 139, 20, -54, 70, -399, -48, 14, 9, -83, -189, 107, -243, 5, -38, -41, -82, -136, -113, -81, 1, -179, 6, 8, -290, 154, -134, 147, -123, 175, -89, -138, -74, -116, 175, 69, 25, -63, -58, -108, 21, -158, -143, -76, 55, -95, -72, -123, 145, 311, -12, -106, -11, 123, -134, 123, -64, 93, 67, -196, 150, -250, -40, 27, -160, -203, -94, -79, -73, -101, -114, -113, 143, -132, -168, -50, 97, -203, 129, 89, -192, 39, 93, 44, -12, -58, 17, 151, -32, -96, 126, 163, 21, -75, 52, 71, 5, 64, 5, 77, 13, -62, -20, 124, -81, -18, 41, 158, -180, 154, -48, 166, -138, -71, 162, -145, 142, 227, 35, -29, -126, 21, 307, -201, -3, -155, 49, 12, 172, 76, 210, -54, -6, -92, 342, -91, -173, 79, 197, 177, 84, 131, -89, -39, 78, -237, -71, 1, -222, -81, 24]
7757B4j74L45l19K02j12R6j94M4J58n1J67k24R8l8L2J39p1k21J37J68j01J1j58
7780d2N7M5o2Lk38L69j51p1M2K64m6k75j76K79o8R3J2j15K92k50k61L47r0J95
7804A53k03N6k69J81J48k6J0o0O3p2j06J17J00j16J61j7j69R9j56J39n9LJ77j54
7828@J88k29j09J47l1K5jm1K27k51P8j06J07k46K21j77L72k45J84K2p2N0j10J03
7852A06l46K10J76K9k24l1n5J21P5J17j93mj03J06K00j99k38JK89j49J70o3j64
7875a69o8L02k7j76j85L94k34K09M2j02k15K68j27l7J08R5j3lJ50J34l35j27K5
7898i1MJ52j60N5L6j09J7L1l8J03j28K18r1J40k25K8J67r9J99k80K35k34j36N5
7922a51J77q4j4R9K20k90q8L6l2J09M3O9j16K17j34j46o4J17j67L21k72q0K78
$$ y = [24, -150, 195, -124, 78, -34, 62, -132, -88, 70, 19, 186, -38, 60, 22, 54, 193, 122, -99, 38, 206, 105, 116, -42, 15, 60, -2, 1, -237, 132, -19, -90, -48, 216, 170, -105, -281, -2, -70, 23, 35, -80, 212, -38, -299, 48, -42, 153, -50, 6, -263, -82, 66, 40, 50, -10, 53, -19, -125, -8, 92, -24, 137, 120, -49, 50, -106, 33, -26, -23, 154, 0, 188, -41, -150, -3, -34, -9, -10, -51, 176, -75, 3, -103, 4, -242, -21, -198, 174, -71, 113, 135, 63, 113, 3, 106, -240, -30, 146, 175, -49, -80, -135, -14, 61, 178, -15, -19, -122, -16, 184, -15, -253, -252, 37, -112, 58, -5, -169, -237, 65, 38, -138, -323, 71, -163, 46, 88, -14, -229, 39, -88, -125, -17, 78, 65, 62, 212, 346, 11, -116, -91, -87, 65, -95, -40, -4, -113, -96, -65, -103, 0, -128, 90, -1, 139, -86, -58, 109, 10, 209, -71, 164, -70, -206, -151, 26, -58, -72, 27, 247, -43, -131, -95, -127, -18, 25, 94, -22, 195, 61, -85, -149, -32, -199, 122, -150, -230, 48]
7945D8J52j46P2p4k25l0M2L81k79Q8j54K87jn22J49J98j06J00Q2p9J46k81K36
7968H4q8J84m05L02k24J04J90l23K81jJ13l40J31PJ28j17r9K27J15j96k47K30
7990E6j71J76N0L1j78J61M8k03j31mL20k59J14P6P5m17J72j7J4J8jK35r4K33j51
8015A53j13J64N1j19j88J77j50K5j78N1j49J45J88j64J61j55K4P8K43n45K83R6
8037G8k65J70J3l0J99l24q2J23K04l70J95j1k1K3O7R6K28m22K4K30Mj7l7j59O2
8062b2q5n5J81K7mLk80N01l91J80m6p6R6k35K62O3j59J24k1o1j85K61j61R5l5
8087b3L6j32K52n0j73O6q1N9O7J8j3j41K43j10L6j12L0l5P6N8r6K47l63K95J10
8112B64l43J46M3k61J36l0j93M1L02l07J94k6M13n23J54K9K37l46P8j14O7R5o9
$$ y = [48, 200, 54, 126, 52, -173, -203, -161, 220, -59, 29, -125, 162, 161, -361, -212, -14, -120, -20, 62, -17, 129, -152, 84, -4, 180, -225, 77, -147, -43, 147, -176, 105, 104, 217, -123, 8, 15, 143, 26, -73, 154, 269, 73, -174, 56, -115, 61, 111, 142, -36, 125, 173, -30, -161, -165, 155, -104, 10, 86, 161, -256, -84, -101, -87, -69, -70, 165, 71, 304, 153, 40, 204, 255, 136, -52, 125, -25, 0, -178, -127, -276, -131, 57, -107, 54, -101, -77, 1, 244, -301, -18, 78, -187, -17, -4, -34, 165, -159, -241, -118, 86, -284, -89, -100, -121, -98, -31, 65, 293, -129, -105, 125, 129, 112, 75, -84, -22, -107, -162, 19, 46, 42, 45, -235, 266, -125, 55, 9, -67, 29, -206, 56, 119, -40, 84, 63, 2, -183, 78, -83, 12, -23, 13, -119, 133, 83, -90, -24, -105, -46, 21, 39, 26, -115, 128, 18, 54, -58, -28, -63, 13, 71, -25, 222, -141, 154, 264, -79, 67, 110, -151, -15, -45, -238, -197, 105, -202, -8, -34, 379, -144, 10, 39, 276, -70, 8, -106, -39, 56, -13]
8135a3O4%P9K89l55R6o3m1n7P6J4k06KJ81K95m18J25k60J69l0K8l0n5m8L33k86
8161a11L18k83j07K58k56qP9J09K12l06L86q9j83q4J96j41j49QK06R5k83j56K89
8184@M6o0k20KL21k67J32
$$ y = [-13, 51, 51, 130, 419, 64, 160, 97, 56, -1, 75, 89, -117, -115, 66, 361, -57, 68, -192, -23, -53, -25, -55, -110, -158, 175, -111, 207, -76, -183, 75, -181, -189, -110, -1, 211, -95, 291, 202, 19, -65, 131, -10, -159, -151, 55, 150, -133, -289, 0, 46, -14, -234, -232, 89, -178, -46]
8191d6
$$ Imaginary data points
##PAGE= N=2
##DATA TABLE= (X++(I..I)), XYDATA
0@%%%%%%%%%%%%%%%qJ6j6J6j6J6k2L0l2L6m4M8n6O6p4Q7j00J11j24J40j58J77
37I3j97K21k47K73l03L37l72M11m54N01n51O07o71P39q14Q97r91J098j217J352
57G12j509J695j914K180k512K936l499M285n457P379j1040K0274q2128j39437
71b08035K56904K0042k09081P9383J61900j09236o1377J10169J5919o9102N249
82g265K0975l38r569j6769J1685J4176m3142r475L9472j3767p503N0763k2261
95F982m4476O7416L0135p7186J2691O2878n4124l8893O6419J0078m8383N656Q867
108H060j6915M276j1224j3788L1588l96l4194M1511M0287n0711j3843L9243l4458
121a0564l5598M4757M674m1664J7838J7813k4641J6554K8571k0300j161K6225
$$ y = [0, 0, 0, 0, 0, 0, 0, 0, 0, 0, 0, 0, 0, 0, 0, 0, -8, 8, -8, 8, -8, 8, -14, 16, -16, 20, -24, 24, -32, 34, -40, 47, -53, 58, -66, 74, -84, 93, -104, 117, -130, 143, -160, 177, -195, 216, -238, 263, -288, 319, -352, 387, -427, 470, -521, 577, -640, 712, -797, 898, -1016, 1164, -1348, 1588, -1911, 2374, -3083, 4296, -6744, 13530, -68598, -208035, 48869, 68911, -140170, -60787, 101113, -8123, -69500, 40669, 56588, -12514, -7265, 13710, 13372, 3803, -12966, -1281, 12895, -30247, -39722, -250, -14017, -21520, 29243, 6982, -37494, 29922, 60057, -17129, -4438, 58440, 4316, -34577, 31842, 41920, -6463, -807, 8060, -8855, -4579, -15803, -29591, 1997, 1601, -32593, 8918, 49205, -1506, -15349, 23894, -10564, -46162, -1405, 3269, -38395, -20557, -2744, -27385, -10831, 17740, -2560, -3721, 22504]
133B2504m948Q79J2599k0136n716J4255l0831j2371M7508r522m8378L6241L3826
146C5910m6539L09M7712k9590m1043K9815J4114k2722M059R893l765K661j0043
159i229o547K3124r999l6156K6195K9758l4428N68M4397k3337l3341L9519J5837
172B6361l3603R408K2212k0983r310J4556k635n890j967n206J2586R292j5438
185f17J0753J8698l1756j6056L6664r790m1100K6020K2868l9823N97M5219j3252
198H425l0604K0220J1382k1565k870J5669L097j0226p166J4023J4379j8453p367
211a1056L0560m404l1113K4218K5060l8584j1711L3522j5666k7024K8948J1527
223A4277k7353Q160K2946j3081p870J3732k491j1970k399N382Q045o551j3215
$$ y = [22504, 17556, 18435, 31034, 10898, 5182, 19437, -11394, -23765, 23743, 14221, -34157, 2084, 35910, -10629, -10320, 37392, 7802, -33241, -3426, 10688, -12034, -7975, 1918, -1847, 814, -9229, -15776, 7348, -2651, -38807, -12612, 17146, -17282, -16714, 27683, 4346, -28995, 10524, 26361, -7242, 2166, 24378, 3395, -5915, 8641, 6006, 116, -1851, -7057, 5529, 14821, -617, 10136, 28834, -2922, -18978, 17686, 7896, -33204, -7184, 15684, -24139, -23542, 21677, 8425, -22179, -1959, 9423, -12142, -15012, 657, 3754, -6472, -13638, 385, 14764, -3689, -11056, 19504, 15100, -16013, 8205, 33265, -5319, -17030, 16492, 826, -26198, 2750, 14277, -13076, -4916, 18030, 4949, -2921, 10811, 8320, -3650, -6049, -667, 7378, 827, -12388]
236a2388J6078J0723k9556j272L5676j6949l4452K9771K1530l5727k233L4686
248A5887r395k4223J3634J4092p989o815P7P072K299j3559j57J8889n534j3466
262i188J7666J1228j3607O012R904j5227l435R111j3771r951J3426n434j5317
275a8583R998R238q432j404L946K894M073q245m746J8559j035k6063J1273K5324
289A6797k1807j5433K8623M830k3254P755J6320p928m938L715R60N947k816j1045
303b274J1088Q403k0857k773J7921j1750j5095J4326K75j4341J1282O899j3140
316a0036Q213J2416j3493j707J4515p287r724O645o19m595J442n339L140J2192
330E763j0933p704K4697Q91k6714J4561K2927k5541j0824K7217l544k1482J2432
$$ y = [-12388, 3690, 14413, -15143, -16415, 19261, 2312, -32140, -2369, 19161, -16566, -18799, 15887, 6492, -17731, -4097, 9995, 2006, -4809, -4732, 2340, 4639, -8920, -9077, 9812, 4278, -9188, 8478, 19706, 6099, 12111, 22015, 6788, 3353, 12464, -1307, -11258, 2168, -3266, -18583, -8585, 653, -7779, -9183, -5237, -2343, 1730, -6515, -11261, 7298, 6263, -19800, -8527, 16797, -5010, -20443, 8180, 13010, -10244, -2489, 13831, 5903, 965, 4680, 5640, 11587, 8771, -2274, 8814, 17217, -3640, -6413, 11508, -242, -15337, -1011, -736, -15077, -3795, 3104, -10036, -1823, 10593, -2900, -4607, 9908, 2621, -7103, -458, -1077, -5672, -4230, -9569, -6429, 5763, -5170, -12874, 11823, 12714, -14000, 561, 23488, -2053, -12877, 14340, 10796, -10686, 1746]
343A746R224j3310L87O043m522J895N02o515P296K598j1871O175J0147j4508p01
358e414J6435j2219j1396J9882l163k3286J3773J4164k1167j818K1025m814j0582
371h580R893N159l253j345m548M961P121j4240m053K1626p546k3467K1202J5688
385A8618k9276R5K9344j3897j7562K3372L266k0355Q417R610j4256J102P844q203
399a881n78M131r188L058N647j3139K106J4617j3542m898K3621p385j9045K3231
413F755P213k8753R472K2505k1987r015K4299m331j5264J3589L886q860O635O70
427F814n528J0168k635j4015J2922M502k2604M489J6818j9854q560K1356o407
440b534j4620J6184L093j4302J0581P307j2924O614J0403j1565J064R755j0294
$$ y = [1746, 10970, -2340, -1953, 4090, -432, 1463, 1965, -4550, 2746, 5344, -6527, -352, 9795, -4713, -5414, 11021, -1198, -12594, 7288, 4125, -19161, -5388, 8776, -12391, -14209, 6816, 2002, -8580, 1313, 6472, 3219, 1874, -2674, 2287, 9408, -4832, -8885, 12741, 5195, -18272, 2930, 18618, -10658, -10563, 18781, 4884, -12678, 10694, 13960, -6395, 2022, 11632, -2624, -1522, 6322, -1881, -2459, 1672, -7516, -4458, 1189, -11950, -9844, 4773, -8769, -13667, 9954, 2569, -16476, 6755, 13968, -14785, -5313, 17192, -4795, -13810, 10489, 6158, -9106, 4483, 8369, -491, 6144, 6814, 1286, 11454, 8819, -5196, 7726, 12228, -10376, -5887, 10931, -8923, -17483, 3873, -2534, -17154, -970, 2123, -12179, -1598, 5709, -7215, -601, 9802, -1763, -699, 9056, -1238]
453a238j617R696j0682k763J5295r008r787K0318j808k0289J5806J2334k2262
466f005Q93J8534j2686q944J2664m844o895R025n352n721J4292l588j3249J6498
480D622P457j9467O593J6223j5503o749J5150o686r868J0564k720j0151J0153
493c82R94j2587Q136Q488j0221L138J0390p471j025Q269p569j723J0250q979o970
508g262J6632m169j7961J3739J2310j9414j083J9268o473j1487Q949K253p309
521b007K038l93k234M679m856n979Q797m61j0987Q457P592j1920J765J2586q906
536a829l720J3627m257r908J2893J905j5248N387R403j1679k590J0423k653l032
550a278M309k741M72O471o288k940J1152n226j1640J0220L041j4736L755J0860
$$ y = [-1238, -2855, 6841, -3841, -6604, 8691, -317, -10104, 10214, 8406, -11883, 3923, 16257, -6005, -5112, 13422, 736, -8208, 4456, -388, -7283, 1742, -3610, -9331, 4961, 1373, -11876, 4622, 12079, -7388, -795, 15428, -75, -6824, 8326, 1640, -8228, 2336, -384, -10535, -382, 612, -11975, -3839, 4649, -5572, -2434, 7956, 485, -540, 7729, 160, -1563, 8687, -292, -7262, 9370, 5201, -12760, 979, 13289, -6125, -7208, 12060, 5587, -5900, 3049, 5302, -2007, 31, -362, -2596, 2083, -2773, -8752, 45, -416, -11403, -2946, 4646, -7274, -5509, 7077, -1829, -5549, 8078, 3821, -6087, 6806, 8711, -6537, -1150, 8253, -3426, -6016, 4407, 1754, -1278, 3031, 290, 762, 7233, 945, -1995, 9157, 3931, -7709, 2511, 5552, -9184, -5429, 5431]
564E431j0505l361J1063m277o027P517j687m314Q747K41q269O666M086q731L580
579A60N531o656K475M746q493J94R031p846m876J2300j758j0021R547M259j2819
594d226K049Q753p844l241O008l396m104L681j743j529O923j171l880O152O88
609C120m353L324R19m711L756K060o017K455L656p297j28O884n699l298Q629k690
625F10p803O339L273n867L013M143m703J967L766n464K26M681m546k007N126k719
641C5k333N509k095l681P638Qp445N618K189j2119J854R410r392n953J1838l09
657G72j0355O007O727n648r02N392j48l73P45r53J655m8k648J719L269m155K52
674A308K933m131j644M303l756l027O066j560o482P246L233q651J998O655o167
$$ y = [5431, -5074, -8435, 2628, -1649, -7676, -159, -1846, -6160, 2587, 2828, -5441, 1225, 5311, -3420, 160, 5691, -965, 1510, 6256, -2237, -2043, 6988, -858, -5734, 6566, 4808, -5213, 4334, 8593, -4226, -2177, 6576, -1268, -4509, 1499, -1897, -6001, -2320, -4063, -5592, 1331, 160, -3720, 2432, 3120, -1233, 2091, 3010, -1701, 2055, 4115, -1902, 553, 4209, -3088, -3216, 3668, -2031, -5329, 3300, 610, -7193, -854, 2419, -3448, -435, 3708, -995, 972, 4738, -726, -500, 4181, -365, -2372, 2754, 35, -2298, 3211, 1116, -2565, 5073, 5081, -2364, 3254, 5443, -6676, -4822, 4588, -4804, -10757, 1081, 772, -9583, -3576, 3151, -2497, -3399, 1993, 1845, 1472, 2217, 1264, 2919, 2871, 223, 1942, 5211, 1056, 1308, 4241, 110, -1534, 2769, -987, -4014, 2052, 492, -5990, 1256, 4489, -4162, -2164, 4491, -1676]
689a676k863N331l208l285M915j796k449P804o73o705P161N046r495J410Q650
704H167o627n515O780r98n227L285O61k641L635k70l299M253N47n804K352L848
720C147m906K27M509m429J54M947m743k078P199l562p700P290L022r628L130Q051
736D630n773j955P571k192k851M003k072l510N151k300n897N843J722p736L486
751a880O567n876m48N943l207k511M668l730k745O032k968n859Q237J615q686
766d848M516O362q262k43P452m956l420O390k718l485O741j649n903O310J191
781C478q231L412M074p716P33N762o079L98P360m827k098J0158l040p460R434
796E358K237j1807M499O996r265j121P883m268k990N804k314l044N852l585m831
$$ y = [-1676, -4539, 792, -2416, -5701, -786, -2582, -5031, 2773, 2100, -4605, 2556, 7602, -1893, -483, 8167, 1540, -3975, 2805, 1807, -3420, -135, 526, -2115, 1520, 1250, -2049, 2204, 2751, -3053, -701, 3147, -1759, -1532, 2977, -1452, -1298, 3649, -1094, -3172, 4027, 465, -7235, 55, 3077, -6551, -3421, 4630, -1143, -3098, 4473, 2281, -570, 3433, 1361, -2149, 3002, 702, -5195, 648, 2370, -5366, -1880, 4687, -1189, -1637, 4306, 1099, -1412, 3256, -474, -3219, 2813, -155, -6014, 2223, 3838, -4848, -332, 6030, -2232, -2475, 4977, 21, -3399, 2991, 273, -3212, 3529, 1880, -4023, 2287, 3478, -4753, -1341, 2733, -4983, -4250, 1512, -4567, -4169, 3191, -1636, -3734, 6424, 3384, -4076, 5358, 7595, -4212, 287, 7283, -1982, -3103, 4780, 512, -2478, 3326, 1012, -2032, 3820, 235, -4596]
811d596O697j448q060N959L292q559L453O668p623M91Q784p022l257J0681l474
826A986q091R642L261j0438M039Q048p449j734N896l072l112K672l288j098L800
841A062m351k092P437k022n716P498K145q688M438N162p924K97O954o561j966
856d327Q940l466o324Q947J682r045L690N445o803j042M870l117j393L030k780
871a693j57M346l824k172O356k483n798O101K009o941L155N031n377J229N651
886E433n121j367O849m069n701O657K12p747K808M907n099l65M667k468p80K814
902A630k390k98L366l559k387N955j695o102N422L737o612J462N653m657j354
917a829M725l251k431N362j427m274M818J567m994K364K843l966n76K891l030
$$ y = [-4596, 2101, 653, -7407, -1448, 1844, -6715, -3262, 3406, -4217, -3726, 5058, -1964, -5221, 5460, 1986, -6105, 3537, 6798, -3640, 399, 8447, 998, -736, 5160, 2088, -1024, 1648, -1640, -2738, 1062, -3289, -5381, 2056, 34, -5682, 1816, 3961, -4727, -289, 4873, -3051, -2754, 4200, -2361, -4327, 4613, 1147, -5177, 3770, 5452, -3593, 97, 5542, -1261, -2303, 2567, -550, -1943, 1087, -1693, -1850, 2496, -1328, -3500, 2856, 373, -5425, 676, 2685, -4256, -1101, 3930, -1447, -218, 5433, 312, -1055, 5794, 1725, -3976, 2681, 2893, -4854, -2046, 2861, -2238, -2603, 2064, -404, -1184, 1630, -760, -1058, 2308, -1251, -3638, 2317, 622, -5480, -58, 3679, -2933, -1471, 4182, -475, -1829, 2896, -355, -2786, 2576, 1149, -3125, 1693, 3260, -1734, 630, 3473, -493, -1069, 1822, -1208]
932a208K15J842l077J043L983m012k142P013j592o704N345L521p368K92M973l488
948a364k315L785k92j432L121j84j293K719q92k193K262k25l018K178M32k576
964a287K283J129m948K402L737o383j250P223k812o130O071K726o327R48M895
979B277k830o49K335j106N36J506k316j57L005k053k020L644M98l002J529J017
995B214j932N42n22k613J563Q17m003P35M406k227k599M356M57l380J343J520
1011F77p09O51K21r36K092J77k883J159K440k252j107K416k92j820N89j240l21
1028a138J561k307j045L432J67m017K508L672l993j630L730m16k145J047Q61P88
1044A075Q62j025m90K190o43l187J305J594k076j49J652j386k60N23k359Q05K481
$$ y = [-1208, -993, 849, -2228, -1185, 2798, -1214, -3356, 3657, 2065, -4639, 706, 4227, -3141, -2849, 2124, -1364, -3679, 106, -186, -1618, 1503, 1319, 26, 2745, 1853, -340, 1922, 1697, -1321, 857, 1289, -1287, 996, 2125, -2823, -421, 3316, -3067, -4317, 2906, 94, -6036, 35, 2761, -3566, -2618, 2277, -553, -1202, 1133, 27, 563, 2069, -247, -404, 2601, 548, -1472, 2172, 2670, -332, 1197, 2214, 282, 824, 302, -2311, -748, 69, -3934, -3199, 1207, -1020, -3619, 737, 1194, -2186, -843, 677, -32, 619, 840, -96, 1996, 2173, -710, 449, 2889, 637, -470, 1946, 1654, -166, 423, -817, -1138, 423, -1884, -2929, 503, 670, -3347, -839, 2833, -1160, -2790, 940, 524, -1621, -574, 287, 1075, 1937, 912, 422, 2612, 1969, -1218, 87, 1681, -395, -544, 1108, -278, -538, -15, -2374, -1569, 912]
1061I12k709j134M833K8n271J628M323l597k285M125J304j752J37P16Q50o52j873
1078d17J63K437k201j879K960L33k833J106J598k115M28R82k433Q71K471k342
1094h71j264M354j002m185K346K278l295K59K555l87p5K47k029J228J740l566
1110a667l26M903j330l282M071M02m555R32K527k943OK485j502k99K224j855j445
1127a654L030r23l354K658R53k528J197J001j862J633J039l280J352L526l911
1142a123m50N617j616m702M332J425n434J121L212k600l79K334j662m03J592k868
1158a604q46L199k105k215M113M7l243K334J185l410K143J970l731J811L798m166
1174g20m03N322k622l999M617R42m733J355K935k895M0J444k384P48J452m064
$$ y = [912, -1797, -2931, 1902, 1930, -3341, -1713, 2610, -987, -3272, 853, 2157, 405, 542, 1258, 2108, 1456, -417, -254, 2183, -18, -1897, 1063, 1396, -1437, -331, 1267, -848, -420, 562, -1871, -1000, 1471, -871, -2135, 2219, 1217, -2968, -622, 1656, -1639, -1380, 1175, 788, 713, 960, -1069, 159, 1899, -1667, -1993, 2910, 1580, -1702, 2369, 2771, -1784, -852, 1675, -1268, -1262, 1223, -279, -578, 1646, -209, -1654, 1376, 453, -2901, -243, 710, -1818, -621, 380, -1482, 151, 1190, -2090, -738, 2788, -1123, -1573, 4044, 2428, -2274, 2058, 3483, -1951, -830, 2382, -218, -597, 1737, 75, -328, 1264, -1604, -2450, 749, -1356, -3571, 542, 589, -2654, -320, 865, -2545, -402, 1568, -2163, -352, 3446, -720, -1123, 4199, 1577, -2422, 2195, 3137, -1596, -241, 2694, -201, -161, 1283, -1101, -353, 1099, -2965]
1190b965M26M798l287k568M898K86m579K427J769k981J262K036k201J621K520
1205C462l855l5M208l481l124M748k49m043K073J527l265J173O56k756J722K927
1221A688m401O85N339l006l677M928J089m817J759K968j884m27J379j153J011
1236A481Q91l173M29L461l123k057L696j2l622J139J186k168K76K58j854K163
1252a029J546l402R39M309k371k682M145J007l411J459J746j676L96N10k277J554
1268G63J884m037j1M377k026l472L835J667m018J83K188j891K13M45j482Q45J776
1285A239l381l36M032j871k815L160J764l148P83J732r99J23M66j733J230J415
1301A661k843k42L897j724l056L282J079k465M74J565r94M26Q3j846J672J019
$$ y = [-2965, -2539, 2259, -1028, -3596, 1302, 1588, -2991, -564, 1205, -1776, -514, 1522, -679, 942, 3462, -393, -428, 3780, 299, -2825, 1923, 1674, -2369, -296, 1231, -2034, -861, -205, -2961, -1239, 1688, -2713, -2028, 3311, 305, -3372, 1556, 2645, -2172, -413, 2555, 671, 244, 1623, 470, 1481, 2372, -801, -372, 3089, -34, -2091, 1605, 1593, -2029, -890, 296, -1872, -1596, -1338, -3192, -1029, 517, -2885, -1946, 2363, -8, -2690, 1455, 2462, -949, 510, 2256, 580, 976, 1486, -791, 763, 2647, -1390, -1401, 2976, 950, -2522, 1313, 2980, -1038, -855, 1333, -558, -345, 100, -1382, -537, 1239, -2142, -2478, 1554, -317, -3132, 28, 1792, -1356, -573, 1159, 160, 283, 749, -984, 246, 1661, -1182, -1424, 2473, 749, -2307, 975, 2054, -411, 63, 1628, 634, 1060, 1143, -703, 969, 1988]
1317A988l789R1L525k408k624L368R03l080J134J730j840N24J319j462O06J935
1333A920k070o98K557j017k282J768O44j496K87M99n22O59l05j224J482J347k874
1350a325M22K807j912j817K352M89j964M65J441q27K26M0m03R28J34j083M60J398
1368A831j774o23J071o91o50M52k17q64P86n36r48J743J50j911R93J907j261l72
1386i14J827P30j045L82N43J86j76o55L5J043j100j090J011M59j794p5R89k79
1404G7j176j2M27R6j65j126N35J077j171p76J317R29q02l00J453O93n86k54Q84
1423A120J010p55o86P53P86j464r72J270k58j574l44J046m62j88l82P63R64j88
1441D39j441P82J610j692j335J811M46j453l56Q07J6k26m91N47J059m85r01J174
$$ y = [1988, -1801, -1710, 1815, -593, -3217, 151, 1054, -2026, -892, 838, -1002, -478, 841, -621, -15, 1920, -150, -848, 1709, 692, -1590, 178, 822, -674, -387, 112, -410, 249, -56, -1280, 202, 1549, -1325, -903, 1904, -8, -1825, 527, 1016, -948, -483, 958, 131, 357, 397, -6, 922, 1056, -27, 433, 1831, 57, -566, 505, -186, -836, -384, -601, -1465, -679, -1215, -2163, -420, -270, -2181, -1188, 719, -542, -914, 913, 1643, 598, 980, 1523, 1709, 1533, 878, 913, 1956, 856, -234, 777, 1236, -558, -633, 356, 77, -1099, -1111, -684, -588, -753, -1879, -1344, -267, -1438, -2214, -897, 32, -770, -1070, 383, 1076, 490, 236, 1120, 2130, 1375, 689, 1442, 2228, 764, -208, 1062, 804, -770, -1114, -68, -530, -718, -1100, -337, 627, 439, -1002, -220, 1390, -302, -1637, 174, 620, -833, -1189, -382, -366, -592, -1083, -536, 523, 38, -863, 311]
1459C11J764k282p24J980J54k097J32J290m61o06J03M1J084mj691J151K085j252
1477I78j185J496O32j615m95L62P6J34j633p00K068j45k448J050K642j634j131
1494a548K160O72j998J97J080n74m9p17j35J255m20j928J497J843j542p08K256
1511A341k74p81J120l50m35J091j085j265J848K54k938R36K635k293j591K399
1527F12K1j635N53K36m09Q16p41j066J350L8k614J089K223k501l97K559j87j324
1545a377K023J28o72J591K9j189J540Q75k665M48K032k189j176J532n85r83J019
1562C81o58n18Q78q87j254J854M57k780J307K153k124p67K255n47r87J184k56
1579c09n01J457m81n34J766K46j867J379R92k052j80J532j327m74J365q71j206
$$ y = [311, 2075, -207, -931, 1049, 1203, -894, -762, 528, 67, -539, -436, -395, 689, 685, -1006, 145, 2230, 978, -207, 1289, 1921, 306, -189, 173, 249, 383, -1250, -1950, 118, -27, -2475, -1425, 1217, -417, -1548, 612, 1284, -714, -517, 563, -11, -60, -777, -912, 343, -77, -2005, -508, 1335, -207, -915, 1341, 1067, 286, 1406, 1056, 621, 1712, 627, -638, 1210, 1464, -1474, -538, 2097, -196, -1787, 612, 633, -1002, -449, -213, -622, 194, -547, -1613, -263, -225, -2839, -1750, 473, -2028, -2425, 134, -53, -1377, 646, 774, 102, 1693, 1722, 533, 2073, 2948, 283, 731, 2763, 574, -602, 930, 345, -638, 381, -277, -795, 83, -804, -2058, -204, 253, -2527, -1220, 933, -1191, -1958, 297, -250, -1237, -53, -309, -810, 647, 166, -368, 1398, 1644, -223, 1156, 2148, 96, -84, 1448, 121, -353, 1012, 141, -1065]
1596a065J191m26j523J622Q86j790Q21K246j942m12J794m18j172N54K35p42N90
1613D49o52r90J106J74k351J291J567j801m86K391k41j669J272P37r48o0J15j59
1631b55N15K42j131J130J045j566j85J820o53o99J420J90j135O31k62j468K36
1648a25K49k025K72J471j204j022K086N9j571O64R46K8K4j07K35R43k20j721J095
1667G7J111k146l58K358n58j567J786J013j052O91K65r94P17j59q71R7J214j641
1685a7r42Q82m06j083L55L90j02J086n76o46J579q4k322R58J995j780j330K105
1703F2O75j995J64J516j97m17M31N79P83j80o19P99M77j395j37Q03r93p52K74
1722a22l19l92O47l02j066J238M19j480L86J702l21j232J094L83r82o31M93N19
$$ y = [-1065, 126, -300, -1823, -201, 685, -1105, -284, 1962, 20, -392, 1402, 984, -188, 366, 601, -141, 449, -203, -1193, -87, 87, -2264, -973, 594, -1207, -1693, 698, 457, -1212, 60, 797, -151, -211, -96, -255, 260, 502, -629, 501, 1546, -20, -205, 1615, 962, 263, 1683, 1873, 738, 1369, 1107, -361, -125, 124, -1901, -1629, -158, -1362, -2384, -298, -239, -1810, -1146, -200, -172, -148, -255, -20, 923, 703, -1018, 77, 1188, -958, -1316, 1042, 484, -1083, 703, 1716, 664, 1355, 1620, 626, 1343, 1184, 313, 410, 1624, -17, -959, -77, -483, -1566, -1211, -821, -923, 163, -413, -1059, 520, 436, -1886, -928, 1067, -713, -2043, 62, 737, -1258, -1094, 422, 225, -192, 239, 818, 1601, 1421, 802, 1601, 2078, 683, 546, 1349, 356, -396, -122, -441, -833, -186, -488, -1554, -316, 103, -1377, -991, 711, 390, -842, 252, 635, -347, -978, -485, 34]
1740C4l90m63P03P39n44j098J082P48j087p2J294L1j161K05M19m93k02m5n1L01
1760e0j45M2L67L27O8l23J78M27j34j22j21K49Rp38m80N71l40j051l68R42m39
1781a131q45J038R46p57p29R46R66o23k70R91L76n97K42L21l7n08k8N35J73m15
1801E94K25L93pp62L15K92p78n73N38n90m70J8l14l90K70K57n72K27Q60j66m4
1822f77M87M54N6j98M88N16n63o87N50M82q60n87R45K04j205P4J487j92q44O59
1842E89R60r70o49R05M7r34j69m2k08j21k40j46M94j98j3K97M24k70L58K0m10
1863b76N40K49j013L4N40n29p06J024N78r74p1J400R9p87M81Q03k53n00j55K92
1883G76J15j260n11R02k95j245N78J252r59q3J053O4m75Q27l35k42L04m45m73
$$ y = [34, -356, -819, -116, 623, 79, -1019, 63, 811, -276, -348, 946, 977, -184, 21, 440, -53, -255, -300, -351, -50, -195, -153, 214, 541, 609, 286, 464, 891, 757, 635, 514, 763, 772, 34, -446, 125, -215, -1266, -1634, -692, -1131, -1976, -938, 8, -749, -1478, -532, 434, -189, -459, 532, 908, 311, 553, 874, 837, 329, 301, 836, 1009, 594, 819, 1212, 1205, 443, 758, 1050, 272, -301, 237, -353, -823, -805, -1119, -1509, -1239, -982, -1554, -1327, -467, -633, -677, -190, 264, 320, 122, 610, 1126, 563, -124, 426, 908, 48, -539, 406, 610, -595, -521, 966, 774, -70, 589, 1549, 579, -70, 835, 882, -52, -221, -263, -471, -592, -832, -978, -484, -682, -695, -398, 26, -244, 114, 134, -276, 264, 513, -500, -466, 74, -455, -1161, -137, 441, -533, -604, 796, 895, 108, 589, 1392, 1139, 639, 484, 776, 891, -369, -880, 22, -273, -1518, -940, 312, -647, -730, 323, 387, -88, 739, 404, 162, 466, 21, -452]
1902d52J78M7o86j6N82l79m0K51j38N79K31n84N32J396j405o81J629J77j528L89
1922H2Q48o18m11L10L25K59k87j65J99Q34j255j93J208p48j553P75N09j113n09
1941a503Q17p19m59Q14j92N5R50L53n74Q04N11n54J91L58J74J06j62l84O3K68
1961I17r15Q6J031p00j229J403N26j647K48J124q27r06L95K41m17J25m87L47J80
1980e05m71p2P02J49m77Q73N36m75l0Q20p98j40M55l67o63O93p9q19K72M94m50
2001c52m26R29K94n36L17M97K67Qp61J16N18p58p87R60J31j454N74P98o35n75
2021h75R86n0q82N62O20m14J65k63j26J39q5p39J16O82n54J62R09k46k26R73j68
2042F86l78O71K21r23K54P15r58p82Q01j69j070L69M82r0n42M74L89M87r15o2
$$ y = [-452, -274, -227, -913, -929, -347, -726, -766, -515, -653, -74, 157, -427, 105, 1501, 96, -585, 1044, 1221, -307, 82, 930, 312, -99, 211, 536, 795, 508, 343, 542, 1376, 121, -72, 1136, 388, -1165, -390, 119, -994, -1503, -686, -1405, -1864, -1050, -1242, -1187, -237, 116, -458, 346, 857, 303, 494, 852, 1026, 1132, 970, 586, 649, 917, 2, 88, 1119, 419, -810, 593, 1119, -528, -280, 844, 17, -889, -494, -253, -670, -545, -1032, -685, -505, -976, -1048, -346, -197, -674, 199, 735, 260, 230, 1050, 252, 112, 567, 200, -463, 230, 151, -668, -396, 98, -352, -778, 151, 445, -91, 226, 723, 990, 998, 237, 353, 871, 113, -674, 286, 417, -1037, -463, 335, -300, -875, 111, 61, -821, -259, 361, -53, 112, -151, -277, -138, -223, -962, -846, -164, -718, -556, 353, 107, -119, 854, 686, 308, 979, 1200, 277, 531, 1246, 288, -494, 307, 138, -932, -563, -81, -171, -713, -239, 150, 637, -278, -340]
2062c40O70k74p24K81O97p51j055J075J44j026M45L36M7M42L6L28Q7K90j09l45
2082B54P46j67k06k97n1j28K70m79j91O69m12n57Q94L76r45j31N95j57j032M26
2102e23M36o45n98O48K68j84j77K29M11K17j88J78R16j56n63J043k63o44LK45
2122F53l59m06O5L6o7q8j73k68K75L58r5k68O18m0m21L4M73l51l05Q3KK59k78
2145b63j28K72M71o17N50O28n32p56M66L36m97m55M54n0l30j47L95m70K71O2M1
2166b99O96p7NL72M5K5p6q5r4K96n38k30j36K54p60Q6N52l57m11J06Q17n23k81
2189f13L28j05K40l97j37N99J52m82O8O20k99k33N89L66m39J43N93R9k26k49j36
2210D81M13o35p16M74J35k83l75o4J57P7k30q5N47r7J74k65K92J47l10rL74j13
$$ y = [-340, 330, 56, -668, -387, 310, -441, -1496, -421, -277, -1303, -858, -522, -475, -33, 3, 331, 418, 708, 599, 254, 1000, 833, 627, 330, 279, 151, 421, -58, -249, 420, 8, -549, 345, 721, -224, -355, 240, 83, -949, -523, -87, -732, -1330, -682, -414, -598, -775, -546, -135, 82, -106, 72, 988, 832, 269, 1312, 1049, 405, 408, 653, 294, -112, -47, -11, -78, -166, -339, -607, -332, 26, -69, -337, 281, 241, -180, -146, 327, -24, -329, -246, -244, 15, -263, -391, -119, 352, -265, 285, 913, 381, -375, 91, 427, -70, -525, -71, -121, -451, -598, -203, -673, -402, -340, -299, 397, 320, 325, 697, 742, 767, 691, 606, 512, 808, 270, 40, -96, 158, -602, -516, 36, -321, -732, -626, 191, -332, -613, -285, -390, -150, -547, -684, -85, 67, -415, -347, 273, -26, -259, 330, 696, 257, 400, 993, 1092, 866, 617, 481, 894, 259, -457, 17, 152, -131, -506, -570, -413, -336, -566, -651, -104, -201, -27, -292, 0, 147, -163, -172, 202, 89]
2232H9r03J62P98n84J16K0L66n3%M76O6J03j42QJ50L8p66J16M33n07m74K44K75
2255C1j32n3J51J33j03k55N64k4j75k66Q1L36l62n34J69M22o16L15Q4J63K53p2
2277A10P0K98J34k86K1L29l58n43J17K44m71r9J15R5mm0k26R03J19n97L10P02
2299I43k71m66K14K18m51l77J88l38K58m15K6M81j20n27L72M70m20m9J79K12n32
2320d05j83M61Pl74Mj71N13M59n54N65P9lo4M79J98k20l05J15L3j90l88j69L00
2343A87m35p22J13N37l20j89N00K66m43K34M70k58J05m3L5K08k53m03J89O56j96
2364B38k41L88L1k9r5L00j44p6Jq0m1J05m49m97N26K14r13K30O93p00k0N54J51
2387A46j84J57L57J23k91k61J42J28k69o87N00M74p00k02L95R4j33P7L04R6j27
$$ y = [89, -814, -652, 146, -438, -322, -302, 64, 11, 11, 487, 553, 656, 514, 522, 672, 710, -56, 60, 493, -14, -488, -244, 31, -101, -154, -3, 130, 27, -228, 336, 312, 137, -129, -48, 288, -74, -608, -439, -17, -633, -318, -234, -71, 182, 110, 180, 478, 612, 326, 347, 676, 318, -225, -108, 136, -335, -434, -319, -224, -228, -268, -494, 409, 528, -69, 241, 943, 672, 206, 420, 638, 187, -190, -2, -340, -82, -497, -471, 10, -110, -637, -265, 205, -215, -264, -85, 127, -405, -588, -127, -120, -494, -490, -661, -148, 311, -243, 322, 401, 398, 334, 813, 1011, 791, 486, 601, 634, 444, 56, -113, 187, -248, -970, -857, -320, -640, -829, -329, -63, -506, -272, 198, -60, 45, 2, 37, 245, -8, -411, -222, 434, 238, -3, 385, 416, 387, 292, 592, 448, 372, 373, 293, 252, 357, -92, -589, -63, 151, -762, -532, 161, -539, -559, -5, 146, -38, 119, 476, 599, 308, 47, 189, 317, 48, -639, -139, 335, -365, -567, -172, -78, -211, -134, 170, 266, 139]
2408A39m3M3L36j07o09M04K02n36n9M41k76K8K9K54J31M1m65J2N38r0p61K73M95
2431D20n54o64Q56J71p29q4J2M22O8m35N53L94k31o13M20O51o33m68P29J5r09
2452f09L90J46L5K7q6J76J43j3OK74K93k0o53M64k84R4o53J85r0K63m91m06R28
2475A19l85n96N30N64l55n41P07M31n36j40L68J23j17j10R6M69l93l14N61J23
2495F04n16j88N37j26k17K82j85j75j78q9k49J05n8l34LM39j12k38L79M15j67
2516f8p0J67N71j87k98J45L93m29m31J68Q56n66n36N83K06p95j19O42m5n06LL46
2538C0K48p03J07K10O5j89j40N97k78k30K78J31o5J93L69k69j57K17l74n5L23
2559C08l85o13J60N76l67n94N50K14o3k39L09K82J52k71K76K58j94p37O83L06
$$ y = [139, 96, 139, 475, 368, -241, 163, 365, -171, -230, 211, -65, -37, -8, 246, 377, 418, -47, -35, 503, 413, -348, -75, 420, -134, -798, 58, 229, -500, -584, -572, -150, -82, -517, 36, 430, 199, -414, 6, 657, 24, -444, 285, 300, -609, -219, -73, -38, -11, -97, 79, 222, 209, 215, 489, 782, 762, 109, 573, 289, 383, -270, -85, -175, 88, -403, -809, 119, -266, -862, -332, 232, -123, -664, 43, 474, -62, -202, 166, 289, 172, 62, 158, 627, 234, -80, 481, 604, 88, -100, 437, 311, 94, 376, 191, 16, -162, -251, -500, -395, -453, -787, -784, -345, -457, -695, -316, 99, -68, -138, 29, 600, 413, 115, 260, 653, 224, -207, -39, 817, 251, -285, 298, 504, -291, -410, 232, 187, -319, -316, 30, 278, -425, -318, -108, -43, -232, -372, 225, -53, -283, -5, 126, 61, 254, 623, 354, 197, 414, 40, -15, 308, -77, -690, -530, 46, -321, -915, -365, -151, -214, -453, -144, 138, 290, 19, 295, 553, 359, -378, 305, 611]
2579F11r90L93K57L9n27J49M25j92k51J87j04m1j7J35l76N3j44j20J55P8m3O1
2601b62p6J92K79%j34L36K24r97O56M67m50n16M17L45o29k09M71J08l57q7L86
2622A64L08o80Q0L59M27o53J6J99k26m29M28J01m19K12k6p9j01L24l51Q9L43J6
2644A02k88l9P34l33n14O20J47o7l85J5K72k61j11lM90L8q73N54N38j087M26K32
2666B07k04j46n02N75l1j70k6K68j65j14J30K45Q4k7K7J84k20m6M30m88k08L24
2688A27q4n16M84l9m62o4N20k92k71K80M39k42n1L03J93J3p07K05P25n55l89P83
2710D00J68p84j16R07m17j12Q3K04l76l7J49M0m22K4k8K13k52jL04j09K27L3k21
2733a23K03J72O8k84K00M30l58l35L76K4k85l02K14R4l75j47M97p3o4m83M14J50
$$ y = [611, -379, 14, 271, 310, -217, -68, 357, 165, -86, 101, -3, -44, -61, 74, -302, -249, -393, -513, -358, -280, -323, -262, -338, -146, 133, 133, -1, 335, 559, -438, 218, 685, 235, -281, 136, 481, -148, -357, 114, 222, -135, -222, 164, 472, -208, -128, 231, 658, 5, 21, 220, -6, -435, -7, 94, -325, -113, -139, -218, -319, 5, -346, -257, 86, 102, -186, -225, 509, 176, -338, 282, 429, 362, -23, -8, 264, 3, -108, -111, 379, 417, -456, 98, 636, -451, -25, 207, 3, -143, -645, -70, -101, -271, -297, -29, -194, -308, -178, 67, 151, 124, 151, 335, 115, 69, 499, 11, -197, 127, 43, -473, 11, -28, -490, -554, -34, -326, -597, -317, 122, -120, -171, 132, 325, 338, -369, -164, 561, 6, -383, 400, 568, -216, -332, 575, 158, 46, 129, 333, -43, -80, 69, 109, -313, -289, -317, -104, -356, -357, -53, -162, 65, 98, -123, 80, 252, 320, 36, 236, 666, 308, -27, 349, 373, 88, -214, 0, 94, -281, -428, 69, -4, -68, -551, -137, 13]
2755A3m52j16N30K70n74%M48ln68M17P3j2Q7K87M1m03K11L87p71J38L09r8k77
2778f3K18k89n6j39J13R0k08l0N68K4n81L57L51m22l39M34K67m65J19L07k56l51
2800c51J41L00L1m54K21L01L8l55J8N45k13m73L22j26j9k14J46j40j50M46k5l23
2822c34J72M14l55l62M36K2j35K01J61k36l00j3O14m22k36J17J009p59J5M86p9
2843D16o86J47O47j89l91p9K97l42q4Q4Q0j29k08J06M66l44M1%J76l7J18j2K2
2866I9J3J03J81j99p3K35m86L22L6j32l79M05N8n63J90K88l7j73l78M70j97K3
2888a94k93Q05k25m33K15L39J68q64O75K11l90K24r6K35m15J42j94K22m8k44O8
2909i2l1J32k91j04J43L44j43k16P5R9J02m67L45N78m29k75K91M24l84q5K15J
$$ y = [13, -439, -555, -25, 245, -329, -329, 119, 116, -452, -35, 38, 26, 113, 400, 441, 38, 249, 636, -135, 3, 312, 214, -63, 155, -134, -190, -329, -216, -126, -334, -364, 204, 228, -353, 4, 355, -67, -406, 28, 295, -170, -51, 256, 0, -351, -210, 90, 121, -333, -112, 189, 227, -128, -110, 435, 222, -251, 71, -55, -74, -288, -142, -282, -432, 14, -11, -334, -162, 252, -103, -465, -29, -7, -142, 59, 220, -16, -316, -329, 285, -137, -373, -256, 753, -6, 9, 495, 416, -270, -123, 524, 335, -56, -135, 162, -180, -264, -180, -100, -229, -437, -331, 135, -209, -168, -168, 8, -29, 89, 77, 99, 112, 215, 396, 197, 124, 359, -127, 195, 231, 99, -280, 125, 183, -380, -190, 98, 61, -112, -490, -20, -217, -194, -487, 318, 93, -340, -125, 214, 382, -482, 193, 404, 14, 238, 142, 377, -38, 104, -90, 132, 84, -160, -92, -123, 9, -282, -386, -243, 101, -42, -258, -183, -84, 18, -449, -104, 474, 45, -230, 61, 485, 101, 16, 231, 232]
2931B32l1j38J51pl76J12J88m0m58K31J80k91k44L23j46J39m35M26O8R3K73p0
2953A80l22O05l26k72J87n8K42k27L4J5J93l15n1N07m94k6K09K37k92k84L47K02
2975B91n75P9N03m1n30J14K77j59l90L17K70nnl26L39j65R0r8K45k96J77j00J33
2998A45j12j6K70k71j2K76l47J22K20k63j56J89L65m48r4K36J2q0l55K21K75l12
3020a35j95L03K76o49L65K14K63p33K87M2J09k75N98k85k97J70j40Q9K35k66J16
3041I2q2r6j12M78l33j67L37k40j42L70o1j63P9M61k30k18J38L16m70R1J31Q1
3063B60m24mP3n0j35l83P67k84k64N0N16j15k99j8M70m35pL29J26k06K12L2Jj93
3087A9M29k33K44j45l22N1J05l4k46n1q0J7j37l5J99K81n02K4K14O7l9q8L59o1
$$ y = [232, 201, 63, 214, 207, -169, -57, 131, 91, -367, -136, 44, -247, -491, -168, -314, -175, -610, -184, -116, -23, 250, 180, -142, 463, 137, -135, 52, -6, 236, 9, 43, 58, 251, -64, -115, 392, -102, -128, 81, 318, 26, -258, 89, 291, -284, -205, 298, 257, -273, -159, 118, -41, -431, -114, 156, 151, 146, -180, 159, -6, 84, -14, 231, -65, 112, 12, 145, 33, 17, 287, 16, 4, 280, -67, 55, 275, 12, -144, 45, 410, -38, -132, 104, 116, 36, -319, -98, 177, -135, -330, -27, 249, -400, -35, 179, 442, -291, -4, 38, 147, -128, 470, 185, -112, 58, -82, 7, 242, -24, 92, 10, -86, -198, 280, -53, -220, 117, -123, -265, 105, 44, -119, -40, 421, 191, -27, 111, 427, -43, 48, 179, 260, -164, -168, -95, -145, -280, -663, 104, -180, -444, -394, 122, 7, -292, -310, 160, -275, -282, 47, 173, -33, 179, 211, 212, 19, 448, 215, 459, 314, -8, 43, 148, 114, -132, -183, -263, -246, -383, -418, -219, 62, -440, -416, -202, -135, -174, -262, 97, 36]
3111C6l37K27K70O5j94k8K90J23m24l6K14l8m78M72N7m43M3J6L00p6k68K66j47
3134i0l6K8K21k50K18j96J29R6n2K9l03K70J38k26j58P0J36j65k91M59m9p6j10
3157b08L81l47Np0L05j91J07J23j6j4m5m3J10J32m76K83L36k48l34L73K50k72
3179A41J41l17O7j19l8l39M10J13k71oL10l41j1R8O6L0j30j75M30j73m6O3L72
3202B75J35o22K11M5K61m99M07N2k05k11K54J36k80J46p6k8L8M6r7K01o5M9l35
3225a62Q9j80n2jJ51k90K49jj09N30l09j91L27Kj46K12J26k6l79L1M24K6k23P2
3249A70K93k90k50K3J22M3j41J81n6k51%O9O4k91K93q5l48M39n4m2L0L29j84r4
3273c0J43Q0q8K42j55J30j60k72M1j8J80k58J91j21j17K27j91N0j94K41J69j2
$$ y = [36, -301, -74, 196, 261, 67, 39, 329, 452, 28, -8, 206, 168, -310, 162, 219, -224, -181, -165, 135, 59, -209, 57, -90, -126, -98, 123, -127, 91, -105, 24, 120, 68, 97, -206, 64, 202, -24, -182, -112, 24, -141, -432, 27, -22, -98, -208, 173, -174, -169, -239, 66, -125, -18, 105, 89, 75, 30, -13, 97, 229, -247, 36, 372, 124, -210, 163, 413, 141, 282, -35, 32, -87, -125, -464, -54, 59, -212, -218, 92, -249, -260, -162, -96, -66, -196, -371, 59, -114, -160, -97, 275, 410, -212, -1, 44, 305, -194, 213, 265, 60, -151, 103, 239, -41, 105, 29, 1, 39, 85, -12, 189, 124, 173, -162, -73, -253, -305, -306, -155, -445, -196, -197, -306, 224, -85, -276, 51, 53, -93, 119, 245, 219, -160, -129, 295, 321, 98, 170, 463, 173, -77, -54, 68, 111, -30, 151, 95, -156, -156, -87, -23, -314, -21, -106, -454, -15, -69, -111, -81, 248, 64, -30, 113, 193, 105, 347, 192, 322, 162, -110, -69, -87, 93, -165, 26, -95, -212, 15, -176, -126, -320, -79, 90, 78]
3295G8m0j42L21l12r9J61J0k1j22K78m4O5k50M10j98J81l80l3K05k47j42K87m23
3318d57K10Ln3L35j32m1j36K89J31j46J01K23k49K97k98L58k86j44j49K68j96
3339g2K13k66L56m7l88J70J27Ok09N3N8j87J51j22L7n5m1J44K26k60K29J10k86
3362e3J11j70K39rM1r5K71j25R4n27M03p5j16J77l38R5L86l84J19R4r4O4l29L28
3386A07k33p7N2L18m08j67J89J07j74K38o8j4j00J30J74R2O1j31k7N2K59o13L54
3409A21J69j15K4p5r9J30k81K27j65J04q8o6K61j33p7q5J96j61k39M87j87k63
3431c15K88k3L1R2j32L7Q0m3JO2r8M5k60J52J70k37J38j63J87q1l85J39L18N3
3455E6q1M30l80J29J88k94R4l0j96j9L23o2k54N8L52j15n59J86J43k15l4K30Q8
$$ y = [78, 38, -104, 217, -95, -194, -33, -23, -44, -166, 112, 68, 133, -117, 293, 95, 276, -104, -137, 68, -179, -321, -34, -457, -247, -244, -297, 38, -94, -135, -271, 18, 149, 3, 104, 327, 78, 375, 77, 435, 149, 5, -144, 124, -72, 141, -125, 231, 184, -204, -34, 93, 99, -110, -57, 1, -186, -35, -157, -120, -175, -216, -72, 154, -106, 123, 233, -53, 58, -112, 127, 118, 159, 64, 335, 210, 304, -223, 180, 105, -11, 166, -172, -77, 309, -75, 44, 138, 44, 108, -221, 107, -126, -203, -151, 167, -241, -408, -219, -112, -286, -48, -116, -130, -230, -100, 74, 166, 227, 96, 69, 121, 380, -233, 121, 290, 175, 199, 124, 25, 155, -126, 101, -64, 40, -48, -114, 147, 14, -63, -148, 48, -113, -352, 135, -52, -315, -27, -50, -19, 73, -59, -22, 58, 15, 16, 78, -20, 25, -235, -83, 87, -150, -12, -175, 12, -69, -454, -315, 3, 56, -25, 405, 25, 154, 342, 48, 142, 112, -84, -103, 220, 158, -96, -38, 314, 199, -360, -174, -31, -246, -280, -50, 38]
3478C8m39K37j45J27r1N9K12M29m48m1L82j71P7J72j2m8Q0Rk51o1l6r1k4k2j97
3503b55j29L32J42k93Q0l7J95j56O7j92M15k66j29M4M00K4k26r5K16m60K29MK17
3526A27j67J62M7k6L17k17l03J67J13m61L64o6J8r6Oj17J29P3q1j33M92m23j42
3549b17K66Q6j52J30j32%p7K5l7J2m3j08M92l92J08J42J87o1k76L01k74j16J11
3572b5j05K80r9J26k45J14K24m91K25K50k88j88J58R4j4k58K43J12o2j35J93J
3594A10l7R6m1j99J69o4n7R3k00J57Q3j17k20J34j85K58k82L07k0J29N0j84j3
3617c3K31k00K20n5L2j2n4k34L87k53j5j12K12j79M6Nk23L8L8N6O3J87l84J03
3641a36K91o2k02N8L2j1j98J69J61k4q9L62Nk37q1J05K2j38O0lJ48l39J02j79
$$ y = [38, -401, -164, -309, -182, -273, -214, -2, 427, -21, -62, 320, 149, 226, 398, 386, 338, 418, 427, 176, 115, 79, -12, -36, -58, -255, -384, -52, 90, -203, -123, -160, 35, -121, -54, -246, 169, -97, -226, -182, 218, 242, 16, -79, 137, -323, -94, -90, 127, -40, 122, 169, 143, 460, 243, -60, 107, 220, -241, 123, 57, 75, -21, -15, -132, -3, 70, -11, -144, 348, -75, -217, 49, 135, -17, 113, -19, -19, -96, -71, -108, -96, -139, -247, 245, -147, -39, 103, 290, 229, -47, 254, -20, -136, -25, -130, 150, 51, 177, -68, 46, 270, -221, 4, 254, -34, -222, -64, 30, 16, -242, 1, 113, 51, -84, 109, 110, 73, 169, 128, -71, 98, 34, -23, 70, -130, 27, 110, -7, -227, -93, -278, -20, -302, 5, -15, 114, 164, -20, -33, 198, -2, 218, 163, 195, 183, 129, -105, 282, 29, 14, -98, 114, -65, -19, -14, -237, -199, -161, -105, -42, 145, -239, -136, 155, 93, -109, -51, -19, -30, -228, -59, 102, 78, -11, 351, 356, 119, 38, 143, 165, 27, 87, 84, 232, -107, -5, -184]
3665a84J42k38Q2k2J18n1j50L92j00J12k30J54j4k24j17O7J73J43k06J66K5j06
3687f8k44L11Q9l18L77j31J26j15M5rJ44l32M3J46l6l00r3K61n2M21k06O0p0J37
3711A86k5k8J9m6j15n6J28l17J40n3K16j05j81J79P0j60o3L87l16L02j29k16M41
3734B58k16k24M45k73l1K5J40j23j41K69j06J16N9O7j84J37o6j10j08L01j50j00
3756a5j9j93j1J38m8K00l6m9J35j98k05L10j6J59j84j34J80j1K6K07k70p8j8J70
3780D0J46J03l23q9K43K54r6m00K27j69Q4j48K15k87P7j9N7J20q3k35K68j13j14
3803b42L32M6J5l98N7K90%r5J12k02L99l63L94q8Q8k11j79k4J05r5L3k02J02j93
3827c19K79K97k32n3l7q2J90R7l03K26k3k02K27L0m7O1j60O7o2J48j98m1J21j14
$$ y = [-184, -42, -280, -198, -220, -102, -153, -303, 89, -11, 101, -129, 25, 11, -213, -330, -263, -90, 53, -153, 13, 38, -68, -312, -1, 88, -230, 147, 16, 142, 27, 72, 63, 207, -125, -82, 64, 28, -272, -365, -104, -156, 265, 59, 119, 49, 186, 161, 133, 152, 106, -9, -65, 63, -254, -114, -167, 49, -56, -237, -58, 12, -148, -211, 176, -140, 162, 33, -183, 258, 42, -182, 263, -10, -41, -16, 124, 1, -140, 129, 23, 139, 198, 265, 81, 218, 152, 42, -66, 235, 85, -15, -34, -227, -238, -100, -148, 52, 16, -33, 102, -96, -301, 9, -7, 152, -32, -166, 14, 3, 29, 236, -34, -112, -130, 40, 186, 289, -34, -123, 120, 374, 278, -122, 105, -64, 20, -128, 87, -200, -123, -142, -85, 35, -48, -283, -15, -128, -242, 90, 136, 151, -247, -190, 100, 100, 5, 117, -85, 314, -49, 345, 257, 345, 134, -45, -69, 36, -59, -26, -228, -126, -319, -40, 257, 25, -28, -65, -147, 43, 140, -163, 63, 40, -162, 65, 95, 48, 109, -51, 16, -46, 102, -96, -137, -16, -130]
3851a30L0J36Rr0R1j87pJ57m4K8K51l28j02K01o0N7n6M65l95j02J50J26j59N2
3875I3o4N8R8j83m2j01J0N7p8k6K4R2j52K56j2K8J61k65K24k03J48K65l23J2l4
3900D3k50K09J15j96JK64k08j01J97j37K48k08%J18k34L78j44k68L2J45j51J40
3922gj59m8J56J13j79K01j76N60k84l53K42L1k04k25M79n1r4o2J61l07L30r5O8
3945I7K86k25KL52l04j91kj45Q4k46L36j87J20J9k41K56l8l1j33M28k39j77p4
3968b53J94%J67k90J26K03j37j39K74p4l49L30L4L4j83N4n0J19j33o1J15K67l28
3991h0r9R9J52j21m5J9J49L9j45J34M9j90J76k92K87j14L7k0k3j69R1lj67r3M40
4016A11J7l04J16j54J52J22J54m19M91j91j19K4J94j33r3j97J26J94J12k55K14
$$ y = [-130, -100, 36, 45, -45, 46, -141, -148, 9, -35, -7, 244, -84, -186, 15, -45, 12, -44, 421, 26, -76, 74, 200, 41, 93, 29, 87, 185, 2, -40, -141, -131, -74, -152, -178, -154, -62, -214, 42, 30, 58, 219, -46, 178, -25, 123, 388, 65, 77, 43, -207, 2, 117, -79, -78, 186, -22, -123, 74, -63, 185, -23, -23, 95, -139, 239, 95, -173, -141, 4, -147, -7, -166, -214, -58, 55, -124, 77, -99, 461, 177, -176, 66, 97, -107, -332, 147, 96, 2, -60, 101, -206, 124, 29, 97, 383, 158, 160, 512, 208, 17, 15, -130, -46, -292, 44, -143, -23, -4, -245, 11, -27, -58, -191, 237, -2, -179, -253, -59, -59, 108, -182, -56, 147, 10, -129, 145, 71, -278, 52, 86, 120, -63, -9, -59, 60, -73, -134, -19, 248, -80, -179, -80, 72, -49, -94, -75, 74, 113, -32, 102, 151, -39, 137, -155, 132, 18, 55, 35, 12, -157, -66, -69, -236, -329, 111, 128, -176, -60, -214, -62, 60, 214, -205, 286, 95, -24, 0, 194, 61, -32, -229, -103, 91, 203, -52, 162]
4037A62k48n1J65j09R5K5l12J20L3N6K37j26nk29R6j6J62j69K32Q4r5j18K3K81
4061B93p6j53j0P4j10m0J22J32n12K68K3J6j75J03K26r1k7j41J09k48J29Q3l5
4084d0K9k77K95l0M65k78k65J68Q5j29J05ok0q5q7l64M34J8p6k01L65j79O6q7
4108i4Q0J11l04L00j47Q5n6K3J20R7j85j05N3j24M3k21M58k1J38k31j37K60j99
4131e6J01J33R0k84n6J72m4O4j94J35p9M7L04l18m5J50k5m9J13j81j1J52j54L1
4155dO6J13l30K8K17k03q8J11J54Q7L7m28K16L46k35j12J18P6m37J40R4K4M6k63
4179b27M65j54K5k40M81j71j48o0L21k74R0q1K2O8j11K36j50j11m6j09K18p0k51
4202b77J07J47J51j94j1l31M27k2q9l0q2J76j22K24l3j10J55K85k19K66k69k07
$$ y = [162, -86, -137, 28, -81, 14, 39, -273, -153, -120, -64, 173, 47, 42, -187, -91, -107, 55, -114, 118, 202, 107, -11, 12, 293, 217, 64, 54, 128, 18, -22, 100, 232, -280, -12, 11, 27, -148, -45, 181, 90, 63, -78, 31, -217, -88, -5, -40, -11, -288, 7, -23, 442, 164, -101, 67, 152, 23, 128, 122, 102, 17, -70, -434, 0, 18, -58, -259, 106, -73, -7, -94, -14, 97, -207, 93, -54, 31, -25, -2, 118, 215, 30, -75, -22, -146, -103, -324, 134, 113, 251, 20, -117, 143, -56, 45, 178, 268, -16, -72, 100, 56, 120, -74, 61, -18, 29, 333, 15, -30, 120, 95, 46, 159, -22, -33, 119, -35, -4, 62, 175, -155, -127, 90, -113, -201, -90, 64, 151, 188, -240, -24, 322, 87, -25, 93, 169, -268, -128, -34, -10, 36, -227, 238, 84, 109, -131, 350, 179, 31, -29, 292, 18, 108, 27, 49, 117, 6, 242, 92, -19, -65, -174, 44, -26, -277, -170, -23, 128, -66, -77, -408, 19, -3, -92, -122, -204, -28, -150, 74, 41, -69, 86, 371, 152, 418, 149, -58]
4224e8J24J17m05K40j71K44k05K88l98J78j61N5J89m80O02j03k15J92o1j07K02
4245F7p3j33JK70J12m95M09J32k85L13m41k6J87j29K13k00J04Jj01K5j75K26M6
4268D8J10j02l35L34J6N0k15J01J20j70L4j33J65k76L06J3nj17Q5jj2R6j81q0
4292a49N5p5j16L22m3k10J03M9p7J63j39L73r6k88L51k07K06l39O6K52j28P3j48
4315bJ62no1l25K37N9O6k76P8P8l18K34Q5M00l52l32J95K0j5J13J12j27j09J12
4339B9p6J1R7j56Q0J91l9o3J13j12j84J63K28j08k41Q0L6j4j97O1jj6o4K71q8
4364Aok31L33o9R5M4l18J13K04j43R5k35J12k2l1P5Q5L6J80m74K78o9j58K44k00
4389f1o1k33K74r2L0j18L00j42k3Lp5K42o2P6K7NK21l08%J08K9j93J09p7K6j8
$$ y = [-58, 66, 183, -222, 18, -153, 91, -114, 174, -224, -46, -207, -152, 37, -443, 159, 56, -159, 33, -28, -135, 67, -6, -139, -138, 132, 244, -251, 158, 290, 5, 318, -123, -149, 38, -91, 122, -78, 26, 27, -74, -49, -224, 2, 48, 158, 56, -279, 55, 71, 121, -94, 7, 127, -43, -9, -142, 23, -253, 53, 66, 61, -56, 29, 28, 16, 112, -69, -149, -94, -169, -285, 37, -6, -216, -113, -64, -141, 22, -117, 256, 160, -128, 223, 16, 222, -117, -51, 201, 73, 146, -2, 160, 155, 94, -231, 6, 65, 131, -145, -67, 11, -307, -73, 12, 412, 60, -272, -77, -57, -72, 41, 153, 26, -83, 29, -47, -36, 61, -95, -15, 176, 137, 74, 187, 75, -109, 54, 282, 174, -67, 13, 49, 35, -162, -101, -102, -118, -182, 89, 1, -5, -236, 97, 28, 123, 167, -151, -38, 166, 23, 118, -117, -5, -27, -58, 17, 102, 138, 318, -156, 122, 53, -105, 139, -61, -122, -355, -81, -173, -143, -261, 39, -103, -126, -123, -198, 44, -18, 58, 85, 90, 311, 3, 3, 111, 140, -53, 56, -21, 5, -13]
4415a3k37L07k97M20l77M04m49K48j20R4l6R3J90l47Q7m4K14k07j3K24mpr2j24
4439h6K71j41J20j51J94j75J95j58P6j92k1j62L00r3J25J3p7R9j42K42o9j01j9
4462D8r6Q5J58R0m58L02j31k9R5J58Kl43J06lJ20j26q8L34j26k74l2k1k0K61q7
4487g5m2L27l1l1m0l6J16k79m0O3j28M10j68q0k1q0K42k13r4J60J28L3J4k84N8
4512i1J31n1P3m3m4K36k39J57oj50j28J66n6nK7O3R3k24N7J08j14K10j97O4K92
4537C29k05j74N4j72K21q3L3K92l05%J71j78K45k79J62l2j97J1J2R8o6j1K1KJ03
4562E2N2R8o8k42K14%j22j79K33j45K32ol16K01Ol47K46J9J82k91j03K35J03k5
4586B9k01K68M0o4n9l7J22p7l4n9J72k4j63q8K96M7kL1L2k01j23l2P7J18j76L50
$$ y = [-13, -250, 57, -240, 180, -197, 207, -242, 6, -114, -20, -56, 37, 227, -120, -33, -77, 137, -70, -83, 141, 137, 130, 38, -86, 185, 44, 164, 13, 207, 32, 227, 69, 145, -47, -68, -230, 70, -23, 102, 115, 38, 137, -5, 237, 168, 67, 48, -48, 37, 195, 285, -173, 129, -2, -31, 64, 222, 224, -119, -13, -16, 104, -22, -110, 224, 98, -176, -208, -229, -249, 12, -75, -117, 210, 179, 148, 108, 72, 188, -91, -131, -68, -196, 214, 46, -34, -55, -135, 107, -106, -200, -40, 88, 121, 135, -149, -91, 40, -11, 62, 19, -25, 211, -28, 129, 123, -27, -155, 11, -45, -50, -23, 40, 133, -91, -34, 74, -40, 170, -27, 37, 329, 124, -50, 4, -168, 53, -30, 3, 295, -10, -10, 161, -17, 228, -51, 111, 79, -118, -107, -95, 3, -63, -74, -53, -51, 52, 104, 202, 134, -108, 106, 106, -16, -195, 38, -107, 125, 119, -197, 4, 10, -337, -91, -72, 110, -181, -284, -49, 54, 29, -172, 96, 136, 72, 13, -24, 98, 21, -13, -72, 100, 76, -87, -175, 121, 168, 166, 197, 229, 28, -95, -127, -50, 68, -108, 242]
4612B42k99P3m8K09j66M2k97J67m3p3O3M0M1q3m6O4p5L69j22k9J50j33j12J4N4
4637BJ42n1j58j24J35n8r5M2P6N1J29j00l5J91l5N1j75R7j70K35M4l79K40k94
4661b39J23J30j67K16j24k3MK89n9j91j6Q5J64m22N12m36j91L34p0N8j13P7N2
4684gJ67J9j07O1k2P0j01K04j05l53J44j62J64j26L8R1pj14J78j35PK25j65K00
4708A64k37k02L12J05k49K51m1k93K34j34J29q8j32k35M22K53j21j77J06Q7j92
4729c8K4K79l72l0nJ00jM7o9j8J23j55j03J89L2k49J18k2K87l37J3L56j40m3q4
4754i8K5M6J1l04M80n9j68L26m02K38K7P4l81J21n0j4K46r9j98J47r7L51l40J34
4778A6j25L15j64J07j49m2K07j20K1N9k16o4M69m11J70j81n7N1Q4r3K13k28J38
$$ y = [242, -57, 16, -32, 177, 11, 53, -244, -77, -120, -193, -130, -90, -49, -132, -178, -114, -189, 180, 58, 29, 179, 46, -66, -52, 2, 144, 93, -65, -189, -54, -112, -207, -165, -89, -38, 91, -9, -44, 147, 112, 163, -12, 85, -85, 150, 194, -185, 55, -239, -116, 14, -153, 63, -61, -84, -80, 209, 150, -41, -57, 28, 192, -230, 282, -154, -345, -11, -81, -23, -136, -59, -7, 160, 179, 72, 133, 111, 181, 80, 284, 179, -174, -30, -192, -28, -154, -116, -25, -32, -146, 32, -103, -96, 129, -36, 164, -73, -275, 37, 142, -107, 144, 103, -190, 44, -90, 39, -49, -181, -416, 6, 259, 138, -39, 67, 154, -38, -14, 265, -107, -137, -142, -42, -43, 4, -65, -83, 40, -115, -218, -29, 3, -246, -128, -150, 137, -200, -187, 169, 29, -14, -98, -73, -27, -16, -320, 160, 101, -67, 259, -143, 95, 122, 196, -185, -64, -114, -128, 118, 19, -179, -32, -129, 222, -118, 16, -109, 206, 42, 149, 0, -42, 165, 45, 66, 125, -91, -155, 314, -97, 73, -108, -165, -114, -30, -123, 90, -138, 0]
4801@k09o9L28O2j70L3J16j39L4j18K66J4l63J48J34J44k60M1q7M09j12r2Qj4
4825A04j02k28J76j13O0n3K38lj98p8P6K16k56M17k13r9R5L6j07O8M8R2Q2l45
4849h7j22K72O6j66j5J73l90L25Q3k32J18j86J5K32K8j47j00Q8m7M8J02K6N1J01
4873B36l19p7K04J43l55K20k62J10O7j8j3r3J73j25L9P8J18m84K70K11l66K06
4895c7L02l43R8j72M20n0n35K58jK7K64j67m1r3J7M2J14r0k2j0n8J66l60K19j0
4920f2J7o9p9K44M7j85J18m1j1j37J13O8o9J55p2J65j93k7r5M19m01M0o4K11k00
4945a08J35J43j0m5ln1K66j56k87r2K34k8lMq2p2Jp9J85J06k74L10j90K12j23
4970gJ00J04j11j17pP1qk79M16k0l43J28K16j75J56pQ3o3p6l66K57R7r3K47o8
$$ y = [0, -209, -278, 50, 112, -58, -25, 91, -48, -14, -132, 134, 148, -215, -67, 67, 211, -49, -8, -95, 314, 202, 110, 118, 104, 2, -226, -50, -163, -103, -156, 82, 79, -119, -197, -121, 95, -161, 256, 43, -56, 39, 75, -32, 36, 84, 176, 258, -87, -209, 63, 129, -37, -52, 121, -269, 56, 139, -93, 25, -161, -146, 86, 114, -33, -133, -45, -92, -44, 58, 84, 135, 236, -83, -160, 44, 187, -168, 52, -210, -100, -33, -51, -64, -157, 16, -109, -70, 8, 126, -358, -88, 123, -243, -37, 265, -78, 20, -152, 268, 218, -317, -59, -60, -33, 231, 64, 23, -70, -53, -11, 103, 13, -9, -19, -77, 89, -271, -52, -62, -45, -114, -193, 51, 98, -87, 31, -10, -21, -158, -45, 23, -46, 109, 37, 202, 9, -18, -113, 306, -95, -55, -119, 92, -108, 27, 170, 160, 115, 112, 61, 327, 171, -116, -208, 26, -2, -5, -1, -83, -155, -154, -233, -48, 58, -216, 94, -96, 116, -7, 93, 197, 86, -31, -38, 33, 25, -254, 162, 142, -201, -73, 143, -32, 124, 117, 200, 137, 61, -305, -48, 49, -44, 203, 135]
4995A35l76J82K62Kj23j32Q3K63l42k2j98K17K40j97r1J09K46k15q6m0J15k25
5017a93o2J65J55j13k14M29l85J59P6L8j30P6J06J25j54l9l18L14O4l89L50O2
5039A22L9q4l6J7j02j47L08o9j66j02L4L48q2k28J46j57m0P8K54j46J78j73K32
5062B24k00j5k2n9R6j12J08j32M9M3rJ11j10M0J71l63J61J33o6k03K17m2j07J96
5086A09k77M14k30M8jj64K31k02J31J68m55J98M3L02m55L49k2M5ml05R1J79k20
5109b7J14j69J18j54K25k14K55l34O0J01j89K20j26PJ1K16j28j96J66m2p4L43
5131A83J66k70k92K91J02q7j69K27L0p8j86K33k69o6lK21l3j98L30k39J83oRj89
5155a10L4m0M6L07m84K55k0K22J35k27n7j50Nm7J6M1J13q2K38m00L04p5k03n2
$$ y = [135, -241, -59, 203, 205, 82, -50, 33, 296, -46, -68, -266, -49, 191, -6, -97, 12, 258, 43, -43, -83, 32, -193, -255, -90, 65, -48, -262, 167, -218, -59, 17, 55, -75, 1, 107, 232, 78, 39, -279, 35, 99, -290, 60, 122, 161, 77, 41, 58, -44, -191, 117, 48, -118, -220, -186, 162, 80, -148, -2, -159, -199, -121, 133, -13, 165, -8, 224, 24, 9, -13, -72, 24, -88, 20, -112, -63, -20, -29, 82, -28, 12, 183, -180, -19, 114, 48, -155, 62, 20, -87, 109, -168, 246, 16, 64, 63, -101, 130, -72, 59, 227, -228, -30, 13, 315, -140, 209, 187, 232, 228, -77, 14, 193, -27, 87, -82, 36, -118, 107, -107, 148, -186, -126, -25, -214, 6, -120, -113, -102, 114, -14, -210, -44, -86, -160, 183, 349, 79, -213, 78, 180, 93, -76, 151, 181, 103, -83, 150, -119, -185, -188, 33, 0, -198, 132, -107, 76, 70, 79, -110, -76, -116, -70, 237, -247, 8, -12, 210, 345, 118, 61, -89, -84, -131, -115, -74, 39, -43, 195, -205, 99, 24, -179, -231]
5179b31J71O7m9J4J03q3J16R4k6l85K95R7l04K25O0j21p6j35N5j95L49O7q2P9
5203A05j26K01l15O8j45M6K7j60M48j84L0k1J93j93M0K23l37J18M5k10K01j59
5225a05J19J45m4j77n9JK28j3j99J70Q8l45J03o3P8p0J99r7O0L6j51J16p7K3J4
5250b0J90p6o3j92o4J09Q2J6J76k54J06J93q3k21j48K62J51p3k24K26K9l07J00
5273h5p1K56j17k07J19K72j6j6r2j13R6k12Q3O5Q0Ml12K63Q8j71J63j63prL19
5298B17l03J05O9P3l66M84l77Pp7L5N7J6N6K78k97K16m0l44K43Pj91K73K75l83
5322C3K61l60J03O7o0L0mj56K70j30l6l6Rj31K13k23J07J42l10J85J48Q4j83j4
5346Ij64K78J09m43K73J3J41n7j63J28j01j15J05nn0l1Q9j96K10j36O4j7n1q9
$$ y = [-231, -60, 7, -42, -28, 75, -8, 108, 202, 176, -209, 86, 183, -121, 104, 164, 43, -33, -168, -113, -308, 41, 108, 26, 105, -21, 180, -135, -67, -212, -166, -139, -299, 149, -35, -5, -26, 167, -26, 14, 237, -100, 18, 63, -147, 54, -105, 14, 159, 115, -62, -121, -120, 108, 95, -104, 66, 154, -191, -88, -151, -73, -143, 56, -41, 19, 55, -96, 20, -57, -34, -20, 170, 94, 31, -161, -225, -116, -34, -18, 158, -96, 10, 203, 120, -101, -249, 13, 164, 91, -133, 93, 122, -185, -85, -156, 100, -17, -224, -105, 167, 151, 135, 43, -70, 26, -186, -103, -38, 42, 46, -266, -3, 85, -86, 77, -86, -93, -102, 217, -86, 19, 88, 161, -205, 279, -98, -91, -168, -133, -76, -60, -4, 274, -23, 193, 153, -191, 52, 59, -132, 141, 416, 33, 294, -66, 37, 104, 44, 74, 70, -86, 184, 54, 18, -18, -9, -140, 73, -150, -43, 99, -211, -26, 122, 206, 23, 9, -155, 123, 232, -211, 62, 75, 216, 159, -4, 124, 23, -92, 13, 8, -42, -73, 16, -180, 30, -106, -42, -59, -110, -199]
5370a99K21j69J35p6q7K81p3J76j64P5k47J87r5R1j75Q0j79K53n7J51j05j83J34
5393b5o9K28N1k22jL8k11J66J08o0j44j21J54K13j40l8L55l32o8K62J55K5k09
5416A15Q7k90J52j46J91j9j19K00j40K24k22r1J24j85J24L26j27k06R1NR2n1l1
5439A04K2l36K04k5J80j14J26j27j8P7j33J47j02j79K65P9k61J18K73j34l16K67
5461A17j26O1r2n8m1L48k90O9J79k37J69p5k5L5P8l33K38L5k13L94m76L10l64
5484b97J46J35j32J86j36J90n2N4Nj75r5P5j9J97q0p3K63l18N7K56Q3l51j10K69
5508G8j51K47k80O3R4K1j34n1K98l42L35j07q7k02K62j2n4J37k19L6j36J30K01
5531A27m03R7K59J34k52J28j61J73p8j2M2J37k18j04L69l1k65R6M0M7j89o4J30
$$ y = [-199, 22, -147, -12, -88, -175, 106, 33, 209, 45, 120, -127, 60, -35, 56, -119, -39, -218, 35, -22, 129, 24, -159, -25, -94, 134, 185, -37, -38, 0, -211, -45, 63, 3, -141, -262, -108, 105, -35, -73, 282, -50, -118, 144, 299, 324, 115, 202, -88, 64, -82, 109, 90, -29, 171, 31, 255, 33, -58, 66, -119, 5, 331, 204, -2, 89, 94, 186, 135, 104, 126, -210, -6, -31, 149, 35, 161, 34, 16, 93, -40, 107, 5, -174, 91, 170, -91, 27, 300, 166, -150, 117, -9, 52, -40, -98, -139, 209, -81, -12, 167, -70, 99, 24, -1, 34, 112, -221, 17, 52, -161, 233, -243, 67, -297, -151, -16, -148, 38, -98, 92, 40, 94, 99, -76, -171, -96, -115, 82, 2, -71, 192, -126, -69, 187, 270, -81, -191, 78, -73, 174, -106, -43, 51, 72, -62, -113, 185, -157, 178, 71, -16, -218, 44, 32, -22, 115, -104, -68, -204, -74, 127, -276, -179, 80, 214, -38, 90, -71, 102, 24, 12, 54, 191, -27, -131, 238, 207, -58, 38, 78, 125, -64, -128, 2]
5554BRp4l6L2qOj31M01j56ro2k8QqN2Rk26L95l35M0JO9O7j92L86q7q4o2j17K60
5584A22j56R6r4J08j67R1K8j04J79o1j68J12R8j82R2o4n4J47q5P0j42K79m9j53
5608e7nO6M0J6n8p0M1N2j35n2N1q1O0J06j10K10R2K0j17J2k23R2J36j72J26K44
5634B84k80J14j92N6j46L28q1k7P7j41J01k34OJ14j03O2K0J55p5o4n1J33l92L99
5658F3j2k54J24j5R9j6L1j55M61k12k94K3J39o4j54J70q9J92r1j69K43J03j05
5681A8r5j09J80L2k9qK4j39J00j43l5J73N6J34k52j42K32J90m43L71k00J53j97
5704a29l8L88l10K64l09O6QL3Q4k43L10j68j80K53mO1j91J67K34k84J79l43R1
$$ y = [2, 11, -63, -99, -67, -75, -69, -200, 201, 45, 36, -26, -54, -46, -54, -2, 7, -219, 176, -159, -119, -118, -49, 18, -174, 212, 125, 41, -21, -138, 122, -34, 62, -32, 76, -91, 0, 28, -76, 103, 42, -126, -14, 84, -98, -6, -70, -124, 23, -62, 8, -134, 145, 96, -57, -62, 4, 44, 60, 2, -68, -27, 25, -110, -162, -111, -192, -132, -26, -136, 74, 166, 186, 69, 81, -142, -50, 86, -86, 40, 284, 4, 118, -74, -18, -164, 164, 83, 56, 133, -8, 93, -141, -135, -21, -124, -62, -42, 113, 38, -26, -77, 56, -336, 63, 51, -203, -79, -94, 5, -11, 20, -135, 326, 114, -180, -157, -18, -82, -236, -66, -155, 37, -54, -223, 20, 123, 18, -77, -186, -6, 26, -3, -11, 13, -126, -26, -169, -204, -31, 25, 159, -93, -235, -3, 187, -256, 115, -85, 68, -129, -167, 221, -89, 175, -134, -68, -60, -27, 57, -186, 124, -44, -224, 29, 25, 86, -105, 62, 296, 12, 191, -152, -61]
$$ [...]
8191c59
##END NTUPLES=NMR FID
##END=
