##TITLE=1H_L6-TMS-J(f12)
 CDCl3
 8 sc, 
 14.02.2022
##JCAMPDX= 6.0         $$ Bruker NMR JCAMP-DX V2.0
##DATA TYPE= NMR FID
##DATA CLASS= NTUPLES
##ORIGIN= UXNMR, Bruker Analytische Messtechnik GmbH
##OWNER= root
$$ XWIN-NMR		Version 3.5
$$ Mon Feb 14 11:00:43 2022 Russian Standard Time (UT+4h)  she@DPX200
##.OBSERVE FREQUENCY= 200.131346
##.OBSERVE NUCLEUS= ^1H
##.DELAY= (6, 6)
##.ACQUISITION MODE= SIMULTANEOUS
##.ACQUISITION SCHEME= undefined
##.AVERAGES= 8
##.DIGITISER RES= 18
##SPECTROMETER/DATA SYSTEM= spect
##.PULSE SEQUENCE= zg30
##.SOLVENT NAME= CDCl3
##.SHIFT REFERENCE= (INTERNAL, CDCl3, 0, 15.7039)
##AUDIT TRAIL= $$ (NUMBER, WHEN, WHO, WHERE, WHAT)
$$ ##TITLE= Audit trail, XWIN-NMR		Version 3.5
$$ ##JCAMPDX= 5.01
$$ ##ORIGIN= Bruker BioSpin GmbH
$$ ##OWNER= she
$$ F:/spectra/data/she/nmr/H-F/1/audita.txt
$$ ##AUDIT TRAIL=  $$ (NUMBER, WHEN, WHO, WHERE, WHAT)
(   1,<2022-02-14 10:59:20.35 +0400>,<she>,<DPX200>,
      <created by zg, POWCHK disabled, PULCHK disabled
       configuration hash MD5:
       00 E9 B6 7A A2 85 ED C7 34 08 36 98 17 FE 4E 26
       data hash MD5: 16K
       BC 47 85 5D 69 80 30 79 01 F6 7A 9B B1 E3 9F E5>)
$$ ##END=
$$ 
$$ hash MD5
$$ 4D FA 7D 98 79 6C 68 EF A0 F8 8F 49 4F 38 28 D8
##$RELAX= 
##$RELAX= 
##$RELAX= 
##$RELAX= 
##$RELAX= 
##$RELAX= 
$$ Bruker specific parameters
$$ --------------------------
##$DU= <F:/spectra>
##$EXPNO= 1
##$NAME= <H-F>
##$PROCNO= 1
##$TYPE= <nmr>
##$USER= <she>
##$AMP= (0..31)
100 100 100 100 100 100 100 100 100 100 100 100 100 100 100 100 100 100 
100 100 100 100 100 100 100 100 100 100 100 100 100 100 
##$AQSEQ= 0
##$AQ_mod= 1
##$AUNM= <au_zg>
##$AUTOPOS= <>
##$BF1= 200.13
##$BF2= 200.13
##$BF3= 200.13
##$BF4= 200.13
##$BF5= 200.13
##$BF6= 200.13
##$BF7= 200.13
##$BF8= 200.13
##$BYTORDA= 1
##$CFDGTYP= 0
##$CFRGTYP= 5
##$CHEMSTR= <none>
##$CNST= (0..31)
1 1 145 1 1 1 1 1 1 1 1 1 1 1 1 1 1 1 1 1 1 1 1 1 1 1 1 1 1 1 1 1 
##$CPDPRG= <>
##$CPDPRG1= <>
##$CPDPRG2= <>
##$CPDPRG3= <>
##$CPDPRG4= <mlev>
##$CPDPRG5= <mlev>
##$CPDPRG6= <mlev>
##$CPDPRG7= <mlev>
##$CPDPRG8= <mlev>
##$CPDPRGB= <>
##$CPDPRGT= <>
##$D= (0..31)
0 1.2 0 0 0 0 0 0 0 0.06 0 0.03 0 0 0 0 0.0002 0 0 0 0 0 0 0 0 0 0 0 0 
0 0 0 
##$DATE= 1644821959
##$DBL= (0..7)
120 120 120 120 120 120 120 120 
##$DBP= (0..7)
150 150 150 150 150 150 150 150 
##$DBP07= 0
##$DBPNAM0= <>
##$DBPNAM1= <>
##$DBPNAM2= <>
##$DBPNAM3= <>
##$DBPNAM4= <>
##$DBPNAM5= <>
##$DBPNAM6= <>
##$DBPNAM7= <>
##$DBPOAL= (0..7)
0.5 0.5 0.5 0.5 0.5 0.5 0.5 0.5 
##$DBPOFFS= (0..7)
0 0 0 0 0 0 0 0 
##$DE= 6
##$DECBNUC= <off>
##$DECIM= 32
##$DECNUC= <off>
##$DECSTAT= 4
##$DIGMOD= 1
##$DIGTYP= 9
##$DL= (0..7)
0 120 120 120 120 120 120 120 
##$DP= (0..7)
150 150 150 150 150 150 150 150 
##$DP07= 0
##$DPNAME0= <>
##$DPNAME1= <>
##$DPNAME2= <>
##$DPNAME3= <>
##$DPNAME4= <>
##$DPNAME5= <>
##$DPNAME6= <>
##$DPNAME7= <>
##$DPOAL= (0..7)
0.5 0.5 0.5 0.5 0.5 0.5 0.5 0.5 
##$DPOFFS= (0..7)
0 0 0 0 0 0 0 0 
##$DQDMODE= 0
##$DR= 18
##$DS= 0
##$DSLIST= <SSSSSSSSSSSSSSS>
$$ [...]
##$SUBNAM2= <"">
##$SUBNAM3= <"">
##$SUBNAM4= <"">
##$SUBNAM5= <"">
##$SUBNAM6= <"">
##$SUBNAM7= <"">
##$SUBNAM8= <"">
##$SUBNAM9= <"">
##$SW= 18.0517287032376
##$SWIBOX= (0..15)
0 0 2 0 0 0 0 0 0 0 0 0 0 0 0 0 
##$SW_h= 3612.71676300578
##$TD= 16384
##$TD0= 1
##$TE= 0
##$TE2= 300
##$TE3= 300
##$TEG= 300
##$TL= (0..7)
0 120 120 120 120 120 120 120 
##$TP= (0..7)
150 150 150 150 150 150 150 150 
##$TP07= 0
##$TPNAME0= <>
##$TPNAME1= <>
##$TPNAME2= <>
##$TPNAME3= <>
##$TPNAME4= <>
##$TPNAME5= <>
##$TPNAME6= <>
##$TPNAME7= <>
##$TPOAL= (0..7)
0.5 0.5 0.5 0.5 0.5 0.5 0.5 0.5 
##$TPOFFS= (0..7)
0 0 0 0 0 0 0 0 
##$TUNHIN= 0
##$TUNHOUT= 0
##$TUNXOUT= 0
##$USERA1= <user>
##$USERA2= <user>
##$USERA3= <user>
##$USERA4= <user>
##$USERA5= <user>
##$V9= 5
##$VALIST= <valist>
##$VCLIST= <CCCCCCCCCCCCCCC>
##$VD= 0
##$VDLIST= <DDDDDDDDDDDDDDD>
##$VPLIST= <PPPPPPPPPPPPPPP>
##$VTLIST= <TTTTTTTTTTTTTTT>
##$WBST= 1024
##$WBSW= 4
##$XGAIN= (0..3)
0 0 0 0 
##$XL= 0
##$YL= 0
##$YMAX_a= 101911
##$YMIN_a= -190629
##$ZGOPTNS= <>
##$ZL1= 120
##$ZL2= 120
##$ZL3= 120
##$ZL4= 120
##$ABSF1= 10
##$ABSF2= 0
##$ABSG= 5
##$ABSL= 3
##$ALPHA= 0
##$AQORDER= 0
##$ASSFAC= 0
##$ASSFACI= 0
##$ASSFACX= 0
##$ASSWID= 0
##$AUNMP= <proc_1d>
##$AZFE= 0.1
##$AZFW= 0.1
##$BCFW= 1
##$BC_mod= 2
##$BYTORDP= 1
##$COROFFS= 0
##$CY= 11.3945322036743
##$DATMOD= 1
##$DC= 2
##$DFILT= <>
##$DTYPP= 0
##$F1P= 2.36226072786647
##$F2P= -0.459571619588291
##$FCOR= 0.5
##$FTSIZE= 0
##$FT_mod= 4
##$GAMMA= 1
##$GB= 0.15
##$INTBC= 1
##$INTSCL= 1
##$ISEN= 128
##$LB= 0.24
##$LEV0= 0
##$LPBIN= 0
##$MAXI= 10000
##$MC2= 0
##$MEAN= 0
##$ME_mod= 0
##$MI= 1.114404
##$NCOEF= 0
##$NC_proc= 0
##$NLEV= 6
##$NOISF1= 3.799351
##$NOISF2= 2.8
##$NSP= 1
##$NTH_PI= 0
##$NZP= 0
##$OFFSET= 15.70392
##$PC= 1
##$PHC0= -16236.96
##$PHC1= 24.20079
##$PH_mod= 1
##$PKNL= yes
##$PPARMOD= 0
##$PSCAL= 0
##$PSIGN= 0
##$REVERSE= no
##$SF= 200.130013532006
##$SI= 16384
##$SIGF1= 3
##$SIGF2= 2
##$SINO= 400
##$SIOLD= 16384
##$SREGLST= <1H.CDCl3>
##$SSB= 0
##$STSI= 0
##$STSR= 0
##$SW_p= 3612.71676300578
##$SYMM= 0
##$S_DEV= 0
##$TDeff= 0
##$TDoff= 0
##$TI= <>
##$TILT= no
##$TM1= 0
##$TM2= 0
##$TOPLEV= 0
##$USERP1= <user>
##$USERP2= <user>
##$USERP3= <user>
##$USERP4= <user>
##$USERP5= <user>
##$WDW= 1
##$XDIM= 8192
##$YMAX_p= 0
##$YMIN_p= 0
$$ End of Bruker specific parameters
$$ ---------------------------------
##NTUPLES= NMR FID
##VAR_NAME=  TIME,          FID/REAL,        FID/IMAG
##SYMBOL=    X,             R,               I
##VAR_TYPE=  INDEPENDENT,   DEPENDENT,       DEPENDENT
##VAR_FORM=  AFFN,          ASDF,            ASDF
##VAR_DIM=   8192,          8192,            8192
##UNITS=     SECONDS,       ARBITRARY UNITS, ARBITRARY UNITS
##FACTOR=    0.0002768,     1,               1
##FIRST=     0,             0,               0
##LAST=      2.2672688,     0,               0
##MIN=       0,             -190629,         0
##MAX=       2.2672688,     101911,          0
$$ Real data points
##PAGE= N=1
##DATA TABLE= (X++(R..R)), XYDATA
$$ [...]
$$ plain form
2173 38 -1739 122 1748 -100 -1722 90 1752 -89 -1795 -335 1456 -44 -1542 -447 1385
2188 1385 -43 -1823 -70 1460 -155 -1550 231 2107 -160 -1384 327 1709 216 -1517 56
2203 56 1775 308 -1669 315 1925 -212 -1805 30 1730 -491 -1845 39 1316 -181 -1598
2218 -1598 43 1526 -208 -1881 88 1649 -27 -1569 448 1994 -152 -1528 289 1948 153
2233 153 -1180 500 1686 242 -1533 345 1683 -283 -1544 -171 1297 -401 -1883 -234 1228
2248 1228 -203 -1672 -184 1214 -203 -1598 195 1462 -160 -1517 114 1548 46 -1666 284
2263 284 1921 19 -1280 388 1828 -125 -1298 200 1679 -290 -1537 93 1520 -538 -1877
2278 -1877 -82 1304 -505 -1847 -9 1217 -83 -1276 153 1565 -35 -1531 532 1875 281
$$ packed form
2173C8j777J861J626j848j622J812J662j841j706J460J791j500j498J095J832
2188A385j428j780J753J530j615j395J781J876k267j224J711J382j493j733J573
2203E6J719j467j977J984J610k137j593J835J700k221j354J884J277j497j417
2218a598J641J483j734j673J969J561j676j542K017J546k146j376J817J659j795
2233A53j333J680J186j444j775J878J338j966j261J373J468j698j482J649J462
2248A228j431j469J488J398j417j395J793J267j622j357J631J434j502j712J950
2263B84J637j902j299J668J440j953j173J498J479j969j247J630J427k058j339
2278a877J795J386j809j342J838J226j300j193J429J412j600j496K063J343j594
$$ plain form
2293 281 -1483 286 1821 -483 -1582 465 1590 -279 -1206 295 1560 -305 -1538 296 1478
2308 1478 -855 -1691 136 1222 -738 -1734 145 1367 -331 -1638 339 1544 -305 -1393 510
2323 510 1589 -78 -1183 515 1828 -232 -1287 580 1648 -114 -1607 401 1241 -307 -1406
2338 -1406 215 1194 -577 -1479 170 1106 -715 -1657 230 1364 -462 -1809 498 1346 -480 -1149
2354 -1149 366 1595 -335 -1228 395 1737 -206 -1326 671 1492 -264 -1352 333 1259 -695 -1191
2370 -1191 99 1149 -641 -1578 297 1177 -595 -1473 290 1051 -326 -1133 259 1347 -317 -1146
2386 -1146 684 1567 -231 -927 728 1271 -356 -1131 792 1610 -497 -1375 523 1101 -553 -1340 345
2403 345 1258 -863 -1412 311 1232 -530 -1263 561 1429 -462 -993 549 1598 -459 -1322 742 1301
$$ packed form
2293B81j764J769J535k304j099K047J125j869r27J501J265j865j233J834J182
2308A478k333q36J827J086j960r96J879J222j698j307J977J205j849j088J903
2323E10J079j667j105J698J313k060j055J867J068j762j493K008Q40j548j099
2338a406J621R79j771r02J649R36j821r42J887J134j826j347K307Q48j826o69
2354a149J515J229j930q93J623J342j943j120J997Q21j756j088J685R26j954m96
2370a191J290J050j790r37J875Q80j772q78J763P61j377q07J392J088j664q29
2386a146J830Q83j798o96J655N43j627p75J923Q18k107q78J898N78j654p87J685
2403C45R13k121n49J723R21j762p33J824Q68j891n31J542J049k057q63K064N59
$$ plain form
2420 1301 -449 -1046 717 1267 -223 -1107 765 1364 -669 -1698 180 919 -561 -1438 364 1105 -736
2437 -736 -1233 401 1089 -688 -1482 335 1142 -504 -1159 696 1295 -392 -978 761 1148 -559 -708
2454 -708 546 1311 -460 -976 787 1140 -679 -1195 450 1077 -724 -1475 322 867 -829 -1210 424
2471 424 828 -707 -1261 613 1034 -560 -1062 803 1279 -431 -1179 663 1591 -99 -993 920 1260
2488 1260 -437 -1059 699 1219 -459 -763 496 984 -563 -1564 435 1048 -746 -1157 347 949 -662
2505 -662 -1355 590 704 -866 -1124 753 1199 -330 -1119 847 1414 -845 -1055 849 1036 -712 -830
2522 -830 719 1112 -779 -1284 191 1023 -1042 -1026 642 810 -1012 -1099 753 795 -659 -953 655 855
2540 855 -580 -845 627 1026 -526 -787 1029 1111 -632 -700 566 1153 -803 -1062 676 905 -862 -1189
$$ packed form
2420A301j750n97J763N50j490q84J872N99k033j029J878P39j480q77J802P41j841
2437g36m97J634O88j777p94J817Q07j646o55J855N99j687n86J739L87j707j49
2454g08J254P65j771n16J763L53j819n16J645O27j801p51J797N45j696l81J634
2471D24M04j535n54J874M21j594n02J865M76j710p48J842R28j690q94J913L40
2488A260j697o22J758N20j678l04J259M88j547j001J999O13j794m11J504O02j611
2505f62o93J945J14j570k58J877M46j529p89J966N67k259k10J904J87j748j18
2522h30J549L93j891n05J475Q32k065J6J668J68j822q7J852M2j454k94J608K00
2540H55j435k65J472L99j552k61J816Q2j743o8J266N87j956k59J738K29j767l27
$$ plain form
2558 -1189 470 860 -849 -1260 389 972 -856 -1278 447 1075 -793 -1209 589 1088 -575 -829 1011
2575 1011 979 -670 -655 567 996 -492 -1011 545 971 -503 -946 644 899 -796 -866 563 718 -988
2593 -988 -1039 571 887 -768 -1003 533 977 -667 -792 603 783 -521 -1026 770 1064 -492 -640 973
2611 973 1040 -517 -809 698 920 -721 -999 556 777 -784 -929 826 900 -1161 -755 697 960 -627
2629 -627 -838 719 746 -751 -731 466 1013 -553 -697 1058 1078 -711 -930 866 862 -818 -677 980 783
2648 783 -790 -663 728 699 -971 -1277 648 760 -805 -941 702 907 -827 -728 721 679 -710 -633
2666 -633 657 832 -668 -631 918 1223 -378 -599 869 898 -792 -1076 966 967 -753 -979 826 518
2684 518 -1053 -830 947 533 -851 -777 807 729 -618 -849 638 618 -764 -369 964 695 -516 -540
$$ packed form
2558a189J659L90j709m11J649N83j828m22J725O28j868m16J798M99j663k54J840
2575A011l2j649J5J222M29j488n19J556M26j474m43J590K55j695p0J429J55j706
2593i88n1J610L16j655k35J536M44j644j25J395J80j304n05J796K94j556j48J613
2611I73O7j557k92J507K22j641k78J555K21j561j45J755P4k061M06J452K63j587
2629f27k11J557K7j497K0J197N47j566j44J755K0j789k19J796mj680J41J657j97
2648G83j573J27J391k9j670l06J925J12j565j36J643K05j734R9J449m2j389P7
2666f33J290J75j500L7J549L05j601k21J468K9j690k84K042Jj720k26J805l08
2684E18j571K23J777m14j384P4J584p8j347k31J487k0j382L95J333k69j211k4
$$ plain form
2702 -540 844 968 -500 -559 830 841 -770 -672 606 512 -878 -832 1100 782 -945 -895 673 519 -800
2721 -800 -597 648 707 -833 -696 964 557 -788 -638 699 991 -475 -643 1082 962 -402 -634 648
2739 648 577 -718 -619 732 574 -825 -778 691 694 -842 -968 674 674 -981 -675 853 424 -915 -648
2758 -648 710 617 -590 -311 961 747 -618 -414 863 1052 -722 -492 1157 557 -1113 -565 898
2775 898 559 -912 -886 731 626 -1064 -535 710 344 -947 -523 862 607 -655 -479 787 468 -528
2793 -528 -336 893 541 -659 -452 805 503 -684 -371 777 487 -819 -404 703 560 -869 -658
2810 -658 877 474 -1058 -328 763 409 -1031 -533 883 421 -659 -404 1035 360 -624 -451 957
2827 957 640 -651 -334 846 598 -720 -273 848 622 -683 -444 585 488 -932 -491 779 288 -843
$$ packed form
2702e40J384J24j468n9J389J1j611R8J278r4j390M6J932l18j727N0J568j54j319
2721h00K03J245N9j540J37J660m07j345J50J337K92j466j68J725j20j364k32J282
2739F48p1j295R9J351j58j399M7J469Lj536j26J642%j655L06J528m29j339K67
2758f48J358r3j207K79J272k14j365K04J277J89j774K30J649o00j670N48J463
2775H98l39j471K6J617j05j690N29J245l66j291M24J385k55j262J76J266l19r96
2793e28J92J229l52j200K07J257l02j187L13J148k90j306M15J107j43j429K11
2810f58J535m03j532P30J091l54j440M98J416m62j080K55J439o75r84J73J408
2827I57l17j291L17J180k48j318M47J121k26j305K39J029r7j420M41J270m91j131
$$ plain form
2845 -843 -650 766 380 -992 -422 880 577 -945 -541 918 556 -682 -269 910 659 -624 -214
2862 -214 758 580 -563 -470 1051 557 -815 -333 655 168 -929 -494 621 487 -961 -531 996 321
2880 321 -821 -600 626 260 -945 -399 890 635 -524 -315 990 543 -795 -349 818 799 -904
2897 -904 -287 836 298 -810 -511 808 313 -1002 -336 833 266 -927 -321 942 183 -792 -235 710
2915 710 453 -617 -182 940 423 -616 -256 1049 579 -573 -319 725 147 -461 -359 823 236 -849
2933 -849 -358 720 315 -930 -445 725 -99 -913 -348 630 430 -854 -479 793 550 -834 -232 880
2951 880 355 -534 -54 813 463 -574 -207 694 535 -644 -37 894 232 -885 -499 835 -92 -862 -399
2970 -399 420 69 -847 -41 794 496 -746 35 891 339 -906 -66 591 159 -1043 -104 1099 459 -848
$$ packed form
2845h43J93J416l86j372N70J302l03j522M04J459l62j238M13J179k51j283M10
2862b14R72j78j143R3J521m94j372M82R88m87j097M35J115j34j448M30J527o75
2880C21j142K21J226l66j205N46J289k55j159K09J305m47j338M46J167j9j703
2897i04O17J123n38j108K99J319m95j315O66J169n67j193O06J263p59r75N57R45
2915G10k57j070M35J122n17j039L60J305m70j152K54J044n78o08J02J182n87j085
2933h49M91J078m05j245M85J170q24q14N65R78k00j284L75J272k43j384O02J112
2951H80n25q89M80Q67l50j037L67R01j59j179O07R31o62j117L86J334r27p70M63
2970c99Q19l51r16Q06Q35k98j242P81Q56n52j245Q40O57m32j202R39J203o40j307
$$ plain form
2989 -848 -284 968 153 -716 -242 722 188 -897 -185 692 89 -659 -276 749 281 -940 -286 622 172
3008 172 -702 -403 958 434 -575 -311 868 220 -587 -103 1040 247 -740 0 957 171 -677 -46 735
3027 735 309 -652 -384 475 139 -1016 -448 726 65 -965 -487 903 -6 -627 -32 835 258 -851
3045 -851 -67 901 25 -919 -102 778 72 -737 -57 859 208 -955 -390 540 -167 -800 -404 562 42 -907
3065 -907 -242 627 46 -1051 -160 711 218 -698 -51 615 250 -609 239 789 107 -702 -46 825 291 -831
3085 -831 -27 792 104 -654 -194 937 -109 -864 -357 636 -206 -1027 -194 745 -225 -740 -163 741 -1
3104 -1 -787 -16 732 195 -496 161 694 193 -630 71 884 26 -623 62 815 -21 -693 0 325 -234 -743
3125 -743 -380 758 184 -921 -25 426 -52 -795 -18 975 88 -795 -181 797 45 -666 73 854 203
$$ packed form
2989h48N64J252q15q69M74R64n34j085P12Q77o03p48L83J025m68j221O54R08m50
3008A72q74K99J361n24j009K64J179o48q07M84J143p93r87P40R57p86q48O31P81
3027G35m26r61K68Q59l36j155N68J174o61j030M78J390r09o21N95Q67n77j109
3045h51P84R68q76r44Q17Q80p06q09O80R16o51j163N65R30p07o33L96R66n20r49
3065i07O65Q69n81j097Q91Q71m93r16O47O66l65q59Q48N50o82q09O56Q71n34j122
3085h31Q04Q19o88p58M60J131j046p55N07R93q42q21Q33R39r70n15N77R04p42
3104ap86P71P48n37o91O57N33n01q23P01Q13q58o49O85P53q36o72O93L25n59n09
3125g43L63J138n74j105Q96M51m78p43P77R93q87q83O14R78p52p11P39P81o51
$$ plain form
3144 203 -537 94 635 78 -933 -55 648 -109 -659 -23 598 -226 -634 -67 646 -43 -857 -116 517 -167
3164 -167 -914 -144 937 69 -628 -47 672 -339 -661 22 647 148 -382 189 693 105 -899 147 749
3183 749 -178 -747 -217 733 -83 -667 -14 547 -31 -673 -41 475 -55 -863 211 869 39 -438 165 771
3203 771 -33 -517 120 794 -267 -821 -91 686 -142 -839 17 550 58 -379 -11 716 -11 -686 43 431
3223 431 -341 -810 -96 760 125 -591 -47 781 -208 -909 219 780 130 -544 253 769 41 -677 350
3242 350 659 -123 -585 259 555 -186 -821 34 512 -112 -621 51 324 -94 -675 212 832 21 -518 198
3262 198 671 31 -514 90 657 -42 -320 148 706 -37 -604 43 878 -389 -704 62 650 -96 -985 162
3282 162 574 -270 -815 -15 425 -447 -664 142 640 -46 -572 388 453 -192 -690 412 932 -293 -504 229
$$ packed form
3144B03p40O31N41n57j011Q78P03p57n50O36O21q24m08N67P13o89q14P41O33o84
3164a67p47P70J081q68o97N81P19j011l22O83O25m99n30N71N04n88j004J046O02
3183G49r27n69N30R50q16n84O53N61n78o42O32N16n30q08J074O58q30m77O03O06
3203G71q04m84O37O74j061n54P30P77q28o97Q56N33m92m37L68P27p27o75P29L88
3223D31p72m69P14Q56o35p16N44Q28r89p01J128N61o50o74P97N16p28p18J027
3242C50L09p82m62Q44K96p41o35Q55M78o24n09O72K73m18n81Q87O20q11n39P16
3262A98M73o40n45O04N67o99k78M68N58p43n67O47Q35j267l15P66N88p46q89J147
3282A62M12q44n45Q00M40q72k17Q06M98o86n26R60O5o45m98J102N20j225k11P33
$$ plain form
3302 229 826 -230 -453 119 646 -188 -872 15 746 -300 -636 156 574 -141 -685 256 309 -92 -666 230
3322 230 648 -223 -505 268 513 -56 -355 350 720 -113 -256 274 491 -190 -496 35 544 -293 -701 144
3342 144 601 -103 -710 224 241 -453 -624 215 406 -28 -370 62 553 55 -443 214 617 -218 -589 256
3362 256 472 -1 -612 393 423 -269 -571 405 685 -390 -522 196 345 -578 -635 72 478 -162 -434 220
3382 220 739 -108 -559 34 307 -134 -152 372 547 -129 -448 332 568 -390 -473 361 891 -150 -629 504
3402 504 424 -286 -550 262 350 -201 -473 197 303 -385 -378 338 507 -100 -130 510 643 -192 -462 311 441 -192
3424 -192 -204 399 700 -259 -340 309 418 -119 -600 163 374 -374 -366 409 327 -253 -364 530 386 -339 -391 162
3446 162 470 -480 -282 357 397 -217 -370 485 641 -114 -460 141 446 -20 -387 144 431 -372 -445 353 534
$$ packed form
3302B29N97j056k23N72N27q34o84Q87P31j046l36P92M18p15n44R41N3m01n74Q96
3322B30M18q71k82P73K45n69k99P05L70q33j43N30K17o81l06N31N09q37m08Q45
3342A44M57p04o07R34J7o94j71Q39J91m34l42M32M91m98m98O57M03q35l71Q45
3362B56K16m73o11J005L0o92l02R76K80j075j32P18J49r23n7P07M06o40k72O54
3382B20N19q47m51N93K73m41j8N24J75o76l19P80K36r58q3Q34N30j041m79J133
3402E04q0p10k64Q12Q8n51k72O70J06o88PP16J69o07l0O40J33q35k70P73J30o33
3424a92j2O03L01r59q1O49J09n37m81P63K11p48QP75q2n80j11Q94j44p25n2N53
3446A62L08r50J98O39M0o14j53Q55J56p55l46O01L05m66l67N31K87q03p3P98J81
$$ plain form
3467 534 -447 -364 114 297 -403 -567 298 247 -457 -581 166 606 -308 -724 399 530 -337 -468 348 370 -79
3488 -79 -241 46 606 -235 -465 320 600 -238 -603 286 456 -475 -406 282 503 -163 -495 345 399 -425 -390
3509 -390 238 511 -493 -280 348 483 -475 -338 480 561 -176 -237 389 230 -318 -389 255 177 -449 -435 443
3530 443 249 -561 -493 96 236 -511 -480 253 200 -583 -577 181 267 -263 -272 328 61 -234 -295 477 539 -474 -245
3553 -245 270 389 -189 -276 440 538 -429 -565 245 389 -440 -483 267 40 -502 -226 235 333 -603 -341 610
3574 610 319 -245 -168 500 513 -259 -190 374 420 -197 -179 432 489 -500 -562 364 319 -235 -385 523 494 -213 -440
3597 -440 -4 261 -270 -378 351 326 -492 -295 -142 276 -355 -444 454 578 -487 -274 190 580 -223 -78
3617 -78 45 322 -378 -553 275 316 -317 -272 576 150 -478 -121 284 473 -652 -245 452 280 -494 -123 468
$$ packed form
3467E34r81Q3M78J83p00j64Q65n1p04j24P47M40r14m16J123J31q67j31Q16K2m49
3488g9j62K87N60q41k30P85K80q38l65Q89J70r31O9O88K21o66l32Q40N4q24L5
3509c90O28K73j004K13O28J35r58J37Q18Q1p37o1O26j59n48p1O44p8o26J4Q78
3530D43j94q10O8N89J40p47L1P33n3p83OP58Q6n30rO00k67k95o1P72O2j013K29
3553b45N15J19n78q7P16R8r67j36Q10J44q29m3P50k27n42K76M61R8r36K62R51
3574F10k91n64P7O68J3p72O9N64M6o17J8O11N7r89o2R26m5n54j50R08k9p07k27
3597d40M36K65n31j08P29k5q18J97J53M18o31q9Q98J24j065K13M64L90q03J45
3617g8J23K77p00j75Q28M1o33M5Q48m26o28L57M05J89j125M07O97j72p74L71N91
$$ plain form
3638 468 402 -110 -227 431 396 -212 -345 534 238 -465 -311 315 124 -516 -366 461 95 -265 -459 167 223
3659 223 -384 -242 56 40 -391 -526 356 170 -311 -211 318 365 -266 -274 458 162 -470 -374 66 368 -386 -273
3681 -273 557 82 -423 -265 107 305 -432 -425 287 74 -669 -318 227 225 -564 -260 556 238 -362 -95 474
3702 474 376 -214 -301 382 420 -394 -264 442 226 -442 -544 416 348 -398 -237 272 298 -445 -249 275 175 -435
3724 -435 -264 408 244 -400 -193 193 48 -282 -350 329 201 -446 29 297 61 -405 -406 540 226 -519 -309
3745 -309 582 148 -333 -258 258 162 -546 -389 460 142 -441 -131 380 -154 -308 -454 297 184 -342 67 700
3766 700 364 -154 -412 49 201 -283 -3 560 306 -684 -273 357 -112 -440 -318 401 78 -672 -141 285
3786 285 232 -455 -203 584 112 -321 15 356 199 -297 -151 506 233 -183 -42 385 162 -468 18 323
$$ packed form
3638D68o6n12j17O58l5o08j33Q79k96p03J54O26j91o40J50Q27l66l60j94O26N6
3659B23o07J42K98j6m31j35Q82j86m81J00N29M7o31qP32k96o32R6M40L02p54J13
3681b73Q30m75n05J58L72J98p37PP12k13p43L51N45kp89L04Q16l18o00K67N69
3702D74r8n90q7O83L8q14J30P06k16o68j02R60o8p46J61N09K6p43J96N24j00o10
3724d35J71O72j64o44K07L86j45l30o8O79j28o47M75K68k36m66jR46l14p45K10
3745c09Q91m34m81P5N16r6p08J57Q49l18n83L10N11n34j54j46P51j13n26M09O33
3766G00l36n18k58M61J52m84K80N63k54r90M11O30m69l28J22P19l23p50N31M26
3786B85n3o87K52P87m72m33L36L41j57m96J46O57k73m16J41M27k23o30M86L05
$$ plain form
3806 323 208 -450 -34 697 191 -196 -436 464 -135 -479 -261 355 282 -405 -163 305 17 -361 -42 380
3826 380 -218 -556 -507 500 16 -151 -235 506 103 -191 105 491 85 -344 66 320 127 -15 -195 383
3846 383 -119 -535 -49 361 -38 -463 -153 517 -120 -530 -21 208 267 -474 -32 213 161 -462 -349 350 39
3867 39 -443 -50 508 127 -632 -113 550 -28 -372 -134 260 35 -359 -345 139 -222 -521 -86 76 148 -150
3888 -150 -51 488 282 -264 60 327 202 -175 -284 220 159 -168 -53 190 -54 -442 -21 176 -208 -120 -46
3909 -46 261 18 -337 56 418 53 -433 -48 359 -77 -434 -214 645 113 -372 196 384 310 -473 41 487
3930 487 228 -341 -107 468 -25 -364 122 403 186 -523 32 356 -185 -380 -76 576 221 -503 41 220
3950 220 10 -65 79 182 259 -247 -40 375 -3 -462 138 155 114 -252 -9 269 -105 -243 220 241 -207 -181
$$ packed form
3806C23j15o58M16P31n06l87k40R00n99l44K18O16p3o87K42M68k88l78L19M22
3826C80n98l38M9J007m84j67q4P41m03k94K96L86m06m29M10K54j93j42j80N78
3846C83n02m16M86M10l99m25L10O70o37m10N09K29N9p41M42K45n2o23J13O99l11
3867C9m82L93N58l81p59N19O63n78l44K38L94k25l94J4M84l61k99M35J62P2k98
3888a50R9N39k06n46L24K67j25l77j09N04o1l27J15K43k44l88M21J97l84Q8P4
3909d6L07k43l55L93L62l65m86L85M07m36l57K20Q59n32m85N68J88p4p83N14M46
3930D87k59n69K34N75m93l39M86K81k17p09N55L24n41j95L04O52l55p24N44J79
3950B20k10p5J44J03P7n06K07M15l78m59O00J7m1l66K43K78l74j38M63K1m48K6
$$ plain form
3972 -181 64 324 -73 -549 72 340 53 -409 171 592 37 -345 -101 685 -66 -403 69 516 63 -296
3992 -296 17 394 -117 -440 -69 383 -28 -172 192 205 88 -504 38 434 34 -354 39 242 57 -366
4012 -366 67 297 168 -447 222 357 130 -455 320 771 -144 -569 220 368 -28 -512 179 394 72 -371
4032 -371 56 256 12 -370 -57 439 -144 -236 -60 370 -38 -505 34 457 2 -357 -85 390 -87 -252
4052 -252 -5 615 -111 -287 80 308 40 -225 273 293 8 -403 -32 279 -287 -470 -246 472 -2 -311
4072 -311 54 340 -235 -544 -38 184 -233 -294 -225 298 107 -139 62 295 113 -277 130 560 -81 -425 207
4093 207 382 11 -344 -121 292 -226 -329 -170 275 -18 -3 -88 311 -188 -449 123 306 -67 -259 107 504
4114 504 127 -167 -17 441 -262 -322 109 391 -22 -332 67 217 -251 -461 80 317 25 -373 -86 -9 -172
$$ packed form
3972a81K45K60l97m76O21K68k87m62N80M21n55l82K44P86p51l37M72M47m53l59
3992b96L13L77n11l23L71M52m11j44L64J3j17n92N42L96m00l88L93K03j85m23
4012c66M33K30j29o15O69J35k27n85P75M51r15m25P89J48l96m84O91K15l22m43
4032c71M27K00k44l82L13M96n83r2J76M30m08m67N39M23m55l59K72M75m77j65
4052b52K47O20p26j76L67K28k68k65M98K0k85m11L71L11n66j83K24P18m74l09
4072c11L65K86n75l09N06K22m17o1O9N23j91k46K01K33j82l90M07M30o41l44O32
4093B07J75l71l55K23M13n18j03J59M45k93J5q5L99m99k61N72J83l73j92L66L97
4114E04l77k94J50M58p03o0M31K82m13l10L99J50m68k10N41K37k92l98K87P7j63
$$ plain form
4135 -172 -604 10 144 -60 -372 217 316 -77 -197 15 382 108 -453 135 178 31 -255 307 253 -16 -420
4156 -420 171 266 54 -582 -96 360 24 -476 203 420 -167 -531 57 428 -84 -227 18 171 -83 -491
4176 -491 273 438 73 -249 215 226 -54 -332 171 442 -284 -323 -14 230 -207 -216 117 302 -217 -266 145 676
4198 676 -50 -307 78 102 -261 -459 189 148 -141 19 -9 410 80 -243 71 336 -66 -406 -42 -62 -156 -451
4220 -451 388 488 -62 -307 202 134 54 -303 -92 314 -210 -550 40 411 -87 -227 229 348 -195 -178 153
4241 153 629 94 -146 19 40 1 -441 150 299 -74 -259 119 328 -45 -227 144 303 -285 -443 144 352
4262 352 45 -297 23 388 -130 -326 346 189 -47 -114 320 290 -72 -245 341 269 -401 75 47 113 -181 -160
4284 -160 77 399 -139 -406 129 194 -260 -473 -23 125 -281 -217 65 284 -124 -303 225 149 -166 -44 184
$$ packed form
4135a72m32O14J34k04l12N89R9l93j20K12L67k74n61N88M3j47k86N62n4k69m04
4156d20N91R5k12o36M86M56l36n00O79K17n87l64N88L71n12j43K45J53k54m08
4176d91P64J65l65l22M64J1k80k78N03K71p26l9L09K44m37rL33J85n19m9M11N31
4198F76p26k57L85K4l63j98O48m1k89J60k8M19l30l23L14K65m02l40L64k0r4k95
4220d51Q39J00n50k45N09o8q0l57K11M06n24l40N90L71m98j40M56J19n43J7L31
4241A53M76n35k40J65K1l9m42N91J49l73j85L78K09l73j82L71J59n88j58N87K08
4262C52l07l42L20L65n18j96O72j57k36o7M34l0l62j73N86p2o70M76k8O6k94K1
4284a60K37L22n38k67N35O5m54k13M50J48m06O4K82K19m08j79N28p6l15J22K28
$$ plain form
4305 184 322 -78 -157 269 197 -357 -276 -61 148 -130 -274 38 136 -76 -391 -267 174 -280 -345 206 308 -290
4327 -290 -228 249 210 133 -328 272 164 -223 -25 30 -9 -201 -242 194 42 85 -310 15 -48 -58 -363 237 211
4350 211 -210 -394 8 230 -206 -126 187 263 -140 -132 358 226 -171 -395 419 217 -35 -385 124 143 -361 -253
4372 -253 78 481 -84 -277 91 -7 138 -173 305 24 1 -177 244 113 -169 -124 86 125 -233 -174 152 180
4394 180 -25 -101 178 401 -314 -224 314 399 159 -149 322 204 -84 -158 245 141 -390 -256 20 264 -201
4415 -201 -225 -41 31 -82 -264 -118 200 -326 -420 259 244 23 -81 -135 173 -289 79 262 313 -323 -138 315
4437 315 446 -195 -268 410 252 -209 -365 368 101 33 -188 204 292 -86 -184 99 -24 -267 -97 409 518
4458 518 9 -26 321 357 73 -380 248 60 -331 -154 231 190 -214 -174 84 192 -283 -321 276 15 25 -270
$$ packed form
4305A84J38m00p9M26p2n54Q1K15K09k78j44L12R8k12l15J24M41m54o5N51J02n98
4327b90O2M77l9p7m61O00j08l87J98N5l9j92m1M36j52M3l95L25o3j0l05O00k6
4350B11m21j84M02K22m36Q0L13P6m03QM90j32l97k24Q14k02k52l50N09J9n04J08
4372b53L31M03n65j93L68r8J45l11M78k81k3j78M21j31k82M5K10L9l58N9L26K8
4394A80k05p6K79K23p15R0N38Q5k40l08M71j18k88p4M03j04n31J34K76K44m65
4415b01k4J84P2j13j82J46L18n26r4O79j5k21j04n4L08m62L68J83N1o36J85M53
4437C15J31o41p3O78j58m61j56P33k67o8k21L92Q8l78r8K83j23k43J70N06J09
4458E18n09l5L47L6k84m53O28j88l91J77L85m1m04M0K58J08m75l8N97k61J0k95
$$ plain form
4480 -270 176 538 -338 -104 182 226 -213 -191 240 393 168 -107 202 273 -289 -194 99 128 -305 -290 313 118
4502 118 -104 -170 149 82 -245 -508 64 113 -110 -407 48 210 -241 166 239 184 -300 -101 20 -12 -54 52
4524 52 40 516 -272 -227 242 309 21 -182 365 -211 58 -150 254 99 -105 -340 -54 292 -148 -63 107 225
4546 225 -308 133 324 89 -209 -23 205 -101 -496 -146 91 101 -281 -159 184 330 -174 -175 173 261 -105
4567 -105 -147 -207 136 -34 -288 292 198 -233 -255 181 172 -136 -107 235 -67 -256 -83 484 13 -116 -71 175 400
4590 400 -137 67 201 -28 -304 11 13 83 -313 -336 267 222 -2 -147 0 10 47 -204 114 176 -336 -199 123
4613 123 97 -292 -132 218 206 -154 -378 262 250 -187 -8 368 8 -355 -64 240 207 -303 -145 146 -28
4634 -28 -221 -237 47 206 -369 -75 99 -17 -72 -85 323 -43 -190 -105 189 251 -177 130 400 202 20 -221
$$ packed form
4480b70M46L62q76K34K86M4m39K2M31J53k25k75L09P1n62R5K93K9m33J5O03j95
4502A18k22o6L19o7l27k63N72M9k23k97M55J62m51M07P3n5m84J99J21l2m2J06
4524E2j2M76p88M5M69O7k88k03N47n76K69k08M04j55k04k35K86L46m40Q5J70J18
4546B25n33M41J91k35k98J86K28l06l95L50K37J0l82J22L43J46n04jL48Q8l66
4567a05m2o0L43j70k54N80r4m31k2M36rl08K9L42l02j89J73N67m71j29M5K46K25
4590D00n37K04J34k29k76L15KP0l96k3O03m5k24j45J47J0L7k51L18O2n12J37L22
4613A23k6l89J60L50j2l60k24O40j2m37J79L76l60l63K91L04l3n10J58K91j74
4634b8j93j6K84J59n75K94J74j16n5j3M08l66j47Q5K94O2m28L07K70j98j82k41
$$ plain form
4656 -221 162 98 -157 -183 352 166 -150 -4 61 260 -180 -152 372 -32 -420 -266 281 181 -365 -258 101
4677 101 202 -285 -54 465 394 -251 -183 0 89 -91 -73 275 171 -154 -72 143 218 -154 -112 38 202 -316
4699 -316 -151 100 218 -285 -123 216 43 -103 -1 289 48 -337 -228 326 132 -338 -16 260 179 -186
4719 -186 -278 448 113 -363 51 38 62 -257 22 260 61 -96 64 287 -288 -101 -168 461 88 -58 -112 298
4741 298 162 -406 -32 363 -78 -145 -42 11 256 -254 -178 121 132 -255 -121 385 -83 -615 -245 255 81
4762 81 -344 -149 143 152 -389 42 211 8 -209 169 218 60 -415 24 377 85 27 -63 -8 -10 -120 74 437
4785 437 -127 -402 1 213 -13 -219 230 389 -63 -133 215 297 167 -100 -176 16 278 72 -121 206 11
4806 11 -186 69 69 141 -69 -19 45 176 -310 -43 127 53 -282 -78 321 246 -161 73 145 -10 -316 -140 207
$$ packed form
4656b21L83o4k55k6N35j86l16J46O5J99m40K8N24m04l88J54N47j00n46J07L59
4677A01J01m87K31N19p1o45O8J83Q9j80J8L48j04l25Q2K15P5l72M2J50J64n18
4699c16J65K51J18n03J62L39j73j46J02K90k41l85J09N54j94m70L22K76q1l65
4719a86r2P26l35m76M14j3K4l19K79K38j99j57J60K23n75J87o7O29l73j46n4M10
4741B98j36n68L74L95m41o7J03N3K45n10P6K99J1l87J34N06m68n32L70N00j74
4762H1m25J95K92Rn41M31J69k03k17L78M9j58m75M39L53k92n8r0N5kj10J94L63
4785D37n64k75M03K12k26k06M49J59m52p0L48Q2j30k67p6J92K62k06j93L27j95
4806A1j97K55%P2k10N0O4J31m86K67J70p4l35K04L99p5m07K34P2j55l06J76L47
$$ plain form
4829 207 -173 -344 -48 284 15 -12 -123 86 26 -298 74 163 -78 -24 -16 60 -16 -494 20 182 -304 -377 51
4852 51 294 80 -128 -72 -1 -234 -278 44 110 -19 -249 45 180 -191 -304 -58 611 162 -186 -9 221 41
4874 41 -178 -60 211 43 -236 -53 475 -168 75 -81 81 19 -436 -85 79 -281 -189 17 26 78 -319 75
4896 75 188 -49 -22 184 343 178 -145 152 276 106 -209 239 220 -81 -204 -21 216 -288 -249 89 150 -194
4918 -194 -241 63 274 32 -102 -59 176 -2 -314 27 113 240 -176 -22 131 108 -453 190 260 44 -104 -129
4940 -129 48 -188 -76 -91 210 -144 -197 24 185 -48 -106 -57 135 -14 -318 -63 145 61 -518 14 73 26
4962 26 -276 23 139 378 -282 175 425 -62 -292 -106 325 -110 -412 107 76 -272 -240 -285 60 -13 -383 144
4984 144 365 169 -322 -172 171 -180 26 22 288 73 -103 -20 411 279 0 106 264 262 -274 117 232 6
$$ packed form
4829B07l80j71K96L32k69k7j11K09o0l24L72Q9k41N4QP6p6m78N14J62m86p3M28
4852E1K43k14k08N6P1k33m4L22O6j29k30K94J35l71j13K46O69m49l48J77K30j80
4874D1k19J18K71j68k79J83N28o43K43j56J62o2m55L51J64l60R2K06RN2l97L94
4896G5J13k37K7K06J59j65l23K97J24j70l15M48j9l01j23J83K37n04L9L38O1l44
4918a94m7L04K11k42j34M3K35j78l12L41Q6J27m16J54J53k3n61O43P0k16j48k5
4940a29J77k36J12j5L01l54n3K21J61k33n8M9J92j49l04K55K08q4n79N32N9m7
4962B6l02K99J16K39o60M57K50m87k30J86M31m35l02N19l1l48L2m5L45p3l70N27
4984A44K21j96m91J50L43l51K06mK66k15j76Q3M31j32k79J06J58kn36L91J15k26
$$ plain form
5006 6 -350 -43 249 -295 -65 190 135 -163 -350 76 244 -120 -211 93 214 125 32 -286 221 -36 -333 -47
5028 -47 198 -91 -193 218 148 414 -178 -3 100 -118 -48 94 58 -251 -127 258 71 -189 -178 181 68 -186
5050 -186 -190 -6 181 58 -384 188 402 43 -123 5 52 95 -346 70 208 3 -359 -342 39 -82 -145 -24
5072 -24 -27 -172 -264 51 234 -129 -195 -13 149 -199 -1 -52 190 69 -56 137 342 82 -167 -15 235 -308
5094 -308 -231 -152 38 -51 -263 -35 329 -206 -291 170 45 -57 -324 10 64 -207 -314 44 179 -176 -15 -363
5116 -363 230 -13 -174 238 173 9 -116 298 233 -178 -299 -1 185 -183 -211 -88 16 -173 -216 292 121
5137 121 -57 -219 -74 48 -95 -51 -146 128 -174 1 -24 276 -149 -177 33 186 -104 -45 33 142 -155 -54
5159 -54 381 -70 -38 -103 34 90 -131 -44 291 153 22 -78 208 53 -125 -109 203 305 149 12 232 102
$$ packed form
5006Fl56L07K92n44K30K55n5k98j87M26J68l64r1L04J21q9r3l18N07k57k97K86
5028d7K45k89j02M11p0K66n92J75J03k18P0J42l6l09J24L85j87k60J1L59j13k54
5050a86mJ84J87j23m42N72K14l59j66J28M7M3m41M16J38k05l62J7L81j21o3J21
5072b4lj45r2L15J83l63o6J82J62l48J98n1K42j21j25J93K05k60k49J52K50n43
5094c08P7P9J90q9k12K28L64n35q5M61j25j02k67L34N4k71j07L58J35l55J61l48
5116c63N93k43j61M12o5j64j25M14o5m11j21K98J86l68k8J23J04j89m3N08j71
5137A21j78j62J45J22j43M4r5K74l02J75k5L00m25k8K10J53k90N9P8J09k97J01
5159e4M35m51L2o5J37N6k21Q7L35j38j31j00K86j55j78J6L12J02j56j37K20j30
$$ plain form
5181 102 -246 -98 38 364 -211 -55 -41 250 -139 -79 103 170 -26 -287 -91 -201 -32 -149 26 25 -45 -141
5203 -141 143 149 -115 203 -100 170 -51 42 -40 250 56 2 200 260 -36 -299 78 289 -151 -403 140 -119
5225 -119 -139 -208 38 71 -192 -229 -22 436 -63 -238 -8 70 -156 -191 41 227 214 -267 158 145 7 68 -74
5248 -74 10 -47 25 229 251 -141 -110 162 137 -6 -153 -90 203 -131 -294 203 123 -12 -149 108 90 -313 -44
5271 -44 190 1 -221 26 72 17 29 -259 -4 125 -97 146 92 265 -34 -425 205 287 114 -153 176 34
5293 34 -104 -233 42 268 -162 -22 -1 246 -287 -203 -15 71 -5 -68 188 210 -93 -131 181 333 -123 -182 105
5316 105 -164 139 -165 123 79 -24 24 134 77 -164 -440 170 268 -107 -82 302 99 -224 -308 317 115 204
5338 204 5 144 -106 -114 -66 4 198 -112 -33 16 330 -439 39 -119 71 -219 -143 152 31 16 -122 103 96
$$ packed form
5181A02l48J48J36L26n75J56J4K91l89O0J82O7j96k61J96j10J69j17J75jp0r6
5203a41K84Ok64L18l03K70k21R3q2K90j94n4J98O0k96k63L77K11m40k52N43k59
5225a19k0o9K46L3k63l7K07M58m99j75K30P8k26l5K32J86j3m81M25j3j38O1j42
5248g4Q4n7P2K04K2l92L1K72k5j43j47O3K93l34j63M97q0j35j37K57j8m03K69
5271d4K34j89k22K47M6n5J2k88K55J29k22K43n4J73k99l91O30Q2j73k67L29j42
5293C4j38j29K75K26m30J40K1K47n33Q4J88Q6p6o3K56K2l03l8L12J52m56n9K87
5316A05k69L03l04K88m4j03M8J10n7k41k76O10R8l75K5L84k03l23q4O25k02Q9
5338B04j99J39k50qM8P0J94l10P9M9L14p69M78j58J90k90P6K95j21j5j38K25p
$$ plain form
5361 96 231 -273 92 163 215 -73 69 79 -14 -386 99 38 104 -29 163 42 -246 16 306 394 -93 -199 274
5384 274 -13 -102 8 85 165 -164 -415 -20 154 -113 -172 209 -105 -77 -375 203 150 -165 -106 36 -18 -112 -265
5407 -265 92 293 -162 -39 196 88 -235 -256 66 150 -2 -289 22 9 16 -107 326 209 35 -153 341 122
5429 122 -98 -461 46 54 -13 42 74 263 -23 -110 186 101 65 -239 5 302 -314 25 5 129 -208 -76 222
5452 222 132 -110 -309 341 325 -101 -131 169 147 -90 -38 80 357 90 107 227 -92 -76 -34 131 307 33 -106
5475 -106 102 -34 99 -256 225 206 -47 -34 18 147 -265 -189 98 100 -191 -207 211 -43 358 -212 118 -82
5497 -82 -94 -232 -208 218 -118 92 -235 -23 -19 -101 118 106 -143 19 250 1 68 18 22 73 -235 -235 3 146 -267
5522 -267 -14 206 117 191 -74 -71 93 -281 109 42 -129 -266 -100 533 -16 -47 -115 67 292 -211 -56 267
$$ packed form
5361I6J35n04L65P1N2k88J42J0r3l72M85o1O6j33J92j21k88K62K90Q8m87j06M73
5384B74k87q9J10P7Q0l29k51L95J74k67n9L81l14K8k98N78n3l15N9J42n4r4j53
5407b65L57K01m55J23K35j08l23k1L22Q4j52k87L11j3Pj23M33j17j74j88M94k19
5429A22k20l63N07Qo7N5L2J89k86q7K96q5l6l04K44K97o16L39k0J24l37J32K98
5452B22r0k42j99O50j6m26l0L00k2k37N2J18K77k67J7J20l19J6M2J65J76k74j39
5475a06K08j36J33l55M81j9k53J3N2J29m12P6K87Kk91j6M18k54M01n70L30k00
5497h2j2j38K4M26l36K10l27K12Mq2K19j2k49J62K31k49O7n0MN1l08%K38J43m13
5522b67K53K20q9P4k65LJ64l74L90o7j71j37J66O33n49l1o8J82K25n03J55L23
$$ plain form
5544 267 149 -86 93 78 -71 -211 -46 -32 41 -226 171 231 51 -23 -102 289 177 -325 -117 83 34 -24 113
5567 113 97 -26 -243 178 219 90 -296 20 54 101 -306 131 130 -139 -134 -135 400 -115 -124 0 64 240 4 142
5591 142 103 -218 -22 -74 298 39 -6 -204 109 -75 130 -95 129 52 -191 30 243 -159 -25 -105 115 40
5613 40 -39 -122 194 243 -100 232 191 115 -118 14 142 275 -46 -101 153 232 -176 -74 71 71 -188 140 437
5636 437 222 122 -140 82 132 -257 -207 212 8 -260 76 273 178 -266 -291 117 95 -142 -87 136 -2 -97
5658 -97 10 86 -31 -371 -105 68 -85 -77 -47 114 -26 -202 20 288 -65 -16 -199 325 -161 -39 106 46
5680 46 108 -95 83 69 64 78 188 146 -111 -431 52 45 190 -94 -218 247 -117 -317 78 111 -95 -122 169 -105
5704 -105 152 -245 19 73 102 -166 294 208 203 -223 -206 78 175 -49 -12 306 102 -126 61 131 -5 -61 -171
$$ packed form
5544B67j18k35J79j5j49j40J65J4P3k67L97O0j80p4p9L91j12n02K08K00m9n8J37
5567A13j6j23k17M21M1j29l86L16L4M7m07M37jk69NjN35n15rJ24O4J76k36J38
5591A42l9l21J96n2L72k59m5j98L13j84K05k25K24p7k43K21K13m02J34q0K20p5
5613D0p9q3L16M9l43L32m1p6k33J32J28J33l21n5K54P9m08J02J45%k59L28K97
5636D37k15j00k62K22N0l89N0M19k04k68L36J97r5m44k5M08k2k37N5K23j38r5
5658i7J07P6j17l40K66J73j53QL0J61j40j76K22K68l53M9j83N24m86J22J45o0
5680D6O2k03J78j4nJ4J10m2k57l20M83pJ45k84j24M65l64k00L95L3k06k7K91k74
5704a05K57l97K64N4K9k68M60q6nm26J7K84R7k24L7L18k04k28J87P0j36n6j10
$$ plain form
5727 -171 9 -60 -69 -85 -34 122 -39 -180 237 -18 -139 175 50 -141 -416 7 -65 -226 130 -12 144 -107
5749 -107 67 155 33 138 -223 142 105 -306 -201 102 -71 -195 0 -89 389 94 -190 -99 215 -49 147
5770 147 80 3 35 12 -130 24 206 -102 141 15 -72 -131 52 116 59 -212 -202 -39 25 -180 108 -264 -28
5793 -28 68 95 168 3 -242 68 132 98 -114 -114 125 -124 128 -127 254 83 30 43 203 17 -108 82 141 79
5817 79 62 183 236 152 -186 -192 -230 -101 -13 121 327 -76 -304 -75 56 -206 -123 -257 297 116 -123 112 74
5840 74 -91 -21 38 234 -204 -65 227 16 10 -299 202 63 39 -223 220 362 251 -153 -167 84 -129 -9
5862 -9 -307 160 -59 -261 -1 -55 18 -98 -35 446 -238 28 190 -125 -32 -30 -169 112 101 -277 170 -60 -29
5885 -29 -181 -25 -64 -37 -5 23 258 -299 -183 -14 177 -208 14 -65 114 0 -109 -232 99 63 -318 51
$$ packed form
5727a71J80o9rj6N1J56j61j41M17k55j21L14j25j91k75M23p2j61L56j42J56k51
5749a07J74Q8j22J05l61L65l7m11J05L03j73j24J95q9M78k95k84R1L14k64J96
5770A47o7p7L2k3j42J54J82l08K43j26q7n9J83O4n7k71J0J63O4k05K88l72K36
5793b8R6K7P3j65k45L10O4l4k12%K39k49K52k55L81j71n3J3J60j86j25J90N9o2
5817G9j7J21N3q4l38ol8J29Q8J34K06m03k28K29J31k62Q3j34N54j81k39K35l8
5840G4j65P0N9J96m38J39K92k11ol09N01j39k4k62M43J42j11m04j4K51k13J20
5862ik98M67k19k02K60n4P3j16O3M81o84K66J62l15R3Kj39K81j1l78M47k30L1
5885b9j52J56l9K7L2K8K35n57J16J69J91l85K22p9J79j14j09j23L31l6l81L69
$$ plain form
5907 51 224 90 101 94 402 -30 -289 -144 214 -137 -47 109 -77 -73 124 127 46 1 -119 -37 210 98 -81 71
5931 71 -19 -71 -29 224 -1 -113 -253 157 255 -49 -211 22 157 -220 -149 -195 -78 -61 152 57 125 -257 -179 75
5955 75 247 -280 11 66 -44 69 -300 -159 77 14 25 75 -148 3 -258 34 111 41 -178 8 306 11
5977 11 -54 127 138 -163 -180 0 -34 -83 166 34 -192 19 4 -96 56 -6 -223 64 78 178 -8 -4 -137 -24
6001 -24 -190 -22 149 133 -70 -4 23 305 -158 -194 -34 -15 -66 73 21 -188 27 164 37 7 -145 168 117
6024 117 -80 27 115 198 -215 -35 78 132 50 -18 124 87 -197 -131 17 337 131 -246 186 88 -36 -95 -44
6047 -44 132 -57 -17 -99 109 -140 -50 -12 201 20 -211 103 -43 -101 -236 164 257 185 -22 157 -5 -58 23
6070 23 75 210 -112 -263 -183 181 -218 -111 8 -110 -217 -327 101 128 140 23 154 320 -124 -304 29 -9
$$ packed form
5907E1J73j34J1pL08m32k59J45L58l51R0J56j86MJ97Lq1m5j20Q2K47j12j79J52
5931G1r0n2M2K53k25j12j40M10R8l04j62K33J35l77P1m6J17J7K13r5O8l82P8K54
5955G5J72n27K91N5j10J13l69J41K36o3J1N0k23J51k61K92P7p0k19J86K98k95
5977A1o5J81J1l01j7J80l4m9K49j32k26K11j5j00J52o2k17K87J4J00j86Mj33J13
6001b4j66J68J71j6k03O6K7K82m63l6J60J9n1J39n2k09K15J37j27l0j52L13n1
6024A17j97J07Q8Q3m13J80J13N4q2o8J42l7k84O6J48L20k06l77M32r8j24n9N1
6047d4J76j89M0q2K08k49R0L8K13j81k31L14j46n8j35M00R3p2k07J79j62n3Q1
6070B3N2J35l22j51Q0L64l99J07J19j18j07j10M28K7J2j17J31J66m44j80L33l8
$$ plain form
6092 -9 -99 88 220 -311 9 113 -61 68 -55 -120 -141 -148 -65 -21 -109 -118 -101 -337 262 28 -11 -9 190 -25 -40 -67
6118 -67 251 -29 -373 -59 -72 160 -81 -52 26 145 250 -131 -45 250 26 88 -232 14 -160 -267 89 147
6140 147 135 -225 -166 142 46 -32 -57 1 87 -103 -36 -33 23 -187 59 -10 -33 2 45 -11 -45 -11 165 18 -109 -207
6166 -207 -189 190 -210 -75 -64 -96 -193 53 51 10 -211 55 -39 23 -430 130 -74 57 -65 9 123 -36 134
6189 134 -43 44 -33 1 -135 1 180 -40 -104 80 36 270 -84 107 17 60 -8 -210 329 154 -225 -124 15
6212 15 -46 15 183 -185 15 45 156 92 -186 179 38 -99 0 -91 -119 239 -275 -3 -31 77 -51 -47 170 73
6236 73 -19 84 -39 159 114 21 92 36 -33 -263 -103 46 81 -109 -309 98 110 136 -64 -8 -2 -277 198 228 107
6261 107 -187 -70 -105 -109 -97 74 83 -36 68 18 19 -50 23 128 175 107 205 131 -40 -67 80 204 45 25 -205 75
$$ packed form
6092ir0J87J32n31L20J04j74J29j23o5k1pQ3M4q8rJ7k36N99k34l9KJ99k15j5k7
6118f7L18k80l44L14j3K32k41K9P8J19J05l81Q6K95k24O2l20K46j74j07L56N8
6140A47j2l60N9L08r6p8k5N8Q6j90O7LN6k10K46o9k3L5M3n6l4L4J76j47j27r8
6166b07J8L79m00J35J1l2r7K46km1k21K66r4O2m53N60k04J31j22P4J14j59J70
6189A34j77Q7p7L4j36J36J79k20o4J84m4K34l54J91r0M3o8k02N39j75l79J01J39
6212A5o1O1J68l68K00L0J11o4k78L65j41j37R9r1k8L58n14K72k8J08j28MK17r7
6236G3r2J03j23J98m5r3P1n6o9k30J60J49L5j90k00M07J2K6k00N6Ok75M75L0j21
6261A07k94J17l5mJ2J71Rj19J04n0Jo9P3J05M7o8R8p4j71k7J47J24j59k0k30K80
$$ plain form
6287 75 -242 -120 -234 215 -67 131 -96 50 7 -243 -75 -5 208 -229 203 40 339 -247 54 57 29 -183
6309 -183 148 44 166 -40 146 13 73 72 30 186 191 221 -53 1 -45 -144 126 354 -129 -72 -86 -82 -216 72 -46
6334 -46 65 216 93 -265 196 79 -17 -46 8 74 225 -92 194 4 -75 -192 67 -37 -188 -196 148 161 94
6357 94 293 -179 -28 72 -258 171 -34 -80 -29 177 22 297 191 62 10 -154 -114 29 -118 18 255 82
6379 82 -58 -102 31 13 162 50 79 94 242 43 -113 -74 183 -189 -41 -34 -99 65 130 272 -234 -20 85
6402 85 72 45 64 22 60 -282 9 79 206 -23 -20 -89 -17 -211 -242 95 312 -70 -208 42 -60 166 -99 54
6426 54 90 32 -11 153 299 6 29 359 163 -8 127 -108 354 152 189 100 110 -77 108 -15 243 96 -156
6449 -156 -175 355 -26 -302 -27 -54 -179 -367 96 30 -15 -157 225 19 -182 -143 54 213 164 -250 -167 -10
$$ packed form
6287G5l17J22j14M49k82J98k27J46m3k50J68P0K13m37M32j63K99n86L01Lk8k12
6309a83L31j04J22k06J86j33O0jm2J56NL0k74N4m6r9K70K28m83N7j4Mj34K88j18
6334d6J11J51j23l58M61j17r6k9N4O6J51l17K86j90p9j17K59j04j51qL44J3o7
6357I4J99m72J51J00l30M29k05m6N1K06j55K75j06j29n2j64M0J43j47J36K37j73
6379H2j40m4J33j8J49j12K9J5J48j99j56L9K57l72J48Po5J64O5J42n06K14J05
6402H5j3k7J9m2L8l42K91P0J27k29Lo9P2j94l1L37K17l82j38K50j02K26k65J53
6426E4L6n8m3J64J46k93K3L30j96j71J35k35M62k02L7q9J0j87J85j23K58j47k52
6449a56j9N30l81k76K75k7j25j88M63o6m5j42L82k06k01L9J97J59m9m14Q3J57
$$ plain form
6471 -10 -199 -231 -81 78 211 -232 -22 89 199 163 -216 25 164 -40 -67 -38 158 -39 -95 30 -63 -43 88
6494 88 12 295 -24 105 59 55 -87 -192 168 -33 -16 -107 -16 90 -15 17 91 84 -159 -36 5 196 -56 -14 -77
6519 -77 -23 52 57 186 15 75 -92 242 49 -172 21 -1 70 -359 -37 -56 -87 -85 -120 192 48 -64 -38 -149 274
6544 274 -299 -82 14 239 -220 -41 3 -31 -12 -222 165 -54 -107 -183 -320 111 189 43 274 -231 -70 175
6566 175 214 -218 5 41 -22 42 -142 69 237 -103 100 50 60 24 131 -160 -55 -2 47 -17 -35 44 -59 190
6590 190 120 -225 -203 -18 47 236 -75 72 102 -238 223 -22 -10 7 -74 76 260 -1 -265 218 59 -82
6612 -82 146 -306 -78 -86 -261 -119 361 23 -116 30 20 121 -95 257 8 92 -157 1 102 63 -52 349
6634 349 276 -316 -438 -22 98 -182 -165 138 201 57 32 91 132 125 -112 125 24 75 -109 -12 278 -5 -306
$$ packed form
6471a0j89l2J50J59J33m43K10J11J10l6l79K41J39k04k7K9J96j97n6J25r3K0J31
6494H8p6K83l19J29m6mj42j05L60k01J7r1R1J06j05L2P4pk43J23M1J91k52M2o3
6519g7N4P5NJ29j71O0j67L34j93k21J93k2P1m29L22j9l1Kl5L12j44j12K6j11M23
6544B74n73K17R6K25m59J79M4l4J9k10L87k19n3p6j37M31P8j46K31n05J61K45
6566A75L9m32K23L6o3O4j84K11J68l40K03n0J0l6J07k91J05N3M9o4j8P9j03K49
6590A90p0l45K2J85O5J89l11J47L0l40M61k45J2J7q1J50J84k61k64M83j59j41
6612h2K28m52K28qj75J42M80l38j39J46j0J01k16L52k49Q4k49J58J01l9j15M01
6634C49p3n92j22M16J20k80J7L03O3j44k5N9M1pk37K37j01N1j84R7K90k83l01
$$ plain form
6657 -306 -210 121 -68 -293 -18 130 41 -154 39 18 33 -22 -196 -197 -20 -15 -165 -39 -100 -273 136 -39 155
6680 155 -211 21 173 83 45 30 -52 -71 -118 -26 15 306 80 -63 188 154 135 -180 -45 -183 -150 -59 184 -51
6704 -51 -64 79 221 -251 -177 188 -21 -60 -307 -20 73 100 -22 -11 47 -210 148 4 63 -174 -1 133 261
6727 261 -19 -184 -18 269 -374 19 135 22 33 -37 -59 -105 -13 30 107 -33 -184 26 105 32 139 -97 117
6750 117 274 46 -46 35 230 -107 -222 -30 31 -126 -23 -169 35 -41 -29 -14 159 -69 85 63 -228 7
6772 7 124 -24 102 126 -327 -15 48 -28 -106 146 -230 172 66 -67 189 -9 -17 193 228 20 43 -82 4 -94
6796 -94 -57 80 -107 -147 -171 77 62 -35 -5 3 -14 -131 53 30 141 12 -215 49 313 -34 -101 -167 207 39
6820 39 37 -85 33 -254 -16 103 91 -278 -93 147 -179 149 -206 30 175 -19 52 34 20 87 24 -27 104
$$ packed form
6657c06R6L31j89k25K75J48q9j95J93k1J5n5j74jJ77Nj50J26o1j73M09j75J94
6680A55l66K32J52r0l8j5q2j9m7R2M1K91k26j43K51l4j9l15J35j38L3R1K43k35
6704e1j3J43J42m72P4L65k09l9k47K87R3K7j22J1N8k57L58j44N9k37J73J34J28
6727B61k80j65J66K87o43L93J16j13J1p0k2m6R2M3P7j40j51K10P9p3J07k36K14
6750A17J57k28r2Q1J95l37j15J92O1j57J03j46K04p6J2J5J73k28J54k2k91K35
6772GJ17j48J26K4m53L12O3p6p8K52l76M02j06j33K56j98qK10L5k08K3j25Q6r8
6796i4L7J37j87m0k4K48j5r7L0Qj7j17J84k3J11j29k27K64K64l47o7o6L74j68
6820C9kj22J18k87K38J19j2l69J85K40l26L28l55K36J45j94P1j8j4O7o3n1J31
$$ plain form
6843 104 -60 -76 174 -7 -13 -82 53 -56 91 76 44 -71 -70 47 43 -142 -218 -226 49 42 -139 -119 43 -152 -326
6868 -326 25 -211 55 -85 -45 45 232 -18 218 -76 164 97 -75 -73 -39 -55 -110 94 203 -120 -213 -32 131
6891 131 -134 7 -182 37 43 -39 -1 170 32 -17 -57 104 -89 -186 279 170 -204 201 21 -98 31 -348
6913 -348 241 132 -65 -213 16 137 -86 -48 -67 168 -173 -15 -117 71 19 -223 113 -61 134 -136 112
6934 112 -133 -273 -362 38 57 -29 -54 204 -46 -32 15 122 27 -68 -8 -399 -68 -59 47 46 188 -93 126 329
6958 329 81 42 24 127 304 -169 126 -60 -270 -170 -70 71 22 346 -163 164 136 166 -146 -82 -102 -75 -9
6981 -9 -16 222 -33 -12 62 -83 -19 -30 -146 -8 174 -86 -21 -5 -184 -105 168 -110 166 -53 225 100 -152 -129
7005 -129 11 186 42 110 266 86 -104 24 -232 114 -9 170 -19 152 79 -33 122 68 182 0 124
$$ packed form
6843A04j64j6K50j81oo9J35j09J47j5l2j15JJ17mj85p6qK75pj81K0J62j95j74
6868c26L51k36K66j40M0R0J87k50K36k94K40o7j72KL4j6n5K04J09l23r3J81J63
6891A31k65J41j89K19Oq2L8J71j38m9m0J61j93r7M65j09l74M05j80j19J29l79
6913c48N89j09j97j48K29J21k23L8j9K35l41J58j02J88n2k42L36j74J95k70K48
6934A12k45j40q9M00J9q6k5K58k50J4M7J07r5r5O0l91L31RJ06jJ42k81K19K03
6958C29k48l9j8J03J77m73K95j86k10J00J00J41m9L24n09L27k8L0l12O4k0K7O6
6981ipK38k55K1P4j45O4j1j16J38J82k60O5J6j79P9K73k78K76k19K78j25k52K3
7005a29J40J75j44O8J56j80j90J28k56L46j23J79j89J71p3j12J55n4J14j82J24
$$ plain form
7026 124 245 -111 -239 56 -169 -256 -12 1 299 87 154 -153 -26 5 -266 87 -27 -134 96 -24 109
7047 109 -23 -159 -60 44 -116 -419 -113 -39 -26 122 2 -83 24 -201 -19 -22 -158 191 64 -281 86 -59
7069 -59 110 130 45 115 -97 -64 -30 -76 -45 120 -31 -197 21 -88 -95 -59 0 -159 -79 -118 114 -60 -68 42 95 71
7095 71 146 55 -170 55 -169 -63 -11 -109 15 30 177 144 -73 -136 15 -48 -210 -15 -18 88 -61 -202 -169 -132
7119 -132 -137 -33 266 203 -56 -46 35 -71 -374 -50 264 127 -268 158 -76 -29 3 169 68 -19 -230 62 276
7142 276 -30 26 -65 56 -142 268 -241 142 -33 101 -101 60 -257 -99 25 90 -74 -9 -11 297 -83 -135
7164 -135 79 -84 44 -24 60 -24 -238 -57 125 -61 90 -147 196 85 -6 -237 -3 89 112 -97 4 116
7186 116 115 -202 -164 -52 12 -34 268 274 -90 -41 -59 100 -66 45 47 354 273 41 79 172 196 230 -42 127 9
$$ packed form
7026A24J21l56j28K95k25q7K44J3K98k12O7l07J27L1k71L53j14j07K30j20J33
7047A09j32j36R9J04j60l03L06P4J3J48j20q5J07k25J82lj36L49j27l45L67j45
7069e9J69K0q5P0k12L3L4m6L1J65j51j66K18j09pL6N9j59Q0l9K32j74qJ10N3k4
7095G1P5r1k25K25k24J06N2r8J24J5J47l3k17o3J51o3j62J95lJ06j49j41L3L7
7119a32nJ04K99o3k59J0Q1j06l03L24L14j37l95M26k34M7L2J66j01q7k11K92K14
7142B76l06N6r1J21j98M10n09L83j75J34k02J61l17J58J24O5j64O5kL08l80n2
7164a35K14j63J28o8Q4q4k14J81J82j86J51k37L43j11r1k31K34R2K3k09J01J12
7186A16jl17L8J12O4m6L02Ol64M9j8J59j66J11KL07q1k32L8R3K4L4k72J69j18
$$ plain form
7211 9 -67 106 26 240 -82 92 166 -104 17 91 15 23 -86 -44 120 -25 -58 -46 282 104 -54 -57 157 -69 3
7236 3 -1 148 195 -111 184 110 -150 -129 13 -72 176 -145 -30 212 -73 -12 -84 290 67 -148 169 198 15 10
7260 10 120 187 -200 -467 -125 59 89 29 53 43 77 -17 -91 14 -257 -36 136 149 149 -159 -145 112 192 78 -122
7285 -122 392 -170 -383 -87 213 -44 69 248 33 -66 -106 217 97 58 -263 69 43 150 135 -19 193 2
7307 2 -275 -225 12 80 -350 -81 3 117 -186 -77 90 -76 -12 67 -122 -112 -112 320 25 -181 -49 122 11
7330 11 118 -45 -331 533 315 -34 -35 27 -106 -232 54 144 -44 -73 -227 82 159 -249 60 166 13 -235
7352 -235 -195 193 -101 -72 -125 137 149 3 -31 -31 3 -132 112 269 -134 -65 -28 50 12 47 -195 6 -55 201 76
7377 76 62 253 170 13 384 201 -53 -61 101 38 35 32 -141 -163 -107 51 81 16 -139 -139 78 18 -135 -240 139 230
$$ packed form
7211Ip6J73q0K14l22J74P4k70J21P4p6Qj09M2J64j45l3J2L28j78j58lK14k26P2
7236CmJ49M7l06K95p4k60K1J42q5K48l21J15K42k85O1p2L74k23k15L17K9j83n
7260A0J10O7l87k67L42J84L0o0K4j0L4r4p4J05k71K21J72J3%l08J4K57Q0j14k00
7285a22N14n62k13K96L00k57J13J79k15r9m0L23j20l9l21L32k6J07j5j54K12j91
7307Bk77N0K37O8m30K69Q4J14l03J09J67j66O4P9j89J0%M32k95k06J32J71j11
7330A1J07j63k86Q64k18l49jO2j33j26K86R0j88k9j54L09P7m08L09J06j53k48
7352b35M0L88k94K9n3K62J2j46l4%L4j35K44J57m03O9L7P8l8L5k42K01o1K56j25
7377G6j4J91q3j57L71j83k54qJ62o3llj73k2N6J58L0o5j55%K17o0j53j05L79R1
$$ plain form
7403 230 -100 -3 -98 -112 -161 -28 64 170 -224 -51 144 -28 72 -41 -30 -25 147 -34 -68 58 -57 61 -66
7426 -66 15 -75 170 -109 -133 21 -94 259 -26 88 -103 76 -77 182 81 78 192 -88 195 7 82 196
7448 196 83 38 -3 17 -212 -222 23 134 117 -199 242 49 5 138 218 26 -50 14 -226 -122 -245 60 -85
7471 -85 -178 -34 35 12 -132 165 192 -92 46 205 172 53 60 94 -6 -23 66 48 143 22 -206 129 160 35 54
7496 54 175 90 -141 35 41 -102 -126 134 16 451 182 -344 -67 -26 42 75 -178 116 163 -180 -110 92 201
7519 201 42 155 -155 -128 -249 4 63 159 15 138 52 -27 -4 -54 -99 -128 -20 -25 -273 -75 -154 110 186 -58
7543 -58 -294 150 204 1 -155 66 300 -202 368 39 284 20 -97 21 162 -112 -102 28 9 163 -12
7564 -12 84 -6 -42 -67 -16 20 -73 -148 -163 249 15 89 13 76 -94 10 -93 122 -210 44 -32 105 -41 -167 7
$$ packed form
7403B30l30R7r5j4m9J33R2J06l94J73J95j72J00j13J1NJ72j81l4J26j15J18j27
7426f6Q1r0K45k79k4J54j15L53k85J14j91J79j53K59j01lJ14k80K83j88P5J14
7448A96j13m5m1K0k29j0K45J11j7l16M41j93m4J33Q0j92p6O4k40J04j23L05j45
7471h5r3J44O9k3j44K97K7k84J38J59l3j19PL4j00j7Q9j8R5j21k28L35L1j25J9
7496E4J21q5k31J76Oj43k4K60j18M35k69n26K77M1O8L3k53K94M7l43P0K02J09
7519B01j59J13l10K7j21K53N9R6j44J23q6p9K3n0m5k9J08nk48J98p9K64P6k44
7543e8k36M44N4k03j56K21K34n02N70l29K45k64j17J18J41k74J0J30j9J54j75
7564a2R6r0l6k5N1L6r3p5j5M12k34P4p6O3j70J04j03K15l32K54p6J37j46j26J74
$$ plain form
7589 7 8 -59 31 283 -24 44 1 -41 148 -204 -7 111 -4 -116 -191 29 174 8 -209 37 35 -81 76 -213
7613 -213 207 202 -205 106 99 -121 -239 179 75 193 3 25 68 152 -161 48 158 -85 -122 210 145 137 -8 -141
7637 -141 -41 11 -83 129 46 170 12 106 52 -74 -76 -45 107 -72 33 25 253 76 -70 -149 197 -78 20 98
7661 98 120 -221 46 68 -140 58 -169 -4 -8 -125 -216 126 28 -25 -190 158 126 -167 -110 -30 173 25 -46 -20
7685 -20 -139 -100 -48 269 54 -89 171 27 -63 94 -90 329 103 -66 3 -7 -135 -106 101 186 -46 -122 -137
7708 -137 44 -23 -73 193 18 -38 21 90 332 282 163 -15 119 62 -71 -206 -17 -109 -70 -82 -252 103 -33
7731 -33 -152 59 117 -23 -192 302 53 76 30 60 -53 70 21 37 183 -96 -24 -155 349 -41 -110 139 112
7754 112 128 36 76 -18 -106 61 -91 167 -26 -319 44 295 -209 97 28 68 49 -113 261 222 -175 -179 315 -52
$$ packed form
7589GJo7R0K52l07O8m3m2J89l52J97J18j15j12p5K20J45j66k17K46kj16J57k89
7613b13M20nm07L11pk20j18M18j04J18j90K2M3Q4l13K09J10k43l7L32o5qj45j33
7637a41J00N2r4K12q3J24j58R4n4j26kL1J52j79J05qK28j77j46p9L46k75R8P8
7661I8K2l41K67K2k08J98k27J65mj17r1L42r8n3j65L48l2k93N7Q0K03j48p1K6
7685b0j19L9N2L17k15j43K60j44r0J57j84M19k26j69O9j0j28K9K07Q5k32p6j5
7708a37J81o7n0K66j75n6N9O9K42n0j19j78J34n7j33j35J89r2L9j2j70L55j36
7731c3j19K11N8j40j69M94k49K3m6L0j13J23m9J6J46k79P2j31N04l90o9K49k7
7754A12J6r2M0r4q8J67j52K58j93k93L63K51n04L06o9M0j9j62L74l9l97mM94l67
$$ plain form
7778 -52 50 -114 80 -102 -41 -190 -126 56 82 -33 263 12 -105 -9 -243 63 -320 -157 132 157 48 29
7800 29 50 30 -16 -91 2 -133 177 -8 67 322 -80 -90 0 -165 -30 -45 196 112 -144 39 242 62 -1 -27
7824 -27 -188 178 -198 156 66 244 -180 147 -380 -80 -56 80 -156 -208 100 83 235 -175 -6 -46 -175 357
7846 357 49 -219 49 80 60 -33 201 118 -57 -139 -147 84 241 -1 57 -263 -149 -108 -128 305 -112 -105 -190 122
7870 122 -50 -208 -50 142 -183 133 121 -21 -5 -324 -107 185 -52 -177 -14 -41 -185 -12 -3 35 -281 -162
7892 -162 75 29 -82 -128 32 328 -190 -155 149 -257 -6 26 184 -47 -150 -200 -217 172 91 3 210 -127 -4
7915 -4 240 5 41 -151 -35 59 12 -24 -3 42 281 140 -21 -75 -48 -161 -215 252 186 -237 -39 10 80 -23 186
7940 186 351 288 -173 -327 49 -118 80 -131 -55 93 -46 -206 38 175 -9 -87 124 -235 -87 -17 114
$$ packed form
7778e2J02j64J94j82O1j49O4J82K6j15K96k51j17R6k34L06l83J63K89K5j09j9
7800B9K1k0m6p5R3j35L10j85P5K55m02j0R0j65J35j5K41q4k56J83K03j80o3k6
7824b7j61L66l76L54r0J78m24L27n27L00K4J36k36n2L08j7J52m10J69m0j29N32
7846C57l08k68K68L1k0r3K34q3j75q2qK31J57k42N8l20J14M1k0M33m17Pq5L12
7870A22j72j58J58J92l25L16j2j42J6l19K17K92k37j25J63k7j44J73RL8l16J19
7892a62K37m6j11m6J60K96n18L5L04m06K51L2J58k31j03n0j7L89q1q8K07l37J23
7915dK44k35L6j92J16R4m7l6K1M5K39j41j61n4K7j13n4M67o6m23J98M9P0j03K09
7940A86J65o3m61j54L76j67J98k11P6J48j39j60K44J37j84p8K11l59J48P0J31
$$ plain form
7961 114 103 29 -219 230 89 -17 -117 -115 187 103 -153 63 8 -139 -38 248 157 139 244 147 -102 -43 -45 373
7985 373 -22 -8 174 -34 122 -69 67 60 57 -2 -16 140 -64 15 -78 0 78 -107 -86 255 66 -37 -56 75
8009 75 -109 -129 -381 -67 177 142 202 71 175 -121 -32 78 116 -102 59 111 98 -55 -77 -60 -319 -130 15
8032 15 336 33 67 306 -148 -86 85 -6 19 78 109 -89 -113 -214 -78 144 51 -54 -100 67 221 208 48 -131
8056 -131 -201 18 -169 -72 -110 145 189 6 156 142 -15 -104 59 -44 -20 -80 250 -93 32 204 231 -59 -16
8079 -16 -320 23 -35 -298 -3 -4 -114 -79 -178 133 169 -188 160 17 -114 -107 -10 108 173 119 42 43 62 -345 -260 170
8105 170 412 39 -206 -1 -166 -339 148 275 40 55 205 13 -15 -182 112 49 25 -259 -42 290 -234
8126 -234 -334 -12 -20 -156 80 -127 29 175 -150 -14 291 44 -15 -122 250 -72 -226 -35 16 -18 -142 30
$$ packed form
7961A14j1p4k48M49j41j06j00KL02q4k56K16n5j47J01K86r1j8J05r7k49N9kM18
7985C73l95J4J82k08J56j91J36pln9j4J56k04P9r3P8P8j85K1L41j89j03j9J31
8009G5j84k0k52L14K44l5O0j31J04k96Q9J10L8k18J61N2j3j53k2J7k59J89J45
8032A5L21l03L4K39m54O2J71r1K5N9L1j98k4j01J36K22r3j05m6J67J54j3j60j79
8056a31p0K19j87R7l8K55M4j83J50j4j57q9J63j03K4o0L30l43J25J72K7k90M3
8079a6l04L43n8k63K95jj10L5r9L11L6l57L48j43j31PR7J18O5n4p7JJ9m07Q5M30
8105A70K42l73k45K05j65j73M87J27k35J5J50j92k8j67K94o3k4k84K17L32n24
8126b34j00L22qj36K36k07J56J46l25J36L05k47n9j07L72l22j54J91N1l4j24J72
$$ plain form
8148 30 -142 -89 7 129 136 53 18 82 -34 -4 258 172 169 296 204 -74 -101 -148 -162 -223 -101 -241 -98 73 121 -28
8174 -28 -56 -275 -12 68 -182 -210 92 -55 100 -61 -153 2 -111 10 229 209 61
$$ packed form
8148C0j72N3R6J22Pq3l5O4j16L0K62q6lJ27r2k78k7m7j4o1J22j40J43J71M8j49
8174b8k8k19K63Q0k50k8L02j47J55j61r2J55j13J21K19k0j48
8191F1
$$ Imaginary data points
##PAGE= N=2
##DATA TABLE= (X++(I..I)), XYDATA
$$ plain form
0 0 0 0 0 0 0 0 0 0 0 0 0 0 0 0 0 -3 8 -8 8 -8 8 -11 16 -16 16 -24 24 -32 32 -40 45 -48 56 -64 72 -80 91 -101
38 -101 114 -125 139 -155 171 -189 210 -231 255 -281 309 -340 375 -413 456 -504 559 -619 689 -773
58 -773 868 -984 1129 -1306 1537 -1848 2293 -2974 4136 -6474 12934 -65094 -190629 64532
72 64532 95584 -101621 -50975 90067 12276 -44370 14498 23404 -1089 -876 -17514 3587
84 3587 38140 -2611 -35166 13905 23888 -23363 -28771 1113 8409 -4013 -18281 -3517 25506
97 25506 8018 -24830 5242 37138 -1322 -31140 7579 29940 -8354 -26222 14785 30391
109 30391 -12624 -24343 18526 24413 -15152 -15498 18815 20175 -7114 -14592 5543 16024 -10758
122 -10758 -30386 412 19541 -15733 -29594 8203 15895 -16298 -18341 10695 18042 -4428 -14674
$$ packed form
0@%%%%%%%%%%%%%%%lJ1j6J6j6J6j9K7l2L2m0M8n6O4p2Q5r3J04j20J36j52J71j92
38a01K15k39K64k94L26l60L99m41M86n36N90o49P15p88Q69r60J063j178J308j462
58g73J641j852K113k435K843l385M141n267P110j0610J9408p8028j25535K55161
72F4532L1052j97205N0646J41042p7791n6646N8868Q906k4493K13j6638K1101
84C587L4553m0751l2555M9071R983m7251n408K9884P296j2422j4268J4764K9023
97B5506j7488l2848L0072L1896l8460k9818L8719K2361l8294j7868M1007J5606
109C0391m3015j1719M2869N887l9565l46L4313J360k7289p478K0135J0481k6782
122a0758j9628L0798J9129l5274j3861L7797P692l2193k043K9036P347k2470j0246
$$ plain form
135 -14674 7858 22185 -3924 -20311 8447 22736 -6566 -17692 9106 19489 -4514 -15971
147 -15971 8036 21647 -6754 -20942 10302 22511 -11500 -21626 7472 13995 -9023 -16096
159 -16096 1001 12269 -5057 -22416 949 24073 -4264 -22568 14366 26798 -12767 -18958
171 -18958 16719 18418 -10070 -11631 9855 14442 -4505 -13543 5638 15954 -8217 -20789 5247
184 5247 16610 -9284 -19955 5238 15116 -9383 -18588 6246 13729 -11060 -18543 5400 14683
197 14683 -5008 -13320 7134 19360 -1645 -17392 7144 23626 -5274 -19295 13957 22029
209 22029 -10835 -11811 16038 11735 -12159 -11685 4451 8851 -5598 -15544 1669 16053 -6471
222 -6471 -20529 7362 16654 -13213 -17184 10287 12547 -8289 -8875 9777 12809 -5617 -13003 6010
$$ packed form
135a4674K2532J4327k6109j6387K8758J4289k9302j1126K6798J0383k4003j1457
147a5971K4007J3611k8401j4188L1244J2209l4011j0126K9098O523k3018p073
159a6096J7097J1268j7326j7359K3365K3124k8337j8304L6934J2432l9565o191
171a8958L5677J699k8488j561K1486M587j8947r038J9181J0316k4171j2572K6036
184E247J1363k5894j0671K5193R878k4499r205K4834P483k4789p483K3943R283
197A4683j9691q312K0454J2226k1005j5747K4536J6482k8900j4021L3252Q072
209B2029l2864r76K7849m303k3894M74J6136M400j4449r946J7213J4384k2524
222f471j4058K7891R292k9867l971K7471K260k0836n86J8652L032j8426p386J9013
$$ plain form
236 6010 14899 -6353 -14406 8126 16148 -5625 -12902 7817 14500 -8289 -17444 5007 13116 -10617
250 -10617 -16113 7674 11238 -10649 -13052 6257 10946 -5493 -12860 5415 17411 -2293 -13032
263 -13032 11600 20410 -6502 -12257 11819 13088 -7708 -9169 6427 10568 -3854 -12529 3056
276 3056 13955 -6811 -18841 4296 12820 -10990 -16224 6338 9880 -10671 -15337 3693 11662
289 11662 -7746 -14884 7498 14938 -7797 -10917 12926 14871 -5944 -7602 10134 13922 -3312
302 -3312 -11189 7119 15208 -8406 -16283 9113 13282 -12049 -11944 9957 7904 -9763 -9350 4796
316 4796 8482 -6155 -13888 4470 13886 -7674 -14677 9526 12618 -11252 -10817 11223 10826 -6588
330 -6588 -6338 9468 11162 -4458 -8552 6798 10281 -7544 -12706 4651 10292 -7780 -13164 5718
$$ packed form
236F010Q889k1252q053K2532Q022k1773p277K0719O683k2789r155K2451Q109k3733
250a0617n496K3787L564k1887k403J9309M689j6439p367J8275J1996j9704j0739
263a3032K4632Q810k6912n755K4076J269k0796j461J5596M141j4422q675J5585
276C056J0899k0766j2030K3137Q524k3810n234K2562L542k0551m666J9030P969
289A1662j9408p138K2382P440k2735l120K3843J945k0815j658J7736L788j7234
302c312p877J8308Q089k3614p877K5396M169k5331J05K1901k053j7667M13J4146
316D796L686j4637p733J8358R416k1560p003K4203L092k3870M35K2040l97j7414
330f588K50J5806J694j5620m094J5350L483j7825n162J7357N641j8072n384J8882
$$ plain form
344 5718 10728 -10061 -13796 7749 10353 -9399 -10192 8105 9831 -4552 -7922 5261 11416 -4043
358 -4043 -12812 6086 14698 -5946 -11485 11910 13594 -8535 -7743 9719 7599 -7632 -9008 3612
372 3612 8369 -4979 -12105 3709 9982 -8870 -14501 5691 9560 -9148 -10551 8060 10770 -5695
386 -5695 -8454 8248 11154 -6603 -10262 8018 11207 -5752 -7800 8108 10429 -6012 -9762 7032
400 7032 11017 -8363 -12158 8380 9693 -10358 -9552 7526 5538 -9221 -9187 3575 6865 -5339
414 -5339 -10418 5792 12301 -5993 -10249 10741 12210 -7757 -6982 10288 9114 -6097 -6363 7505
428 7505 9180 -6485 -9766 6891 9477 -8866 -10129 6416 6685 -8547 -9452 4646 7129 -7239
442 -7239 -11305 5559 8925 -9054 -9553 8905 7594 -8011 -4596 8807 8134 -3344 -5537 6340
$$ packed form
344E718N010k0789l735K1545K604j9752p93J8297J726j4383l370J3183O155j5459
358d043q769J8898Q612k0644n539K3395J684k2129P92J7462k120j5231j376J2620
372C612M757j3348p126J5814O273j8852n631K0192L869j8708j403J8611K710j6465
386e695k759J6702K906j7757l659J8280L189j6959k048J5908K321j6441l750J6794
400G032L985j9380l795K0538J313k0051Q06J7078j988j4759L4J2762L290j2204
414e339n079J6210O509j8294m256K0990J469j9967P75J7270j174j5211k66J3868
428G505J675j5665l281J6657K586j8343j263J6545K69j5232r05J4098K483j4368
442g239m066J6864L366j7979m99J8458j311j5605L415J3403o73j1478k193J1877
$$ plain form
456 6340 11282 -3487 -9800 8220 11781 -8705 -9296 10021 6117 -10663 -6524 6256 3546 -7676
470 -7676 -8307 4371 7590 -7046 -10535 6475 9449 -7867 -8828 8153 8066 -7607 -6766 9115 9051
485 9051 -5686 -6136 8883 8678 -6349 -6753 7090 7404 -5935 -8309 5098 7934 -6660 -10699
499 -10699 5695 8105 -10163 -10599 7183 5943 -8604 -5648 6567 6034 -4411 -6023 4743 8915
513 8915 -5111 -9141 8869 11662 -7361 -6943 11451 7848 -8997 -5363 7954 4658 -7209 -6291
527 -6291 6155 6663 -7425 -9185 5611 6326 -9295 -8929 6474 5691 -8117 -6767 7840 6999 -7280
542 -7280 -6323 7963 7349 -6732 -5278 7724 7802 -3862 -4364 6823 7885 -5294 -7511 6501 7531
557 7531 -7842 -7301 7665 5212 -8633 -6048 5248 2745 -7543 -6154 4721 4667 -6681 -6588 6966
$$ packed form
456F340M942j4769o313J8020L561k0486n91J9317l904j6780M139J2780k710j1222
470g676o31J2678L219j4636l489J7010K974j7316r61J6981q7j5673Q41J5881o4
485I051j4737m50J5019k05j5027m04J3843L14j3339k374J3407K836j4594m039
499a0699J6394K410j8268m36J7782j240j4547K956J2215n33j0445j612J0766M172
513H915j4026m030J8010K793j9023M18J8394l603j6845L634J3317l296j1867R18
527f291J2446N08j4088j760J4796P15j5621L66J5403p83j3808J350J4607q41j4279
542g280R57J4286o14j4081J454J3002P8j1664n02J1187J062j3179k217J4012J030
557G531j5373N41J4966k453j3845K585J1296k503j0288J389J0875n4j1348R3J3554
$$ plain form
572 6966 6355 -7353 -5527 8074 6751 -5688 -4702 7646 7014 -5278 -4970 8422 7469 -6967 -5524
587 -5524 7852 5368 -7498 -5919 5593 4577 -6860 -7751 5011 5865 -8845 -9038 7591 6034
601 6034 -9435 -5612 7520 4414 -5539 -3755 5685 6753 -3047 -6001 6654 8792 -6607 -7168
615 -7168 9718 7596 -8497 -4748 8368 4120 -7357 -4947 4859 3996 -6896 -7521 5276 5582
629 5582 -8040 -7354 6896 5492 -7789 -5386 7387 5117 -6608 -3570 8559 6229 -5800 -3728
643 -3728 8080 5505 -6195 -4850 6693 5735 -5724 -5772 6664 5728 -8670 -7386 7083 3622
657 3622 -9650 -5078 6614 2574 -6799 -4302 4472 4500 -5672 -6150 6630 6874 -7044 -4344 10348
672 10348 6103 -7151 -2084 8180 3862 -5421 -3071 5742 4921 -5557 -5535 6610 4889 -8333
$$ packed form
572F966o11j3708J826J3601j323j2439R86J2348o32j2292L08J3392r53j4436J443
587e524J3376k484j2866J579J1512j016j1437q91J2762Q54j4710j93J6629j557
601F034j5469L823J3132l106r953J784R440J068r800k954J2655K138j5399n61
615g168J6886k122j6093L749J3116m248j1477K410R806q63j0892o25J2797L06
629E582j3622O86J4250j404j3281K403J2773k270j1725L038J2129k330j2029K072
643c728J1808k575j1700J345J1543r58j1459m8J2436r36j4398J284J4469l461
657C622j3272M572J1692m040r373K497Q774K8j0172m78J2780K44j3918K700J4692
672A0348m245j3254N067J0264m318r283K350Q813q21j0478K2J2145j721j3222
$$ plain form
686 -8333 -5887 6206 3095 -7720 -4592 5425 3579 -6510 -5356 6151 5142 -7287 -4728 8363
700 8363 4698 -7013 -2680 7929 4103 -5215 -2920 6368 4871 -5487 -4476 6699 4435 -7426
714 -7426 -4849 6573 2797 -7622 -4559 4932 2768 -7295 -5079 5769 3658 -7059 -4316 6587
728 6587 4015 -6064 -3247 6892 4733 -4925 -3679 7313 6158 -5804 -3778 8366 4370 -6975
742 -6975 -2903 6811 2757 -6545 -3878 5025 3691 -6614 -5764 5273 3948 -8415 -5113 6597
756 6597 2444 -7872 -2889 6291 2713 -5773 -2761 6697 4619 -5299 -3379 7967 5010 -6432
770 -6432 -2341 8099 3606 -6175 -2387 6109 2969 -6706 -3845 5579 2755 -7231 -3736 5959 1998
785 1998 -6949 -3762 5332 2796 -6055 -3997 5947 4408 -6246 -2996 7770 3874 -6434 -1580
$$ packed form
686h333K446J2093l111j0815L128J0017j846j0089J154J1507j009j2429K559J3091
700H363l665j1711M333J0609l826r318K295R288j497j0358J011J1175k264j1861
714g426K577J1422l776j0419L063R491k164j0063K216J0848k111j0717K743J0903
728F587k572j0079K817J0139k159r658J246J0992j155j1962K026J2144l996j1345
742f975M072R714m054r302K667Q903j334j0305Q50J1037j325j2363L302J1710
756F597m153j0316M983R180l578q486L012R458k078r918J920J1346k957j1442
770f432M091J0440m493r781L788Q496l140r675K861R424k824r986L495R695l961
785A998q947L187R094k536q851K058R944j539j0654L250J0766l896j0308M854
$$ plain form
799 -1580 7557 3149 -5183 -2178 6311 4151 -5809 -4171 6698 3401 -8195 -4095 6720 912
813 912 -7987 -2266 4938 889 -5897 -3197 4366 3361 -5493 -3821 6590 4060 -6323 -1788 7724
828 7724 2940 -4912 -1220 6427 3630 -4387 -2591 6551 4243 -6071 -2797 6930 2276 -7599 -2912
843 -2912 5098 701 -6612 -3261 4584 1858 -6829 -3613 6236 2467 -7013 -2307 7526 2386 -6092
858 -6092 -658 6750 2871 -4643 -1604 6106 3004 -5352 -2449 6791 2913 -6200 -2533 5735 1749
873 1749 -6697 -3014 5131 1545 -7048 -2938 5747 1555 -6806 -2200 5504 2107 -5210 -1825 6233
888 6233 3498 -5288 -1901 7546 3607 -5597 -1291 7199 1611 -5748 -840 5385 1080 -5673 -2718
903 -2718 4403 1964 -6324 -3587 5313 1584 -7609 -2687 5186 909 -6102 -1897 5025 1805 -5198
$$ packed form
799a580R137m408q332L005Q489k160r960J638J0869l297j1596M100J0815n808
813I12q899N721P204m049o786K700P563j005q854J672J0411k530j0383M535R512
828G724m784p852L692P647k797q017J796R142k308j0314L274R727m654r875M687
843b912Q010m397p313L351P845k726q687L216R849l769r480M706R833n140q478
858f092N434P408l879p514L039P710l102q356K903R240l878r113L667Q268l986
873A749q446L683Q145l586q593M110Q685m192q361M606P704l397p317L385Q058
888F233k735q786L387R447l939r204M306Q490n588p359M908O225m305o753K955
903b718P121k439q288K737Q900l729r193M922P873m277p011M205O922l220p003
$$ plain form
918 -5198 -2018 6015 2447 -5455 -1235 7228 2489 -5066 -570 6433 2136 -4944 -1274 5662 2192
933 2192 -6333 -2466 5889 1229 -6878 -1869 5404 475 -6357 -1904 4844 1339 -5524 -1948 5837
948 5837 1971 -6142 -1342 6659 1646 -5920 -1020 6091 1967 -5092 -1072 6382 2125 -5772 -1491
963 -1491 6257 1153 -6394 -1516 5112 195 -6091 -2093 4417 561 -6307 -2229 5596 1171 -5933
978 -5933 -515 6372 908 -4618 192 5584 1872 -3784 -793 5639 2303 -5285 -1027 6917 1086
993 1086 -6209 -140 5751 -289 -5434 -911 3912 207 -5996 -2429 4498 623 -6904 -2061 5420
1008 5420 398 -6105 -603 5560 958 -4819 -101 6164 2102 -4559 -571 5929 1582 -4934 -99
1023 -99 5567 720 -5176 -1080 4596 1046 -5759 -1641 5095 552 -6401 -889 5075 -250 -5181
$$ packed form
918e198L180Q033l568p902M220Q463m739p555M496P003m297p080L670O936l470
933B192q525L867Q355m660q107N009P273m929o832M453O748l505o863L576P785
948E837l866q113M800Q001n013p566M900P111m124p059M020P454m257p897M281
963a491P748n104p547M878O628m917o286L998O510l856o868M078P825m425p104
978e933N418O887n464n526M810N392l712n656K991O432l336p588M258P944n831
993A086p295O069N891o040n145M523M823l705o203L567O927l875p527M843P481
1008E420n022o503N502O163m602n777M718O265m062o661L988O500m347o516M835
1023i9N666m847n896M096N676l550o805M118O736m543o953N512N964n325m931
$$ plain form
1038 -5181 -763 3945 176 -4689 -1312 5287 1822 -5584 -589 7265 1607 -5634 546 6613 263
1053 263 -4975 646 4760 -73 -5415 -1216 4492 -14 -6580 -1310 4930 -998 -6247 -387 4646
1068 4646 -616 -5141 -565 4438 522 -4598 -196 5718 1191 -4801 -147 5748 1429 -4066 373
1083 373 6288 1596 -4980 188 6046 183 -5860 70 5256 -804 -5718 -295 4032 -1087 -5818
1098 -5818 -1027 4550 -280 -5603 126 5452 -633 -5110 852 4750 -539 -4175 456 4263 649
1113 649 -3945 156 5367 589 -4983 141 5203 -19 -4645 47 4201 -225 -4957 -713 4409
1128 4409 -346 -6067 -492 5299 -328 -5278 228 4882 -123 -4304 583 5222 634 -3978 723
1143 723 5858 350 -4950 1189 5422 -517 -4456 486 4306 -231 -4287 -453 4045 -546 -5671
$$ packed form
1038e181M418M708l769m865L377O599l465p406M995P854n658p241O180O067o350
1053B63n238N621M114m833n342M199N708m506o566N270O240n928n249N860N033
1068D646n262m525M576N003l916n120M402N914m527n992M654N895m319n495M439
1083C73N915m692o576N168N858n863o043N930N186o060m914N423M327n119m731
1098e818M791N577m830n323N729N326o085m477N962L898n289l636M631L807l614
1113F49m594M101N211m778n572N124N062n222m626M692M154m426m732M244N122
1128D409m755n721N575N791n627m950N506M654n005m181M887M639m588m612M701
1143G23N135n508n300O139M233n939l939M942L820m537m056L834M498m591n125
$$ plain form
1158 -5671 -663 4216 -855 -5344 -115 4021 -812 -4791 -57 4418 7 -4612 381 5715 407
1173 407 -4588 1576 5668 118 -3986 1411 5020 -1 -4117 332 4717 -262 -5362 140 4498
1188 4498 -1677 -5468 382 4170 -1317 -4697 459 3827 -715 -4712 71 4650 -576 -4740 979
1203 979 5020 -675 -4088 1344 4729 -198 -3539 554 4630 50 -4691 360 4533 -1314 -5182
1218 -5182 563 3557 -1778 -4689 -77 3378 -520 -4048 18 4396 -272 -4494 1067 4940 -429
1233 -429 -3849 1543 4846 -471 -3428 1102 4711 -235 -4027 1041 4802 -625 -4606 1113 4135
1248 4135 -1646 -4733 631 3293 -1608 -4802 55 3413 -1098 -4557 498 4118 -1231 -4090 1047
1263 1047 4291 -81 -3679 1214 4687 -329 -4033 1208 4671 -1109 -3880 1103 4065 -992 -3728
$$ packed form
1158e671N008M879n071m489N229M136m833l979M734M475m411m619M993N334n308
1173D07m995O164M092n550m104N397L609n021m116M449M385m979n100N502M358
1188D498o175l791N850L788n487l380N156L368m542l997M783M579n226m164N719
1203I79M041n695l413N432L385m927l341M093M076m580m741N051M173n847l868
1218e182N745K994n335k911M612L455l898l528M066M378m668m222N561L873n369
1233d29l420N392L303n317k957M530L609m946l792N068L761n427l981N719L022
1248D135n781l087N364K662m901l194M857L358m511l459N055L620n349k859N137
1263A047L244m372l598M893L473n016l704N241L463n780k771M983K962n057k736
$$ plain form
1278 -3728 616 3847 -1149 -4334 446 4201 -944 -4649 843 3492 -1748 -4049 1109 3663 -1086
1293 -1086 -3468 1181 4129 -55 -3475 1276 4927 -459 -3649 1728 4411 -1056 -3774 1236 3504
1308 3504 -1526 -4280 736 3562 -1606 -4724 894 3394 -1711 -4380 851 3542 -1563 -3962 801
1323 801 4080 -1563 -3794 1531 4140 -1237 -3132 2564 4095 -376 -2818 1708 4457 -409 -3690
1338 -3690 1218 3997 -1466 -4196 1633 3515 -2374 -4035 766 2755 -1716 -3547 589 3236 -1578
1353 -1578 -4142 973 3745 -1490 -3573 1784 3684 -1190 -3039 1675 3924 -489 -3495 1581 4380
1368 4380 -1208 -3530 1878 3370 -1867 -3349 1330 2567 -1768 -3837 229 3561 -1748 -4244 990
1383 990 3874 -2418 -3404 2077 3389 -1669 -2659 2229 3120 -666 -2450 1457 4148 -1021 -3171 1684
$$ packed form
1278c728M344L231m996l185M780L755n145l705N492K649n240k301N158K554m749
1293a086k382M649K948m184l420M751L651n386l190N377K683n467k718N010K268
1308C504n030k754N016K826n168l118N618K500n105k669N231K691n105k399M763
1323H01L279n643k231N325K609n377j895N696J531m471k442M526K749m866l281
1338c690M908K779n463k730N829J882n889j661M801J989m471j831M136K647m814
1353a578k564N115K772n235k083N357J900m874j849M714K249m413l006N076K799
1368D380n588k322N408J492n237j482M679J237m335k069M066L332n309k496N234
1383I90K884o292r86N481J312n058r90M888Q91l786j784L907K691n169k150M855
$$ plain form
1399 1684 3752 -1657 -3251 2045 2921 -1884 -3481 1322 2916 -2288 -3762 1220 2592 -2428 -3789
1414 -3789 1405 2703 -1634 -3303 1538 3480 -1105 -3020 2101 3986 -1064 -2759 2507 3373 -1832
1429 -1832 -2692 1541 2645 -1315 -3086 1018 2825 -1713 -3618 1178 3047 -2462 -3721 1666 2537
1444 2537 -2125 -3001 1251 2385 -1423 -2750 1635 3458 -1065 -2931 2361 3796 -1583 -2565 2361
1459 2361 3477 -1625 -2421 1919 2758 -1551 -3062 1256 2796 -2246 -3589 1199 2335 -2148 -3511
1474 -3511 1224 2878 -1992 -3272 1964 3131 -1837 -3192 2074 3293 -1747 -2520 2122 3074 -1060
1489 -1060 -2433 1936 3305 -1267 -2839 1946 3278 -1609 -3017 1770 2850 -2269 -2908 1324 2107
1504 2107 -2200 -3311 1424 2317 -2109 -2870 2022 2752 -2120 -2390 2173 2931 -1508 -2574 2164 3123
$$ packed form
1399A684K068n409j594N296Q76m805j597M803J594n204j474M982J372n020j361
1414c789N194J298m337j669M841J942m585j915N121J885n050j695N266Q66n205
1429a832q60M233J104l960j771M104J807m538j905M796J869n509j259N387Q71
1444B537m662q76M252J134l808j327M385J823m523j866N292J435n379r82M926
1459B361J116n102p96M340Q39m309j511M318J540n042j343M788J136m483j363
1474c511M735J654m870j280N236J167m968j355N266J219n040p73M642R52m134
1489a060j373M369J369m572j572M785J332m887j408M787J080n119o39M232P83
1504B107m307j111M735Q93m426p61M892P30m872k70M563P58m439j066M738R59
$$ plain form
1520 3123 -1855 -2731 2441 2951 -1912 -2139 2176 2317 -1706 -2443 1676 2680 -1901 -3357 1488 2584
1536 2584 -2647 -3545 1794 2217 -2714 -2691 1824 2211 -1768 -1919 1945 2990 -1399 -2135 2481 3143 -1433
1553 -1433 -2328 2655 2717 -1794 -2310 1936 2170 -2053 -2511 1404 2074 -2088 -2985 1711 2271 -2302 -2773
1570 -2773 1655 2162 -2052 -2765 2080 2755 -1855 -2252 2584 2535 -1884 -1262 2607 2790 -1250 -1795 1947
1587 1947 2503 -1753 -2621 1889 2337 -2520 -2888 2005 1773 -2618 -2377 1714 1208 -2048 -2034 1432 2448
1604 2448 -1600 -2747 2002 2932 -1936 -2382 2520 2594 -1702 -1519 2682 2643 -1713 -1815 2063 2772 -1795
1621 -1795 -2274 2184 2163 -2385 -2692 1827 1791 -2710 -2602 1699 1684 -2453 -2542 1838 2061 -2205 -1798 2326
1639 2326 2213 -1908 -1715 2243 2446 -1603 -2047 2274 2472 -2029 -1885 2762 1982 -1976 -1721 2062 1736
$$ packed form
1520C123m978q76N172N10m863k27M315J41m023p37M119J004m581j456M845J096
1536B584n231q98N339M23m931K3M515L87l979j51L864J045m389p36M616O62m576
1553a433q95M983O2m511n16M246K34m223m58L915O70m162q97M696N60m573m71
1570b773M428N07m214p13M845O75m610l97M836m9m419O22L869J83m040n45L742
1587A947N56m256q68M510M48m857l68M893k32m391K41M091n06l256J4L466J016
1604B448m048j147M749R30m868m46M902P4m296J83M201l9m356j02L878P09m567
1621a795m79M458k1m548l07M519l6m501J08M301j5m137q9M380K23m266M07M124
1639B326j13m121J93L958K03m049m44M321J98m501J44M647p80l958K55L783l26
$$ plain form
1656 1736 -2081 -1947 1687 1522 -2412 -2443 1829 1914 -2605 -1973 2487 1760 -2273 -1832 2382 2071 -1572
1673 -1572 -1554 2327 2375 -1827 -1870 2380 1869 -2185 -1632 2262 1837 -2063 -1757 1675 1445 -2165 -2214 1578
1691 1578 1370 -2281 -1848 1891 1681 -2148 -1842 1997 1834 -2123 -1737 2038 2031 -1603 -1338 2618 2122 -1615
1709 -1615 -1230 2173 1954 -1607 -1764 2177 2111 -2045 -2037 1963 1360 -2651 -1797 1925 1207 -2427 -2111 1734
1727 1734 1717 -2412 -1930 2463 1785 -2465 -1587 2595 1884 -1848 -887 2304 1750 -1332 -1407 1940 1956 -1878
1745 -1878 -1755 2254 1634 -2406 -1622 2042 1053 -2362 -1730 1483 1219 -2271 -2052 1697 1237 -2478 -1501
1762 -1501 2254 1633 -2337 -968 2557 1561 -1663 -977 2622 1862 -2074 -1075 2605 1676 -2108 -1244 2069
1779 2069 1138 -2537 -1439 1619 1063 -2073 -1856 1540 1119 -2499 -1381 1835 1217 -2333 -1249 2239
$$ packed form
1656A736l817J34L634j65l934l1M272Q5m519O32M460p27m033M41M214l11l643
1673a572J8L881M8m202m3M250n11m054N53L894m25l900L06L432k30l610m9L792
1691A578k08l651M33L739k10l829L06L839j63l957L86L775pl634K65L956m96l737
1709a615L85L403k19l561j57L941o6m156QM000o03m011Q54L722p18l634L16L845
1727A734j7m129M82M393o78m250Q78M182p11l732R61L191n54l082p5L347J6l834
1745a878J23M009o20m040P84L664r89l415O32L213k64l490K19L749m60l715R77
1762a501L755o21l970J369L525r96l224O86L599p60l936R99L680r29l784Q64L313
1779B069r31l675J098L058n56l136K17L396m21l618J118L216o18l550J084L488
$$ plain form
1795 2239 989 -2111 -1085 2671 1911 -1654 -815 2523 1646 -1982 -1012 2411 1459 -2105 -826 1774
1811 1774 951 -2107 -1776 1950 949 -2356 -1443 1962 1034 -2163 -973 1814 956 -2047 -1299 2136
1827 2136 1681 -1720 -1015 2428 1595 -2147 -605 2530 1291 -1662 -1085 2177 1344 -1767 -1222 1728
1843 1728 948 -2442 -1522 1785 932 -2556 -1546 1780 717 -2069 -1019 1913 855 -1778 -1082 2355
1859 2355 1545 -1667 -1007 2294 1439 -1776 -885 2451 1343 -1922 -809 2549 1112 -2296 -1029 2190
1875 2190 527 -2459 -1168 1822 591 -2457 -1436 1667 865 -2284 -1241 2204 777 -2290 -755
1890 -755 2141 985 -1492 -746 1914 1341 -1514 -1029 2233 1038 -1904 -763 2242 954 -2232 -820
1906 -820 2018 775 -2074 -941 1468 657 -2413 -1225 1467 558 -2335 -729 1985 538 -1879 -549
$$ packed form
1795B239j250l100J026L756p60l565Q39L338q77l628R70L423r52l564J279K600
1811A774q23l058L31L726j001l305R13L405r28l197J190K787q58l003P48L435
1827B136m55l401P05L443q33l742J542L135j239k953N77L262q33l111N45K950
1843A728p80l390R20L307q53l488J010L326j063k786J050K932j058k633O96L437
1859B355q10l212O60L301q55l215Q91L336j108l265J113L358j437l408J267L219
1875B190j663k986J291K990j231l048J021L103q02l149J043L445j427l067J535
1890g55K896j156k477P46K660n73k855M85L262j195k942J141L005j288l186J412
1906h20K838j243k849J133K409q11l070J188K692r09k893J606K714j447k417J330
$$ plain form
1922 -549 2200 1101 -1621 -586 2341 1060 -1634 -322 2349 675 -1874 -508 2070 647 -2150
1937 -2150 -938 1729 810 -2563 -1127 1797 574 -2239 -1016 2126 679 -2104 -843 1916 811
1952 811 -1751 -643 2312 871 -1637 -192 2225 773 -1436 31 2211 898 -1533 -523 1978
1967 1978 731 -2252 -775 1940 350 -2180 -748 1486 55 -2255 -772 1876 568 -2122 -786
1982 -786 2066 753 -1962 -365 2597 596 -1776 -139 2079 691 -1714 -308 2016 753 -1829
1997 -1829 -679 1916 450 -2495 -800 2096 108 -2143 -284 1461 484 -2198 -564 1947 484
2012 484 -1941 -328 1939 445 -1626 -310 2483 554 -1725 -661 2198 678 -1749 -187 2412
2027 2412 245 -1906 -96 1633 75 -1976 -458 1720 352 -1967 -813 1631 342 -2432 -621
$$ packed form
1922e49K749j099k722J035K927j281k694J312K671j674k549J366K578j423k797
1937b150J212K667r19l373J436K924j223k813J223L142j447k783J261K759j105
1952H11k562J108K955j441k508J445K417j452k209J467K180j313k431J010K501
1967A978j247k983J477K715j590k530J432K234j431k310J483K648j308k690J336
1982g86K852j313k715J597K962k001k372J637K218j388k405J406K324j263k582
1997a829J150K595j466k945J695K896j988k251J859J745r77k682J634K511j463
2012D84k425J613K267j494k071J316K793j929k279J064K859j520k427J562K599
2027B412k167k151J810J729j558k051J518K178j368k319J154K444j289k774J811
$$ plain form
2042 -621 1880 178 -1827 -393 1892 645 -1579 80 2305 822 -1579 -120 2126 991 -2050
2057 -2050 -146 2094 479 -2088 -366 1686 278 -2044 -554 1716 274 -2119 -373 1977 80
2072 80 -1774 -498 1953 391 -1952 -232 1817 367 -1874 91 2259 636 -1655 294 2014
2087 2014 211 -1582 -51 1981 399 -1573 -552 1968 -88 -2049 -613 1643 -79 -2218 -382
2102 -382 1525 -51 -1909 -175 1681 359 -1804 -241 1792 466 -1680 242 1924 602 -1552
2117 -1552 186 1895 280 -1871 21 2070 279 -1984 -86 1734 -140 -1842 -709 1095 -205
2132 -205 -2075 -627 1432 167 -2278 -153 1854 43 -1719 203 1858 154 -1381 88 1650
2147 1650 507 -1670 -393 1866 195 -1920 -245 2044 -152 -1923 -94 1544 -100 -1641 -209
$$ packed form
2042f21K501j702k005J434K285j247k224J659K225j483k401J459K246j135l041
2057b050J904K240j615k567J722K052j408k322J490K270j442k393J746K350j897
2072H0j854J276K451j562k343J720K049j450k241J965K168j623k291J949J720
2087B014j803j793J531K032j582j972J021K520k056j961J436K256j722k139J836
2102c82J907j576j858J734J856j322k163J563K033j326k146J922J682j322k154
2117a552J738J709j615k151J892K049j791k263J898J820j874j702J133J804j300
2132b05j870J448K059j265k445K125K007j811j762J922J655j704j535J469J562
2147A650j143k177J277K259j671k115J675K289k196j771J829J638j644j541J432
$$ plain form
2162 -209 1304 -315 -1829 -373 1566 346 -1885 -46 1816 102 -1932 273 1665 303 -1463
2177 -1463 415 2079 180 -1385 120 1651 69 -1624 303 1583 -9 -1659 -340 1662 -239
2192 -239 -2087 -67 1500 -359 -1932 -136 1586 -459 -1493 119 1802 149 -1628 203 1951
2207 1951 354 -1720 438 1948 -240 -1675 143 1526 51 -1352 12 1551 -133 -1801 -213
2222 -213 1377 -353 -2106 -20 1605 -431 -1796 421 1593 -314 -1579 130 1871 -211 -1672
2237 -1672 333 1503 275 -1524 342 1520 -73 -1417 164 1753 -188 -1685 -4 1507 -237
2252 -237 -1528 -54 1232 -332 -1657 -57 1509 -145 -1837 -22 1688 -347 -1820 285 1606
2267 1606 -56 -1252 549 1760 230 -1443 421 1475 -200 -1279 386 1845 -143 -1481 482
$$ packed form
2162b09J513j619j514J456J939j220k231J839J862j714k034K205J392j362j766
2177a463J878J664j899j565J505J531j582j693J927J280j592j650J319K002j901
2192b39j848K020J567j859j573J796J722k045j034J612J683j653j777J831J748
2207A951j597k074K158J510k188j435J818J383j475j403J364J539j684j668J588
2222b13J590j730j753K086J625k036j365K217J172j907j265J709J741k082j461
2237a672K005J170j228j799J866J178j593j344J581J589j941j497J681J511j744
2252b37j291J474J286j564j325J600J566j654j692J815J710k035j473K105J321
2267A606j662j196J801J211j530j673J864J054j675j079J665J459j988j338J963
$$ plain form
2282 482 1128 -467 -1651 230 1289 -554 -1471 75 1473 -218 -1615 327 1706 -320 -1601 532
2298 532 1682 -147 -1307 396 1685 -31 -1510 546 1651 -201 -1532 395 1609 -195 -1466
2313 -1466 93 1071 -556 -1548 -26 1215 -312 -1629 226 1303 -309 -1257 -37 1347 -350 -1568
2329 -1568 286 1382 -90 -1455 512 1732 -310 -1202 740 1540 -394 -1326 429 1312 -355 -1705
2345 -1705 211 1196 -622 -1752 291 1053 -753 -1308 293 1243 -458 -1221 513 1313 -128 -1481
2361 -1481 562 1608 -204 -1368 537 1724 -497 -1184 414 1374 -267 -1293 342 1202 -575 -1358
2377 -1358 81 1004 -582 -1803 311 1133 -649 -1347 220 905 -577 -1255 451 1517 -414 -978
2393 -978 673 1438 -271 -779 592 1345 -302 -1268 600 1313 -568 -1376 427 1168 -717 -1544 425
$$ packed form
2282D82O46j595j184J881J059j843r17J546J398j691j397J942J379k026j281K133
2298E32J150j829j160J703J289j716j479K056J105j852j331J927J214j804j271
2313a466J559R78j627r92J522J241j527j317J855J077j612r48J220J384j697j218
2329a568J854J096j472j365J967J220k042q92J942Q00j934r32J755Q83j667j350
2345a705J916R85j818j130K043P62j806n55J601R50j701p63J734Q00j441j353
2361a481K043J046j812j164J905J187k221o87J598R60j641j026J635Q60j777p83
2377a358J439R23j586j221K114Q22j782o98J567O85j482o78J706J066j931n64
2393i78J651P65j709n08J371P53j647r66J868P13j881q08J803P41j885q27J969
$$ plain form
2410 425 1207 -598 -1403 386 1002 -764 -1294 305 1243 -578 -1217 676 1252 -659 -916 825 1350
2427 1350 -223 -1309 587 1217 -225 -1120 785 1348 -786 -1194 262 1125 -690 -1546 575 1226 -602
2444 -602 -1386 571 1194 -765 -1328 617 1142 -730 -1402 698 964 -451 -1078 759 1218 -566 -1345
2461 -1345 901 1244 -427 -860 668 1098 -515 -1043 220 846 -763 -1127 483 1095 -689 -1475 512
2478 512 1150 -604 -1143 417 1312 -409 -938 753 1354 -605 -892 765 1339 -530 -937 794 1336
2495 1336 -374 -942 692 1142 -595 -1012 872 1067 -570 -1343 451 896 -910 -1219 326 902 -505
2512 -505 -996 770 1114 -715 -944 1032 1152 -583 -775 808 1496 -281 -881 669 1042 -248 -928
2529 -928 724 1070 -1131 -1182 583 793 -721 -1208 229 634 -902 -1230 339 849 -922 -972 675 1011
$$ packed form
2410D25P82j805q05J789O16j766n30J599R38j821o39J893N76j911k57J741N25
2427A350j573j086J896O30j442q95J905N63k134m08J456Q63j815q56K121O51j828
2444f02p84J957O23j959n63J945N25j872o72K100K66j415o27J837M59j784p79
2461a345K246L43j671m33J528M30j613n28J263O26j609l64J610O12j784p86J987
2478E12O38j754n39J560Q95j721n29J691O01j959k87J657N74j869m07J731N42
2495A336j710n68J634M50j737m17J884J95j637p73J794M45j806l09J545N76j407
2512e05m91J766L44j829k29J976J20j735j92J583O88j777o00J550L73j290o80
2529i28J652L46k201n1J765K10j514m87J437M05j536l28J569N10j771n0J647L36
$$ plain form
2547 1011 -558 -689 768 1130 -653 -662 965 997 -384 -816 548 1066 -740 -987 809 896 -632 -961
2565 -961 490 824 -750 -1285 346 919 -949 -1119 771 601 -622 -929 699 1142 -612 -897 927
2582 927 1263 -571 -893 726 1174 -747 -606 1188 857 -806 -790 657 898 -959 -1097 524 546 -849
2600 -849 -940 726 966 -827 -1172 893 971 -595 -772 840 840 -618 -654 648 1024 -677 -724 854 955
2619 955 -591 -1072 867 809 -838 -988 585 820 -779 -1047 804 587 -952 -960 324 844 -958 -1009
2637 -1009 822 722 -741 -740 1001 949 -574 -816 867 1034 -857 -682 754 1018 -282 -708 668 861
2655 861 -591 -804 599 1031 -852 -895 730 513 -679 -957 736 436 -979 -961 773 536 -686 -800
2673 -800 1143 882 -632 -626 822 912 -524 -656 715 969 -593 -870 943 745 -792 -716 498 577 -702
$$ packed form
2547A011j569j31J457L62j783rJ627L2j381m32J364N18j806k47J796Q7j528l29
2565i61J451L34j574n35J631N73j868j70J890j70j223l07J628M43j754k85J824
2582I27L36j834l22J619M48j921J41J794l31j663J6J447K41j857j38J621K2j395
2600h49r1J666K40j793l45K065P8j566j77J612%j458l6J302L76j701m7J578J01
2619I55j546m81J939n8j647j50J573K35j599k68J851k17j539qJ284N20j802n1
2637a009J831j00j463JJ741n2j523k42J683J67j891J75J436K64j300m26J376J93
2655H61j452k13J403M32j883m3J625k17j192k78J693l00j415J8J734k37j222j14
2673h00J943k61j514OJ448R0j436j32J371K54j562k77J813j98j537P6J214P9j279
$$ plain form
2692 -702 -635 460 738 -947 -764 621 411 -882 -835 572 674 -717 -626 1047 1010 -758 -492 988
2710 988 828 -634 -582 846 884 -580 -647 993 553 -1021 -708 729 697 -971 -848 782 598 -942
2728 -942 -791 491 742 -946 -715 848 732 -778 -962 944 644 -624 -442 883 697 -981 -429
2745 -429 928 767 -799 -523 947 801 -797 -660 686 559 -1009 -972 739 292 -1024 -740 599
2762 599 678 -1139 -421 809 898 -937 -613 742 379 -468 -350 1013 904 -625 -521 799 650 -721
2780 -721 -531 688 446 -720 -527 886 349 -925 -624 769 340 -957 -840 630 490 -873 -511
2797 -511 1046 497 -460 -304 944 735 -750 -130 913 476 -727 -513 1042 564 -703 -302 807
2814 807 388 -924 -541 636 443 -790 -620 717 274 -893 -486 857 490 -732 -518 876 420
$$ packed form
2692g02O7J095K78j685J83J385k10j293M7J407J02j391R1J673l7j768K66J480
2710I88j60j462N2J428L8j464o7J640m40j574L13J437l2j668J23J630j84j540
2728i42J51J282K51j688K31J563j16j510j84J906l00j268J82J325j86j678N52
2745d29J357j61j566K76J470j46j598J37J346j27j568L7J711m47j316K84J339
2762E99P9j817P18J230Q9j835L24J355l63q47J18J363j09j529J04J320j49j371
2780g21J90J219k42j166J93J413n37j274L01J393m29j297J17J470j40j363L62
2797e11J557n49r57J56J248k09j485O20J043m37j203K14J555m78j267M01J109
2814H07m19j312L83J177j93j233J70J337m43j167M07J343l67j222K14J394m56
$$ plain form
2831 420 -850 -446 847 582 -732 -207 852 475 -605 -120 834 461 -850 -580 935 506 -898
2848 -898 -536 865 111 -1203 -489 784 587 -846 -604 764 510 -741 -511 1164 362 -701 -546
2865 -546 871 341 -770 -370 803 636 -575 -216 971 454 -802 -564 574 384 -1024 -450 604
2882 604 90 -661 -458 811 229 -867 -668 471 460 -872 -276 799 274 -734 -254 998 584 -616
2900 -616 -95 969 427 -784 -254 785 469 -932 -373 715 126 -543 -396 561 -172 -530 -538 558 266
2919 266 -875 -511 639 279 -807 -159 804 349 -543 -183 843 596 -833 -189 842 223 -740 -305
2937 -305 863 319 -696 -136 630 276 -1123 -505 825 157 -1098 -442 859 63 -1012 -226 934
2954 934 378 -738 -257 824 335 -766 -223 1083 330 -776 104 1170 282 -957 -92 677 297 -992
$$ packed form
2831D20j270M04J293k65j314N25J059l77j080M85R54l73j311K70J515m29j404
2848h98L62J401p54j314P14J273j97j433K42J368k54j251K30J675q02j063J55
2865e46J417n30j111M00J173j67j211L59J187n17j256K38J138j90j408N74J054
2882F04n14p51K03J269n82j096J99J139j1j332N96J075n25j008M80J252m14j200
2900f16N21J064n42j211N30J039l16j401N59J088n89o69J47R57p33l58qJ096k92
2919B66j141L64J150l60j086O48R63m55q92L60J026k47j429O44J031o19r63M35
2937c05J168n44j015N60P66l54j399O18J330o68j255O56J301p96j075P86J160
2954I34n56j116M81J081m89j101N43J306p53j106Q80J066q88j239Q65P69l80j289
$$ plain form
2972 -992 -292 845 91 -1205 -372 826 91 -722 -402 864 35 -800 40 625 142 -979 -208 839
2990 839 359 -761 -258 788 201 -730 -36 756 347 -637 -284 913 237 -1015 -283 815 50 -863
3008 -863 -325 558 -35 -927 -227 616 33 -717 23 754 -11 -684 3 924 166 -470 96 953 173 -590
3028 -590 -124 732 415 -627 -40 937 -126 -967 -102 563 27 -532 -175 648 30 -846 -224 534 66
3047 66 -951 107 798 247 -883 109 997 187 -589 -145 808 129 -652 -65 1002 235 -671 34 643
3066 643 -110 -614 -163 512 68 -883 -380 926 112 -917 -82 744 -154 -750 -184 646 194 -600 86
3085 86 734 433 -535 309 799 312 -478 133 848 112 -750 -245 849 165 -572 -46 549 32 -1002 -285
3105 -285 727 96 -797 -120 441 204 -588 -13 1110 107 -614 -51 738 156 -496 81 672 244 -582
$$ packed form
2972i92P00J137p54j296Q33J198p35q13L20J266q29q35Q40N85m83j121P71J047
2990H39m80j120N03J046n87r31O94P92m09r84L53J197o76j252P32J098p65r13
3008h63N38Q83n93q92P00Q43n83p50P40P31p65o73O87R21p58o36N66Q57p80p63
3028e90M66Q56l17j042N87R77j063q41Q65O65n36n59L57Q23o18q76O22P58m68
3047F6j017J058O91n51j130R92Q88q10p76M44R53o79p81N87J067p67r06P05O09
3066F43p53n04M51O75m44r51N03J306q14j029Q35Q26q98n96N66Q30m52p94O86
3085H6O48l01r68Q44M90m87p90O11P15p36q62N05J094o84p37N26N95n17j034P17
3105b85J012o31q93O77N61k37p92N75J123j003p21N63P89n82o52N77N91m28q26
$$ plain form
3124 -582 -85 711 -34 -768 -3 916 -48 -758 -322 1003 -115 -688 -46 607 -10 -757 -439 784 -84
3143 -84 -455 63 895 131 -819 278 888 70 -839 -101 577 156 -586 0 618 -76 -873 -64 574 43
3163 43 -822 -246 643 -88 -950 -136 491 -66 -711 200 797 -278 -739 -29 500 15 -414 322 534 22
3183 22 -559 288 984 -231 -469 88 670 -189 -581 190 358 -309 -825 -106 374 131 -456 170 558 -110
3203 -110 -601 215 646 -43 -466 239 648 20 -440 -19 673 29 -438 137 718 -149 -753 39 517 27
3223 27 -551 -74 566 -198 -761 -154 409 66 -612 126 718 -220 -513 169 897 46 -338 107 920 -108
3243 -108 -594 58 692 -100 -579 256 590 -92 -395 -28 872 -194 -718 178 455 -242 -437 119 641 -81
3263 -81 -716 -35 585 -169 -342 177 794 -4 -407 176 789 -83 -699 225 805 -124 -668 194 635 -50
$$ packed form
3124e82M97P96p45p34P65R19r64p10M36J325j118n73O42O53o17p47L18J223q68
3143h4l71N18Q32p64r50J097O10q18r09P38O78m21p42N86O18o94p97Q09O38n31
3163D3q65N76Q89p31q62Q14O27n57o45R11N97j075m61P10N29m85m29P36K12n12
3183B2n81Q47O96j215k38N57N82q59l92P71J68o67n16P19M80k43n87O26L88o68
3203a10m91Q16M31o89m23P05M09o28m60M21O92o44m67N75N81q67o04P92M78m90
3223B7n78M77O40p64n63O07N63l43o78P38N92r38k93O82P28q51l84M45Q13j028
3243a08m86O52O34p92m79Q35L34o82l03L67R00j066n24Q96K77o97j95N56N22p22
3263h1o35O81O20p54j73N19O17p98m03N83O13q72o16R24N80r29n44Q62M41o85
$$ plain form
3283 -50 -706 217 556 -93 -538 261 576 60 -563 0 530 -290 -790 74 598 -157 -698 206 776 -192
3303 -192 -453 245 632 -487 -559 48 720 107 -487 83 638 -160 -795 441 632 -374 -745 233 695
3322 695 6 -721 172 561 -344 -562 407 612 -439 -564 -154 958 -326 -605 467 722 -92 -348 141
3341 141 523 -321 -371 272 614 -363 -542 124 348 -325 -472 50 571 -197 -695 151 363 -301 -446 62
3361 62 517 -98 -268 423 419 -15 -517 350 773 74 -443 342 548 -248 -370 524 354 -284 -574 266 419
3382 419 -472 -733 -46 434 -263 -603 201 172 -356 -456 -127 453 -301 -475 269 592 -98 -521 230 596
3402 596 -307 -563 231 535 -240 -330 147 681 -405 -315 -45 338 77 -693 355 346 -417 -553 376 616 -447
3423 -447 -678 387 462 -344 -481 285 645 -278 -245 309 525 75 -533 298 472 -139 -524 293 380 -210 -475
$$ packed form
3283e0o56R23L39o49m45P99L15n16o23N63N30q20n00Q64N24p55n41R04N70r68
3303a92k61O98L87j119p2O07O72o13n94N70N55p98o35J236J91j006l71R78M62
3322F95o89p27Q93L89r05k18R69K05j051j25M10J112j284k79J072K55q14k56M89
3341A41L82q44n0O43L42r77j79O66K24o73j47N22N21p68m98Q46K12o64j45N08
3361F2M55o15j70O91mm34n02Q67M23o99n17P85K06p96j22Q94j70o38k90Q40J53
3382D19q91k61O87M80o97l40Q04k9n28j00L29N80p54j74P44L23o90m23P51L66
3402E96r03k56P94L04p75r0M77N34j086R0K70L83k61p70J048rp63j36R29K40j063
3423d47k31J065P5q06j37P66L60r23L3N54K16m50o08Q31J74o11l85Q17Q7n90k65
$$ plain form
3444 -475 223 340 -243 -718 389 370 -395 -474 110 364 -407 -237 326 478 -98 -535 320 560 -332 -579
3464 -579 423 640 -606 -408 187 532 -394 -480 249 557 -356 -524 247 424 -451 -665 263 273 -367 -434
3484 -434 220 383 -145 -449 200 521 -404 -253 506 319 43 -277 466 469 -238 -417 257 597 -244 -642 176
3505 176 346 -208 -615 171 297 -460 -446 181 406 -374 -459 145 565 -410 -395 360 600 -356 -452 371 636
3526 636 -238 -252 452 399 -416 -416 270 372 -313 -463 652 84 -337 -338 442 323 -449 -316 140 169 -636 -357
3548 -357 391 396 -359 -442 389 395 -207 -315 415 400 -242 -543 245 459 -391 -289 544 485 -608 -326 453 282
3570 282 -373 -497 282 242 -295 -326 212 358 -604 -519 509 278 -446 -319 371 212 -247 -350 249 252 -202
3591 -202 153 262 386 -439 -526 491 316 -423 -182 511 227 -656 -346 324 416 -495 -270 182 578 -178
$$ packed form
3444d75O98J17n83m75J107j9p65p9N84K54p71J70N63J52n76m37Q55K40q92k47
3464e79J002K17j246J98N95L45r26q6P29L08r13j68P71J77q75k14R28J0o40o7
3484d34O54J63n28l04O49L21r25J51P59j87k76l20P43Lp07j79O74L40q41l98Q18
3505A76J70n54m07P86J26p57J4O27K25p80q5O04M20r75J5P55K40r56r6Q23K65
3526F36q74j4P04n3q15%O86J02o85j50J115n68m21jP80j19p72J33M56K9q05K79
3548c57P48Np55q3Q31Oo02j08P30j5o42l01P88K14q50J02Q33n9j093K82P79j71
3570B82o55j24P79m0n37l1N38J46r62Q5J028k31p24J27O90j59m59j03N99Lm54
3591b02L55J09J24q25q7J017j75p39K41O93k84q83L10O70R2r11K25M52L96p56
$$ plain form
3611 -178 -173 384 416 -440 -443 501 229 -337 -169 226 138 -416 -159 220 450 -360 -223 164 403 -361 -370 407 266
3634 266 -258 -247 306 223 -473 -209 136 325 -265 -215 477 53 -284 -265 521 502 -423 -366 336 324 -247 -353
3656 -353 490 239 -262 -264 317 322 -384 -424 354 311 -347 -404 170 256 -572 -158 239 79 -352 -419 393 343 -373
3679 -373 -402 332 413 -224 -246 388 194 -448 -156 539 177 -494 -209 396 192 -532 -287 262 230 -580 -597 236
3701 236 -73 -437 -351 18 133 -391 -40 302 191 -354 -78 278 444 -139 -321 359 64 -294 -206 563 572
3722 572 -596 -95 309 219 -373 -123 230 170 -556 -414 194 51 -582 -169 432 89 -510 -287 301 185
3742 185 -477 -108 483 248 -270 -74 342 232 -240 -10 384 259 -471 -216 273 -6 -65 -103 380 -207 -338
3763 -338 -251 297 67 -649 -181 226 346 -476 -149 638 321 -292 -13 393 162 -387 -6 552 235 -415
$$ packed form
3611a78NN57L2q56lR44k72n66J68L95q8n54K57L79K30q10J37L87K39p64rP77j41
3634B66n24J1N53q3o96K64L45J89n90N0O92m24l37J9P86j9r25N7P02j2n71j06
3656c53Q43k51n01kN81Np06m0P78m3o58n7N74Q6q28M14L97j60m31o7Q12n0p16
3679c73k9P34Q1o37k2O34j94o42K92O95l62o71K85O05k04p24K45N49l2q10j7Q33
3701B36l09l64Q6L69J15n24L51L42j11n45K76L56J66n83j82O80k95l58Q8P69R
3722E72j168N01M04r0n92K50L53o0p26J42O08j43o33M13O01l43n99K23N88j16
3742A85o62L69N91k35n18J96M16j10m72K30L94j25p30K55M89k79n9l8M83n87j31
3763c38Q7N48k30p16M68M07J20q22L27P87l17o13K79M06k31n49L81N58l17o50
$$ plain form
3783 -415 -338 270 149 -240 177 404 -49 -425 -102 426 -204 -499 65 353 199 -342 -269 274 431 -264 -178
3804 -178 361 325 -349 -204 362 92 -494 -128 740 312 -421 -274 444 -133 -410 63 366 -18 -282 -136
3824 -136 152 -41 -256 -52 392 249 -537 -62 429 306 -250 -58 589 283 -202 87 636 483 -165 -95
3844 -95 255 130 -375 -135 687 123 -432 -318 271 150 -416 -45 209 80 -509 -483 503 -58 -566 -123 175
3865 175 -20 -551 -12 293 172 -418 63 405 436 -275 -254 319 10 -448 -141 313 113 -287 -38 251 -117
3886 -117 -112 -238 605 142 -488 -42 223 172 -405 -168 437 49 6 -18 439 129 -404 -47 344 150 -262 152
3908 152 196 54 -404 -19 219 165 -429 -208 287 70 -212 -192 201 -45 -236 -96 417 -117 -500 -74 245
3929 245 -151 -189 113 622 127 -314 19 410 68 -285 49 362 -17 -300 -20 398 -24 -322 -146 335
$$ packed form
3783d15P7O08j21l89M17K27m53l76L23N28o30k95N64K88j54n41P3N43J57o95Q6
3804a78N39l6o74J45N66k70n86L66Q68m28p33J47P18n77k77M73L03l84k64J46
3824a36K88j93k15K04M44j43p86M75M91j23n56J92O47l06m85K89N49j53o48P0
3844i5L50j25n05K40Q22n64n55J14N89j21n66L71K54j29n89K6R86n61n08M43K98
3865A75j95n31N39L05j21n90M81L42L1p11K1N73l09m58L07M54k00m00K49K89l68
3886a17Nj26Q43m63o30M46K65n1n77K37O05l88m3k4M57l10n33L57L91j94m12M14
3908A52M4j42m58L85K38n4n94K21M95k17k82K0L93k46j91J40N13n34l83M26L19
3929B45l96l8L02N09m95m41L33L91l42l53L34L13l79k83K80M18m22k98J76M81
$$ plain form
3949 335 214 -651 102 601 16 -331 -135 451 -106 -368 -18 675 200 -328 249 484 67 -224 262 328
3969 328 283 -426 14 526 80 -328 113 51 -82 -307 -203 409 54 -514 -125 199 -177 -327 231 377 141
3990 141 -342 176 457 127 -354 -36 265 22 -572 94 340 -120 -425 -175 412 38 -617 -262 237 -87
4010 -87 -397 50 243 -52 -584 89 271 -94 -543 23 531 -18 -162 -95 339 103 -446 -61 175 6 -317
4031 -317 -69 335 -52 -469 1 285 -127 -396 -63 361 48 -568 68 199 -157 -287 58 352 -43 -523
4051 -523 256 245 -39 -321 138 139 46 -239 305 411 108 -240 -72 388 -55 -396 -196 449 -164 -215 46 507
4073 507 64 -414 -169 513 -42 -368 154 252 -5 -544 166 230 -263 -249 -21 267 -34 -184 224 240 82
4094 82 -65 60 223 127 -510 -206 541 -205 -170 -45 173 -67 -379 -160 59 -27 -128 155 174 -155 -320 -33
$$ packed form
3949C35j21q65P53M99n85l47J96N86n57k62L50O93m75n28N77K35m17k91M86O6
3969C28m5p09M40N12m46m08M41o2j33k25J04O12l55n68L89L24l76j50N58J46k36
3990A41m83N18K81l30m81L18L01k43n94O66K46m60l05K50N87l74o55L55M99l24
4010h7l10M47J93k95n32O73J82l65m49N66N08n49j44O7M34k36n49L85K36j69l23
4031c17K48M04l87m17M70K84m12k69L33M24l13o16O36J31l56j30L45K94l95m80
4051e23P79j1k84k82M59Jr3k85N44J06l03l48J68M60m43l41K00O45o13n1K61M61
4073E07m43m78K45O82n55l26N22R8k57n39P10O4m93J4K28K88l01j50M08J6j58
4094H2j47J25J63r6o37L04P47p46L5J25K18k40l12K19K19q6j01K83J9l29j65K87
$$ plain form
4116 -33 542 93 -477 202 372 -252 -290 121 252 -103 -496 222 210 -48 -254 70 354 268 -295 -25 304
4137 304 -440 -506 66 397 -64 -406 84 275 -102 -389 100 230 -34 -185 -70 152 -39 -224 37 426
4157 426 41 -437 232 403 32 -220 386 341 -149 -453 -129 526 -85 -458 -121 268 -59 -411 18 158
4177 158 159 -441 443 429 -20 -430 21 521 -97 -164 160 228 -400 -77 224 555 37 -322 25 402 -139 -385
4199 -385 62 211 216 -518 -54 439 -193 -414 78 327 -105 -306 331 97 -213 -40 -28 290 -138 -468 163
4220 163 387 -204 -286 -8 274 34 -406 -1 280 -294 -132 301 344 -262 -317 -72 295 -310 -89 120 204
4241 204 156 -248 -126 162 -222 -291 153 162 -275 -263 38 177 -72 -294 350 229 -186 -14 -176 125 -260 -281
4263 -281 102 127 -402 -446 225 164 -157 -261 79 311 -275 -144 31 154 23 -259 405 360 108 -176 414
$$ packed form
4116c3N75m49n70O79J70o24l8M11J31l55l93P18j2k58k06L24K84q6n63K70L29
4137C04p44o6N72L31m61l42M90J91l77k87M89J30k64j51J15K22j91j85K61L89
4157D26l85m78O69J71l71k52O06m5m90l04L24O55o11l73L37L89l27l52M29J40
4177A58Jo00Q84j4m49m10M51N00o18o7L24O8o28L23L01L31n18l59L47L77n41k46
4199c85M47J49Np34M64M93o32k21M92K49m32k01O37k34l10J73J2L18m28l30O31
4220A63K24n91q2K78K82k40m40M05K81n74J62M33M3o06n5K45L67o05K21K09Q4
4241B04m8m04J22K88l84o9M44Rm37J2L01J39k49k22O44j21m15J72j62L01l85k1
4263b81L83K5n29m4O71o1l21j04L40K32n86J31J75J23j31k82O64m5k52k84N90
$$ plain form
4284 414 88 -237 -431 200 55 -173 -151 155 263 -280 -286 116 73 -241 -331 92 234 -270 -448 89 114 -50
4306 -50 -259 287 215 -352 -130 59 442 79 -355 228 618 -111 -367 -100 162 -7 -516 158 460 -242 -92
4327 -92 -24 369 -240 -335 306 75 -231 -309 187 402 -36 -181 -7 560 -174 -320 284 403 -350 -401 313 239
4349 239 -33 -71 154 415 -46 -450 142 127 -18 -286 203 17 -252 -105 346 242 -346 -256 490 368 -225
4370 -225 -254 28 280 79 23 257 259 -46 -286 38 -48 -225 -335 214 399 -71 -360 86 70 -256 -201 209
4392 209 287 -272 -78 293 111 -36 -295 176 319 -176 -270 224 218 -204 -111 -14 127 -8 -288 286 440 -340
4414 -340 -380 455 228 -251 -189 185 295 -430 -218 100 254 -253 -231 131 214 -99 -227 238 385 -207 -190 196
4436 196 300 -109 -233 245 430 81 -167 -30 193 -196 -170 299 231 -376 -234 139 100 -185 -249 -38 269
$$ packed form
4284D14l26l25j94O31j45k28K2L06J08n43oM02m3l14r0M23J42n04j78N37K5j64
4306e0k09N46p2n67K22J89L83l63m34N83L90p29k56K67K62j69n09O74L02p02J50
4327i2O8L93o09r5O41k31l06p8M96K15m38j45J74N67p34j46O04J19p53n1P14p4
4349B39k72l8K25K61m61m04N92j5j45k68M89j86k69J47M51j04n88R0P46j22n93
4370b25k9K82K52k01n6K34Kl05k40L24q6j77j10N49J85m70k89M46j6l26N5M10
4392B09P8n59J94L71j82j47k59M71J43m95r4M94om22R3R7J41j35k80N74J54p80
4414c40m0Q35k27m79O2L74J10p25K12L18J54n07K2L62Q3l13j28M65J47n92J7L86
4436A96J04m09j24M78J85l49k48J37K23l89K6M69o8o07J42L73l9k85o4K11L07
$$ plain form
4457 269 -185 -90 249 186 -282 -182 163 132 -156 -382 285 324 -117 -280 58 324 -210 -145 203 -149 -100 -392
4479 -392 253 163 -207 -80 84 71 -317 -87 283 24 -279 -115 110 272 -176 -43 279 151 -62 -359 213
4500 213 291 -103 -65 81 308 -93 -375 121 141 -360 -239 259 -32 156 -145 255 93 -335 -348 -4 201
4521 201 -159 -126 327 69 -60 -26 21 181 -205 6 218 75 -240 -52 148 182 -102 -158 413 175 -181 -354
4543 -354 2 303 -115 -153 86 77 -323 -323 199 108 -109 -335 179 304 -75 73 259 135 -125 0 335 -219
4565 -219 -272 -127 162 112 -188 -31 95 188 -372 -281 155 279 -201 57 258 142 -292 -133 64 94 -97 -159
4587 -159 143 281 -148 -176 125 -3 -27 -6 264 248 -184 40 357 305 -115 -393 385 95 -419 -248 171 145
4609 145 -291 -142 270 246 28 -253 271 168 -241 -203 390 -4 -280 44 474 203 -291 -73 288 178 -427
$$ packed form
4457B69m54R5L39o3m68J00L45l1k88k26O67L9m41j63L38K66n34O5L48l52M9k92
4479c92O45r0l70J27J64j3l88K30L70k59l03J64K25J62m48J33L22j28k13k97N72
4500B13P8l94L8J46K27m01k82M96K0n01J21M98k91J88l01M00j62m28j3L44K05
4521B01l60L3M53k58j29L4M7J60l86K11K12j43l15J88K00L4k84n6N71k38l56j73
4543c54L56L01m18l8K39rm00%N22r1k17k26N14J25l79J48J86j24k60J25L35n54
4565b19n3J45K89n0l00J57J26R3n60R1M36J24m80K58K01j16m34J59J97L0j91o2
4587a59L02J38m29k8L01j28k4K1K70j6m32K24L17n2m20k78P78k90n14J71M19k6
4609A45m36J49M12k4k18k81N24j03m09L8N93l94k76L24M30k71m94K18L61j10o05
$$ plain form
4630 -427 -36 310 55 -406 -208 -47 182 -344 -219 254 4 -103 -236 -40 -81 37 62 190 -207 -79 -126
4651 -126 330 95 -317 -78 167 134 -142 -140 226 29 -446 -251 323 -16 -273 -231 -11 210 -248 -176 247 65
4673 65 -123 70 -9 55 -108 -200 306 215 -241 -160 212 -51 -306 -156 355 210 -99 181 33 237 -292 -20
4695 -20 391 103 -492 -124 194 121 3 63 205 -25 -354 -20 177 157 -305 142 439 56 -293 -152 242
4716 242 220 -97 -207 430 37 -110 98 173 31 72 37 154 -232 -123 39 103 46 -192 -137 67 83 -244 -100
4739 -100 115 131 -420 -305 164 57 -255 57 212 175 -336 38 37 -4 -235 -3 251 -85 -313 59 300 -148
4761 -148 -287 -124 355 3 -206 -87 191 215 -320 -260 340 88 -331 -175 170 231 -155 -237 307 161 -371
4782 -371 27 255 -253 -144 141 430 118 -399 -100 353 201 -328 134 179 -109 -144 -20 135 98 -72 -84
$$ packed form
4630d27L91L46k55m61J98J61K29n26J25M73k50j07j33J96m1J18K5J28l97J28m7
4651a26M56k35m12K39K45l3k76KL66j97m75J95N74l39k57M2K20K21m58P2M23j82
4673F5j88J93p9O4j63r2N06r1m56Q1L72k63k55J50N11j45l09K80j48K04n29K72
4695b0M11k88n95L68L18p3j18O0J42k30l29L34J97k0m62M47K97l83l49J41L94
4716B42k2l17j10O37l93j47K08P5j42M1l5J17l86J09J62O4n7k38N5K04J6l27J44
4739a00K15J6n51J15M69j07l12L12J55l7n11L74jm1k31K32K54l36k28L72K41m48
4761a48j39J63M79l52k09J19K78K4n35O0O00k52m19J56L45O1l86q2N44j46n32
4782c71L98K28n08J09K85K89l12n17K99M53j52n29M62M5k88l5J24J55l7j70j2
$$ plain form
4803 -84 61 155 -281 -199 243 137 -449 95 454 274 -407 25 311 175 -194 -71 236 -94 -213 -144 151
4824 151 -76 -192 69 242 16 -257 5 154 -52 -320 15 222 88 -213 178 237 -32 -249 -171 281 150
4845 150 -257 106 293 295 -166 39 231 -18 -173 -128 370 -40 -274 91 395 -80 4 132 7 112 -319
4866 -319 -73 91 109 -104 10 117 80 -188 -41 192 19 -354 -133 161 84 -166 119 377 -93 -295 -40
4887 -40 21 198 -280 -11 297 67 -374 -33 381 -154 -206 -53 208 -155 -336 -51 460 154 -35 151 333
4908 333 145 28 67 144 -125 -387 250 390 -8 -128 50 387 -93 -576 -14 203 -78 -385 -1 350 -139
4929 -139 -109 157 -101 119 -373 69 221 57 -135 -22 153 -170 -356 75 290 58 -187 3 73 154 -149
4950 -149 -21 17 -228 -191 -91 100 -57 -293 32 156 -89 -390 154 355 -166 -202 -33 177 58 -380 53
$$ packed form
4803h4J45R4m36Q2M42j06n86N44L59j80o81M32K86j36l69J23L07l30j19O9K95
4824A51k27j16K61J73k26k73K62J49k06k68L35K07j34l01L91N9k69k17P8M52j31
4845A50m07L63J87Km61K05J92k49j55M5M98m10k34L65L04m75Q4J28j25J05m31
4866c19K46J64J8k13J14J07l7k68J47K33j73l73K21K94p7k50K85K58m70k02K55
4887d0O1J77m78K69L08k30m41L41M14n35n2J53K61l63j81K85N11l06j89J86J82
4908C33j88j17L9P7k69k62O37J40l98j20J78L37m80m83N62K17k81l07L84L51m89
4929a39L0K66k58K20m92M42J52j64j92J13J75l23j86M31K15k32k45J90P0Q1l03
4950a49J28L8k45L7J00J91j57k36L25J24k45l01N44K01n21l6J69K10j19m38M33
$$ plain form
4971 53 297 174 196 -486 134 -97 -228 39 -7 -159 -263 -163 120 299 -221 -134 352 -45 -78 242 175 15
4993 15 -115 -149 224 -37 -151 -23 207 84 -80 48 159 -43 -250 161 217 -247 -209 -225 152 -99 -77 -158
5015 -158 186 75 -621 22 198 138 -170 19 319 282 -458 -23 319 72 -234 54 202 44 -200 8 356
5036 356 -215 -215 157 223 -19 -131 -61 93 -117 -256 -8 148 -108 -593 -59 99 -191 39 -170 -15 -51 -8
5058 -8 -242 261 32 -421 38 407 242 -115 12 177 -79 -251 149 288 64 -209 133 301 -67 -241 45
$$ packed form
4971E3K44j23K2o82O20k31j31K67m6j52j04J00K83J79n20Q7M86l97l3L20o7j60
4993A5j30l4L73k61j14J28K30j23j64J28J11k02k07M11N6m64L8j6L77k51K2q1
5015a58L44j11o96O43J76o0l08J89L00l7p40M35L42k47l06K88J48j58k44K08L48
5036C56n71%L72O6k42j12P0J54k10j39K48J56k56m85N34J58k90K30k09J55l6M3
5058hk34N03k29m53M59L69j65l57J27J65k56j72M00J39k24k73L42J68l68j74K86
$$ [...]
8191a30
##END NTUPLES=NMR FID
##END=
