##TITLE=1H_L6(jul-21)-f12
 CDCl3, 8 sc, 
 7.07.2021
##JCAMPDX= 6.0         $$ Bruker NMR JCAMP-DX V2.0
##DATA TYPE= NMR FID
##DATA CLASS= NTUPLES
##ORIGIN= UXNMR, Bruker Analytische Messtechnik GmbH
##OWNER= root
$$ XWIN-NMR		Version 3.5
$$ Wed Jul  7 08:49:13 2021 Russian Standard Time (UT+4h)  she@DPX200
##.OBSERVE FREQUENCY= 200.131506
##.OBSERVE NUCLEUS= ^1H
##.DELAY= (6, 6)
##.ACQUISITION MODE= SIMULTANEOUS
##.ACQUISITION SCHEME= undefined
##.AVERAGES= 8
##.DIGITISER RES= 18
##SPECTROMETER/DATA SYSTEM= spect
##.PULSE SEQUENCE= zg30
##.SOLVENT NAME= CDCl3
##.SHIFT REFERENCE= (INTERNAL, CDCl3, 0, 15.7039)
##AUDIT TRAIL= $$ (NUMBER, WHEN, WHO, WHERE, WHAT)
$$ ##TITLE= Audit trail, XWIN-NMR		Version 3.5
$$ ##JCAMPDX= 5.01
$$ ##ORIGIN= Bruker BioSpin GmbH
$$ ##OWNER= she
$$ F:/spectra/data/she/nmr/H-F/1/audita.txt
$$ ##AUDIT TRAIL=  $$ (NUMBER, WHEN, WHO, WHERE, WHAT)
(   1,<2021-07-07 08:47:49.62 +0400>,<she>,<DPX200>,
      <created by zg, POWCHK disabled, PULCHK disabled
       configuration hash MD5:
       00 E9 B6 7A A2 85 ED C7 34 08 36 98 17 FE 4E 26
       data hash MD5: 16K
       89 43 8C 95 83 47 4B 33 29 55 C0 E0 B0 9B AE CB>)
$$ ##END=
$$ 
$$ hash MD5
$$ 9B AD D0 68 B3 54 6E 85 27 8A 6B 2B 93 AE 2C 00
##$RELAX= 
##$RELAX= 
##$RELAX= 
##$RELAX= 
##$RELAX= 
##$RELAX= 
$$ Bruker specific parameters
$$ --------------------------
##$DU= <F:/spectra>
##$EXPNO= 1
##$NAME= <H-F>
##$PROCNO= 1
##$TYPE= <nmr>
##$USER= <she>
##$AMP= (0..31)
100 100 100 100 100 100 100 100 100 100 100 100 100 100 100 100 100 100 
100 100 100 100 100 100 100 100 100 100 100 100 100 100 
##$AQSEQ= 0
##$AQ_mod= 1
##$AUNM= <au_zg>
##$AUTOPOS= <>
##$BF1= 200.13
##$BF2= 200.13
##$BF3= 200.13
##$BF4= 200.13
##$BF5= 200.13
##$BF6= 200.13
##$BF7= 200.13
##$BF8= 200.13
##$BYTORDA= 1
##$CFDGTYP= 0
##$CFRGTYP= 5
##$CHEMSTR= <none>
##$CNST= (0..31)
1 1 145 1 1 1 1 1 1 1 1 1 1 1 1 1 1 1 1 1 1 1 1 1 1 1 1 1 1 1 1 1 
##$CPDPRG= <>
##$CPDPRG1= <>
##$CPDPRG2= <>
##$CPDPRG3= <>
##$CPDPRG4= <mlev>
##$CPDPRG5= <mlev>
##$CPDPRG6= <mlev>
##$CPDPRG7= <mlev>
##$CPDPRG8= <mlev>
##$CPDPRGB= <>
##$CPDPRGT= <>
##$D= (0..31)
0 1.2 0 0 0 0 0 0 0 0.06 0 0.03 0 0 0 0 0.0002 0 0 0 0 0 0 0 0 0 0 0 0 
0 0 0 
##$DATE= 1625633269
##$DBL= (0..7)
120 120 120 120 120 120 120 120 
##$DBP= (0..7)
150 150 150 150 150 150 150 150 
##$DBP07= 0
##$DBPNAM0= <>
##$DBPNAM1= <>
##$DBPNAM2= <>
##$DBPNAM3= <>
##$DBPNAM4= <>
##$DBPNAM5= <>
##$DBPNAM6= <>
##$DBPNAM7= <>
##$DBPOAL= (0..7)
0.5 0.5 0.5 0.5 0.5 0.5 0.5 0.5 
##$DBPOFFS= (0..7)
0 0 0 0 0 0 0 0 
##$DE= 6
##$DECBNUC= <off>
##$DECIM= 32
##$DECNUC= <off>
##$DECSTAT= 4
##$DIGMOD= 1
##$DIGTYP= 9
##$DL= (0..7)
0 120 120 120 120 120 120 120 
##$DP= (0..7)
150 150 150 150 150 150 150 150 
##$DP07= 0
##$DPNAME0= <>
##$DPNAME1= <>
##$DPNAME2= <>
##$DPNAME3= <>
##$DPNAME4= <>
##$DPNAME5= <>
##$DPNAME6= <>
##$DPNAME7= <>
##$DPOAL= (0..7)
0.5 0.5 0.5 0.5 0.5 0.5 0.5 0.5 
##$DPOFFS= (0..7)
0 0 0 0 0 0 0 0 
##$DQDMODE= 0
##$DR= 18
##$DS= 0
##$DSLIST= <SSSSSSSSSSSSSSS>
$$ [...]
##$SUBNAM2= <"">
##$SUBNAM3= <"">
##$SUBNAM4= <"">
##$SUBNAM5= <"">
##$SUBNAM6= <"">
##$SUBNAM7= <"">
##$SUBNAM8= <"">
##$SUBNAM9= <"">
##$SW= 20.0188882624521
##$SWIBOX= (0..15)
0 0 2 0 0 0 0 0 0 0 0 0 0 0 0 0 
##$SW_h= 4006.41025641026
##$TD= 16384
##$TD0= 1
##$TE= 0
##$TE2= 300
##$TE3= 300
##$TEG= 300
##$TL= (0..7)
0 120 120 120 120 120 120 120 
##$TP= (0..7)
150 150 150 150 150 150 150 150 
##$TP07= 0
##$TPNAME0= <>
##$TPNAME1= <>
##$TPNAME2= <>
##$TPNAME3= <>
##$TPNAME4= <>
##$TPNAME5= <>
##$TPNAME6= <>
##$TPNAME7= <>
##$TPOAL= (0..7)
0.5 0.5 0.5 0.5 0.5 0.5 0.5 0.5 
##$TPOFFS= (0..7)
0 0 0 0 0 0 0 0 
##$TUNHIN= 0
##$TUNHOUT= 0
##$TUNXOUT= 0
##$USERA1= <user>
##$USERA2= <user>
##$USERA3= <user>
##$USERA4= <user>
##$USERA5= <user>
##$V9= 5
##$VALIST= <valist>
##$VCLIST= <CCCCCCCCCCCCCCC>
##$VD= 0
##$VDLIST= <DDDDDDDDDDDDDDD>
##$VPLIST= <PPPPPPPPPPPPPPP>
##$VTLIST= <TTTTTTTTTTTTTTT>
##$WBST= 1024
##$WBSW= 4
##$XGAIN= (0..3)
0 0 0 0 
##$XL= 0
##$YL= 0
##$YMAX_a= 352864
##$YMIN_a= -407223
##$ZGOPTNS= <>
##$ZL1= 120
##$ZL2= 120
##$ZL3= 120
##$ZL4= 120
##$ABSF1= 10
##$ABSF2= 0
##$ABSG= 5
##$ABSL= 3
##$ALPHA= 0
##$AQORDER= 0
##$ASSFAC= 0
##$ASSFACI= 0
##$ASSFACX= 0
##$ASSWID= 0
##$AUNMP= <proc_1d>
##$AZFE= 0.1
##$AZFW= 0.1
##$BCFW= 1
##$BC_mod= 2
##$BYTORDP= 1
##$COROFFS= 0
##$CY= 11.3945322036743
##$DATMOD= 1
##$DC= 2
##$DFILT= <>
##$DTYPP= 0
##$F1P= 15.9154993809931
##$F2P= -4.1035820241983
##$FCOR= 0.5
##$FTSIZE= 0
##$FT_mod= 4
##$GAMMA= 1
##$GB= 0.15
##$INTBC= 1
##$INTSCL= 1
##$ISEN= 128
##$LB= 0.24
##$LEV0= 0
##$LPBIN= 0
##$MAXI= 10000
##$MC2= 0
##$MEAN= 0
##$ME_mod= 0
##$MI= 1.114404
##$NCOEF= 0
##$NC_proc= 0
##$NLEV= 6
##$NOISF1= 3.799351
##$NOISF2= 2.8
##$NSP= 1
##$NTH_PI= 0
##$NZP= 0
##$OFFSET= 15.70392
##$PC= 1
##$PHC0= -11913
##$PHC1= 12.20099
##$PH_mod= 1
##$PKNL= yes
##$PPARMOD= 0
##$PSCAL= 0
##$PSIGN= 0
##$REVERSE= no
##$SF= 200.130013532006
##$SI= 16384
##$SIGF1= 3
##$SIGF2= 2
##$SINO= 400
##$SIOLD= 16384
##$SREGLST= <1H.CDCl3>
##$SSB= 0
##$STSI= 0
##$STSR= 0
##$SW_p= 3612.71676300578
##$SYMM= 0
##$S_DEV= 0
##$TDeff= 0
##$TDoff= 0
##$TI= <>
##$TILT= no
##$TM1= 0
##$TM2= 0
##$TOPLEV= 0
##$USERP1= <user>
##$USERP2= <user>
##$USERP3= <user>
##$USERP4= <user>
##$USERP5= <user>
##$WDW= 1
##$XDIM= 8192
##$YMAX_p= 0
##$YMIN_p= 0
$$ End of Bruker specific parameters
$$ ---------------------------------
##NTUPLES= NMR FID
##VAR_NAME=  TIME,          FID/REAL,        FID/IMAG
##SYMBOL=    X,             R,               I
##VAR_TYPE=  INDEPENDENT,   DEPENDENT,       DEPENDENT
##VAR_FORM=  AFFN,          ASDF,            ASDF
##VAR_DIM=   8192,          8192,            8192
##UNITS=     SECONDS,       ARBITRARY UNITS, ARBITRARY UNITS
##FACTOR=    0.0002496,     1,               1
##FIRST=     0,             0,               0
##LAST=      2.0444736,     0,               0
##MIN=       0,             -407223,         0
##MAX=       2.0444736,     352864,          0
$$ Real data points
##PAGE= N=1
##DATA TABLE= (X++(R..R)), XYDATA
$$ plain form
0 0 0 0 0 0 0 0 0 0 0 2 -8 8 -8 16 -16 24 -24 32 -40 48 -56 70 -81 97 -113 134 -154 179 -207 239 -271 311
32 311 -351 399 -452 510 -571 640 -717 800 -890 991 -1098 1216 -1346 1488 -1642 1809 -1993
49 -1993 2199 -2420 2667 -2938 3242 -3583 3965 -4396 4893 -5469 6147 -6955 7941 -9175
63 -9175 10770 -12924 15998 -20773 29252 -48813 192337 -88876 -236909 352864 4667
74 4667 -243209 180580 157906 -205679 83837 184445 -106495 -14035 180023 -5682 -20905
85 -20905 65718 -26461 -12037 81164 -19461 -6320 82272 -24641 -75217 37593 -13622 -68422
97 -68422 43872 41606 -64075 -11 56205 -26128 -37253 21765 -16898 -59709 -26296 -16080
109 -16080 -40057 -16675 13648 -9634 -42855 -33621 -21014 -30419 -32298 -28595 -38719 -35903 -17831
$$ packed form
0@%%%%%%%%%Kj0J6j6K4l2M0m8N6p2Q8j04J26j51J78k10K47k88L33l86M46n10N82
32C11o62P50q51R62j081J211j357J517j690J881k089K314k562K834l130L451l802
49a993M192m619N087n605O180o825P548q361R289j0362J1616j3102J4896j7116
63i175J9945k3694K8922l6771N0025p8065K41150k81213j48033N89773l48197
74D667k47876M23789k2674l63585K89516J00608k90940R2460J94058j85705j5223
85b0905Q6623r2179J4424R3201j00625J3141Q8592j06913n0576J12810n1215n4800
97f8422J12294k266j05681O4064N6216q2333j1125N9018l8663m2811L3413J0216
109a6080k3977K3382L0323k3282l3221R234J2607r405j879L703j0124K816J8072
$$ plain form
122 -17831 -20118 -35378 -33790 -22878 -23016 -37214 -44314 -26008 -16089 -34819 -36864 -24152 -39490
135 -39490 -45441 -23447 -33672 -48790 -12131 542 -36005 -25028 11129 -17609 -47168 -23583
147 -23583 -22766 -45604 -29411 -10324 -24458 -22570 -2172 -5629 -22008 -18694 -1988 -1039 -19217
160 -19217 -19742 -846 -5184 -14826 3374 999 -29531 -18986 5724 -10458 -10865 19917 16223 -520
174 -520 14478 14933 -6310 -1969 9075 -3960 -10050 3810 11294 10392 17662 27246 23345 11710
188 11710 10430 14111 10052 12103 18660 13487 12297 20897 15203 9633 24835 27679 15549 22064
202 22064 26810 15506 25338 39907 21470 12116 24557 13705 2505 22940 28897 17285 27017
215 27017 30723 17208 25534 33247 15980 18998 30712 12664 7659 25131 16667 13272 32782
$$ packed form
122a7831k287j5260J588J0912j38j4198p100J8306R919j8730k045J2712j5338
135c9490n951K1994j0225j5118L6659J2673l6547J0977L6157k8738k9559K3585
147b3583Q17k2838J6193J9087j4134J888K0398l457j6379L314J6706R49j8178
160a9217n25J8896m338r642J8200k375l0530J0545K4710j6182m07L0782l694j6743
174e20J4998M55k1243M341J1044j3035o090J3860P484r02P270R584l901j1635
188A1710j280L681m059K051O557n173j190Q600n694n570J5202K844j2130O515
202B2064M746j1304R832J4569j8437r354J2441j0852j1200K0435N957j1612R732
215B7017L706j3515Q326P713j7267L018J1714j8048n005J7472q464l395J9510
$$ plain form
228 32782 16210 -5754 20526 27067 -650 16594 36611 8667 4534 21522 1599 -2194 19957
241 19957 2191 -9452 17097 8489 -6810 20354 15401 -12087 7567 3027 -34682 -7472 18987
254 18987 -22590 -18442 25142 -4792 -27740 12035 4319 -32520 -10377 -439 -32727 -24685 -1453
267 -1453 -16361 -23350 -11864 -17767 -25119 -21267 -21184 -16636 -11855 -17465 -18673 -12939 -15878 -21947 -24145
282 -24145 -26602 -29038 -32318 -31538 -23852 -20017 -17514 -10279 -14441 -20861 -13027 -14246 -24949 -19504 -17180
297 -17180 -25269 -19745 -18307 -25330 -10720 -7168 -27474 -15147 2892 -20611 -19024 10489 -7033
310 -7033 -22562 5497 -1182 -25658 -2662 7160 -16707 -7505 8604 -4649 -2689 7293 -312
323 -312 3585 7961 -4793 1537 14888 2211 2700 19120 9686 923 14767 15872 5386 9857
$$ packed form
228C2782j6572k1964K6280O541k7717J7244K0017k7944m133J6988j9923l793K2151
241A9957j7766j1643K6549q608j5299K7164m953k7488J9654m540l7709K7210K6459
254A8987m1577M148M3584k9934k2948L9775p716l6839K2143R938l2288Q042K3232
267a453j4908o989J1486n903p352L852Q3M548M781n610j208N734k939o069k198
282b4145k457k436l280P80P686L835K503P235m162o420P834j219j0703N445K324
297a7180q089N524J438p023J4610L552k0306J2327J8039k3503J587K9513j7522
310g033j5529K8059o679k4476K2996R822k3867R202J6109j3253J960R982p605
323c12L897M376j2754O330J3351j2677M89J6420r434q763J3844J105j0486M471
$$ plain form
337 9857 17707 15024 7343 10802 21264 12754 2092 19973 23486 1630 15077 35762 12103
350 12103 11414 38155 17137 405 27600 17724 -5163 20879 21959 -2653 22109 32711 2440
363 2440 19153 37187 4002 9328 34243 4207 617 33168 9212 -7307 27020 14162 -11601
376 -11601 20586 20682 -10202 16779 28035 -8385 8889 32379 -7124 -7297 27040 -2722 -18928
389 -18928 20622 6736 -20948 15976 19624 -19991 1534 22480 -13729 -10953 16678 -9570
401 -9570 -16073 12890 -6468 -21858 9408 -244 -25689 3565 6992 -24482 -3004 11834 -23631
414 -23631 -15242 10225 -23405 -29310 6512 -11831 -29947 2062 -585 -23626 -1495 -281 -26152
427 -26152 -10738 -3838 -28806 -16700 -3224 -25359 -15377 2838 -22391 -20460 4418 -19626 -29117
$$ packed form
337I857P850k683p681L459J0462q510j0662J7881L513k1856J3447K0685k3659
350A2103o89K6741k1018j6732K7195r876k2887K6042J080k4612K4762J0602l0271
363B440J6713J8034l3185N326K4915l0036l590L2551k3956j6519L4327j2858k5763
376a1601L2187R6l0884K6981J1256l6420J7274K3490l9503j73L4337k9762j6206
389a8928L9550j3886k7684L6924L648l9615K1525K0946l6209K776K7631k6248
401i570o503K8963j9358j5390L1266r652k5445K9254L427l1474K1478J4838l5465
414b3631Q389K5467l3630n905L5822j8343j8116L2009k647k3041K2131J214k5871
427b6152J5414O900k4968J2106J3476k2135R982J8215k5229J931K4878k4044r491
$$ plain form
440 -29117 3174 -9475 -30254 -1656 -596 -27023 -9325 -2490 -28051 -16371 -1032 -21950
452 -21950 -16842 3129 -10317 -11587 3515 -10196 -16326 24 -11919 -22983 -2008 -1490 -16207
465 -16207 -549 8340 -7862 -3748 6425 -5835 -8845 2275 -2154 -7337 1395 5234 1474 1390
479 1390 4693 5657 4378 3887 5655 6943 7332 9081 8501 7364 8938 6306 4838 9667 8938 6881
495 6881 14498 15808 10486 17316 21509 9560 10810 19116 9542 5226 16002 13781 7728 16575 17208
510 17208 9916 16784 19627 11217 14077 20477 13191 11193 17463 11946 6211 12529 12748 4633 9554
525 9554 16842 9763 7716 18280 15642 3477 8022 11817 105 753 10256 2221 -1145 10853
539 10853 7109 -961 8493 5209 -5756 3493 3768 -9563 228 7077 -10595 -6752 7599 -9816
$$ packed form
440b9117L2291j2649k0779K8598J060k6427J7698O835k5561J1680J5339k0918
452b1950N108J9971j3446j270J5102j3711o130J6350j1943j1064K0975N18j4717
465a6207J5658Q889j6202M114J0173j2260l010J1120m429n183Q732L839l760q4
479A390L303R64j279m91J768J288L89J749n80j137J574k632j468M829p29k057
495F881P617J310n322O830M193j1949J250Q306r574m316J0776k221o053Q847O33
510A7208p292O868K843q410K860O400p286j998O270n517n735O318K19q115M921
525I554P288p079k047J0564k638j2165M545L795j1712O48R503q035l366J1998
539A0853l744q070R454l284j0965R249K75j3331R791O849j7672L843J4351j7415
$$ plain form
553 -9816 -14438 5045 -5201 -17852 2644 3234 -15411 -4378 1657 -16661 -14016 -4117 -17761
566 -17761 -17910 -5190 -12464 -13965 -449 -7543 -14827 -3779 -9377 -20093 -8454 -7899 -22490 -13583
580 -13583 -3271 -16994 -15570 -2927 -13016 -19067 -4647 -7997 -17747 -5207 -2784 -16411 -9917
593 -9917 -1923 -16035 -15725 -3278 -12730 -16136 549 -3698 -14045 978 2340 -14685 -7115 2834
607 2834 -13041 -12888 2488 -5276 -8396 5875 760 -9035 1837 3076 -6565 -879 2793 -4452
621 -4452 992 4991 -1588 1803 6202 -2835 -2217 6418 2410 2775 9958 6665 4000 10191 6283 609
637 609 4854 3892 380 5505 7219 5969 11303 13077 8979 11259 11682 5111 5164 9089 6407 6181 10878
654 10878 10572 7913 9291 10383 9126 9027 10094 9337 8155 10650 13657 11104 7828 8875 8039 4550
$$ packed form
553i816m622J9483j0246j2651K0496N90j8645J1033O035j8318K645R899j3644
566a7761j49J2720p274j501J3516p094p284J1048n598j0716J1639N55j4591Q907
580a3583J0312j3723J424J2643j0089o051J4420l350r750J2540K423j3627O494
593i917P994j4112L10J2447r452l406J6685m247j0347J5023J362j7025P570R949
607B834j5875J53J5376p764l120J4271n115r795J0872J239r641N686L672p245
621d452N444L999o579L391M399r037O18Q635m008L65P183l293k665O191l908n674
637F09M245r62l512N125J714j250N334J774m098K280M23o571N3L925k682k26M697
654A0878l06k659J378J092j257r9J067p57j182K495L007k553l276J047q36l489
$$ plain form
670 4550 5450 7300 7104 9694 10847 8240 9141 11641 8743 4322 4250 5152 4004 3685 4716 4305 5049
687 5049 7150 5454 964 3112 6265 734 -1207 5097 2423 -2925 1964 1204 -6081 -1511 1990
702 1990 -6196 -4994 1906 -1474 -2709 -45 -5306 -6199 -3864 -9885 -9007 -3677 -9726 -9641 -390 -8295
718 -8295 -12191 786 -5982 -18408 -5071 -4271 -18524 -8365 -1666 -16820 -11670 -1365 -15979
731 -15979 -15642 -2164 -13469 -15523 -148 -10066 -16921 748 -6737 -21953 -4941 -3529 -23049
744 -23049 -9838 1154 -17221 -9362 6807 -11369 -14562 4185 -7152 -16871 355 -3755 -15808
757 -15808 -847 896 -12755 -1046 5578 -10128 -4793 6042 -6013 -5177 9413 -473 -7044
770 -7044 6953 3278 -7974 2865 6454 -3880 1982 10026 1191 2447 12216 6540 1138 8609
$$ packed form
670D550R00J850j96K590J153k607R01K500k898m421p2R02j148l19J031m11P44
687E049K101j696m490K148L153n531j941O304k674n348M889p60p285M570L501
702A990q186J202O900l380j235K664n261q93K335o021Q78N330o049Q5R251p905
718h295l896J2977o768j2426J3337Q00j4253J0159O699j5154N150J0305j4614
731a5979L37J3478j1305k054J5375r918o855J7669p485j5216J7012J412j9520
744b3049J3211J0992j8375P859J6169j8176l193J8747j1337r719J7226m110j2053
757a5808J4961J743j3651J1709O624j5706N335J0835j2055Q36J4590r886o571
770g044J3997l675j1252J0839L589j0334N862Q044q835J256R769n676n402P471
$$ plain form
784 8609 6542 -360 6101 9406 3024 7335 13500 5590 3786 12229 9314 3944 10370 11373 4366
799 4366 8480 12530 6011 5630 11601 7079 3371 8851 9561 7285 11005 11262 7568 8902 8609 4693
815 4693 5072 6993 4938 5550 7098 6310 6457 8536 7692 4456 4107 4960 3449 1692 4520 5684 2195
832 2195 3193 4788 388 -187 4561 907 -2309 4029 3248 -2269 3246 4369 -3898 -1535 1977 -6741
848 -6741 -5049 2372 -3220 -4871 3664 -1205 -7056 276 -1160 -8853 -3885 -1999 -9315 -4897 -632
863 -632 -7047 -4535 -671 -7982 -8061 -2052 -7618 -9442 -1754 -5048 -10844 -3809 -4119 -11702 -6808 -3491
879 -3491 -10757 -8721 -2269 -7455 -8621 -1108 -4546 -10503 -5589 -5893 -12040 -8177 -4482 -8898 -7156
894 -7156 -2719 -6950 -6740 -1979 -5774 -8191 -2562 -5169 -8774 -2427 -3033 -8690 -3282 -1133 -8849 -5588
$$ packed form
784H609k067o902O461L305o382M311O165p910j804Q443k915n370O426J003p007
799D366M114M050o519l81N971m522l708N480P10k276L720K57l694J334k93l916
815D693L79J921k055O12J548p88J47K079q44l236l49Q53j511j757K828J164l489
832B195R98J595m400n75M748l654l216O338p81n517N515J123q267K363L512q718
848f741J692P421n592j651Q535m869n851P332j436p693M968J886p316M418M265
863f32o415K512L864p311p9O009n566j824P688l294n796P035l10p583M894L317
879c491p266K036O452n186j166P513l438n957M914l04o147L863L695m416J742
894g156M437m231K10M761l795k417N629k607l605O347o06n657N408K149p716L261
$$ plain form
910 -5588 284 -5741 -5205 3141 -887 -4548 3134 998 -5747 -702 1200 -5171 -1356 3326 -1115
925 -1115 855 5564 880 727 6012 2249 -76 5533 4137 609 5990 6759 2049 5755 7635 2004
941 2004 3728 8911 4229 4258 10814 7686 3541 8919 8778 2262 6769 10025 3817 5971 12411 6658
957 6658 5415 12656 8903 3261 8622 7793 1506 6762 9767 4152 7005 10757 5165 5326 8817 4134
973 4134 4099 8785 3412 2041 8890 3861 -664 7359 5334 -3152 3589 5916 -2538 2023 7809 -277
989 -277 -294 5845 -395 -4438 1285 -989 -4654 -406 -842 -3651 -402 -24 -3716 -1525 -1746 -5649 -3973
1006 -3973 -3200 -6414 -4886 -3076 -5439 -5559 -4480 -6196 -5971 -5552 -6134 -4890 -4902 -6668 -4920 -5201 -8458
1023 -8458 -6373 -5617 -9758 -7271 -4347 -8430 -6233 -2125 -6634 -7116 -1841 -6564 -9726 -3135 -5743
$$ packed form
910e588N872o025N36Q346m028l661P682k136o745N045J902o371L815M682m441
925a115J970M709m684j53N285l763k325N609j396l528N381P69m710L706J880n631
941B004J724N183m682K9O556l128m145N378j41o516M507L256o208K154O440n753
957F658j243P241l753n642N361q29o287N256L005n615K853L752n592J61L491m683
973D134l5M686n373j371O849n029m525Q023k025q486O741K327q454M561N786q086
989b77j7O139o240m043N723k274l665M248m36k809L249L78l692K191k21l903J676
1006c973P73l214J528J810k363j20J079j716K25M19n82J244j2j766J748k81l257
1023h458K085P56m141K487K924m083K197M108m509m82N275m723l162O591k608
$$ plain form
1038 -5743 -10266 -2934 -3387 -9230 -3242 -1023 -9132 -5505 788 -6173 -5831 847 -4102 -5637 1152
1053 1152 -2889 -6570 -257 -1872 -6887 -132 798 -5064 866 4121 -3840 -1388 4873 -2810 -4045
1068 -4045 4318 1242 -3371 4402 4886 -1979 2100 6356 -451 -540 5688 1943 -1244 5143 5447 1135
1084 1135 4879 6702 2178 3009 6491 2978 3225 7148 3778 2935 7684 4951 1323 5990 5586 835
1100 835 5734 8170 2576 5784 10526 4795 3939 9230 5068 929 6294 5119 1634 5619 6562 2325
1116 2325 4873 7523 3499 4017 6428 4346 3793 5686 3907 3629 4453 2420 1401 2863 1665 918
1132 918 3184 1885 1352 3883 3331 684 1851 2181 -364 -406 1450 172 -1409 -840 1 -615 -1720
1149 -1720 -1363 -1342 -2686 -3228 -1014 -1637 -3671 -1530 -880 -4778 -4181 -1032 -4495 -6675 -3077 -3116 -6155
$$ packed form
1038e743m523P332m53n843N988K219q109L627O293o961L42O678m949j535O789
1053A152m041l681O313j615n015O755R30n862N930L255p961K452O261p683j235
1068d045Q363l076m613P773M84o865M079M256o807q9O228l745l187O387L04m312
1084A135L744J823m524Q31L482l513K47L923l370q43M749k733l628M667m04m751
1100H35M899K436n594L208M742n731q56N291m162m139N365j175l485L985R43m237
1116B325K548K650m024N18K411k082n53J893j779k78Q24k033j019J462j198p47
1132I18K266j299n33K531n52k647J167L30k545m2J856j278j581N69Q41o16j105
1149a720L57K1j344n42K214o23k034K141O50l898N97L149l463k180L598l9l039
$$ plain form
1166 -6155 -4000 -3065 -6277 -5609 -4152 -6173 -6417 -5106 -5920 -5675 -4688 -4775 -4425 -3682 -6233 -7070 -4729 -6607
1184 -6607 -8393 -4905 -5179 -7423 -4618 -3300 -6064 -4589 -3008 -6046 -5058 -1919 -5421 -5002 -1880 -4472
1200 -4472 -4796 -622 -4106 -5943 -248 -1743 -6053 320 1492 -4842 -481 3379 -3183 -1683 4008
1215 4008 -1981 -3401 3941 1004 -2639 3609 3242 -1652 3451 4895 -355 2802 5424 25 2362
1230 2362 6781 2017 1402 6521 3732 1287 6954 5577 2188 5783 6400 2213 4868 6903 3007
1245 3007 3762 6432 3845 3903 7256 4931 3378 6938 5975 1753 5283 7345 2263 3107 7672 3679
1261 3679 1769 6287 4401 -202 4592 6111 234 2547 7358 2013 1021 7010 2481 -988 4688
1276 4688 2428 -2723 2970 3461 -2715 1817 5107 -2082 -496 4766 -2294 -2988 3918 -896 -4694
$$ packed form
1166f155K155R35l212O68J457k021k44J311q14K45R87q7L50P43k551q37K341j878
1184f607j786L488k74k244K805J318k764J475J581l038R88L139l502M19L122k592
1200d472l24M174l484j837N695j495m310O373J172o334M361L860o562J500N691
1215D008n989j420P342k937l643O248l67m894N103J444n250L157K622n399K337
1230B362M419m764o15N119k789k445N667j377l389L595O17m187K655K035l896
1245C007P55K670k587N8L353k325j553L560r63m222L530K062n082Q44M565l993
1261C679j910M518j886m603M794J519n877K313M811n345r92N989m529l469N676
1276D688k260n151N693M91o176M532L290p189J586N262p060o94O906m814l798
$$ plain form
1291 -4694 3259 1477 -4950 590 1768 -4678 -1623 925 -5439 -3201 751 -4281 -4085 896 -3232
1306 -3232 -5273 126 -2006 -5913 -1130 -1607 -6226 -2456 -815 -5816 -4927 -1744 -4781 -5545 -2821 -4262
1322 -4262 -5254 -2889 -3843 -4461 -2550 -3077 -4802 -3098 -3141 -4565 -4405 -3549 -4612 -4789 -3828 -3995 -4480 -3661
1340 -3661 -2307 -3226 -3949 -2400 -1346 -3484 -3549 -2095 -2725 -3790 -1840 -2118 -3643 -1846 -795 -2757
1356 -2757 -2134 -503 -2058 -2286 -270 -862 -1383 287 -16 -938 1130 733 -1492 198 1388 -558 7
1373 7 2490 811 761 2783 1771 1092 3067 2541 1415 3881 3136 1236 3794 4212 2065 4108 5013
1390 5013 1464 2694 6154 2397 1571 5661 4323 2184 5282 5279 2494 4942 6441 3437 4140 5455
1406 5455 3135 3370 5201 2788 2960 4917 2946 3005 6048 3756 1684 5061 4500 1392 3266 4490
$$ packed form
1291d694P953j782o427N540J178o446L055K548o364K238L952n032J96M981m128
1306c232k041N399k132l907M783m77m619L770J641n001Q89L183l037p64K724j441
1322d262r92K365r54o18J911n27j725J704m3j424J60Q56j063j77R61j67m85Q19
1340c661J354r19p23J549J054k138o5J454o30j065J950k78j525J797J051j962
1356b757O23J631j555k28K016n92n21J670l03r22K068l97k225J690J190j946N65
1373GK483j679n0K022j012o79J975n26j126K466p45j900K558M18k147K043R05
1390E013l549J230L460l757q26M090j338k139L098lk785K448J499l004P03J315
1406E455k320K35J831k413J72J957j971N9L043k292k072L377n61l108J874J224
$$ plain form
1422 4490 1457 2330 4596 2062 1038 2977 1923 370 1389 1208 570 1050 1021 1001 1619 703 -785
1439 -785 281 225 -1925 -1306 -37 -1677 -1849 162 -1400 -3141 -1165 -663 -4083 -3873 -1196 -3380 -4193
1456 -4193 -1041 -1671 -3885 -1783 -1997 -4688 -3644 -2816 -5516 -4596 -2571 -4605 -4753 -2362 -3829 -4695
1472 -4695 -2603 -4002 -5595 -2372 -2345 -5110 -3155 -1816 -4854 -3880 -1995 -4457 -4700 -2782 -3993 -4489
1488 -4489 -2134 -2287 -3517 -1638 -996 -2554 -2556 -1777 -2252 -1874 -1183 -1917 -2814 -1354 -687 -1376 -1791 -643
1506 -643 -508 -1304 -443 282 -393 240 1390 -226 -112 1185 318 -142 2395 1416 -288 1623 1606 -686
1524 -686 2135 3384 -405 1331 4620 845 578 5464 2804 278 4082 3416 -430 3248 4585 670
1540 670 2804 5313 1383 1758 5307 2534 1403 4887 2793 1157 5390 3748 745 4545 5119 160
$$ packed form
1422D490l033Q73K266k534j024J939j054j553J019j81o38M80k9k0O18r16j488
1439g85J066n6k150O19J269j640j72K011j562j741J976N02l420K10K677k184q13
1456d193L152o30k214K102k14k691J044Q28k700R20K025k034j48K391j467q66
1472d695K092j399j593L223K7k765J955J339l038R74J885k462k43J918j211m96
1488d489K355j53j230J879O42j558kP79m75L78O91p34q97J460O67o89m15J148
1506f43J35p96Q61P25o75O33J150j616J14J297q67m60K537r79j704J911j7k292
1524f86K821J249l789J736L289l775k67M886k660k526L804o66l846L678J337l915
1540F70K134K509l930L75L549k773j131L484k094j636M233j642l003L800N74m959
$$ plain form
1556 160 2392 4461 831 1479 5478 2315 865 4467 3887 969 3308 3313 618 2141 3052 889 2176
1573 2176 3437 909 1072 3397 500 -33 2887 1431 -1228 2229 2420 -1283 827 2783 -476 -918
1589 -918 2040 -296 -1965 862 565 -1986 -340 232 -2297 -1186 -349 -2432 -1922 -87 -2432 -3041
1605 -3041 -563 -1648 -3501 -1847 -1582 -4258 -2401 -1135 -3424 -3329 -1479 -3372 -4516 -2502 -3145 -4330
1621 -4330 -2420 -2614 -4288 -2465 -2484 -4197 -2971 -2138 -4588 -4104 -2193 -4220 -4069 -1698 -2637 -3916 -1588
1638 -1588 -2641 -4680 -2516 -2305 -3565 -2410 -1156 -3324 -1836 -564 -2685 -1832 -35 -2959 -3784 89
1654 89 -1433 -2649 662 58 -2122 314 1202 -1234 -194 1891 -388 -645 1328 1156 891 1699 1098
1671 1098 1025 1707 374 752 1918 1334 1868 3408 2220 1730 3704 3045 1678 3113 3150 1909 2196 2914
$$ packed form
1556A60K232K069l630O48L999l163j450L602n80k918K339Nk695J523R11k163J287
1573B176J261k528J63K325k897n33K920j456k659L457J91l703K110J956l259m42
1589i18K958k336j669K827k97k551J646N72k529J111Q37k083N10J835k345o09
1605c041K478j085j853J654K65k676J857J266k289R5J850j893j144K014o43j185
1621d330J910j94j674J823j9j713J226Q33k450M84J911k027J51K371r39j279K328
1638a588j053k039K164K11j260J155J254k168J488J272k121Q53J797k924q25L873
1654H9j522j216L311o04k180K436Q88k436J040K085k279k57J973j72k65Q08o01
1671A098p3O82j333L78J166n84N34J540j188m90J974o59j367J435L7j241K87P18
$$ plain form
1689 2914 2547 3218 3246 2428 2834 2971 2315 3314 3265 2555 3142 3471 2652 3397 3927 2120 1978 2800 1652 2136
1709 2136 2777 1561 1863 2934 1646 1301 3460 2266 920 3060 2259 -317 2193 2643 -947 962
1725 962 2716 -691 -555 2456 -43 -946 2112 1132 -1455 1251 1423 -1589 -93 1429 -1708 -1767 746
1742 746 -1133 -1874 158 -957 -2570 -1111 -926 -2487 -1142 317 -1926 -2192 -554 -1860 -2630 -1048
1758 -1048 -2023 -3501 -1400 -1652 -3761 -1994 -614 -3441 -2643 -464 -3171 -4040 -916 -2176 -4172 -891
1774 -891 -1055 -4236 -2089 -305 -3549 -3073 -568 -3046 -3969 -1157 -2349 -3018 -1121 -1317 -3228 -1680
1790 -1680 -1133 -3313 -1832 -408 -2988 -2359 -275 -2178 -2405 373 -1120 -2945 -607 -120 -2269 -1084
1806 -1084 576 -1141 -759 339 -416 -842 505 -114 -874 84 200 -653 362 1025 192 864 1554 481
$$ packed form
1689B914l67O71K8q18M06J37o56R99m9p10N87L29q19P45N30j807j42Q22j148M84
1709B136O41j216L02J071j288l45K159j194j346K140q01k576K510M50l590J909
1725I62J754l407J36L011k499r03L058r80k587K706J72l012J496J522l137n9K513
1742G46j879p41K032j115j613J459J85j561J345J459k243k66J638j306p70J582
1758a048r75j478K101k52k109J767J380k827P98K179k707q69L124j260j996L281
1774h91j64l181K147J784l244M76K505k478r23K812j192o69J897j96j911J548
1790a680N47k180J481J424k580O29K084j903k27K778j493j825K338M87k149J185
1806a084J660j717L82J098p55m26J347o19p60R58J16q53J015O63q33O72O90j073
$$ plain form
1824 481 362 1678 1396 723 1364 1692 910 1326 2556 1971 1705 2578 2097 1601 2153 2592 1591 2002 2779
1843 2779 2003 2319 2891 2203 2529 3339 2230 1995 3033 2561 1467 2746 3520 2082 2175 3153 2010 1521
1861 1521 2982 2385 1076 2262 2386 1284 2163 2789 1822 1740 2222 1042 979 1713 633 102 1652 987
1879 987 132 1400 1198 -299 493 703 -778 -233 660 -1075 -830 216 -458 -941 306 -1214 -1873 -576
1897 -576 -1397 -2429 -595 -482 -2405 -1322 -735 -2500 -1649 -1050 -2878 -2496 -838 -2265 -3352 -1256 -1892
1914 -1892 -3018 -1541 -1796 -3024 -2442 -1883 -3129 -2590 -1213 -2626 -2798 -1412 -1943 -2796 -1556 -1653 -3122
1931 -3122 -2081 -1417 -2798 -2362 -1031 -2409 -2489 -846 -1031 -2380 -1058 -697 -2097 -918 -177 -2043 -1383
1948 -1383 -175 -1405 -1478 46 -667 -1515 397 58 -1184 587 625 -1246 292 1369 -650 162 1828
$$ packed form
1824D81j19J316k82o73O41L28p82M16J230n85k66Q73m81m96N52M39j001M11P77
1843B779p76L16N72o88L26Q10j109k35J038m72j094J279P74j438R3R78j143m89
1861A521J461n97j309J186J24j102Q79O26r67q2M82j180o3P34j080n31J550o65
1879I87q55J268k02j497P92K10j481N45Q93j735K45J046o74m83J247j520o59J297
1897e76q21j032J834J13j923J083N87j765Q51N99j828L82J658j427j087K096o36
1914a892j126J477k55j228N82N59j246N39J377j413j72J386n31q53J240r7j469
1931c122J041O64j381M36J331j378q0J643j85j349J322L61j400J179P41j866O60
1948a383J208j230p3J524p13q48J912l39j242J771L8j871J538J077k019Q12J666
$$ plain form
1965 1828 -81 -352 1776 387 -579 1165 994 -235 1473 2059 453 1268 2342 831 864 2323 1053
1982 1053 786 2479 1620 640 2248 2304 1136 1743 2189 1039 768 2222 1445 875 2245 2294 1547 2147
2000 2147 2606 1565 1371 2110 1640 1133 1894 1769 1231 1602 2025 1498 1584 2011 1250 1374 2165 1390 1116 1819
2020 1819 1341 716 1271 1568 666 727 1433 577 350 1188 803 63 1015 564 -137 608 721 -990 -324 347
2040 347 -847 -978 461 -311 -1394 70 127 -1251 -1006 -18 -1544 -1549 -458 -863 -2090 -903 -953 -2045
2058 -2045 -1033 -1152 -2157 -1707 -1314 -2333 -1559 -1247 -2328 -1971 -1069 -1798 -2549 -1177 -1768 -3204 -1560
2075 -1560 -1004 -2550 -2052 -1034 -2200 -2448 -858 -2104 -2417 -1374 -1611 -2724 -1515 -1179 -2162 -1338 -793
2092 -793 -1670 -1510 -813 -1970 -1590 -567 -1227 -1518 -181 -297 -1245 -32 -38 -780 -528 -334 -720 -405 564
$$ packed form
1965A828j909k71K128j389r66J744j71j229J708N86j606Q15J074j511L3J459j270
1982A053k67J693q59r80J608N6j168O07M46j150k71J454p77n70J370M9p47O00
2000B147M59j041j94P39m70n07P61j25n38L71M23n27Q6M27p61J24P91p75k74P03
2020A819m78o25N55K97r02O1P06q56k27Q38l85p40R52m51p01P45J13j711O66O71
2040C47j194j31J439p72j083J464N7j378K45R88j526nJ091m05j227J187n0j092
2058b045J012j19j005M50L93j019P74L12j081L57R02p29p51J372n91j436J644
2075a560N56j546M98J018j166k48J590j246l13J043k37j113J209L36r83Q24N45
2092g93q77J60O97j157L80J023o60k91J337j16r48J213op42K52J94l86L15R69
$$ plain form
2111 564 -256 -200 498 373 -233 993 877 130 807 1462 529 1077 1765 751 743 1474 1211 898 1293 1451
2131 1451 1165 1793 1876 1586 1787 2392 1210 1543 2199 1349 1694 2134 1570 1580 2460 1586 1111 2111 1993 981
2151 981 2177 2343 1249 1645 2043 1350 1142 1854 1196 882 1834 1580 952 1545 1696 938 1334 1139 778
2170 778 621 1040 594 465 1072 615 443 721 475 -83 162 438 -631 -188 430 -384 -856 364 81
2189 81 -1296 -322 -55 -1149 -842 -357 -981 -987 -97 -920 -1635 -686 -1094 -1975 -1148 -722 -1722 -1018 -563 -1480
2209 -1480 -1174 -490 -1341 -2005 -1034 -1689 -1890 -1101 -1412 -2209 -1217 -833 -2200 -1255 -682 -1830 -1518 -604 -1535
2228 -1535 -1930 -994 -1646 -1955 -1176 -703 -1827 -1542 -344 -1447 -1295 -480 -677 -1302 -732 -658 -1520 -819 -406
2247 -406 -1365 -533 -372 -1021 -664 329 -584 -1104 383 108 -1003 416 325 -842 -206 867 -568 -691
$$ packed form
2111E64q20N6O98j25o06J226j16p47O77O55r33N48O88j014qP31k63l13L95J58
2131A451k86O28Q3k90K01O05j182L33O56q50L45M40n64J0Q80q74m75J000j18j012
2151I81J196J66j094L96L98o93k08P12o58l14R52k54o28N93J51p58L96j95l61
2170G78j57M19m46j29O07m57j72K78k46n58K45K76j069M43O18q14m72J220k83
2189H1j377R74K67j094L07M85o24oQ90q23p15R49m08q81Q27M26j000P04M55r17
2209a480L06O84q51o64R71o55k01P89l11p97R92L84j367R45N73j148L12R14r31
2228a535l95R36o52l09P79M73j124K85J198j103J52Q15j97o25N70P4q62P01M13
2247d06r59Q32J61o49L57R93r13n20J487k75j111J419r1j167O36J073j435j23
$$ plain form
2265 -691 1044 280 -389 1073 578 -132 842 831 -293 429 1189 461 619 1732 737 1034 1820 866 593
2284 593 1759 1471 536 1325 1589 816 1393 1939 1172 1052 1757 1325 633 1738 1543 1157 1939 1908 1064 1668
2304 1668 1534 1044 1306 1512 1221 1288 1865 1638 1148 1574 1593 1259 812 1287 505 679 987 869 765 815 888
2325 888 415 652 721 430 418 517 -117 254 294 80 -367 -158 -633 -371 -412 -133 -303 -212 8 -412 -752 -527
2347 -527 -954 -1160 -782 -913 -1334 -1209 -924 -1056 -1095 -924 -907 -1215 -1325 -1033 -1395 -1374 -1036 -1629 -1390 -1218 -1677
2368 -1677 -1698 -1358 -1214 -1498 -1184 -999 -1319 -1386 -992 -1511 -1406 -1113 -1565 -1169 -1157 -1317 -1118 -902 -1030 -1037 -902
2389 -902 -853 -959 -944 -840 -992 -664 -621 -548 -533 -254 -538 -556 -100 -527 -335 -77 -297 -456 -37 44 -245 53
2411 53 -26 -84 49 258 474 307 940 547 138 713 849 240 478 761 215 577 1342 779 632 1379 740
$$ packed form
2265f91J735p64o69J462m95p10R74j1j124P22P60p28J58J113r95K97P86r54k73
2284E93J166k88r35P89K64p73N77N46p67j20P05m32o92J105j95l86P82l1q44O04
2304A668j34m90K62K06k91O7N77k27m90M26J9l34m47M75p82J74L08j18j04N0P3
2325H88m73K37O9k91j2R9o34L71M0k14m47K09m75K62m1K79j70R1K20m20l40K25
2347e27m27k06L78j31m21J25K85j32l9J71J7l08j10K92l62K1L38n93K39J72m59
2368a677k1L40J44k84L14J85l20o7L94n19J05K93m52L96J2j60J99K16j28pJ35
2389i02M9j06J5J04j52L28M3P3J5K79k84j8M56m27J92K58k20j59M19Q1k89K98
2411E3p9n8J33K09K16j67O33l93m09N75J36o09K38K83n46L62P65n63j47P47o39
$$ plain form
2432 740 275 1455 1106 491 1150 1188 605 824 1136 493 863 1444 668 608 1788 1414 715 1426 1349 234
2452 234 1051 1434 555 852 1539 682 606 1639 961 445 1499 919 176 1122 776 155 521 835 295 625
2472 625 1090 396 212 790 650 100 557 575 -333 16 320 -305 -222 357 -115 -382 460 -145 -547 -96 113
2493 113 -645 -149 63 -985 -686 -206 -669 -984 -474 -659 -1398 -412 -281 -1114 -1005 -485 -1029 -950 -348 -965
2513 -965 -1398 -829 -1047 -1435 -917 -712 -1670 -928 -1235 -1298 -1352 -542 -1453 -1528 -937 -1413 -1507 -596 -897 -1540 -742
2534 -742 -642 -1531 -1084 -671 -1077 -1583 -718 -580 -1232 -506 -352 -827 -563 -300 -797 -421 -126 -437 -610 -75
2554 -75 -479 -539 -23 -397 -416 62 104 -68 -112 394 89 132 614 485 283 639 187 449 424 744 588 785
2576 785 660 685 879 1052 1242 990 1064 991 835 1049 1245 784 1101 1224 1032 1053 1296 1168 976 1432 1202
$$ packed form
2432G40m65J180l49o15O59L8n83K19L12o43L70N81p76o0J180l74o99P11p7j115
2452B34Q17L83q79K97O87q57p6J033o78n16J054n80p43R46l46o21L66L14n40L30
2472F25M65o94j84N78j40n50M57J8r08L49L04o25Q3N79m72k67Q42o05m02M51K09
2493A13p58M96K12j048K99M80m63l15N10j85p39R86J31q33J09N20n44P9O02o17
2513i65m33N69k18l88N18K05r58P42l07o3n4Q10r11p5N91m76r4R11l01o43P98
2534g42J00q89M47M13m06n06Q65J38o52P26J54m75K64K63m97L76K95l11j73N35
2554g5m04o0N16l74j9M78M2j72m4N06l05M3M82j29k02L56m52K62k5L20j56J97
2576G85j25K5J94J73J90k52P4p3j56K14J96m61L17J23j92K1K43j28j92M56k30
$$ plain form
2597 1202 946 1158 1067 747 1023 1179 855 874 1245 853 816 1166 727 759 933 770 496 1017 882 231 362
2618 362 830 -18 573 836 462 349 677 303 -85 767 -169 -146 72 -34 -342 103 -111 -203 -15 -94 -412
2639 -412 -172 22 -256 -337 -539 -612 -670 -644 -561 -970 -639 -810 -752 -421 -484 -632 -819 -627 -864 -810 -826 -862 -910 -717
2663 -717 -778 -748 -839 -774 -918 -696 -812 -1094 -1215 -848 -644 -1331 -1005 -840 -952 -936 -468 -808 -964 -459 -563 -814
2685 -814 -424 -505 -847 -756 -681 -1142 -895 -516 -807 -849 220 -357 -827 55 -404 -755 -427 -226 -465 -510 -72
2706 -72 -80 -371 94 63 -165 91 -41 -350 218 262 -241 457 333 236 294 462 279 9 668 597 -49 874 869
2729 869 598 554 835 564 615 931 646 466 809 1098 784 978 1079 773 921 1259 870 731 1069 1114 547
2750 547 1081 1478 795 844 1391 558 981 1155 794 680 1223 735 389 965 502 314 924 669 738 821 1025
$$ packed form
2597A202k56K12r1l20K76J56l24J9L71l92l7L50m39L2J74j63k74N21j35o51J31
2618C62M68q48N91K63l74j13L28l74l88Q52r36K3K18j06l08M45k14r2J88p9l18
2639d12K40J94k78q1k02p3n8K6Q3m09L31j71N8L31o3j48j87J92k37N4j6l6m8J93
2663g17o1L0r1O5j44K22j16k82j21L67K04o87L26J65j12J6M68l40j56N05j04k51
2685h14L90q1l42R1P5m61K47L79k91m2J069n77m70Q82m59l51L28K01k39m5M38
2706g2qk91M65l1k28K56j32l09N68M4n03O98j24r7N8J68j83k70O59p1o46R23n
2729H69k71m4K81k71N1L16k85j80L43K89l14J94J01l06J48L38l89j39L38M5n67
2750E47N34L97o83M9N47q33M23J74l61j14N43m88l46N76m63j88O10k55O9Q3K04
$$ plain form
2771 1025 238 158 1226 414 139 599 186 -245 101 290 19 114 311 -238 -481 172 -283 -15 238 47
2791 47 -366 -66 -318 -725 -330 -556 -990 -570 -639 -792 -891 -217 -616 -1004 -433 -722 -1357 -689 -480 -1024 -1104
2812 -1104 -667 -664 -1043 -621 -801 -1300 -1169 -1268 -870 -1205 -648 -712 -808 -893 -999 -972 -989 -616 -1223 -661 -769 -434
2834 -434 -723 -352 -575 -805 -686 -840 -732 -448 -676 -836 -184 -373 -267 132 -157 -410 -432 -522 -200 -113 175
2855 175 -42 39 -34 -14 132 85 358 62 234 519 588 319 250 193 435 528 277 371 415 441 499 1193 791 510
2879 510 562 523 443 568 712 643 750 770 1094 659 1034 614 374 583 429 623 935 413 601 1045 827 751
2901 751 793 503 781 609 749 943 717 802 767 162 531 664 463 349 477 509 556 319 568 598 303 781
2923 781 58 226 496 150 -46 339 231 -152 399 89 -180 218 326 -15 75 351 -175 -395 -53 -336
$$ packed form
2771A025p87q0J068q12k75M60m13m31L46J89k71R5J97n49k43O53m55K68K53j91
2791D7m13L00k52m07L95k26m34M20o9j53r9O74l99l88N71k89o35O68K09n44q0
2812a104M37Ll79M22j80m99J31r9L98l35N57o4r6q5j06K7j7L73o07N62j08L35
2834d34k89L71k23k30J19j54J08K84k28j60O52j89J06L99k89k53k2r0L22Q7K88
2855A75k17Q1p3K0J46m7K73k96J72K85O9k69o9n7K42R3k51R4M4K6N8O94m02k81
2879E10N2l9q0J25J44o9J07K0L24m35L75m20k40K09j54J94L12n22J88M44k18p6
2901G51M2k90K78j72J40J94k26Q5l5o05L69J33k01j14J28L2M7k37K49L0k95M78
2923G81p23J68K70l46j96L85j08l83N51l10k69L98J08l41R0K76n26k20L42k83
$$ plain form
2943 -336 -572 -114 20 -324 -380 -180 -713 -308 -357 -537 -834 -302 -883 -685 -579 -759 -781 -294 -538 -1166 -811
2964 -811 -541 -1237 -733 -299 -618 -1024 -470 -834 -1025 -724 -593 -904 -777 -578 -799 -675 -540 -578 -585 -619 -875
2985 -875 -1239 -550 -826 -1242 -610 -495 -670 -584 171 -774 -856 -331 -340 -670 -174 50 -382 -151 269 -300 -306 371
3007 371 -493 -268 210 -127 -288 400 193 12 38 268 -49 125 443 163 417 756 675 353 556 981 334
3028 334 614 686 450 490 955 681 875 1135 772 728 822 992 524 959 767 402 700 661 767 821 1198 489
3050 489 595 1134 617 649 1116 965 588 582 551 614 441 719 316 569 539 225 375 724 598 511 510 585 218
3073 218 459 328 -117 -191 122 -35 -257 113 -35 109 38 237 -184 -405 -161 -459 -373 -166 -370 -298 -163
3094 -163 -321 -504 -347 -146 -539 -484 -712 -574 -639 -488 -646 -605 -288 -409 -714 -618 -767 -739 -605 -540 -549 -788 -663
$$ packed form
2943c36k36M58J34l44n6K00n33M05m9j80k97N32n81J98J06j80k2M87k44o28L55
2964h11K70o96N04M34l19m06N54l64j91L01J31l11J27J99k21J24J35l8pl4k56
2985h75l64O89k76m16O32J15j75Q6P55r45q2N25rl30M96K24m32K31M20n69oO77
3007C71q64K25M78l37j61O88k07j81K6K30l17J74L18k80K54L39q1l22K03M25o47
3028C34K80P2k36M0M65k74J94K60l63m4R4J70m68M35j92l65K98l9J06N4L77p09
3050D89J06N39n17L2M67j51l77ol1O3j73K78m03K53l0l14J50L49j26q7jP5l67
3073B18K41j31m45p4L13j57k22L70j48J44p1J99m21k21K44k98Q6K07k04P2J35
3094a63j58j83J57K01l93N5k28J38o5J51j58M1L17j21l05R6j49K8J34O5rk39J25
$$ plain form
3117 -663 -818 -768 -462 -1032 -868 -224 -681 -712 -429 -698 -580 -489 -501 -547 -363 -394 -822 -491 -546 -702 -425 -278
3139 -278 -354 -288 -130 -360 -496 -370 -144 -247 -225 -258 -420 -290 -382 -377 -305 30 -103 -382 -162 139 -186 -1 -192
3162 -192 -36 -108 45 54 88 77 198 -75 228 295 30 144 390 309 373 784 459 440 740 449 493 684 618 654
3186 654 352 959 662 585 838 711 668 849 530 539 632 887 454 727 1212 862 875 840 649 630 913 853 289
3209 289 616 810 436 865 867 771 514 713 539 155 429 765 250 524 437 129 345 401 90 -23 386 163
3231 163 295 133 -3 -257 146 171 -183 -231 -136 -148 23 -278 -36 -535 -156 -229 -511 -462 -343 -732 -644 -639 -627
3254 -627 -809 -668 -724 -904 -470 -514 -902 -735 -385 -1074 -631 -732 -815 -1018 -713 -623 -909 -752 -760 -726 -587 -341
3276 -341 -878 -757 -470 -856 -550 -556 -790 -680 -495 -612 -885 -432 -543 -431 -458 40 -512 -430 -46 -285 -59
$$ packed form
3117f63j55N0L06n70J64O44m57l1K83k69J18R1j2m6J84l1m28L31n5j56K77J47
3139b78p6O6J58k30j36J26K26j03K2l3j62J30r2NP2L35j33k79K20L01l25J85j91
3162a92J56p2J53RL4j1J21k73L03O7k65J14K46q1O4M11l25j9L00k91M4J91o6L6
3186F54l02O07k97p7K53j27m3J81l19RR3K55m33K73M85l50J3l5j91j9K83o0n64
3209B89L27J94l74M29Kr6k57J99j74l84K74L36n15K74q7l08K16N6l11j13M09k23
3231A63J32j62j36k54M03K5l54m8R5j2J71l01K42m99L79p3k82M9J19l89Q8NJ2
3254f27j82J41n6j80M34m4l88J67L50o89M43j01q3k03L05R0k86J57qL4J39K46
3276c41n37J21K87l86L06ok34J10J85j17k73M53j11J12k7M98n52Q2L84k39K26
$$ plain form
3297 -59 -46 -270 -383 -114 -151 -251 -54 2 55 123 125 137 -135 152 32 137 -9 225 426 450 405 312 483 656
3321 656 278 109 663 527 308 485 426 398 245 601 445 376 743 697 538 721 419 498 895 619 530 460
3343 460 620 722 532 912 579 695 698 300 420 557 831 315 748 440 393 454 410 -46 172 650 338 561
3365 561 365 608 450 592 188 338 395 343 -294 257 498 -202 284 221 73 -102 16 -70 -174 -112 -76 -144
3387 -144 -23 -263 15 80 -301 -524 -309 173 -343 -420 -248 -383 -504 -346 -297 -735 -588 -612 -639 -779 -388 -789
3409 -789 -626 -220 -504 -604 -360 -842 -853 -446 -489 -777 -592 -660 -794 -644 -425 -729 -868 -418 -838 -922 -440
3430 -440 -507 -597 -297 -548 -555 -523 -351 -564 -744 -293 -435 -402 -396 -343 -563 -107 -447 -500 -366 -68 -465 -312 -1
3453 -1 -279 -289 191 12 -192 257 238 -31 141 175 341 96 299 119 577 536 347 346 742 654 412 545 715
$$ packed form
3297e9J3k24j13K69l7j00J97N6N3O8KJ2k72K87j20J05j46K34K01K4m5r3J71J73
3321F56l78j69N54j36k19J77n9k8j53L56j56o9L67m6j59J83l02P9L97k76q9p0
3343D60J60J02j90L80l33J16Ll98J20J37K74n16M33l08m7O1m4m56K18M78l12K23
3365E61j96K43j58J42m04J50N7n2o37N51K41p00M86o3j48j75J18q6j04O2L6o8
3387a44J21k40K78O5l81k23K15M82n16p7J72j35j21J58M9m38J47k4k7j40L91m01
3409g89J63M06k84j00K44m82j1M07m3k88J85o8j34J50K19l04j39M50m20q4M82
3430d40o7r0L00k51pL2J72k13j80M51j42L3ON3k20M56l40n3J34K98l97J53L11
3453ak78j0M80j79k04M49j9k69J72L4J66k45K03j80M58m1j89jL96q8k42J33J70
$$ plain form
3476 715 257 278 785 -4 641 897 710 443 799 836 733 533 765 704 398 1063 605 586 540 752 664 676
3498 676 731 403 528 944 263 688 380 475 291 861 254 278 267 577 131 349 704 233 208 307 185 232
3520 232 447 298 168 324 147 26 114 -32 -83 151 -233 -131 -78 -93 -260 -427 -98 -144 -309 -502 -167 -128
3542 -128 -612 -253 -335 -189 -355 -493 -397 -785 -512 -660 -526 -483 -546 -557 -413 -290 -566 -461 -603 -721 -550 -402
3564 -402 -455 -362 -418 -568 -530 -629 -359 -885 -257 -525 -577 -782 -470 -359 -414 -481 -460 -434 -345 -422 -673 -487 -401 -492 20
3589 20 -366 -604 -61 -397 -557 -371 -533 -360 -139 -354 -144 -14 -270 81 -71 41 -25 8 67 15 196 341
3611 341 440 100 344 272 76 228 412 250 271 535 482 169 713 363 316 383 606 341 199 610 327 509
3633 509 701 455 567 597 603 435 451 637 547 757 843 531 645 615 698 546 710 646 453 547 580 399 650 599
$$ packed form
3476G15m58K1N07p89O45K56j87k67L56L7j03k00K32o1l06O65m58j9m6K12q8J2
3498F76N5l28J25M16o81M25l08R5j84N70o07K4j1L10m46K18L55m71k5R9j22M7
3520B32K15j49j30J56j77j21Q8j46n1K34l84J02N3j5j67j67L29m6j65j93L35L9
3542a28m84L59q2J46j66j38R6l88K73j48J34M3o3j1J44J23k76J05j42j18J71J48
3564d02n3R3n6j50L8r9K70n26O28k68n2k05L12J11n5o7K1K6Q9p7k51J86Q6r1N12
3589B0l86k38N43l36j60J86j62J73K21k15K10J30k56L51j52J12o6L3N9n2J81J45
3611C41R9l40K44p2j96J52J84j62K1K64n3l13N44l50m7O7K23k65j42M11k83J82
3633E09J92k46J12L0Oj68J6J86r0K10Q6l12J14l0Q3j52J64o4j93R4L3j81K51n1
$$ plain form
3657 599 815 566 800 504 715 592 452 176 259 334 388 249 337 328 27 511 263 -101 -170 279 -152 124
3679 124 21 19 -92 5 -592 -277 -141 -439 -283 -32 -76 -450 -296 -236 -430 -533 -324 -619 -674 -326 -802 -435
3701 -435 -282 -627 -1222 -469 -507 -843 -459 -577 -749 -636 -597 -557 -938 -768 -408 -698 -737 -955 -781 -807 -349 -721
3723 -721 -678 -449 -594 -626 -416 -907 -701 -402 -422 -749 -467 -127 -398 -543 -129 -381 -513 -170 -171 -343 2 -87
3745 -87 -193 26 111 -356 -115 197 -219 -190 470 182 -53 310 77 -124 17 249 -53 429 151 352 320
3766 320 411 301 316 271 497 33 371 485 296 603 385 542 505 516 432 384 669 596 553 496 757 626 357
3789 357 671 467 381 371 344 358 397 455 492 473 667 557 450 499 527 377 550 256 202 467 599 467 371 420
3813 420 -36 103 293 508 -49 367 387 256 59 212 212 257 -24 71 143 77 -128 -259 -5 -300 58 -246
$$ packed form
3657E99K16k49K34k96K11j23j40k76Q3P5N4j39Q8rl01M84k48l64o9M49m31K76
3679A24j03kj11R7n97L15J36k98J56K51m4l74J54O0j94j03K09k95n5L48m76L67
3701d35J53l45n95P53l8l36L84j18j72J13L9M0l81J70L60k90l9k18J74k6M58l72
3723g21M3K29j45l2K10m91K06K99k0l27K82L40k71j45M14k52j32L43jj72L45q9
3745h7j06K19Q5m67K41L12m16K9O60k88k35L63k33k01J41K32l02M82k78K01l2
3766C20R1j10J5m5K26m64L38J14j89L07k18J57l7J1q4m8K85p3m3n7K61j31k69
3789C57L14k04q6j0k7J4L9N8L7j9J94j10j07M9K8j50J73k94n4K65J32j32r6M9
3813D20m56J39J90K15n57M16K0j31j97J53%M5k81R5P2o6k05j31K54k95L58l04
$$ plain form
3835 -246 -20 -327 -64 6 -97 -134 -122 -553 -72 -139 -275 -647 -711 -467 -434 -410 -609 -474 -441 -365 -533 -244 -375
3858 -375 -486 -393 -285 -494 -609 -427 -551 -638 -372 -556 -716 -315 -650 -457 -615 -619 -570 -456 -572 -572 -142 -269
3880 -269 -352 -211 -307 -220 -417 -541 -267 -399 -113 -140 -339 -391 -397 -242 -405 -209 -153 -284 72 -273 -148 -124 50
3903 50 106 139 285 189 300 325 239 73 330 370 373 249 151 72 320 272 395 663 609 623 466 727 496 268 548
3928 548 576 348 561 628 742 684 836 180 385 798 390 535 676 694 618 680 707 552 379 457 358 190 565
3951 565 888 385 468 427 542 347 416 85 333 471 315 1 91 -184 75 310 -187 254 33 188 -159
3972 -159 -10 72 36 -203 -27 -7 -105 -80 24 -270 -433 -326 -151 -496 -410 -261 -462 -370 -292 -440 -452 -684 -707
3995 -707 -251 -146 -750 -208 -398 -305 -511 -304 -756 -686 -523 -405 -746 -588 -759 -435 -252 -708 -598 -407 -374
$$ packed form
3835b46K26l07K63P0j03l7J2m31M81o7j36l72o4K44L3K4j99J35L3P6j68K89j31
3858c75j11R3J08k09j15J82j24q7K66j84j60M01l35J93j58mM9J14j16%M30j27
3880b69q3J41r6Q7j97j24K74j32K86k7j99n2oJ55j63J96N6j31L56l45J25K4J74
3903E0N6L3J46r6J11K5q6j66K57M0Lj24r8p9K48m8J23K68n4J4j57K61k31k28K80
3928E48K8k28K13O7J14n8J52o56K05M13m08J45J41J8p6O2K7j55j73P8r9j68L75
3951E65L23n03Q3m1J15j95O9l31K48J38j56l14R0k75K59K35m97M41k21J55l47
3972a59J49Q2l6k39J76K0r8K5J04k94j63J07J75l45Q6J49k01R2P8j48j2k32k3
3995g07M56J05o04N42j90R3k06K07m52P0J63J18l41J58j71L24J83m56J10J91L3
$$ plain form
4016 -374 -298 -636 -390 -264 -550 -156 -744 -543 -602 -130 -541 -449 -89 -356 -182 -312 -241 -378 -315 -230 -571 -281
4038 -281 -35 -289 -255 -425 -127 -1 -196 -6 -133 152 221 179 -161 61 -63 54 206 273 94 106 425 201
4060 201 285 55 533 121 345 17 446 270 309 654 102 533 397 222 384 328 342 770 339 567 485 237
4082 237 603 492 466 372 404 525 621 607 704 692 529 497 395 355 315 396 679 596 455 452 377 110 447 443 231 380
4108 380 579 528 330 458 12 333 300 383 102 314 224 43 12 272 83 161 9 -27 -462 -127 22 170
4130 170 -432 -35 -29 -298 -185 -420 -354 -293 -268 -203 -128 -123 -319 -239 -297 -559 -390 -532 -461 -547 -521 -500 -307 -664 -394
4155 -394 -668 -597 -268 -624 -729 -544 -403 -707 -525 -409 -690 -402 -662 -913 -428 -506 -500 -606 -604 -441 -330 -562
4177 -562 -222 -390 -182 -75 -406 -334 -181 -361 -160 -91 -491 -291 -127 83 -9 -27 403 -183 108 177 22 119
$$ packed form
4016c74P6l38K46J26k86L94n88K01n9M72m11R2L60k67J74j30P1j37O3Q5l41K90
4038b81K46k54L4j70K98J26j95J90j27K85O9m2l40K22j24J17J52O7j79J2L19k24
4060B01Q4k30M78m12K24l28M29j76L9L45n52M31j36j75J62n6J4M28m31K28q2k48
4082B37L66j11k6r4L2J21R6j4R7j2j63l2j02m0m0Q1K83q3j41lp5k67L37mk12J49
4108C80J99n1j98J28m46L21l3Q3k81K12r0j81l1K60j89P8j52l6m35L35J49J48
4130A70o02L97Ok69J13k35O6O1K5O5P5Nj96Q0n8k62J69j42P1q6K6K1J93l57K70
4155c94k74P1L29l56j05J85J41l04J82J16k81K88k60k51M85p8Oj06KJ63J11k32
4177e62L40j68K08J07l31P2J53j80K01O9m00K00J64K10r2j8M30n86K91O9j55R7
$$ plain form
4199 119 230 25 -76 375 341 176 165 69 83 31 406 358 339 328 497 262 630 445 135 529 436 415 327 733
4223 733 545 239 421 432 244 529 553 406 618 520 595 561 435 347 401 648 511 452 582 379 468 470 634 345
4247 345 459 405 129 212 252 60 203 50 130 453 72 412 -47 187 175 197 221 258 80 187 265 49 -164
4270 -164 10 115 -229 -7 -57 -170 -257 -285 -195 64 -303 -255 -409 -296 -216 -467 -234 -470 -375 -168 -114 -484 -301
4293 -301 -267 -355 -331 -526 -411 -276 -763 -672 -656 -558 -460 -495 -377 -589 -437 -620 -471 -400 -762 -696 -504 -598 -472 -373
4317 -373 -681 -698 -371 -662 -401 -400 -511 -482 -633 -117 -412 -358 -497 -351 -317 -451 -470 -378 -400 -279 -73 -41 -55 -2
4341 -2 132 -361 -35 -140 -26 62 63 -18 -315 271 150 220 83 309 9 155 182 310 387 207 389 349 291 357
4365 357 422 486 712 551 311 543 231 609 436 695 652 355 357 464 386 672 824 495 644 286 760 565
$$ packed form
4199A19J11k05j01M51l4j65j1r6J4n2L75m8j9j1J69k35L68j85l10L94r3k1q8M06
4223G33j88l06J82J1j88K85K4j47K12r8P5l4j26q8N4K47j37n9J30k03Q9KJ64k89
4247C45J14n4k76Q3M0j92J43j53Q0L23l81L40m59K34j2K2K4L7j78J07P8k16k13
4270a64J74J05l44K22n0j13q7k8R0K59l67M8j54J13Q0k51K33k36R5K07N4l70J83
4293c01L4q8K4j95J15J35m87R1J6R8R8l5J18k12J52j83J49P1l62O6J92r4J26R9
4317c73l08j7L27k91K61Jj11K9j51N16k95N4j39J46L4j34j9R2k2J21K06L2j4N3
4341bJ34m93L26j05J14Q8Jq1k97N86j21P0j37K26l00J46K7J28P7j80J82m0n8O6
4365C57O5O4K26j61k40K32l12L78j73K59m3k97KJ07p8K86J52l29J49l58M74j95
$$ plain form
4387 565 816 532 375 789 371 569 947 499 264 585 406 360 512 284 478 272 734 196 323 191
4407 191 281 -147 42 283 275 394 218 -4 17 107 -155 126 201 -459 -224 -207 231 -100 -312 -222 -357 -165 -237
4430 -237 -496 -440 -160 -608 -136 -269 -59 -412 -393 -245 -581 -343 -465 -674 -411 -636 -544 -386 -678 -353 -415
4451 -415 -495 -613 -632 -474 -402 -558 -356 -341 -505 -592 -571 -137 -299 -297 -413 -514 -340 -474 -551 -291 -378 -188 -391
4474 -391 -171 145 -302 -259 -195 -201 -272 -260 -54 -206 -19 -268 -336 -185 80 -135 97 -40 46 -110 101 88 -2
4497 -2 72 -41 -190 94 32 -74 117 248 6 319 326 296 339 320 296 275 346 509 402 225 353 161 447 712
4521 712 513 482 565 477 570 683 690 255 624 297 58 569 599 517 673 448 496 322 354 635 312 310 476 507
4545 507 392 471 305 243 473 392 340 270 799 49 241 406 146 91 219 83 169 172 -122 66 61 -1 59 -87
$$ packed form
4387E65K51k84j57M14m18J98L78m48k35L21j79m6J52k28J94k06M62n38J27j32
4407A91R0m28J89K41qJ19j76k22K1R0k62K81P5o60K35J7M38l31k12R0j35J92p2
4430b37k59N6K80m48M72j33K10l53J9J48l36K38j22k09K63k25R2J58k92L25o2
4451d15q0j18j9J58P2j56K02J5j64q7K1M34j62Kj16j01J74j34p7K60q7J90k03
4474c91K20L16m47M3O4op1J2K06j52J87k49o8J51K65k15K32j37Q6j56K11j3r0
4497bP4j13j49K84o2j06J91J31k42L13Pl0M3j9k4k1P1J63j07j77J28j92K86K65
4521G12j99l1Q3q8R3J13Pm35L69l27k39N11L0q2J56k25M8j74L2K81l23kJ66L1
4545E07j15P9j66o2K30q1n2p0N29p50J92J65k60n5J28j36Q6Lk94J88no2O0j46
$$ plain form
4569 -87 95 201 -233 -16 -223 -165 -114 -4 -398 -180 -378 -585 9 -377 -496 -195 -407 -385 -351 -776 -274 -406
4591 -406 -439 -303 -474 -304 -796 -520 -471 -429 -458 -389 -653 -577 -456 -640 -385 -694 -591 -656 -621 -706 -558 -473 -329
4614 -329 -655 -512 -554 -439 -526 -392 -306 -403 -306 -308 -298 -268 -288 -276 -191 -152 -406 -426 -124 -38 -285 -169 -83 41 -167
4639 -167 130 55 201 120 401 121 26 167 106 283 440 263 306 442 356 127 530 346 420 436 324 192 524
4662 524 397 497 570 413 674 319 565 393 627 561 466 199 415 573 71 293 692 391 476 456 428 619
4684 619 176 236 108 558 459 363 477 399 438 361 176 269 368 587 136 347 139 221 62 60 104 -109 163 306
4708 306 -112 53 -94 -43 -175 -265 219 58 26 1 -295 -129 151 -231 -338 -276 -134 -232 54 -198 -391 -392 -391
4731 -391 -216 -244 -345 -185 -421 -268 -229 -397 -258 -305 -302 -221 -492 -301 -315 -362 -207 -601 -427 -274 -422 -185 -330
$$ packed form
4569h7J82J06m34K17k07N8N1J10l94K18j98k07N94l86j19L01k12K2L4m25N02j32
4591d06l3J36j71J70m92K76M9M2k9O9k64P6J21j84K55l09J03o5L5q5J48Q5J44
4614c29l26J43m2J15q7J34Q6r7R7kJ0L0k0J2Q5L9k54k0L02Q6k47J16Q6J24k08
4639a67K97p5J46q1K81k80r5J41o1J77J57j77M3J36q6k29M03j84P4J6j12j32L32
4662E24j27J00P3j57K61l55K46j72K34o6r5k67K16J58n02K22L99l01Q5k0k8J91
4684F19m43O0j28M50r9r6J14p8L9p7j85R3R9K19m51K11k08Q2j59kM4k13K72J43
4708C06m18J65j47N1j32r0M84j61l2k5k96J66K80l82j07O2J42r8K86k52j93jJ
4731c91J75k8j01J60k36J53L9j68J39m7LQ1k71J91j4m7J55l94J74J53j48K37j45
$$ plain form
4754 -330 -668 -448 -570 -250 -619 -543 -336 -383 -565 -497 -343 -599 -15 -407 -509 -284 -310 -323 -170 -269 -233 -343
4776 -343 -44 -348 -123 20 -406 -186 -60 -123 51 -294 -286 44 91 19 171 124 -164 -80 77 420 61 -41
4798 -41 282 357 302 256 320 712 293 493 343 271 255 522 459 360 597 890 497 481 329 454 350 425 491 415
4822 415 367 632 536 648 430 596 559 706 475 332 748 368 419 602 403 349 239 367 193 361 461 22
4844 22 390 294 221 348 94 382 344 14 307 132 49 -10 46 95 -107 -10 -18 -359 -168 -50 -123 -129 -61 -219 -158
4869 -158 -267 -393 -351 -228 -317 -169 -215 -435 -412 -376 -501 -504 -83 -366 -598 -311 -354 -288 -415 -264 -546 -512 -230
4892 -230 -399 -640 -344 -358 -489 -446 -639 -209 -517 -684 -368 -378 -425 -423 -371 -488 -369 -289 -188 -337 -175 -282 -63
4915 -63 -194 -448 -309 -324 -447 -203 -433 -451 -113 -283 -82 17 -166 -190 17 43 111 101 -127 -193 -6 -226 70
$$ packed form
4754c30l38K20j22L20l69P6K07m7j82O8J54k56N84l92j02K25k6j3J53r9L6j10
4776c43K99l04K25J43m26K20J26o3J74l45QL30M7p2J52m7k88Q4J57L43l59j02
4798d1L23P5n5m6O4L92m19K00j50p2j6K67o3r9K37K93l93j6j52J25j04P5O6p6
4822D15m8K65r6J12k18J66l7J47k31j43M16l80N1J83j99n4j10J28j74J68J00m39
4844B2L68r6p3J27k54K88l8l30K93j75q3n9N6M9k02R7ql41J91J18p3oO8j58O1
4869a58j09j26M2J23q9J48m6k20K3L6j25lM21k83k32K87m3O6j27J51k82L4K82
4892b30j69k41K96j4j31M3j93M30l08j67L16j0m7KN2j17J19Q0J01j49J62j07K19
4915f3j31k54J39j5j23K44k30j8L38j70K01R9j83k4K07K6O8j0k28o6J87k20K96
$$ plain form
4938 70 -219 108 -43 194 122 101 229 286 -168 139 119 243 221 162 285 203 102 312 608 583 258 686 193
4961 193 466 362 517 542 225 612 126 436 404 307 311 235 303 251 415 353 243 213 321 488 399 760 502 314
4985 314 265 259 464 476 319 386 335 379 514 212 348 232 203 148 239 248 146 256 110 -74 109 184 108 132 -138
5010 -138 93 83 78 -77 -153 21 -117 -132 162 -203 -464 -254 -292 -180 -265 -390 -323 -139 -477 -495 -333 -437 -196
5033 -196 -370 -487 -850 -448 -286 -160 -426 -290 -582 -370 -614 -524 -526 -278 -316 -433 -395 -319 -378 -483 -389 -439 -621
5056 -621 -140 -322 -273 -246 -374 -89 -480 -430 -322 -486 -286 -564 -45 -323 -473 -265 -327 -288 -112 133 -129 52
5078 52 -236 -18 -62 -1 487 -83 319 244 269 37 335 349 218 219 306 -24 267 332 316 257 334 205 260 554 344
5103 344 261 433 512 526 443 519 643 537 469 173 181 667 412 311 442 746 384 364 609 542 252 263 332 545
$$ packed form
4938G0k89L27j51K37p2k1J28N7m54L07k0J24k2n9J23q2j01K10K96k5l25M28m93
4961A93K73j04J55K5l17L87m86L10l2r7Mp6O8n2J64o2j10l0J08J67q9L61k58j88
4985C14m9oK05J2j57O7n1M4J35l02J36j16k9n5R1Rj02J10j46j84J83P5p6K4k70
5010a38K31j0nj55p6J74j38j5K94l65k61K10l8J12q5j25O7J84l38j8J62j04K41
5033a96j74j17l63M02J62J26k66J36k92K12k44R0kK48l8j17L8P6n9j05R4n0j82
5056f21M81j82M9K7j28K85l91N0J08j64K00k78N19k78j50K08o2L9J76K45k62J81
5078E2k88K18m4O1M88n70M02p5K5k32K98J4j31JQ7l30K91O5j6n9P7j29N5K94k10
5103C44q3J72P9J4q3P6J24j06o8k96QM86k55j01J31L04l62k0K45o7k90J1O9K13
$$ plain form
5127 545 179 312 392 291 387 419 306 280 304 248 332 99 89 266 359 57 372 571 -60 17 20 95 37 268 -50
5152 -50 2 39 -181 80 -169 -16 -69 -45 -61 -335 -107 175 -208 -210 152 -196 -217 -262 -198 -471 -268 -331 -312 -233 -254
5177 -254 -285 -129 -367 -296 -388 -206 -376 -576 -539 -423 -500 -559 -314 -681 -89 -471 -322 -576 -435 -142 -560 -521
5199 -521 -572 -566 -461 -87 -289 -209 -235 -523 -355 -538 -444 -473 -207 -312 -386 -312 -324 -153 -273 -353 -258 -182 -87 -244 -276
5224 -276 27 161 27 -33 -87 -193 -117 146 229 -204 166 265 171 -35 181 199 0 367 239 135 290 119
5246 119 437 335 617 386 228 363 310 155 147 341 376 543 686 565 379 360 504 509 500 600 381 608 506
5269 506 644 495 330 605 470 561 291 511 533 589 702 550 194 372 376 307 559 511 299 276 398 332 354
5292 354 272 89 276 -11 202 129 104 10 -22 229 -49 -74 9 -195 -327 -89 -266 -87 33 -361 -335 -378 42
$$ packed form
5127E45l66J33Q0j01R6L2j13k6K4n6Q4k33j0J77R3l02L15J99o31P7LP5n8K31l18
5152e0N2L7k20K61k49J53n3K4j6k74K28K82l83kL62l48k1m5O4k73K03o3J9P9k1
5177b54l1J56k38P1r2J82j70k00L7J16p7n9K45l67N92l82J49k54J41K93m18L9
5199e21n1OJ05L74k02Q0k6k88J68j83R4k9K66j05p4P4j2J71j20q0R5P6R5j57l2
5224b76L03J34j34o0n4j06P6K63Q3m33L70R9r4k06K16J8j99L67j28j04J55j71
5246A19L18j02K82k31j58J35n3j55qJ94L5J67J43j21j86j9J44NrJ00k19K27j02
5269E06J38j49j65K75j35R1k70K20K2N6J13j52l56J78Mo9K52m8k12k3J22o6K2
5292C54q2j83J87k87K13p3k5r4l2K51k78k5Q3k04j32K38j77J79J20l94K6m3M20
$$ plain form
5315 42 8 -10 -340 -243 -230 -299 -494 -484 -599 -297 -126 -803 -408 -339 -434 -409 -326 -351 -482 -523 -568 -299 -473 -435 -456
5340 -456 -503 -377 -354 -443 -499 -461 -503 -533 -564 -621 -326 -119 -209 -285 -359 -357 -288 -414 -196 -156 -344 -49 -80 -261 -119 -218
5366 -218 -281 -197 -384 -68 -106 -145 49 38 -143 290 -60 97 55 -87 374 -50 259 99 64 40 247 377 237
5389 237 96 2 305 255 315 47 341 298 556 423 539 412 150 221 653 497 206 399 278 471 451 551
5411 551 231 259 751 376 351 807 199 435 381 215 928 385 451 288 407 595 283 429 223 274 200 202 395
5434 395 400 218 526 358 331 49 166 87 234 32 384 98 221 169 312 236 41 147 -104 -26 -144 -19
5456 -19 -55 70 -53 -135 -400 -146 -203 -222 -103 -220 -252 -362 -402 -358 -250 -304 -454 -391 -82 -472 -559 -390 -282 -513
5480 -513 -261 -512 -574 -477 -270 -545 -574 -311 -476 -384 -215 -388 -232 -665 -274 -230 -330 -561 -415 -242 -643 -115
$$ packed form
5315D2l4j8l30R7J3o9j95J0j15L02J71o77L95O9r5K5Q3k5j31m1m5K69j74L8k1
5340d56m7J26K3q9n6L8m2l0l1n7K95K07r0p6p4KO9j26K18M0j88K95l1j81J42r9
5366b18o3Q4j87L16l8l9J94j1j81M33l50J57m2j42M61m24L09j60l5k4K07J30j40
5389B37j41r4L03n0O0k68K94m3K58j33J16j27k62P1M32j56k91J93j21J93k0J00
5411E51l20K8M92l75k5M56o08K36n4j66P13n43O6j63J19J88l12J46k06N1p4KJ93
5434C95Nj82L08j68k7k82J17p9J47k02L52k86J23n2J43p6j95J06k51P8j18J25
5456a9l6J25j23q2k65K54n7j9J19j17l2j10m0M4J08n4j50O3L09l90q7J69J08k31
5480e13K52k51o2R7K07k75k9K63j65R2J69j73J56m33L91M4j00k31J46J73m01N28
$$ plain form
5502 -115 -389 -509 -463 -552 -434 -260 -339 -411 -64 -261 -370 -92 -28 77 -3 -52 -81 -162 7 54 142 135 -147 -98 -39
5527 -39 213 426 76 462 119 48 478 344 160 193 44 71 195 444 490 -10 241 438 604 182 188 749
5549 749 682 556 329 467 436 484 438 586 579 334 109 480 375 469 581 532 381 516 465 382 643 650 295 373
5573 373 536 424 505 305 366 349 406 203 225 201 13 139 19 30 184 186 439 -151 117 -40 131 84 225
5596 225 -25 -6 -92 -96 62 -224 39 -88 -174 -293 -146 -463 97 -437 -70 -328 -386 -415 -388 -73 -460 -288 -3
5619 -3 -306 -407 -205 -403 -170 -268 -326 -398 -188 -549 -452 -461 -475 -377 -466 -176 -509 -336 -766 -496 -470 -481 -527 -563 -138
5644 -138 -442 -268 -534 -381 -429 -77 -243 -491 -183 -191 -392 -202 -209 -102 -362 -242 -219 -225 -26 -311 -329 -372 -13
5667 -13 -219 -241 -106 -143 -171 -34 204 73 -120 147 298 294 423 -14 194 155 343 100 55 -16 -71 -21 260 354
$$ packed form
5502a15k74j20M6q9J18J74p9p2L47j97j09K78O4J05q0m9k9q1J69M7Q8pk82M9N9
5527c9K52K13l50L86l43p1M30j34j84L3j49K7J24K49M6n00K51J97J66m22ON61
5549G49o7j26k27J38l1M8m6J48pk45k25L71j05R4J12m9j51J35n1q3K61Pl55P8
5573C73J63j12Q1k00O1j7N7k03K2k4j88J26j20J1J54KK53n90K68j57J71m7J41
5596B25k50J9q6mJ58k86K63j27q6j19J47l17N60n34L67k58n8k9K7L15l87J72K85
5619cl03j01K02j98K33r8n8p2K10l61R7rj4R8q9K90l33J73m30K70K6j1m6l6M25
5644a38l04J74k66J53m8L52j66k48L08qk01J90pJ07k60J20K3oJ99k85j8m3L59
5667a3k06k2J35l7k8J37K38j31j93K67J51mJ29m37K08l9J88k43m5p1n5N0K81R4
$$ plain form
5691 354 292 376 267 524 320 490 375 368 636 176 631 344 372 481 254 537 434 456 438 769 593 717
5713 717 629 352 253 471 627 465 340 240 495 379 376 326 209 280 333 318 289 376 428 282 280 256 86 358 122
5738 122 60 131 -71 63 119 119 199 -29 19 -59 -101 1 138 -48 -133 -94 -210 -94 -375 -222 -61 -207 -178 -238
5762 -238 -455 -382 -499 -194 -149 -363 -337 -291 -665 -524 -138 -283 -541 -436 -591 -523 -416 -526 -340 -301 -568 -277
5784 -277 -441 -454 -359 -341 -378 -390 -417 -323 -626 -423 -460 -435 -274 -284 -115 -515 -540 -175 -38 -211 -286 -130 -75 -185
5808 -185 -141 -79 92 119 -140 361 96 -131 -145 93 62 -27 -50 -34 17 -18 -25 173 329 -1 313 38 -20 220
5832 220 211 356 7 320 274 106 162 169 396 259 202 257 109 313 317 430 278 215 318 500 207 562 510 302
5856 302 278 441 451 216 273 326 17 141 356 378 191 422 395 48 219 357 277 334 259 279 293 237 387 151
$$ packed form
5691C54o2Q4j09K57k04J70j15pK68m60M55k87K8J09k27K83j03K2j8L31j76J24
5713G17q8k77r9K18J56j62j25j00K55j16ln0j17P1N3j5k9Q7N2j46kk4j70K72k36
5738A22o2P1k02J34N6%Q0k28M8p8m2J02J37j86q5L9j16J16k81J53J61j46K9o0
5762b38k17P3j17L05M5k14K6M6l74J41L86j45k58J05j55O8J07j10J86L9k67K91
5784b77j64j3R5J8l7j2k7R4l03K03l7K5J61j0J69m00k5L65J37j73p5J56N5j10
5808a85M4O2J71K7k59N01k65k27j4K38l1q9k3J6N1l5pJ98J56l30L14k75n8K40
5832B20rJ45l49L13m6j68N6PK27j37n7N5j48K04MJ13j52o3J03J82k93L55n2k08
5856C02k4J63J0k35N7N3l09J24K15K2j87K31k7l47J71J38q0N7p5K0J4n6J50k36
$$ plain form
5880 151 466 645 107 319 112 221 233 411 113 269 385 -281 465 119 -57 97 -12 112 -22 -113 -214
5901 -214 73 -51 -51 -275 -78 -162 -33 -420 -104 -30 -219 -405 -287 -503 -337 -299 -182 -121 -468 -320 -266 -156
5923 -156 -202 -163 -441 -556 -545 -388 -441 -377 -263 -97 -540 -299 -348 -110 -345 -625 -389 -521 -278 -307 -336 -329 -224
5946 -224 -125 -433 -426 108 -439 -376 -398 -258 -144 -253 -229 -238 -230 -87 -210 -134 -342 17 -125 -218 311 -368 -201 194
5970 194 161 -79 360 284 -38 -69 -13 365 112 325 207 108 383 325 29 290 378 411 253 430 263 242 307
5993 307 376 37 238 252 388 258 270 267 375 416 390 341 555 516 186 24 593 270 315 406 529 567 225 192
6017 192 183 583 71 151 419 327 229 221 187 175 407 81 105 186 280 383 -208 71 95 -205 84 198 -48 203
6041 203 -134 -97 -66 -212 -76 -123 48 -212 -95 -186 -276 -14 -182 -189 -146 -284 -121 -479 -287 -405 -104 -498 -368
$$ packed form
5880A51L15J79n38K12k07J09J2J78k98J56J16o66P46l46j76J54j09J24j34r1j01
5901b14K87j24%k24J97q4J29l87L16P4j89j86J18k16J66L8J17O1l47J48N4J10
5923a56m6L9k78j15J1J57n3O4J14J66m43K41m9K38k35k80K36j32K43k9k9PJ05
5946b24R9l08PN34n47O3k2J40J14j09K4rQJ43j23P6k08L59j42r3N29o79J67L95
5970A94l3k40M39p6l22l1N6L78k53K13j18r9K75n8k96K61Q8L3j58J77j67k1O5
5993C07O9l39K01J4J36j30J2lJ08M1k6m9K14l9l30j62N69l23M5R1J23L8l42l3
6017A92rM00n12Q0K68r2r8ql4j2K32l26K4Q1R4J03n91K79K4l00K89J14k46K51
6041B03l37L7L1j46J36m7J71k60J17r1r0K62j68pM3j38J63l58J92j18L01l94J30
$$ plain form
6064 -368 -182 -414 -109 -389 -109 -499 -126 -156 -135 -122 -169 -235 -728 -251 -212 -256 -286 -362 -383 -440 -296 -493 -452 -295
6088 -295 -360 -286 -16 -495 -529 -397 -342 -361 -233 -162 -262 16 -481 -249 -368 -21 -205 -74 -274 -116 -90 -76 -172
6111 -172 66 -366 -369 -107 -183 -109 -148 191 26 55 -66 136 105 116 19 107 178 72 147 250 167 83 80 192 278 410
6137 410 292 418 66 251 219 187 150 424 103 345 313 205 299 246 457 486 274 323 357 549 161 537 398
6160 398 410 240 426 419 231 553 305 495 246 236 214 570 220 272 184 383 109 83 178 415 -85 -121 241
6183 241 272 102 46 291 31 220 -77 215 162 75 -273 2 -13 205 -207 -211 -198 -384 13 -207 -333 -233 -369
6206 -369 -158 -649 -416 -303 -219 -27 -409 -440 -524 -234 -412 -321 -120 -564 -376 -578 -295 -26 -270 -354 -422 -256
6228 -256 -432 -545 -545 -176 -174 -288 -159 -393 -289 -315 -167 -110 -252 -176 -292 -149 -165 -165 -202 -268 -296 -263 -39 -107 -343
$$ packed form
6064c68J86k32L05k80K80l90L73l0K1J3m7o6m93M77L9m4l0p6k1n7J44j97M1J57
6088b95o5P4K70m79l4J32N5j9J28P1j00K78m97K32j19L47j84J31k00J58K6J4r6
6111a72K38m32lK62p6P4l9L39j65K9j21K02l1J1r7Q8P1j06P5J03q3q4lJ12Q6J32
6137D10j18J26l52J85l2l2l7K74l21K42l2j08R4n3K11K9k12M9L4J92l88L76j39
6160C98J2j70J86pj88L22k48J90k49j0k2L56l50N2q8J99k74k6R5K37n00l6L62
6183B41L1j70n6K45k60J89k97K92n3q7l48K75j5K18m12mJ3j86L97k20j26J00j36
6206c69K11m91K33J13Q4J92l82l1q4K90j78R1K01m44J88k02K83K69k44q4o8J66
6228b56j76j13%L69Kj14J29k34J04k6J48N7j42P6j16J43j6%l7o6k8L3K24o8k36
$$ plain form
6253 -343 -12 -194 -63 -334 -162 35 -19 -228 307 57 0 200 324 -31 194 10 81 -59 214 -130 -57
6274 -57 13 128 281 246 364 231 359 221 228 278 186 242 497 175 284 105 197 178 271 426 291 413 309 425
6298 425 346 147 284 168 358 348 110 468 763 563 518 357 315 261 232 113 218 287 115 303 178 559
6320 559 183 51 -55 162 112 197 21 43 88 -33 234 205 94 -113 6 117 -74 -70 1 66 -298 -30 -95
6343 -95 -11 62 -9 -257 -110 -447 -144 13 -330 -84 -206 -137 -295 -307 -93 -504 -172 -66 -440 -449 -174 -215 -243
6366 -243 -392 -380 -194 -34 -108 -56 -315 -387 -163 -309 -285 -190 -57 -291 -207 -285 -300 -402 -391 -246 -280 -267 -313 -423
6390 -423 -534 -244 -489 -321 -280 -265 -131 20 -91 -47 -279 -71 -133 -38 -137 56 -426 -277 126 -37 -60 -106 -199
6413 -199 -148 121 147 26 237 175 -30 38 -25 331 251 248 228 198 147 373 322 401 171 120 -20 332 398 222 69
$$ packed form
6253c43L31j82J31k71J72J97n4k09N35k50n7K00J24l55K25j84P1j40K73l44P3
6274e7P0J15J53l5J18j33J28j38PN0r2N6K55l22J09j79R2j9R3J55j35J22j04J16
6298D25p9j99J37j16J90j0k38L58K95k00m5j61m2n4k9j19J05O9j72J88j25L81
6320E59l76j32j06K17n0Q5j76K2M5j21K67k9j11k07J19J11j91MP1O5l64K68o5
6343i5Q4P3p1k48J47l37L03J57l43K46j22O9j58j2K14m11L32J06l74rK75m1k8
6366b43j49J2J86J60p4N2k59p2K24j46K4R5J33k34Q4p8j5j02J1J45l4J3m6j10
6390d23j11K90k45J68M1J5J34J51j11M4k32K08o2R5r9J93m82J49M03j63k3m6r3
6413a99N1K69K6j21K11o2k05O8o3L56q0lk0l0n1K26n1P9k30n1j40L52O6j76j53
$$ plain form
6438 69 227 111 164 363 260 27 151 370 82 95 339 594 350 404 221 176 470 419 270 436 589 388
6460 388 267 350 242 408 485 374 158 126 260 141 67 353 316 134 154 111 464 -250 289 117 -147 177
6482 177 -156 220 25 -37 -134 125 -211 96 55 -336 32 -306 -102 -210 374 -128 -450 -446 62 -260 -393 -418
6504 -418 -299 -268 -379 -26 -120 -1 -393 -259 -433 -236 -325 -184 -366 -174 -118 -129 -193 -404 -414 -69 -393 -308 -543
6527 -543 -87 -328 -476 -194 -407 -281 -144 -275 -349 -254 -200 -386 -431 -199 -162 -71 -96 14 -253 -9 -30 -183 -329
6550 -329 -214 -116 -141 -30 -72 -133 21 70 -31 157 -18 249 -114 106 129 199 22 -4 -134 -85 -59 -26 17 102
6574 102 91 11 138 170 45 273 13 221 176 126 -39 378 232 280 338 417 202 -16 143 320 668 111 195
6597 195 363 303 273 315 508 118 301 49 279 423 32 155 229 611 333 289 373 7 262 135 134 271 243
$$ packed form
6438F9J58j16N3J99j03k33J24K19k88J3K44K55k44N4j83m5K94n1j49J66J53k01
6460C88j21Q3j08J66P7j11k16l2J34j19p4K86l7j82K0m3L53p14N39j72k64L24
6482A77l33L76j95o2r7K59l36L07m1l91L68l38K04j08N84n02l22MN08l22j33k5
6504d18J19L1j11L53r4J19l92J34j74J97q9J41j82J92N6j1o4k11j0L45l24Q5k35
6527e43M56k41j48K82k13J26J37j31p4R5N4j86m5K32L7R1k5J10k67K44k1j53j46
6550c29J15R8k5J11m2o1J54M9j01J88j75K67l63K20K3P0j77k6j30M9K6L3M3Q5
6574A02j1q0J27L2j25K28k60K08m5n0j65M17j46M8N8P9k15k18J59J77L48n57Q4
6597A95J68o0l0M2J93l90J83k52K30J44l91J23P4L82k78m4Q4l66K55j27jJ37k8
$$ plain form
6620 243 -6 526 329 302 153 245 178 121 191 -69 -155 157 64 21 99 47 116 -144 51 210 -378 134 14 -338
6644 -338 -183 -256 -99 -194 -116 -70 -220 -106 -362 -144 -116 -189 -145 -292 -89 -304 -109 -262 -510 -670 -197 -340
6666 -340 -137 -115 -576 -253 -369 -197 -393 -351 -305 -866 -321 -155 -346 -260 -483 -470 -155 -324 -125 -205 -371 -455
6688 -455 -332 -121 1 -313 -161 -429 -128 21 -437 -227 84 -216 74 54 -405 -55 -115 -157 193 -67 118
6709 118 71 -73 47 -63 169 207 111 5 281 165 309 22 303 -15 52 16 27 302 263 99 -74 289
6731 289 80 235 377 243 100 370 352 236 353 113 209 331 317 254 114 242 214 252 332 349 499 224 174
6754 174 -98 277 292 322 65 257 -39 388 145 107 172 338 413 127 254 223 39 60 -105 -30 79 -10 -67
6777 -67 96 147 189 116 266 151 8 341 93 104 -137 -6 -18 130 -121 58 -31 41 -20 -305 -440 -105 -275
$$ packed form
6620B43k49N32j97k7j49R2o7n7P0k60q6L12r3m3P8n2O9k60J95J59n88N12j20l52
6644c38J55p3J57r5P8M6j50J14k56K18K8p3M4j47K03k15J95j53k48j60M73j43
6666c40K03K2m61L23j16J72j96M2M6n61N45J66j91Q6k23J3L15j69J99q0j66q4
6688d55J23K11J22l14J52k68L01J49m58K10L11l00K90k0m59L50o0m2L50k60J85
6709A18m7j44J20j10K32L8r6j06K76j16J44k87K81l18O7l6J1K75l9j64j73L63
6731B89k09J55J42j34j43K70j8j16J17k40R6J22j4o3j40J28k8L8Q0J7J50k75n0
6754A74k72L75J5L0k57J92k96M27k43l8O5J66P5k86J27l1j84K1j65P5J09q9n7
6777f7J63N1M2p3J50j15j43L33k48J1k41J31j2J48k51J79q9P2o1k85j35L35j70
$$ plain form
6800 -275 -122 -205 -71 -412 -225 -225 -151 -125 -196 -152 -233 63 -298 -451 -177 -18 -175 -221 -187 -443 -102 -338 -501
6823 -501 -369 -544 -317 -389 -85 -406 -518 -193 -299 -343 -174 -305 -79 -399 -427 -213 -432 -211 -221 -311 -391 -131
6845 -131 -150 -8 -288 -200 -239 -383 16 -71 -135 124 -32 -180 -50 -43 -86 -163 35 -63 -73 -85 -67 12 -94 275 -131
6870 -131 135 -37 -97 234 127 383 358 105 330 243 363 65 203 315 268 390 516 245 363 400 623 126
6892 126 346 472 69 187 188 222 349 282 340 399 199 77 328 425 247 538 387 372 359 190 423 329 108
6915 108 274 266 321 136 124 254 202 142 186 -41 28 139 -20 235 -64 -94 230 190 -247 129 -96 212 -45
6938 -45 74 168 -73 -104 -211 80 -203 -72 36 -51 143 47 -32 -111 -67 -175 -258 -131 -251 -314 -318 -368 -256 -164 36
6963 36 -32 -24 -244 -255 -180 -280 -73 -274 168 -119 -159 -141 10 -155 -240 2 -63 -353 -129 -400 -334 -103 -125 -343
$$ packed form
6800b75J53q3J34l41J87%P4K6p1M4q1K96l61j53K74J59j57m6L4k56L41k36j63
6823e01J32j75K27p2L04l21j12L25j06m4J69j31K26l20k8K14k19K21j0r0q0K60
6845a31j9J42k80Q8l9j44L99q7o4K59j56j48J30Pm3p7J98r8j0j2J8P9j06L69m06
6870a31K66j72o0L31j07K56k5k53K25q7J20k98J38J12m7J22J26k71J18L7K23m97
6892A26K20J26m03J18JL4J27o7N8N9k00j22K51R7j78K91j51j5j3j69K33r4k21
6915A08J66qN5j85j2J30n2o0M4k27O9J11j59K55k99l0L24m0m37L76k25L08k57
6938d5J19R4k41l1j07K91k83J31J08q7J94r6p9p9M4j08q3J27j20o3mn0J12R2K00
6963C6o8Qk20j1P5j00K07k01M42k87m0J8J51j65q5K42o5k90K24k71O6K31k2k18
$$ plain form
6987 -343 -398 -142 -178 -142 10 -80 -55 -120 223 99 -126 26 -284 -125 20 19 -61 -90 67 77 76 20 -99 -70 223
7012 223 -80 -223 197 82 22 164 170 151 54 -47 251 -7 216 300 79 134 302 112 -10 232 167 209 441
7035 441 327 343 358 414 283 198 238 79 593 45 380 328 340 -88 236 300 -76 242 250 214 370 295 -45 386
7059 386 -4 37 329 187 265 317 255 209 307 233 443 314 -100 233 67 277 109 88 169 159 51 -219 -142 305
7083 305 120 97 -164 -8 90 143 29 106 -182 -114 -108 -332 -217 -34 -66 176 140 -250 82 -286 -246 -137 -87 -80
7107 -80 -58 -283 -240 -502 -404 -141 -288 -281 -359 -360 -360 -98 -172 -190 -288 -564 -411 -253 -176 185 -234 -9 -256 -5 -229
7132 -229 -219 -111 8 -436 -202 -35 -65 -261 -261 -181 -261 -62 -386 -221 140 -318 -315 -166 197 -197 74 -69 51
7155 51 6 -20 151 -211 -81 -159 145 223 -259 128 -26 -85 342 216 -75 145 84 184 163 214 -7 358 232
$$ packed form
6987c43n5K56l6L6J52r0K5o5L43j24k25J52l10J59J45jq0k9J57J0jn6j19K9K93
7012B23l03j43M20j15o0J42Oj9r7j01K98k58K23Q4k21N5J68j90j22K42o5M2K32
7035D41j14J6J5N6j31q5M0j59N14n48L35n2J2m28L24O4l76L18Ql6J56p5l40M31
7059C86l90M1K92j42P8N2o2m6R8p4K10j29m14L33j66K10j68k1Q1j0j08k70P7M47
7083C05j85k3k61J56R8N3j14P7k88O8Ok24J15J83l2K42l6l90L32l68M0J09N0P
7107h0K2k25M3k62R8K63j47Pp8j%K62p4j8r8k76J53J58P7L61m19K25k47K51k24
7132b29J0J08J19m44K34J67l0j96%Q0q0J99l24J65L61m58LJ49L63l94K71j43J20
7155E1m5k6J71l62J30p8L04P8m82L87j54n9M27j26k91K20o1J00k1N1k21L65j26
$$ plain form
7178 232 141 211 391 290 467 119 250 367 275 -79 116 256 123 259 353 139 76 118 3 205 182 297
7200 297 -47 381 146 347 372 210 287 300 171 30 255 66 -80 240 218 320 175 181 74 184 349 21
7222 21 439 -47 185 220 -14 31 -155 68 286 -7 -52 -80 -306 4 -277 -47 69 -190 -133 -101 7 -25 -110
7245 -110 -158 -244 -252 -208 30 -126 -53 -398 -133 -121 -26 12 -179 -123 -326 -239 -345 -190 -1 -140 -21 -37 -257 -165
7269 -165 39 -476 -253 -399 -352 -283 -366 -373 71 -400 -160 -386 -274 -66 -39 -261 -275 -4 -370 54 -18 -264 -158
7292 -158 -78 -215 -184 -78 -151 -6 -159 -390 15 -198 -45 -6 -280 79 -24 -150 -9 149 98 100 60 137 13
7315 13 26 199 228 -151 211 194 39 38 -141 125 208 213 375 158 202 139 232 274 -46 8 404 173 384 184 139
7340 139 174 157 190 244 116 513 -15 120 230 118 275 230 385 -156 278 195 206 173 124 196 398 385 132 148
$$ packed form
7178B32r1P0J80j01J77l48J31J17r2l54J95J40j33J36R4k14o3M2j15K02k3J15
7200B97l44M28k35K01K5j62P7J3j29j41K25j89j46L20k2J02j45Oj07J10J65l28
7222B1M18m86K32L5k34M5j86K23K18k93m5k8k26L10k81K30J16k59N7L2J08l2q5
7245a10m8q6qM4K38j56P3l45K65J2R5L8j91N6k03Q7j06J55J89j39J19j6k20R2
7269a65K04n15K23j46M7O9q3pM44m71K40k26J12K08K7k22j4K71l66M24p2k46J06
7292a58Q0j37L1J06p3J45j53k31M05k13J53L9k74L59j03j26J41J58n1Km0P7j24
7315A3J3J73K9l79L62j7j55jj79K66Q3NJ62k17M4o3R3M2l20N4L96k31K11k00m5
7340A39L5j7L3N4j28L97n28J35J10j12J57m5J55n41M34q3J1l3m9P2K02j3k53J6
$$ plain form
7364 148 45 284 150 26 245 157 144 316 19 25 -98 -177 -88 -19 -156 2 -155 106 -94 10 -264 7
7386 7 -79 -236 -169 -77 259 -421 -320 -31 -432 -205 -121 21 -224 -92 -171 -155 -41 -217 -349 -128 -153 -114 -173 -164
7410 -164 -398 -11 -205 -239 -313 -111 -272 -372 -222 -10 -384 -45 -28 -19 -263 -229 -200 -310 -218 -391 -398 -210 -420
7433 -420 -464 -5 -221 -184 -313 1 -74 -2 -238 -45 -120 -55 -367 -316 36 40 -42 219 118 43 112 -71 203 138
7457 138 119 11 -51 2 9 -104 -39 157 -273 -146 -181 -71 158 262 -142 -4 216 89 82 104 -35 228 154 251
7481 251 3 15 85 229 250 60 485 242 265 287 146 -76 63 131 272 249 272 196 36 298 188 79 142
7504 142 477 74 412 169 261 492 54 20 525 73 78 50 67 29 277 262 217 -45 364 -6 -13 122 247 -356
7528 -356 170 -31 -109 82 112 -69 80 43 80 18 -245 -116 -172 -377 -278 -28 96 127 -181 -46 -50 -347 -271 -199
$$ packed form
7364A48j03K39j34j24K19q8j3J72k97Oj23p9Q9O9j37J58j57K61k00J04k74K71
7386Gq6j57O7R2L36o80J01K89m01K27Q4J42k45J32p9J6J14j76j32K21k5L9n9R
7410a64k34L87j94l4p4K02j61j00J50K12l74L39J7Rk44L4K9j10R2j73pJ88k10
7433d20m4M59k16L7j29L14p5P2k36J93p5O5l12N1L52Mq2K61j01p5O9j83K74o5
7457A38j9j08o2N3Pj13O5J96m30J27l5J10K29J04m04J38K20j27pK2j39K63p4R7
7481B51k48J2P0J44K1j90M25k43K3K2j41k22J39O8J41k3K3p6j60K62j10j09O3
7504A42L35m03L38k43R2K31m38l4N05m52Nk8J7l8K48j5m5k62M09l70pJ35J25o03
7528c56N26k01p8J91L0j81J49l7L7o2k63J29n6k05R9K50J24L1l08J35mk97P6P2
$$ plain form
7552 -199 -490 107 -92 -273 -205 -225 -245 137 -254 -332 -176 -221 -14 -278 -49 -150 -363 -304 -127 -497 -443 -312
7574 -312 -155 -21 -328 -161 -21 -208 -126 -246 -272 -9 -175 91 -300 -14 66 1 -86 -129 -76 133 55 76 -141
7597 -141 128 145 -186 -116 -139 27 54 49 -188 254 92 255 24 -49 245 176 190 -58 -57 157 16 119 -84 116
7621 116 -124 126 -72 -39 48 291 17 255 152 177 353 267 140 -214 184 194 335 309 388 -167 146 329
7643 329 357 430 335 -163 291 249 359 35 211 73 414 125 91 225 -101 93 271 223 157 318 65 -144
7665 -144 25 385 156 56 393 174 -147 14 16 232 218 -31 -45 277 -106 104 108 -193 4 165 24 -103
7687 -103 -79 164 18 4 -302 -131 -45 -56 206 -95 104 -219 -175 -328 -110 -105 -447 -128 -43 -326 -183 -245 -317
7710 -317 -325 -49 -69 -310 -261 -430 -283 -346 -320 -126 -281 -146 -182 -148 -393 -165 -96 -198 -276 -1 -241 -319 -117 35
$$ packed form
7552a99k91N97j99j81O8k0k0L82l91p8J56m5K07k64K29j01k13N9J77l70N4J31
7574c12J57J34l07J67J40j87Q2j20k6K63j66K66l91K86Q0o5q7m3N3K09p8K1k17
7597a41K69J7l31P0k3J66K7nk37M42j62J63k31p3K94o9J4k48JK14j41J03k03K00
7621A16k40K50j98L3Q7K43k74K38j03K5J76q6j27l54L98J0J41k6P9n55L13J83
7643C29K8P3r5m98M54m2J10l24J76j38L41k89l4J34l26J94J78m8o6J61k53k09
7665a44J69L60k29j00L37k19l21J61KK16j4k49j4L22l83K10Ml01J97J61j41j27
7687a03K4K43j46j4l06J71Q6j1K62l01J99l23M4j53K18Nl42L19Q5k83J43o2p2
7710c17qK76k0k41M9j69J47o3K6J94j55J35l6L4k45K28O9j02p8K75k40p8K02J52
$$ plain form
7734 35 -401 -330 -114 -220 17 4 -159 -32 -224 -96 -183 -90 3 -27 -94 -215 37 -142 20 -53 13 254 -75
7757 -75 52 67 -232 275 -94 -38 63 171 115 193 145 -190 43 46 217 -69 154 277 112 76 72 248 215 -31
7781 -31 -13 111 -62 -40 151 194 168 104 176 93 -20 160 356 385 69 256 86 124 140 261 34 232 177 101
7805 101 244 193 -16 117 47 -159 76 -35 138 165 38 91 256 1 307 15 74 181 159 -155 69 399
7827 399 276 147 103 163 -154 -144 -32 -292 -80 327 -165 377 -32 263 -178 -87 -166 -424 -126 -156 -99 -378
7849 -378 -154 -92 43 -143 -150 36 -87 -58 33 -147 267 -278 -50 -242 145 -206 55 -247 -13 -359 -149 -219
7871 -219 -294 -283 -72 -320 -321 -76 -4 -33 -281 -78 -77 -17 -164 -42 47 -158 -247 -142 -163 -54 -326 -165 -114 -120 -220
7896 -220 -35 29 13 -169 -52 186 103 24 -76 -376 -125 19 -169 -78 -23 103 204 -25 -154 -149 -71 178 262
$$ packed form
7734C5m36P1K16j06K37j3j63J27j92J28q7R3R3l0o7j21K52j79J62p3O6K41l29
7757g5J27J5k99N07l69N6J01J08n6P8m8l35K33LJ71k86K23J23j65l6mJ76l3k46
7781c1J8J24j73K2J91M3k6o4P2q3j13J80J96K9l16J87j70L8J6J21k27J98n5p6
7805A01J43n1k09J33p0k06K35j11J73K7j27N3J65k55L06k92N9J07k2l14K24L30
7827C99j23j29m4O0l17J0J12k60K12M07m92N42m09K95m41R1p9k58K98l0N7k79
7849c78K24O2J35j86pJ86j23K9R1j80M14n45K28j92L87l51K61l02K34l46K10p0
7871b19p5J1K11k48jK45P2k9k48K03JO0j47J22Q9k05q9J05k1J09k72J61N1oj00
7896b20J85O4j6j82J17K38q3p9j00l00K51J44j88R1N5J26J01k29j29NP8K49Q4
$$ plain form
7919 262 338 191 275 -168 -36 31 302 210 36 6 255 -155 151 126 264 186 29 178 193 146 458 292 209
7942 209 -156 41 306 222 240 62 304 59 204 175 107 279 150 -12 172 -361 267 307 289 119 -70 51
7964 51 -148 -121 421 400 120 132 20 247 165 -77 -118 19 333 198 58 369 184 90 -94 -192 -333 137 115
7987 115 -311 210 -55 178 -229 -179 -138 -157 97 -210 -32 -84 67 -222 -80 -98 -205 -131 -149 -257 -155 -14
8009 -14 -127 -154 -383 -625 -168 -285 -150 -221 -150 -634 -298 10 -226 -62 -143 -322 -219 57 -175 -323 68 -255
8031 -255 -187 -45 -230 -137 -39 -276 -65 -132 -226 -321 -206 -225 -30 -322 -117 -48 -152 166 -349 21 -118 7 -101
8054 -101 178 104 66 110 -16 -65 47 -50 254 77 101 13 141 51 145 56 259 302 209 151 107 181 -38 -174 57
8079 57 280 325 328 247 243 -83 -121 -108 142 88 146 296 43 57 -129 -75 305 250 224 249 107 112 63 62 -31 280 151
$$ packed form
7919B62P6j47Q4m43J32O7K71r2j74l0K49m10L06k5J38p8j57J49J5m7L12j66q3
7942B09l65J97K65q4J8j78K42k45J45k9o8J72j29j62J84n33O28M0j8j70j89J21
7964E1j99K7N42k1k80J2j12K27q2k42m1J37L14j35j40L11j85r4j84r8j41M70k2
7987A15m26N21k65K33m07N0M1j9K54l07J78n2J51k89J42j8j07P4j8j08J02J41
8009a4j13k7k29k42M57j17J35p1P1m84L36L08k36J64q1j79J03K76k32j48L91l23
8031b55O8J42j85R3R8k37K11o7r4r5J15j9J95k92K05O9j04L18n15L70j39J25j08
8054a01K79p4l8M4j26m9J12r7L04j77K4q8J28r0R4q9K03M3r3n8m4P4k19j36K31
8079E7K23M5Lq1ml26l8J3K50n4N8J50k53J4j86N4L80n5k6K5j42Nm9jr3L11j29
$$ plain form
8106 151 228 -31 106 25 163 -20 -28 -74 153 171 89 193 21 140 193 189 249 193 32 53 88 14 140 4 18
8131 18 117 272 190 -38 -234 9 48 152 -131 137 -71 -323 -63 20 -42 -164 -66 -1 -44 -139 -404 -83 -158 -288
8155 -288 -171 -485 -173 -232 -314 -35 -246 -131 -54 158 -235 -98 -144 -278 -279 -136 -232 -67 -94 -64 -98 -266 -292 -238
8179 -238 -245 88 -125 -256 -228 -252 -257 -154 -190 -340 -62 -196
$$ packed form
8106A51P7k59J37q1J38j83qm6K27J8q2J04j72J19N3mO0n6j61K1L5p4J26j36J4
8131A8R9J55q2k28j96K43L9J04k83K68k08k52K60Q3o2j22R8O5m3r5k65L21p5j30
8155b88J17l14L12n9q2K79k11J15P7K12l93J37m6j34jJ43r6J65k7L0l4j68k6N4
8179b38pL33k13j31K8k4nJ03l6j50K78j34
8191a96
$$ Imaginary data points
##PAGE= N=2
##DATA TABLE= (X++(I..I)), XYDATA
$$ plain form
0 0 0 0 0 0 0 0 0 0 0 0 0 -8 8 -8 8 -8 16 -16 16 -24 24 -32 40 -45 53 -61 71 -80 93 -104 119 -135 152 -173
34 -173 196 -219 244 -272 304 -340 374 -418 461 -509 562 -622 684 -754 831 -917 1007 -1111
52 -1111 1227 -1355 1501 -1665 1853 -2076 2335 -2646 3026 -3503 4121 -4952 6134 -7935 10985
67 10985 -17056 33496 -161535 -407223 218264 69193 -341628 65091 189545 -237445 -51312
78 -51312 180968 -128210 -127646 129651 -37872 -141209 2622 -46931 -84543 25938 -43065
89 -43065 -88435 11549 -55237 -132095 -8140 -5696 -90048 164 28633 -89071 -53078 27806
101 27806 -52595 -88010 -14493 -32193 -81066 -38830 -7762 -33109 -22348 4661 -21554 -55496
113 -55496 -38883 -14482 -21138 -25797 -16642 -19074 -17171 -733 -2568 -18976 -16404 -3418 -3901 -14832
$$ packed form
0@%%%%%%%%%%%qJ6j6J6j6K4l2L2m0M8n6P2q5R8j14J32j51J73j97K23k54K87l25
34a73L69m15M63n16N76o44P14p92Q79r70J071j184J306j438J585j748J924k118
52a111K338k582K856l166L518l929M411m981N672o529P624r073J1086j4069J8920
67A0985k8041N0552j95031k45688O25487j49071m10821M06719J24454m26990J86133
78e1312K32280l09178N64K57297j67523j03337J43831m9553l7612J10481o9003
89d3065m5370R9984o6786p6858J23955K444q4352R0212K8469j17704L5993Q0884
101B7806q0401l5415P3517j7700m8873M2236L1068k5347J0761K7009k6215l3942
113e5496J6613K4401o656m659R155k432J903J6438j835j6408K572J2986m83j0931
$$ plain form
127 -14832 -17417 255 10818 -7183 -13436 3525 -1226 -9438 12863 14296 -3038 23470 39260
140 39260 778 -1612 33542 11177 -23660 4255 21913 874 13460 37823 23910 16475
152 16475 34448 30317 11118 14492 30564 29431 11856 10997 30246 29307 14268 25225 28845 3897
166 3897 11747 42924 31501 19860 44423 41389 14231 21740 27883 7115 8636 25702 17645
179 17645 11328 27441 35476 29199 28725 31352 22626 8832 8236 15108 14101 13454 19328 15546 10688
194 10688 18239 15831 7297 18290 22598 6611 7262 15433 4691 5945 17788 1009 -14174 1156
208 1156 446 -10895 6915 16753 -410 701 7143 -7242 -6445 3491 -12017 -15897 -1637 -13691
222 -13691 -22683 -3364 -5219 -17591 -3527 -10954 -33828 -11656 4025 -24784 -19348 4543 -21558
$$ packed form
127a4832k585J7672J0563j8001o253J6961m751q212K2301J433j7334K6508J5790
140C9260l8482k390L5154k2365l4837K7915J7658k1039J2586K4363j3913p435
152A6475J7973m131j9199L374J6072j133j7575q59J9249r39j5039J0957L620k4948
166C897P850L1177j1423j1641K4563l034k7158P509O143k0768J521J7066q057
179A7645o317J6113Q035o277m74K627q726j3794n96O872j007o47N874l782m858
194A0688P551k408q534J0993M308j5987O51Q171j0742J254J1843j6779j5183J5330
208A156p10j1341J7810R838j7163J111O442j4385P97R936j5508l880J4260j2054
222a3691q992J9319j855j2372J4064p427k2874K2172J5681k8809N436K3891k6101
$$ plain form
235 -21558 -36219 -12602 -22235 -33565 -10015 -17266 -35316 -10723 -8641 -32024 -13622 -8977 -40663
248 -40663 -29070 -16124 -46139 -27817 9239 -25484 -37062 8003 -10922 -46923 -10658 -4235
260 -4235 -45445 -28570 -3664 -31380 -29538 818 -11194 -25489 -10981 -10994 -19797 -12200 -7558 -5824
274 -5824 -2241 -7450 -10931 -5188 -6888 -13424 -12558 -9654 -8044 -5569 -704 7975 11786 9865 11842
289 11842 8387 32 5446 8233 -1331 2728 10824 4585 7636 15192 9336 16568 24285 6828 10817
304 10817 32562 14554 5607 33894 23622 -1269 22765 27617 -97 16377 35207 10278
316 10278 11268 33598 20569 13687 26311 19795 15744 23069 13424 14418 28537 18512 11320 26643
330 26643 20186 5887 18102 22496 9274 10945 19950 14646 6884 9086 17376 12147 361 12784
$$ packed form
235b1558j4661K3617r633j1330K3550p251j8050K4593K082k3383J8402M645l1686
248d0663J1593J2946l0015J8322L7056l4723j1578M5065j8925l6001L6265O423
260d235m1210J6875K4906k7716J842L0356j2012j4295J4508j3q803P597M642J734
274e824L583n209l481N743j700o536Q66K904J610K475M865Q679L811j921J977
289A1842l455q355N414K787r564M059Q096o239L051P556n856P232P717j7457L989
304A0817K1745j8008q947K8287j0272k4891K4034M852k7714J6474J8830k4929
316A0278R90K2330j3029o882J2624o516m051P325r645R94J4119j0025p192J5323
330B6643o457j4299J2215M394j3222J671R005n304p762K202Q290n229j1786J2423
$$ plain form
344 12784 21590 268 4380 26569 6456 -7315 18027 5620 -19666 5184 9086 -18516 1782
357 1782 15644 -11876 881 19663 -11214 -9137 15625 -13151 -21504 9602 -10084 -26477 6948
370 6948 -3883 -31091 159 2367 -30399 -5616 8242 -26256 -11498 11123 -24662 -22241 9208
383 9208 -22616 -35937 3658 -12354 -38889 -837 1164 -34680 -7287 9126 -32404 -23145 9227
396 9227 -22580 -32027 2177 -14032 -31275 -866 -7804 -31691 -4115 -293 -30322 -9423 7023
409 7023 -25898 -16422 8309 -22687 -26679 6616 -15235 -31285 7105 1805 -26107 2226 10298
422 10298 -19975 -6575 6240 -20609 -12022 6201 -15661 -11545 11654 -6336 -7553 15402 -3423
435 -3423 -12693 14893 1636 -16601 14243 13222 -14657 7954 19373 -10323 -557 17429 -5895
$$ packed form
344A2784Q806k1322M112K2189k0113j3771K5342j2407k5286K4850L902k7602K0298
357A782J3862k7520J2757J8782l0877K077K4762k8776q353L1106j9686j6393L3425
370F948j0831k7208L1250K208l2766K4783J3858l4498J4758K2621l5785K421L1449
383I208l1824j3321L9595j6012k6535L8052K001l5844K7393J6413m1530R259L2372
396I227l1807r447L4204j6209j7243L0409o938k3887K7576L822l0029K0899J6446
409G023l2921R476K4731l0996l992L3295k1851j6050L8390n300k7912K8333Q072
422A0298l0273J3400J2815k6849Q587J8223k1862M116K3199j7990j217K2955j8825
435c423r270K7586j3257j8237L0844j021k7879K2611J1419k9696R766J7986k3324
$$ plain form
448 -5895 -1357 21973 5050 729 23745 13643 1560 17062 9463 -2697 13769 10862 -2325
461 -2325 16991 24335 5798 14824 26678 9068 6371 19677 10194 3569 16565 15795 8625 16310
475 16310 20650 14264 12606 15483 15466 13253 11961 13365 13722 13208 13086 11604 9498 10311 9395 7767 11848
492 11848 12751 9048 13127 15133 7090 8665 12493 896 -1877 8374 2602 -4974 6287 7372
506 7372 -1577 4236 7519 -2311 584 5406 -4112 -4428 2628 -4324 -9241 -3298 -6054 -12586 -6535
521 -6535 -3247 -10599 -8194 -278 -6526 -12139 -4239 -5326 -18631 -15972 -7802 -16739 -18368 -6297 -10474
536 -10474 -17061 -6286 -6889 -18126 -11629 -9392 -20985 -14650 -7936 -20435 -15184 -3613 -18149 -19933
550 -19933 -2952 -13733 -23719 -3186 -5537 -22377 -5909 1379 -20084 -14882 -1649 -17638 -18971
$$ packed form
448e895M538K3330j6923m321K3016j0102j2083J5502p599j2160J6466k907j3187
461b325J9316P344j8537R026J1854j7610k697J3306r483o625J2996p70p170P685
475A6310M340o386j658K877j7k213j292J404L57n14j22j482k106Q13r16j628M081
492A1848R03l703M079K006q043J575L828j1597k773J0251n772p576J1261J085
506G372q949N813L283r830K895M822r518l16P056o952m917N943k756o532O051
521f535L288p352K405P916o248n613P900j087j3305K659Q170q937j629J2071m177
536a0474o587J0775o03j1237O497K237j1593O335O714j2499N251J1571j4536j784
550a9933J6981j0781r986K0533k351j6840J6468P288k1463N202J3233j5989j333
$$ plain form
563 -18971 -2977 -10943 -15084 656 -2219 -9104 2418 -874 -12473 -3088 -2180 -13446 -3544 3254
577 3254 -10036 -4560 9570 -1863 -5991 8425 2583 -7159 6934 8858 -3618 4825 11556 -2484
591 -2484 -453 11431 593 -3141 11941 7971 498 14836 14705 820 10164 16243 -1369 1774
605 1774 16296 4332 133 18034 14000 4069 15999 14912 1629 9953 15357 4005 6932 14663
619 14663 7401 8538 15149 7682 7521 13493 6672 4757 14504 12261 7942 13990 11078 4750 8970
634 8970 7433 956 4948 7726 4270 8408 11798 8117 9818 10709 4294 3427 5107 -708 -1120 5130
650 5130 3449 1640 5243 4963 937 1146 2741 1146 -64 748 265 -968 -197 1755 -1878 -6016
666 -6016 -4681 -3863 -6347 -4826 -1725 -2536 -1716 -1629 -4975 -5936 -4072 -7083 -11341 -9967 -7653 -8038 -7834
$$ packed form
563a8971J5994p966m141J5740k875o885J1522l292j1599R385R08j1266R902O798
577C254j3290N476J4130j1433m128J4416n842r742J4093J924j2476Q443O731j4040
591b484K031J1884j0838l734J5082l970p473J4338j31j3885R344O079j7612L143
605A774J4522j1964m199J7901m034r931J1930j087j3283Q324N404j1352K927P731
619A4663p262J137O611p467j61N972o821j915R747k243m319O048k912o328M220
634H970j537o477L992K778l456M138L390l681J701Q91o415q67J680n815m12O250
650E130j681j809L603k80m026K09J595j595j210Q12m83j233P71J952l633m138
666f016J335Q18k484J521L101q11Q20Q7l346r61J864l011m258J374K314l85K04
$$ plain form
683 -7834 -6798 -6636 -6747 -6109 -7690 -11579 -10220 -6179 -9871 -13002 -7050 -7729 -13901 -10033 -7348 -13669
699 -13669 -10918 -4498 -11414 -12275 -3762 -6331 -11064 -8069 -10953 -13139 -8666 -10987 -11335 -4123 -6945
714 -6945 -9991 -1014 -4632 -12065 -1098 -2358 -16179 -5541 2661 -11428 -6386 5671 -7687 -8073
728 -8073 6154 -4297 -9044 6789 1039 -7136 7912 4222 -7873 7015 7054 -10654 2594 12338
742 12338 -6546 1036 18038 2079 622 18908 5016 -5919 14332 9645 -5428 10693 14198
755 14198 -1305 9838 17989 2529 7820 18576 3715 3372 18004 8363 3291 17497 11566
768 11566 97 12810 13776 251 8703 16656 5447 7120 16651 8458 4150 13852 9724 999
782 999 7245 8570 1357 6063 11294 4660 4885 11111 4310 -46 7760 7154 -726 3733 6658 -804
$$ packed form
683g834J036J62j11O38j581l889J359M041l692l131N952o79o172L868K685o321
699a3669K751O420o916q61Q513k569m733K995k884k186M473k321l48P212k822
714f945l046Q977l618p433J0967j260j3821J0638Q202j4089N042J2057j3358l86
728h073J4227j0451m747J5833n750q175J5048l690j2095J4888L9j7708J3248R744
742A2338j8884P582J7002j5959j457J8286j3892j0935K0251m687j5073J6121L505
755A4198j5503J1143Q151j5460N291J0756j4861l43J4632r641n072J4206n931
768A1566j1469J2713R66j3525Q452P953j1209J673R531q193m308R702m128q725
782I99O246J325p213M706N231o634K25O226o801m356P806o06p880M459K925p462
$$ plain form
798 -804 411 5873 -136 -2848 3531 634 -4249 829 3190 -594 224 515 -3973 -3844 -2900 -6054
814 -6054 -5516 -2421 -3787 -4449 -1812 -3068 -4376 -3363 -4131 -7051 -7726 -5879 -6419 -7697 -5531 -3896
830 -3896 -7349 -7943 -5300 -8062 -9419 -4568 -5915 -9989 -4515 -3263 -9865 -6835 -3478 -11152 -10814 -4338
846 -4338 -9550 -10703 -1214 -4711 -9705 -2136 -4093 -11531 -5543 -3267 -11375 -7253 -2095 -8364 -6144
861 -6144 -285 -5642 -6290 -1122 -6572 -8194 -729 -3049 -7280 275 -698 -7610 -2108 826 -6766 -3336
877 -3336 3078 -3331 -3603 4513 1001 -3252 3288 1891 -5141 -579 2508 -3094 -235 5709 2143
892 2143 1812 6734 3544 1021 5924 3802 19 5171 5324 902 5581 7746 1589 5097 8796 2360
908 2360 3483 11390 6618 3592 11693 9248 2682 8782 9013 922 5160 9882 4086 5582 11811
$$ packed form
798h04J215N462o009k712O379k897m883N078K361l784Q18K91m488J29R44l154
814f054N38L095j366o62K637j256j308J013p68k920o75J847n40j278K166J635
830c896l453n94K643k762j357M851j347m074N474J252o602L030L357p674L38O476
846d338n212j153R489l497m994P569j957p438N988K276q108M122N158o269K220
861f144N859n357o48N168n450j622P465k320m231P555r73o912N502K934p592L430
877c336O414o409k72Q116l512m253O540j397p032M562L087n602K859N944l566
892B143l31M922l190k523M903k122l783N152J53m422M679K165o157L508L699o436
908B360J123P907m772l026Q101k445o566O100K31q091M238M722n796J496O229
$$ plain form
923 11811 7432 6342 11345 6903 4116 8891 6974 3104 7929 8210 3376 7202 9012 3549 4626
938 4626 8252 2861 2582 8486 4949 1923 7648 5757 -932 3475 5092 -1785 1013 6147 -47
953 -47 -180 6194 1324 -3050 3344 1060 -6417 -1755 1006 -5862 -2152 2720 -3127 -3496 1165 -4069
969 -4069 -6780 -1484 -5055 -7295 -2258 -5371 -8971 -2537 -4431 -10789 -4041 -2888 -11816 -6946 -1213
984 -1213 -9037 -7914 -262 -7697 -11670 -4038 -7524 -13120 -6468 -5092 -10201 -5974 -3605 -7978 -5532
999 -5532 -4157 -8273 -7064 -5200 -8518 -7415 -4651 -6706 -6011 -2854 -5026 -5458 -3536 -4471 -4677 -3255
1015 -3255 -3621 -2801 -2010 -3450 -2736 -1862 -4257 -2770 177 -2753 -1478 2964 -99 -518 3999 814
1031 814 -1783 3353 1395 -3478 3190 3907 -1480 3804 6607 -433 3093 7812 581 1295 9126 3942
$$ packed form
923A1811m379j090N003m442k787M775j917l870M825K81m834L826J810n463J077
938D626L626n391k79N904l537l026N725j891o689M407J617o877K798N134o194
953d7j33O374m870m374O394k284p477M662K761o868L710M872n847l69M661n234
969d069k711N296l571k240N037l113l600O434j894o358O748J153q928M870N733
984a213p824J123P652p435l973P632l486n596O652J376n109M227K369m373K446
999e532J375m116J209J864l318J103K764k055O95L157k172m32J922r35k06J422
1015c255l66Q20P91j440P14Q74k395J487K947k930J275M442l063m19M517l185
1031H14k597N136j958m873O668P17n387N284K803p040L526M719p231P14P831n184
$$ plain form
1047 3942 686 8091 5278 816 7125 5789 392 6076 7331 1072 6255 10259 3198 5758 10255
1062 10255 2743 1920 9712 4433 245 9000 8178 1235 7224 9830 1621 3194 9227 2823 407
1077 407 7409 5885 1199 6259 7997 1952 3798 6846 2202 1366 5339 3110 1216 4857 2677
1092 2677 -72 4058 3167 -1728 1901 4243 -1082 1697 5561 -102 -132 4808 -482 -3966 1490 -791
1108 -791 -5945 -972 857 -4037 -1086 1643 -3134 -2279 1282 -2455 -3996 -991 -2540 -4817 -2731
1123 -2731 -3368 -4846 -4165 -4816 -5943 -4064 -4310 -5069 -3114 -3619 -5359 -3462 -3202 -6554 -5855 -4625 -6555
1140 -6555 -6708 -4303 -5290 -6644 -5637 -4817 -5255 -6121 -5737 -4537 -5697 -5926 -3710 -3931 -6077 -4376 -2840
1157 -2840 -6278 -6174 -2384 -4261 -6875 -3174 -1546 -5134 -3610 -1235 -3834 -4175 -1415 -2249 -3457 -1073
$$ packed form
1047C942l256P405k813m462O309j336n397N684J255o259N183M004p061K560M497
1062A0255p512q23P792n279m188Q755q22o943N989K606q209J573O033o404k416
1077D07P002j524m686N060J738o045J846L048m644q36L973k229j894L641k180
1092B677k749M130q91m895L629K342n325K779L864n663l0M940n290l484N456k281
1108g91n154M973J829m894K951K729m777Q55L561l737j541L005j549k277K086
1123b731o37j478O81o51j127J879k46p59J955n05j740J897K60l352O99J230j930
1140f555j53K405r87j354J007Q20m38q66L84J200j160k29K216k21k146J701J536
1157b840l438J04L790j877k614L701J628l588J524K375k599l41K760q34j208K384
$$ plain form
1173 -1073 -587 -1419 53 -374 -746 85 -1364 -2057 660 535 -1668 1856 3137 512 2410 4526 1704
1190 1704 1864 4199 1739 1987 5421 3170 1932 5495 3759 2130 6424 4730 1491 6508 6969 2121
1206 2121 6194 9380 2638 4311 9298 3525 2149 8587 4967 1066 8495 7471 1840 6860 8331
1221 8331 1798 5092 8665 2743 3583 7737 2567 2005 7348 3828 1123 6417 4924 669 5144
1236 5144 5006 365 2657 4506 -336 833 3880 602 -355 3155 1195 -520 2691 868 -2047
1251 -2047 825 1080 -3126 -1199 1705 -2983 -3544 1040 -1493 -5055 -994 -962 -6016 -2318 892 -4820
1267 -4820 -4731 881 -3148 -6427 -768 -2952 -7901 -2755 -2061 -7797 -3378 -301 -7080 -4709 41 -6136
1283 -6136 -6723 -376 -5107 -8238 -810 -2852 -8542 -1330 -600 -8230 -4491 -376 -7035 -5831 -922
$$ packed form
1173a073M86q32J472m27l72Q31j449o93K717j25k203L524J281k625J898K116k822
1190A704J60K335k460K48L434k251j238L563j736j629M294j694l239N017M61m848
1206B121M073L186o742J673M987n773j376O438l620l901P429j024n631N020J471
1221H331o533L294L573n922Q40M154n170n62N343l520k705N294j493m255M475
1236E144j38m641K292J849m842J169L047l278r57L510j960j715L211j823k915
1251b047K872K55m206J927K904m688n61M584k533l562M061L2n054L698L210n712
1267d820Q9N612m029l279N659k184m949N146O94n736M419L077o779K371M750o177
1283f136n87O347m731l131P428k042n690P212P30p630L739M115o659J204M909
$$ plain form
1298 -922 -5866 -5648 -161 -4048 -6056 89 -2489 -6523 -1042 -761 -6040 -1890 -96 -5072 -2764 801
1314 801 -3982 -4355 491 -1477 -3404 -29 -333 -1846 357 172 -1080 582 810 -1353 -377 642
1330 642 -577 -620 860 341 216 1449 1714 988 1895 2890 2514 1530 2637 3394 1614 629 3314 2787
1348 2787 1354 3410 3891 2030 2824 4712 3082 2669 4914 3934 2785 4903 4740 2907 4811 4470
1364 4470 2972 4431 4830 2321 3231 5680 3298 2975 5404 4306 3177 5013 4415 2862 4465 4386
1380 4386 2796 3963 4377 1882 3347 4402 1109 2464 4279 958 574 4307 1668 -809 3274
1395 3274 3334 -530 1751 2890 -633 395 2456 -732 -1433 759 -994 -1853 117 -1271 -1874 -2
1411 -2 -1384 -2375 -136 -1584 -4188 -1524 -1119 -4741 -3155 -858 -3941 -4244 -1557 -3613 -5243 -3076
$$ packed form
1298i22m944K18N487l887k008O145k578m034N481K81n279M150J794m976K308L565
1314H01m783l73M846j968j927L375l04j513K203j85j252J662K28k163R76J019
1330F42j219m3J480n19j25J233K65p26R07R95l76r84J107P57j780r85K685n27
1348B787j433K056M81j861P94J888j630m13K245r80j149K118j63j833J904l41
1364D470j498J459L99k509R10K449k382l23K429j098j129J836n98j553J603p9
1380D386j590J167M14k495J465J055l293J355J815l321l84L733k639k477M083
1395C274O0l864K281J139l523J028K061l188p01K192j753q59J970j388o03J872
1411bj382r91K239j448k604K664M05l622J586K297l083l03K687k056j630K167
$$ plain form
1427 -3076 -3413 -4977 -3944 -3090 -3897 -3398 -3148 -3816 -3290 -3948 -5157 -4300 -4131 -5456 -4727 -2990 -4054 -4671
1445 -4671 -2769 -3402 -5195 -3771 -2354 -4983 -4861 -1525 -2471 -4204 -1392 -1329 -4035 -2326 -1204 -4061
1461 -4061 -3571 -941 -2962 -2566 292 -950 -2123 664 -157 -2039 157 111 -1710 878 2046 -1160
1477 -1160 370 2312 -213 -281 2284 435 3 2478 2162 857 3182 3482 1666 2681 3729 1681
1493 1681 1374 2783 2633 2353 3231 2623 1988 3328 3868 2774 2734 3831 4012 2826 3088 3898 3332 3167
1511 3167 3996 2859 2298 3653 3087 2065 3903 3921 1290 3192 4011 1408 3017 4852 1430 1767 5392
1528 5392 2306 -99 4535 3075 -935 2559 3039 -1274 1426 4361 326 597 3467 334 -619 3050
1544 3050 1179 -1359 1779 1026 -1799 1551 1939 -2366 98 2311 -3024 -2246 1632 -1351 -2653 1938
$$ packed form
1427c076l37j564J033Q54q07M99K50o68N26o58j209Q57J69j325P29J737j064o17
1445d671J902o33j793J424J417k629J22L336r46j733K812O3k706J709J122k857
1461d061M90K630k021L96K858j242j173K787q21j882K196m6j821K588J168l206
1477a160J530J942k525o8K565j849m32K475l16j305K325L00j816J015J048k048
1493A681l07J409j50k80Q78o08o35J340N40j094m0J097J81j186K62Q10n66j65
1511C167Q29j137n61J355n66j022J838J8k631J902Q19k603J609J835l422L37L625
1528E392l086k405M634j460m010L494M80m313K700K935m035K71K870l133r53L669
1544C050j871k538L138p53k825L350L88m305K464K213n335P78L878k983j302M591
$$ plain form
1560 1938 -396 -3429 -127 144 -3636 -2087 -362 -3223 -2640 -1029 -2654 -2679 -599 -2732 -3253 -891
1576 -891 -2983 -4601 -1637 -1620 -4676 -2313 -831 -4407 -3852 -823 -3860 -4765 -1626 -2816 -5219 -2704
1592 -2704 -1711 -4745 -3376 -1509 -4359 -3815 -1649 -3222 -3656 -1414 -2759 -4329 -1595 -1460 -4052 -2456
1608 -2456 -1192 -3517 -2196 -104 -2598 -3171 -650 -1687 -2985 -590 -380 -1940 -525 218 -1454 -270
1624 -270 919 -1084 -158 1202 -1232 -1113 1551 688 -210 2510 1959 -226 1661 1901 -156 1801 3043
1641 3043 1320 1941 3921 1765 2116 3905 2104 1572 3612 2009 552 4236 4121 1854 4306 4883
1657 4883 1540 3067 4914 2425 2388 4906 2819 1551 4036 3897 2763 3302 2643 1972 3028 2381 1981
1674 1981 3291 2972 2572 3841 2849 1704 3080 2795 826 1673 2199 731 1115 2197 1476 1157 1451
$$ packed form
1560A938k334l033L302K71l780J549J725k861N83J611j625k5K080k133n21K362
1576h91k092j618K964J7l056K363J482l576N55L029l037r05L139j190k403K515
1592b704R93l034J369J867k850N44K166j573m34K242j345j570K734J35k592J596
1608b456J264k325J321K092k494n73K521j037j298K395K10j560J415P43j672J184
1624b70J189k003R26J360k434J19K664q63q98K720n51k185J887K40k057J957J242
1641C043j723O21J980k156L51J789j801n32K040j603j457L684j15k267K452N77
1657D883l343J527J847k489l7K518k087j268K485j39j134N39o59o71J056o47m00
1674A981J310l19m00J269r92j145J376k85j969Q47N26j468L84J082p21l19K94
$$ plain form
1691 1451 706 515 1023 20 392 764 13 177 532 -802 -559 79 -1382 -1686 -954 -1203 -1633 -487
1709 -487 -1320 -1468 -499 -1599 -2535 -587 -1175 -3369 -1331 -1283 -3588 -2228 -1196 -3934 -2952 -758 -3469
1726 -3469 -4468 -685 -1833 -3946 -1268 -1501 -4406 -2197 -1184 -3915 -3193 -894 -3383 -4094 -1713 -1930
1742 -1930 -3786 -1823 -1450 -3728 -2130 -877 -2465 -2001 -203 -2005 -3036 -1081 -1668 -2915 -1047 -1604
1758 -1604 -3001 -942 -352 -2305 -1095 832 -1754 -1656 956 -886 -2361 594 493 -2165 384 1234
1774 1234 -1825 -589 2261 -692 -1221 1881 308 -1211 1682 1901 -79 1854 2093 -108 1047 2662
1790 2662 318 1145 2772 746 258 3268 1878 402 3236 2515 363 2154 3276 1157 1586 3667
1806 3667 2302 1565 3306 2447 1275 2516 2809 1328 2469 2537 1741 2486 3138 2284 2314 2995 1981 1401
$$ packed form
1691A451p45j91N08j003L72L72p51J64L55j334K43O38j461l04P32k49m30J146
1709d87q33j48R69j100r36J948n88k194K038M8k305J360J032k738R82K194k711
1726c469r99L783j148k113K678k33k905K209J013k731P22K299k489p11K381k17
1742a930j856J963L73k278J598J253j588M64J798j802j031J955n87j247J868n57
1758a604j397K059N90j953J210J927k586R8K612j842j475K955j01k658K549Q50
1774A234l059J236K850k953n29L102j573j519K893K19j980J933K39k201J155J615
1790B662k344Q27J627k026m88L010j390j476K834p21k152J791J122k119M29K081
1806C667j365p37J741q59j172J241K93j481J141O8p96P45O52q54L0O81j014n80
$$ plain form
1824 1401 2933 2615 1521 1942 2673 1657 1224 2784 2255 1334 1765 2006 694 1628 1863 731 939 1702
1842 1702 910 351 1298 566 64 577 186 -541 191 557 -999 -336 667 -618 -1168 24 -795 -1960
1860 -1960 -750 -666 -2384 -1229 -448 -1830 -1491 -614 -1873 -2490 -1608 -2444 -2652 -1853 -2101 -3189 -1835 -1919
1878 -1919 -3212 -1947 -1679 -3033 -2468 -2078 -3248 -3041 -1759 -2533 -3146 -1301 -2372 -3200 -2146 -2237 -3369
1895 -3369 -2102 -2142 -3067 -1638 -1260 -2764 -1898 -506 -2268 -2287 -687 -1806 -2360 -444 -925 -2192 -648
1912 -648 40 -1654 -891 -55 -1662 -1047 483 -407 -405 944 126 -728 801 740 -301 554 1256 -23 133
1931 133 1379 619 597 2207 1279 353 1897 1704 614 1597 2394 1080 1574 2573 1071 765 2526 1695
1949 1695 742 2600 2485 1083 2809 2879 1156 1843 3098 903 1561 3128 1312 1328 3074 1713 768
$$ packed form
1824A401J532l18j094M21P31j016m33J560n29r21M31K41j312R34K35j132K08P63
1842A702p92n59R47p32n02N13l91p27P32L66j556O63J003j285n50J192q19j165
1860a960J210Q4j718J155P81j382L39Q77j259o17Q82q36k08P99k48j088J354q4
1878a919j293J265K68j354N65L90j170K07J282p74o13J845j071q28J054r1j132
1895c369J267m0r25J429L78j504Q66J392j762j9J600j119n54J916m81j267J544
1912f48O88j694P63Q36j607O15J530q90KJ349q18q54J529o1j041Q55P02j279J56
1931A33J246p60k2J610r28r26J544j93j090R83P97j314M94R99j502l06J761q31
1949A695r53J858j15j402J726P0j723O87J255k195O58J567j816J6J746j361r45
$$ plain form
1966 768 2643 2297 361 2142 2757 235 1835 2796 998 1300 2802 1038 621 1914 1121 224 1782
1983 1782 1636 20 1318 1676 -128 481 1292 204 254 1100 492 -251 1066 1076 -302 201 437 -594
2001 -594 -744 -54 -681 -919 -311 -699 -874 -375 -223 -975 -1069 -571 -1166 -1484 -561 -992 -1606 -880 -1202 -2072
2021 -2072 -1625 -1151 -2250 -1966 -1038 -1858 -2128 -1253 -1306 -2152 -1306 -1512 -2661 -1950 -1409 -2452 -2478 -1294 -1954
2040 -1954 -2396 -1118 -1351 -2539 -1284 -1094 -2168 -1881 -930 -1794 -2670 -989 -1431 -2171 -1353 -762 -1942 -1279
2058 -1279 -821 -1600 -1469 -503 -1388 -1302 -57 -981 -1326 223 -210 -1474 314 -138 -1493 -105 808 -835
2076 -835 -316 1174 211 -217 1155 734 -163 1207 1023 179 1007 1685 753 994 2006 729 941 2244
2094 2244 1109 945 2346 1735 1207 2496 2351 1401 2027 2401 1661 1754 2420 1539 1533 2613 1985 1560 2414
$$ packed form
1966G68J875l46j936J781O15k522J600R61j798L02J502j764m17J293p93q97J558
1983A782j46j616J298L58j804O09Q11j088N0Q46o08p43J317J0j378N03K36j031
2001e94j50O90o27k38O08l88j75M99J52p52r4M98n95l18R23m31o14P26l22q70
2021b072M47M74j099K84R28q20k70Q75n3q46Q46k06j149P11N41j043k6J184o60
2040a954m42J278k33j188J255J90j074K87R51q64q76J681m42p40Q18N91j180O63
2058a279M58p79J31R66q85Q6J245r24l45J549m33j264J788m52j355J388R13j643
2076h35N19J490r63m28J372m21q97J370j84q44Q28O78r32K41J012j277K12J303
2094B244j135j64J401o11n28J289j45r50O26L74p40R3O66q81oJ080o28m25Q54
$$ plain form
2113 2414 2219 1216 2194 2287 1442 1967 2398 1513 1328 2086 1538 981 1734 1462 902 1470 1478 952 1541 1630 1013
2134 1013 969 1050 379 649 1044 178 163 701 113 -173 698 369 -844 20 137 -996 -389 112 -881 -1238
2154 -1238 -347 -876 -1467 -588 -542 -1325 -1065 -674 -1125 -1090 -882 -1304 -1761 -1435 -1938 -1545 -1227 -1441 -1751 -776
2174 -776 -1138 -1945 -1494 -1451 -1950 -1955 -1129 -2150 -1929 -1038 -1476 -2268 -1164 -1081 -2212 -1611 -1086 -1768 -1823 -563
2194 -563 -1593 -1940 -793 -1095 -2024 -1070 -1147 -1802 -847 -262 -993 -1094 32 -761 -1266 -214 -999 -1393 -341
2213 -341 -451 -1428 -68 -36 -876 55 711 -373 91 928 -215 -509 698 384 -450 447 471 92 694
2232 694 1115 130 82 1147 658 451 1389 878 41 1069 1057 639 1065 1375 696 1227 1849 1076 809 1607
2252 1607 982 663 1707 1782 221 1410 1983 846 882 2347 1220 1023 2214 1772 847 1889 1846 715
$$ packed form
2113B414j95j003R78R3q45N25M31q85j85P58n48n57P53k72n60N68Qn26N89Q9o17
2134A013m4Q1o71K70L95q66j5N38n88k86Q71l29j213Q64J17j133O07N01r93l57
2154a238Q91n29n91Q79M6p83K60L91m51L5K08m22m57L26n03L93L18k14l10R75
2174g76l62q07M51M3m99nQ26j021K21Q91m38p92J104Q3j131O01N25o82n5J260
2194e63j030l47J147l02r29R54p7o55R55N85p31j01J126p93n05J052p85l94J052
2213c41j10r77J360L2q40R31O56j084M64Q37j143k94J207l14q34Q97K4l79O02
2232F94M21r85m8J065m89k07R38n11q37J028j2m18M26L10o79N31O22p73k67P98
2252A607o25l19J044P5j561J189N73j137L6J465j127j97J191m42r25J042m3j131
$$ plain form
2270 715 964 1930 713 875 1751 1055 903 1623 1140 690 1522 1249 157 1098 1436 138 1147 1381 468
2289 468 496 1095 428 -50 630 303 -254 251 521 -259 47 316 -409 -296 -281 -399 -188 -287 -462 -595 -288
2310 -288 -306 -1149 -1018 -861 -1229 -1235 -810 -1396 -1234 -1003 -681 -1294 -1079 -1193 -1305 -1240 -1140 -1643 -1590 -1314 -1744 -1510
2332 -1510 -1073 -1694 -1693 -1763 -1549 -1415 -1053 -1100 -1401 -1299 -1024 -1506 -1734 -1416 -1409 -1741 -1651 -1054 -1089 -1318 -982 -837
2354 -837 -1161 -865 -837 -822 -921 -581 -723 -601 -210 -429 -301 -300 -217 -160 36 295 -117 346 162 -5 402 723
$$ packed form
2270G15K49R66j217J62Q76o96j52P20m83m50Q32k73j092R41L38j298J009K34r13
2289D68K8N99o67m78O80l27n57N05K70p80L06K69p25J13J5j18K11r9j75j33L07
2310b88j8q43J31J57l68oM25n86J62K31L22o13K15j14j12O5J00n03N3K76m30K34
2332a510M37o21Jp0K14J34L62m7l01J02K75m82k28L18Pl32R0N97l5k29L36J45
2354h37l24K96K8J5r9L40j42J22L91k19J28JQ3N7J96K59m12M63j84j67M07L21
$$ [...]
8191A51
##END NTUPLES=NMR FID
##END=
