##TITLE=1H_L6(jul-21)-f10
 CDCl3, 8 sc, 
 7.07.2021
##JCAMPDX= 6.0         $$ Bruker NMR JCAMP-DX V2.0
##DATA TYPE= NMR FID
##DATA CLASS= NTUPLES
##ORIGIN= UXNMR, Bruker Analytische Messtechnik GmbH
##OWNER= root
$$ XWIN-NMR		Version 3.5
$$ Wed Jul  7 08:55:18 2021 Russian Standard Time (UT+4h)  she@DPX200
##.OBSERVE FREQUENCY= 200.131506
##.OBSERVE NUCLEUS= ^1H
##.DELAY= (6, 6)
##.ACQUISITION MODE= SIMULTANEOUS
##.ACQUISITION SCHEME= undefined
##.AVERAGES= 8
##.DIGITISER RES= 18
##SPECTROMETER/DATA SYSTEM= spect
##.PULSE SEQUENCE= zg30
##.SOLVENT NAME= CDCl3
##.SHIFT REFERENCE= (INTERNAL, CDCl3, 0, 15.7039)
##AUDIT TRAIL= $$ (NUMBER, WHEN, WHO, WHERE, WHAT)
$$ ##TITLE= Audit trail, XWIN-NMR		Version 3.5
$$ ##JCAMPDX= 5.01
$$ ##ORIGIN= Bruker BioSpin GmbH
$$ ##OWNER= she
$$ F:/spectra/data/she/nmr/H-F/1/audita.txt
$$ ##AUDIT TRAIL=  $$ (NUMBER, WHEN, WHO, WHERE, WHAT)
(   1,<2021-07-07 08:54:08.90 +0400>,<she>,<DPX200>,
      <created by zg, POWCHK disabled, PULCHK disabled
       configuration hash MD5:
       00 E9 B6 7A A2 85 ED C7 34 08 36 98 17 FE 4E 26
       data hash MD5: 16K
       89 7F D4 0F 29 56 3F 6B 1B 53 7F C4 9B 3A 07 2C>)
$$ ##END=
$$ 
$$ hash MD5
$$ 38 70 E2 35 27 81 83 A5 36 51 CB 0D 51 2E 73 2B
##$RELAX= 
##$RELAX= 
##$RELAX= 
##$RELAX= 
##$RELAX= 
##$RELAX= 
$$ Bruker specific parameters
$$ --------------------------
##$DU= <F:/spectra>
##$EXPNO= 1
##$NAME= <H-F>
##$PROCNO= 1
##$TYPE= <nmr>
##$USER= <she>
##$AMP= (0..31)
100 100 100 100 100 100 100 100 100 100 100 100 100 100 100 100 100 100 
100 100 100 100 100 100 100 100 100 100 100 100 100 100 
##$AQSEQ= 0
##$AQ_mod= 1
##$AUNM= <au_zg>
##$AUTOPOS= <>
##$BF1= 200.13
##$BF2= 200.13
##$BF3= 200.13
##$BF4= 200.13
##$BF5= 200.13
##$BF6= 200.13
##$BF7= 200.13
##$BF8= 200.13
##$BYTORDA= 1
##$CFDGTYP= 0
##$CFRGTYP= 5
##$CHEMSTR= <none>
##$CNST= (0..31)
1 1 145 1 1 1 1 1 1 1 1 1 1 1 1 1 1 1 1 1 1 1 1 1 1 1 1 1 1 1 1 1 
##$CPDPRG= <>
##$CPDPRG1= <>
##$CPDPRG2= <>
##$CPDPRG3= <>
##$CPDPRG4= <mlev>
##$CPDPRG5= <mlev>
##$CPDPRG6= <mlev>
##$CPDPRG7= <mlev>
##$CPDPRG8= <mlev>
##$CPDPRGB= <>
##$CPDPRGT= <>
##$D= (0..31)
0 1.2 0 0 0 0 0 0 0 0.06 0 0.03 0 0 0 0 0.0002 0 0 0 0 0 0 0 0 0 0 0 0 
0 0 0 
##$DATE= 1625633648
##$DBL= (0..7)
120 120 120 120 120 120 120 120 
##$DBP= (0..7)
150 150 150 150 150 150 150 150 
##$DBP07= 0
##$DBPNAM0= <>
##$DBPNAM1= <>
##$DBPNAM2= <>
##$DBPNAM3= <>
##$DBPNAM4= <>
##$DBPNAM5= <>
##$DBPNAM6= <>
##$DBPNAM7= <>
##$DBPOAL= (0..7)
0.5 0.5 0.5 0.5 0.5 0.5 0.5 0.5 
##$DBPOFFS= (0..7)
0 0 0 0 0 0 0 0 
##$DE= 6
##$DECBNUC= <off>
##$DECIM= 32
##$DECNUC= <off>
##$DECSTAT= 4
##$DIGMOD= 1
##$DIGTYP= 9
##$DL= (0..7)
0 120 120 120 120 120 120 120 
##$DP= (0..7)
150 150 150 150 150 150 150 150 
##$DP07= 0
##$DPNAME0= <>
##$DPNAME1= <>
##$DPNAME2= <>
##$DPNAME3= <>
##$DPNAME4= <>
##$DPNAME5= <>
##$DPNAME6= <>
##$DPNAME7= <>
##$DPOAL= (0..7)
0.5 0.5 0.5 0.5 0.5 0.5 0.5 0.5 
##$DPOFFS= (0..7)
0 0 0 0 0 0 0 0 
##$DQDMODE= 0
##$DR= 18
##$DS= 0
##$DSLIST= <SSSSSSSSSSSSSSS>
$$ [...]
##$SUBNAM2= <"">
##$SUBNAM3= <"">
##$SUBNAM4= <"">
##$SUBNAM5= <"">
##$SUBNAM6= <"">
##$SUBNAM7= <"">
##$SUBNAM8= <"">
##$SUBNAM9= <"">
##$SW= 20.0188882624521
##$SWIBOX= (0..15)
0 0 2 0 0 0 0 0 0 0 0 0 0 0 0 0 
##$SW_h= 4006.41025641026
##$TD= 16384
##$TD0= 1
##$TE= 0
##$TE2= 300
##$TE3= 300
##$TEG= 300
##$TL= (0..7)
0 120 120 120 120 120 120 120 
##$TP= (0..7)
150 150 150 150 150 150 150 150 
##$TP07= 0
##$TPNAME0= <>
##$TPNAME1= <>
##$TPNAME2= <>
##$TPNAME3= <>
##$TPNAME4= <>
##$TPNAME5= <>
##$TPNAME6= <>
##$TPNAME7= <>
##$TPOAL= (0..7)
0.5 0.5 0.5 0.5 0.5 0.5 0.5 0.5 
##$TPOFFS= (0..7)
0 0 0 0 0 0 0 0 
##$TUNHIN= 0
##$TUNHOUT= 0
##$TUNXOUT= 0
##$USERA1= <user>
##$USERA2= <user>
##$USERA3= <user>
##$USERA4= <user>
##$USERA5= <user>
##$V9= 5
##$VALIST= <valist>
##$VCLIST= <CCCCCCCCCCCCCCC>
##$VD= 0
##$VDLIST= <DDDDDDDDDDDDDDD>
##$VPLIST= <PPPPPPPPPPPPPPP>
##$VTLIST= <TTTTTTTTTTTTTTT>
##$WBST= 1024
##$WBSW= 4
##$XGAIN= (0..3)
0 0 0 0 
##$XL= 0
##$YL= 0
##$YMAX_a= 204574
##$YMIN_a= -236525
##$ZGOPTNS= <>
##$ZL1= 120
##$ZL2= 120
##$ZL3= 120
##$ZL4= 120
##$ABSF1= 10
##$ABSF2= 0
##$ABSG= 5
##$ABSL= 3
##$ALPHA= 0
##$AQORDER= 0
##$ASSFAC= 0
##$ASSFACI= 0
##$ASSFACX= 0
##$ASSWID= 0
##$AUNMP= <proc_1d>
##$AZFE= 0.1
##$AZFW= 0.1
##$BCFW= 1
##$BC_mod= 2
##$BYTORDP= 1
##$COROFFS= 0
##$CY= 11.3945322036743
##$DATMOD= 1
##$DC= 2
##$DFILT= <>
##$DTYPP= 0
##$F1P= 15.9154993809931
##$F2P= -4.1035820241983
##$FCOR= 0.5
##$FTSIZE= 0
##$FT_mod= 4
##$GAMMA= 1
##$GB= 0.15
##$INTBC= 1
##$INTSCL= 1
##$ISEN= 128
##$LB= 0.24
##$LEV0= 0
##$LPBIN= 0
##$MAXI= 10000
##$MC2= 0
##$MEAN= 0
##$ME_mod= 0
##$MI= 1.114404
##$NCOEF= 0
##$NC_proc= 0
##$NLEV= 6
##$NOISF1= 3.799351
##$NOISF2= 2.8
##$NSP= 1
##$NTH_PI= 0
##$NZP= 0
##$OFFSET= 15.70392
##$PC= 1
##$PHC0= -11912.13
##$PHC1= 11.60099
##$PH_mod= 1
##$PKNL= yes
##$PPARMOD= 0
##$PSCAL= 0
##$PSIGN= 0
##$REVERSE= no
##$SF= 200.130013532006
##$SI= 16384
##$SIGF1= 3
##$SIGF2= 2
##$SINO= 400
##$SIOLD= 16384
##$SREGLST= <1H.CDCl3>
##$SSB= 0
##$STSI= 0
##$STSR= 0
##$SW_p= 3612.71676300578
##$SYMM= 0
##$S_DEV= 0
##$TDeff= 0
##$TDoff= 0
##$TI= <>
##$TILT= no
##$TM1= 0
##$TM2= 0
##$TOPLEV= 0
##$USERP1= <user>
##$USERP2= <user>
##$USERP3= <user>
##$USERP4= <user>
##$USERP5= <user>
##$WDW= 1
##$XDIM= 8192
##$YMAX_p= 0
##$YMIN_p= 0
$$ End of Bruker specific parameters
$$ ---------------------------------
##NTUPLES= NMR FID
##VAR_NAME=  TIME,          FID/REAL,        FID/IMAG
##SYMBOL=    X,             R,               I
##VAR_TYPE=  INDEPENDENT,   DEPENDENT,       DEPENDENT
##VAR_FORM=  AFFN,          ASDF,            ASDF
##VAR_DIM=   8192,          8192,            8192
##UNITS=     SECONDS,       ARBITRARY UNITS, ARBITRARY UNITS
##FACTOR=    0.0002496,     1,               1
##FIRST=     0,             0,               0
##LAST=      2.0444736,     0,               0
##MIN=       0,             -236525,         0
##MAX=       2.0444736,     204574,          0
$$ Real data points
##PAGE= N=1
##DATA TABLE= (X++(R..R)), XYDATA
$$ [...]
2020a566O66m69q85J357L49o72N13L04o06k2O28j142N39N24q77k13Q23j83M9M74
2040d09n44j05N82l49m33O85L6o32Q32O0n65N14J86r89J046L15j396J50R90m87
2060e13J96M32k08l09O39l93k55N46l2n92L97M88o12M68l2m60K15L52p42o1Q18
2081C42l50J08O42m44L1N93n24M1N32m30o23P35l94J06N63O6n76O67j85o29L98
2102F69M12n66J69O18q42N08O34q36J4Q63p22k75L15l01Q7N58l11m49J088n38
2122A095j69K93l83k09M28p6o99N79K13m08L02O37o34l87O98q11j37O02l14p06
2142h6N92K01k16J27J25m87Nm20R0K43k36k36L19R9k79J45J84p23r9L16m16OO96
2165e0k74n08P31l0o81L31k31j43R4l92m68P21K69n77L10M1K8Nj28q7J34r9l18
$$ y = [-1566, -900, -1369, -2254, -897, -548, -1220, -707, -403, -1009, -1031, -403, -1545, -1006, -482, -1359, -1572, -749, -932, -883, -409, -953, -1058, -476, -825, -1258, -573, -537, -1169, -337, -277, -842, -328, -142, -1131, -85, 230, -1166, -1016, -26, -513, -317, 115, -93, -402, 237, -156, -411, 135, 103, -489, -92, 396, -216, 252, 220, -240, -25, 327, -415, -476, 342, -8, 100, 742, 298, 329, 922, 398, 439, 971, 541, -82, 653, 259, 365, 928, 994, 418, 1085, 900, 271, 669, 1081, 515, 684, 1302, 460, 968, 1602, 766, 780, 1643, 921, 646, 961, 660, 747, 1305, 994, 545, 1633, 1095, 926, 1219, 836, 627, 1055, 979, 280, 859, 1072, 664, 966, 1603, 969, 582, 1280, 469, 332, 934, 620, -86, 506, 707, 491, 618, 743, 256, 261, -159, -69, 174, -62, -298, 21, 120, -159, -14, 170, -553, -652, -336, -752, -746, -50, -324, -832, -101, -131, -812, -481, -712, -855, -761, -1153, -1621, -900, -631, -1208, -898, -857, -829, -824, -952, -1039, -905, -1004, -1322]
2188a322K23J65l18M87r1k82L18k2m58k39P36k00j84O74l30k20L95J05k99J75
2208f87K89k49N3J61k62M12K70p66N85k53J13k18K19N8J69j06J59L1L65k63q1
2229aK54Q0l07rK7j40P58j54n74P55L32p63J64M22n10J17L69k74k16M22M0k97
2251D95M73l65n1P0R6j76J45k3l30P51m65j69M29k19k02J70K81k05Q9J27m44K33
2273G10K69n13K50K5k82k47O01k45l94N51L78p10M30q7J14o8Ml18j57J94j63J37
2295D79j06j12N3J84k86K83pp3j62K1l8k45L19r7l88O61k83m59K86n9l85M24J25
2318A35k60l4K47J41n57K44l3m67K56j60j93m8K37J71n0l44r4K70k44rK18m08
2340i82K27J21L7n1l35N04m64QR5r9j79J70k00J47N59k91q6K36Km03M48m4j45
$$ y = [-1322, -1099, -934, -1252, -765, -856, -1138, -820, -842, -1300, -1539, -803, -1003, -1187, -513, -843, -1063, -668, -563, -862, -687, -398, -647, -594, -433, -695, -283, -13, -779, -194, -447, -334, -552, -333, -275, -106, -212, -53, -22, 343, 80, -1, 253, 333, 26, 17, 44, -96, 662, 508, -66, 689, 1021, 258, 422, 844, 334, 451, 820, 546, 330, 752, 792, 495, 968, 603, 552, 622, 718, 542, 687, 664, 334, 1085, 620, 451, 880, 661, 459, 629, 910, 705, 794, 921, 477, 710, 979, 466, 716, 741, 459, 212, 813, 568, 174, 725, 1103, 393, 823, 736, 850, 782, 786, 468, 311, 505, 342, 479, 373, 261, 314, 498, 212, 495, 488, 415, 253, 274, 236, -9, 310, 213, -175, 486, 203, -256, 30, -29, -414, 10, 135, -125, -159, 88, 229, -328, -84, -117, -584, -328, -488, -681, -729, -492, -321, -371, -715, -809, -539, -783, -792, -574, -982, -755, -634, -597, -648, -983, -479, -943, -935, -840, -939, -1118, -948, -1148, -1001, -442, -733, -819, -583, -581, -984, -536, -580, -725]
2363g25p3J7l54L02j17p6J91M47m60L9L27j80K19J71r5J06j8J00P8k39L65j91
2385a66L6j38l01L36K08j80M10j33n1J77K26j26J94K63n00J31L15m09j45M90j11
2406E26q1J94j2l85L67K1j4L94j83m9K81j66k75K38M4j60j58prN7M04j60j77K94
2430I84r1l96M31j36j79L02rk77j4L26m02Q8ql88O9J2L04j66K43j78k10L23J12
2453G40m00j8j68J20m5k14j40M46k07n41L21q9N7O8K34j7j69L29K20q65J28K65
2475E5m0k56M4k74N6O7r5k08J22J36K38j45l4J72P9k83J84L51n05oL14o34k36
2498h98L61k64j26L37J7k32M25rk40J46pJ8n0L03m86L9J64m28L97l26O8J06m9
2521g34K8k74K09M10j3l2J03k05J35J02m36R3Q4j10J3K29k84L24J69j75k20L63
$$ y = [-725, -798, -781, -1135, -833, -950, -1026, -835, -388, -848, -809, -482, -662, -443, -272, -367, -261, -279, -179, -101, -340, 25, -166, -130, -268, -569, -233, -25, -205, 205, 72, 21, 198, 424, 298, 492, 755, 255, 386, 701, 292, 147, 637, 526, 445, 639, 627, 242, 609, 630, 616, 1010, 827, 778, 1059, 893, 618, 856, 900, 740, 582, 575, 566, 623, 1027, 867, 690, 984, 893, 497, 928, 792, 613, 915, 906, 629, 615, 941, 539, 627, 619, 231, 300, 312, 616, 450, 693, 515, 305, 628, 740, 340, 322, 154, 274, 229, 15, -125, 321, 114, -427, -106, -195, -138, -70, 164, 147, -22, 307, 527, -338, -210, 55, 15, -241, -197, -471, -415, -348, -443, -651, -529, -393, -155, -300, -334, -162, -83, -366, -182, 169, -336, -342, -28, -662, -898, -537, -801, -927, -590, -573, -805, -380, -389, -629, -483, -490, -472, -522, -219, -705, -666, -502, -930, -533, -859, -791, -685, -734, -706, -980, -771, -361, -374, -406, -303, -508, -373, -271, -707, -614, -530, -640, -627, -398, -682, -358, -189, -364, -584, -221]
2543b21j96J27L49k66J0M47k87k01M59j1k65N0J72n85K05J48K32J08P7n2pK97
2565E90p7J41j31K1J43P5l90J03J69l19j62L55N1k5Q1J50r4J63J06j36J52m0J76
2588A102r8k45j88R9O5q3l57K55q3P7L85m62L07J93l51p4K77l42k46L70J51n81
2610A71J01J82j39j60J68k91M0L54l76K6N15j12r3P4l80m17M23K7k05J4l62qj26
2633e74K39j80O26m15l07J83L04j72j75J53k74K78j11m49M4J44q9j50K70lj4R1
2655e81l26K14O33j32n17M00p1k12M3Nk92L79j79j94M2L94j22o08O34j22J56Q9
2677c67j32K76J27m4k50P1M9k50K2K13k73K24j07j27J3K20K74j50J84Oo2M3k91
2700c31R6L26j71j0J53k75O9RL7j3Q4M3p4L45J44j00R5o8p8j12O5l3l03M80m84
$$ y = [-221, -417, -290, 59, -207, -197, 250, -37, -238, 221, 210, -55, -5, 167, -418, -213, -65, 167, 275, 352, 300, 293, 590, 513, 654, 523, 544, 687, 762, 372, 475, 644, 325, 163, 518, 569, 544, 625, 775, 681, 844, 950, 814, 966, 926, 1102, 1004, 759, 571, 670, 735, 652, 295, 550, 467, 544, 929, 467, 774, 967, 616, 542, 819, 477, 231, 601, 752, 171, 272, 454, 315, 155, 323, 32, 72, 426, 50, 76, 591, 479, 386, 460, 80, -337, 86, 113, -92, -78, -440, -448, -574, -335, -515, 111, -304, -611, -428, -124, -296, -471, -318, -592, -314, -425, -874, -830, -686, -775, -925, -655, -658, -672, -581, -907, -693, -60, -192, -709, -309, -380, -592, -549, -544, -836, -457, -636, -830, -788, -394, -516, -1124, -490, -612, -456, -367, -499, -223, -96, -140, -390, -319, -270, -520, -498, -285, -558, -334, -441, -568, -555, -335, -61, -211, -27, -21, -83, -40, -331, -235, 91, -80, -90, 63, -212, -143, -134, -97, -110, -26, 17, -57, 288, 432, 332, 427, 359, 281, 169, 234, 201, -102, 378, -106]
2725a06L1K59R9j19K08j01RJ87k23J8K27K91l77K65R4k4l3j29l61j17J47n5NK52
2749D47Q9J76K45j78j33K49j90j4p6q1k89L08J96k35m5J77j34r8J1j09K27k28
2771C15R5J29J42K3o6j43m7m14J2l8K00r8l37K35J27k08J74J33Q7n52K27l02L9
2794b67L72m73j79K54K33k75j09P2k2m12K05k48K09K35K47l05K89M8l76j88J42
2815e48k64K20k93k38N25L8k17K70k25j11J85pk60L22K59l17J26L26k78q6J26
2836d47r4j63J41j58o0J28q2L79j02L44J37k76o1J29J9j14j25L05m8n0k74N44
2858G2j64K18k03MJ31r6M6J4K77n3L7Q1L4J1l30J3l79M25K3j95j54O07J53j1M0
2883F01m1N1j01r8k18M91k05k10J56J99l34o1N2r5L68m2k88K3J45k6M71L7m00
$$ y = [-106, -75, 184, 283, 164, 372, 271, 280, 467, 244, 262, 489, 780, 403, 668, 762, 738, 705, 576, 215, 98, 245, 190, 195, 447, 536, 712, 957, 779, 646, 895, 705, 691, 615, 534, 245, 553, 749, 514, 469, 646, 512, 414, 425, 316, 543, 315, 410, 539, 681, 704, 638, 495, 448, 34, 46, 8, 208, 110, -227, 8, 135, -73, 101, 234, 321, -231, -4, -306, -267, 105, -368, -547, -293, -60, -335, -444, -372, -394, -806, -601, -849, -640, -405, -158, -463, -174, -126, -502, -690, -548, -812, -592, -885, -1123, -598, -560, -777, -507, -732, -843, -658, -665, -925, -603, -344, -661, -535, -209, -487, -573, -447, -541, -704, -563, -721, -781, -653, -735, -356, -458, -114, 23, -253, -314, -185, -166, -280, -405, -100, -148, -198, -472, 72, -92, 126, -77, -73, 58, -38, 8, 22, 299, 246, 283, 364, 398, 409, 79, 92, -287, 138, 161, -34, -188, 419, 572, 561, 601, 560, 611, 510, 412, 194, 685, 480, 270, 426, 625, 291, 230, 282, 187, 555, 513, 225, 248, 393, 367, 838, 875, 475]
2906D75M45j3o17k05K64l0j54L41j65k43M20J08l19K20j30n1k4L72k4j98R4j77
2928C89O9M4J18k70l28j83M7L10K59j8k01k04L03M02j76n35O4N3J1j23j12J00
2950A9Q7Q7l29J43n5k52M7J05j96K83J03j40j40L22Qo06J41r3N6l37J55p6R6O7
2974e05R2P5K27k79N5k33n3l13O76l64j22K10j01q5K01l3J36l64rM46L6m11J65
2997e53L22k44J41j89j00J0j69j1L39j92j06P1K57J59Q7j22j2J0L37k50K35j29
3019a09Q7K78j80L2M9k13N9k04n2J69P5K89l54N36l2M6p0J65k05j72K6k08L88
3042D00L21m15J7K51j75L5J58l19M3K87nL3PJ89m91N47m97K06j83K12l98k8K21
3065D16k43K6K97M3L04l9m74M4L52m87k1J81K1k5j61J75j87J26p1k87R9lj56L40
$$ y = [475, 920, 907, 290, 85, 349, 319, 165, 506, 341, 98, 518, 626, 307, 527, 397, 346, 322, 694, 670, 472, 566, 389, 458, 502, 620, 350, 22, -161, -114, 196, 455, 437, 236, 32, 335, 737, 561, 26, 90, 143, 154, 31, -81, 19, 106, 193, -136, 7, -48, -300, -253, -148, -344, -61, 42, -98, -238, 84, 92, -514, -373, -466, -410, -747, -592, -668, -572, -505, -413, -338, -111, -390, -335, -568, -621, -934, -258, -622, -744, -534, -635, -720, -519, -552, -416, -780, -789, -343, -307, -718, -553, -231, -475, -334, -523, -623, -613, -782, -793, -454, -646, -752, -681, -424, -265, -178, -300, -312, -302, 35, -215, 20, -109, -22, 256, 76, 108, 157, -56, 3, -201, -253, -84, -9, 280, -74, 462, 430, 476, 406, 571, 366, 194, 220, 12, 400, 721, 306, 323, 574, 399, 434, 592, 273, 316, 603, 598, 631, 638, 827, 336, 883, 386, 592, 409, 621, 223, 195, 416, 173, 199, 496, 539, 843, 804, 330, 374, 726, 239, 218, 399, 420, 395, 234, 409, 222, 348, 277, -10, 89, 86, -70, 270]
3089B70J78k99L26L1l37M2Kj2k74j33O2j32J79O1j43N0J65N3m32M66o42L49M3
3112a27p3o2J39J12j48J03j94m7r9j63J20k82N86r4j95K84Q8J04k41k58K2J90
3134b35k16k89J10K50n5K72l09J03K6k30J23N5j33P4P4J58j66Q0J6k28j26J65
3156d81l74K92j36%J22R7J67L12l06K32m33j02J92j64K53p8P1K24j56K63k57k19
3178d81J22J84j19j64L83j30P0K74l5j55J52K19j49P1k34k67K52rK18J68Oj11
3200B65K43%j18j73j77L84m3nQ0J53k49K58k68j30O9o9j9K13k62L49L51p9p3%
3224G00j74K01k12Pk05J89K3k9J54J38l14K03j60k04J04j70J27R5P4m0l4K0j15
3247C78J00k36j34J04m14L00l79M11n6L1L1l5M1N3l74J16j57L6K1K31k27n5J29
$$ y = [270, 448, 149, 475, 506, 169, 211, 213, 201, -73, -206, -144, -276, -97, -36, -179, -129, 36, 89, -343, 123, -519, -170, -127, -200, -262, -123, -11, -159, -56, -250, -297, -396, -559, -439, -721, -135, -229, -424, -140, -52, 52, -189, -447, -425, -235, -451, -740, -630, -380, -435, -163, -472, -369, -343, -573, -450, -395, -528, -454, -380, -222, -388, -308, -292, -520, -646, -481, -855, -563, -699, -699, -577, -480, -313, -1, -307, -75, -508, -610, -418, -582, -329, -407, -336, -112, -268, -5, -262, -481, -359, -175, -294, -458, -75, -205, -135, 139, 104, -51, 101, 320, 171, 242, 8, -259, -7, -16, 202, 370, 376, 265, 508, 508, 390, 217, 40, 424, 381, 376, 456, 609, 360, 618, 350, 220, 289, 220, 201, 414, 152, 501, 852, 773, 700, 700, 526, 727, 515, 522, 317, 506, 529, 500, 654, 792, 478, 681, 521, 317, 421, 251, 378, 473, 547, 507, 473, 493, 378, 478, 242, 108, 212, -202, 98, -281, 130, 74, 105, 136, 101, 142, 195, -179, -63, -220, -184, -163, 68, -159, -214, -85]
3270h5L0l72J95j46k29l4K78n1K87j46J90l29J42J80l92n5j63J04J52J6J40q5
3292c73j58J10j40J01M7l83K32lJ86j06J12j00L68qj58j91k82m2J19K01k17N97
3314h8k81J28K18o8k2j64J19l00K63q0p4L8K66l19J76ok02L26j5k66K00J23k9
3337e7q9K24l21L59m0q9q6j74j44o0J03L27J95L51k19j71K01j04k56K46Q6j15
3359A67Q8k64J17L85p2L9m1m3j38k15L25j39p3M26j90J05J13j69l6p1N4O4j07
3382C25K38k99R8K03l9l7M87m71k8k65P8J5p7M12K2j88J53n6l6k09o0m81M05r1
3406I9J82n0J02J51l0j37O1QJ1l08l4j27L60l3l5l18K25q3k54J31k89K55J34k88
3430b67J01L2k08N13j68k86j90j0j27j50M11l53L44j99J16mL53l53Nk0k2k26j4
$$ y = [-85, -55, -427, -232, -378, -607, -641, -363, -414, -127, -273, -83, -412, -270, -90, -482, -537, -700, -596, -444, -428, -288, -373, -531, -421, -561, -460, -413, -796, -564, -567, -381, -487, -375, -475, -107, -115, -273, -464, -746, -788, -669, -468, -685, -88, -369, -241, -23, -91, -113, -277, -158, -458, -195, -275, -349, -311, -45, -364, -188, -194, -396, -70, -85, -351, -151, -28, -57, -146, 78, -243, 116, 76, -13, -99, -273, -417, -477, -374, -47, 148, 499, 280, 109, 310, 206, -50, 196, 282, 167, 255, -9, 108, 493, 421, 460, 419, 376, 238, 23, 348, 209, 136, 562, 372, 477, 590, 421, 385, 314, 368, 432, 325, 563, 264, 362, 565, 526, 489, 976, 505, 477, 212, 290, 305, 228, 640, 662, 474, 627, 571, 535, 326, 266, -215, 190, 99, 281, 231, 333, 484, 454, 317, 378, 386, 397, 89, 55, -72, 288, 255, 220, -98, 127, 44, -210, -79, -368, -113, 21, -267, -166, -134, -342, 171, 3, -283, -473, -483, -610, -760, -349, -702, -358, -557, -441, -445, -92, -445, -440, -460, -482, -708, -722]
3453g22J37o7J58K0l0j8p8JK3k9q0J16M0K18l9o3K90m07P5l2K8n4J71j40K69J41
3479g2j04K8k43J81j27K36j71N7J15j93J66j01J13L84j23j16L16o14J26M69m10
3500h3kM33l78J48j06J78l0J67J05l71M5L8O7J18N5L1k50K50q8r2J89k00Q4j08
3524B00K89k51P5J68K8j21J17k59k08K40p1L80k58R1O3j39K92j53qj56j29O7O
3547B63p5K82r2j53L00J79j72k59L8n5j65p7K87j41J67L12k84K0j61K84k63k03
3569C2R6j79L52j61J44j81L2J5qj73j22K1J21k32J94lJ46o3k52J48jk6M8j11K45
3594H2m43P1j05K94pk19P3l18K6j89K97K32k11J15j31K46j01n2j52m4J37k80K79
3617d00j81K16L3k36J96j52p7N2k9K2J25j61M1l3J33j64M41o9j43j36K8J51k85
$$ y = [-722, -585, -652, -494, -474, -504, -522, -600, -599, -576, -605, -685, -569, -529, -311, -350, -413, -123, -530, -455, -487, -459, -513, -342, -482, -213, -72, -176, -148, -391, -210, -337, -101, -272, -215, -100, -293, -127, -228, -115, 269, 146, 30, 346, -268, -142, 327, -83, -85, 348, -30, 118, 12, 190, 160, 327, 432, 61, 106, 144, 211, 329, 384, 415, 165, 415, 327, 235, 424, 224, 308, 200, 489, 238, 313, 481, 509, 388, 505, 246, 38, 278, 207, 587, 329, 420, 483, 344, 636, 483, 475, 319, 190, 257, 263, 188, 470, 378, 225, 525, 704, 532, 273, 311, 256, 91, 14, 301, 160, 327, 639, 355, 375, 214, 498, 235, 32, 128, -51, 301, 140, 284, 103, 135, 150, 142, -31, -153, -132, -11, -243, -49, -52, 94, 31, -221, -73, -74, -100, -52, -163, 82, -361, -290, -395, -101, -108, -327, -254, -572, -546, -735, -438, -206, -417, -302, -433, -187, -288, -340, -492, -536, -399, -679, -400, -581, -365, -332, -568, -372, -524, -601, -549, -578, -556, -431, -592, -551, -584, -451, -615, -174, -243, -386, -522, -494, -343, -628]
3640f28MO0K69j01K13K44n46K03J88k60J11J37o2R4J97j5j00N5K33j86N6o8n9
3663C9J16m7M3J48J16k99L62j23k1p6o7K43j96q8J75J70O1r4O8M8l45J57j17R2
3687C65l03M2L60Q1J19j27p4j88L94l79R4j97J40J86N5j77j3J10j35N2q2J37l05
3710A55N01m50J47J52m68L65k8j34r3K59l58j06M38l77L01k46P8Q8j11K7j30r
3732Al07L00n6Q5J56j41K34k40J00j59j13m7J26L0l98L64k92K02K00k13kJ37q8
3755a21m09K87J5L6K54m39%J26j28O7j7j03Q6j27J91J03k92J18K38Q9k59L04k47
3778b28j84J48K0k94P0L5rK05k09M1M9J40k09N4r3J73k77L43j66L49k16P7j27
3801c08r6l0Q9Q9j82L90k58o7J46K12j87L12l75L69k30J25k9r9K42l84K55K17
$$ y = [-628, -624, -564, -295, -396, -183, 61, -485, -282, -94, -354, -243, -106, -168, -74, 123, 108, 8, 63, 296, 110, 166, 98, 39, 155, 108, 151, 299, 415, 116, 478, 355, 334, 258, 191, 434, 238, 150, 325, 495, 556, 462, 530, 578, 233, 390, 273, 365, 62, 104, 464, 545, 664, 537, 463, 275, 669, 290, 384, 187, 327, 513, 568, 391, 378, 488, 353, 405, 323, 460, 155, 656, 206, 353, 505, 37, 402, 374, 240, 147, 406, 48, -58, 380, 3, 304, 58, 136, 224, 113, 140, 10, 1, -306, -6, -62, 23, 179, 38, 272, 32, 132, -27, -140, -187, -61, -31, -429, -65, -357, -155, 45, -168, -170, -33, -121, -530, -243, -228, -192, 62, -377, -377, -251, -379, -312, -329, -432, -346, -473, -282, -179, -471, -353, -115, -26, -285, 19, -228, -412, -264, -244, -538, -468, -433, -442, -237, -446, -405, -356, -216, -425, -371, -464, -291, -568, -225, -391, -42, -258, -181, -308, -404, -434, -345, -256, -438, -48, -306, -373, -227, -15, -202, 110, -265, 104, -126, -1, -30, -129, 113, -271, -16, 201]
3823B01k90K26j18l8K7l7N5j16O35l53n4K36L28k30P2k29r0K44k30j70L51J24
3845E44p1j34K99k92o2J53L73K1m00J94k38L21k48J14r4K1m13P7M7Q6J76J2k52
3868B34J75j37K21j86j64J76N7j59k40m3J42l4p5M8L03n14L31M0k99O4K45k67
3890h2K48j87j01K79J9m09q9J70j09j33K36J10l66M18l94L19j84P8J10j76j24
3911c67r5r3J07K07j63O6r1j94K53k57M05j30l10N09M3k93L7J21k65J89J94j13
3933b40j42J47m95J48J98O2J03J19k44K24r4J78k90q2L77l49M28k06j74J13J03
3954a16K9j16k07P8nK28J67j69pK56M9m8l10N3K43k76J27J1J18J53l78L3K54k31
3978f4P5M3L78k12k1O8j02K56l46L45o4n1k31R4K7j15J20J49l20l9N23N7j96l5
$$ y = [201, -89, 137, 19, -19, 8, -29, 26, -90, 545, 192, 138, 374, 702, 472, 544, 315, 225, 469, 239, 69, 420, 544, 473, 339, 638, 346, 284, 437, 810, 831, 431, 625, 387, 708, 460, 574, 480, 501, 88, 165, 212, 298, 474, 486, 234, 409, 272, 493, 307, 143, 319, 376, 217, -23, -66, 76, 42, -33, 15, 318, -196, 135, 175, -124, -60, 185, -82, 166, -21, -122, 157, 176, -233, -322, -152, -261, -394, -158, -48, -414, 4, -390, -71, -255, -177, -67, -243, -367, -462, -555, -448, -241, -404, -338, -429, -623, -370, -627, -222, -352, -662, -153, -110, -403, -366, -245, -510, -321, -127, -240, -382, -235, -730, -582, -384, -322, -219, -100, -344, -120, -214, -36, -326, -408, -31, -380, 48, -158, -332, -219, -116, -87, -203, -410, -332, -337, -109, 58, -111, -118, 138, 187, 139, -171, -118, 125, -151, -24, -13, 105, 258, -120, -87, 167, -64, 11, 54, 432, 220, 199, 267, 165, 421, 75, 420, 356, 305, 74, 168, 195, 80, 200, 349, 29, -10, 513, 570, 374, 339]
4002C39j37k8L20m6J29q8O1j34m0J22j65r8j69J62M33k30m1M0j08j15M6L19p6
4025D96j70l1O1j80Ml5O1j95K39o7P2k97L58K4%k07j7K53j94j6j84m6K9J19m25
4050c48L73l6j7k76J03K43nm1k65R1Q7Q2j28k4r1M8r9j31J43M1j8o0r6j6J35J67
4076a38r5L7k37nK64j27j44k35L86k31J20k98M45o2J41n37J43Q2J70J85m56L03
4098b89J19k75M0K60m71M26j62n0J11Q3k00O6K93k29J96l7J85m7l14M17l5p8K8
4121C7l09L15p6q7j78K31L91m14n7K96J21p9M18j26k56J71j97K40j46j55J25j79
4143H6K43l18K03J82m05J96j29M50J55j69k54Q7j07m6k2L7k2J62j66o3M3J84j33
4166A94Q5j9j6L94O0l90j21j90M54j7k49K20j7j72k34K1K45p2J1k61L48j2k00
$$ y = [339, 202, 174, 494, 448, 577, 489, 550, 416, 376, 498, 333, 235, 66, 228, 661, 431, 390, 430, 322, 207, 253, 572, 496, 326, 295, 356, 176, 180, 145, 206, 11, 250, 183, 255, -42, 316, 340, 340, 133, 116, 369, 175, 159, -25, -71, -42, 77, -348, 25, -11, -28, -304, -201, 42, 37, -4, -269, -178, -91, -9, -137, -161, -252, -204, -303, -434, -291, -250, -268, -328, -424, -440, -305, -138, -233, -196, -433, -438, -174, -301, -445, -680, -294, -525, -405, -703, -258, -320, -179, -716, -573, -491, -321, -136, -592, -289, -170, -445, -405, -145, -616, -190, -352, -402, -291, -208, -408, -342, -49, -278, -82, -119, 66, 19, -295, 122, 87, 9, 37, -272, 43, -33, -120, -298, -67, 324, -90, -147, 149, 270, 191, 609, 483, 227, 398, 201, 441, 295, 140, 265, 86, 329, 11, 214, 396, -9, 187, 58, 508, 663, 494, 240, 327, 220, 174, 152, 189, 167, 329, 163, 100, 143, 327, 194, 279, 260, 244, 638, 698, 308, 187, -3, 451, 434, 185, 405, 388, 216, -18, 3, 248, 176, 187, -74, 274, 262, 62]
4189F2J89l04K23J9K38l25L83m05Q4l35M44j57q7J51J72l53o6J76N5Jj65J70j07
4212F3J25j41mj48L8o0q1l23J87j2J85P1q6j11L03l6J89k54J28k48J6n7l3j71
4236d60J84j30j86J10J48M6k04O0J51n3J60j40J6o0L6j85L19j99O7k92K16r4J62
4259c28q2K40l13O9J05K56J42l00j2K39q4k25n3p6K66M6Oj13J99o6L2J46j89J71
4283G6Rm3J61P4n9q9p3o0j60J05Q2J59k98N08p0J05k64K24r1JkK05l99M00k33
4308B68J49k1r3J48l68M82j07K9k38J98j76j25L96j96R8K19l06K1k03Pj71K84
4330B95J93k04j18J8K14k19L2L13k99j91L43J3l1m8%k09J81k72J8j6p1J29k61
4353a90K76k58K41L67k08j63j09pl9j86nK46k19J72k64L92m52J26L68n4l95L65
$$ y = [62, 251, -53, 170, 189, 427, 102, 485, 80, 164, -171, 273, 116, 29, 180, 352, -1, -67, 109, 164, 165, 0, 170, 63, 188, 47, 43, -105, -67, -127, -208, -531, -344, -356, -171, -100, -186, -297, 6, -30, 159, -95, 33, -215, -199, -256, -289, -460, -276, -406, -592, -482, -334, -288, -492, -432, -281, -334, -174, -314, -298, -358, -322, -507, -188, -387, -320, -612, -396, -490, -328, -410, -170, -483, -414, -309, -53, 89, -211, -223, 16, -68, -293, -346, -422, -156, -110, -104, -217, -18, -84, -52, 94, -95, 76, 85, 42, 203, 277, 218, 129, 56, -4, -164, -59, 23, 182, -116, 392, 322, 427, 163, 387, 296, 297, 295, 500, 101, 501, 268, 417, 396, 303, 451, 83, 565, 458, 487, 249, 447, 271, 146, 542, 346, 444, 663, 357, 378, 175, 182, 11, 295, 488, 284, 166, 184, 398, 179, 211, 524, 225, 34, 377, 390, 359, 311, 311, 102, 283, 11, 29, 13, -58, 71, -190, 86, -172, 69, 436, 228, 65, -44, -51, -90, -276, -281, -35, -254, -82, -346, 46, -406, -280, 88, 34, -361, 4]
4375Dj01P9p5p4M9K43L8m33K33k83k09J74k4J29p3k8R5J60k83l1K20k56J64q1
4399c63Q5L13k67k41M04k30L9j6k39L53j8l12N24l86K12l6L62k35j30j00l19J44
4421d56K50m0l12n9L48LJ79K8k10k08N07P5j84J29j98L07j74J1J83k64l35N37
4443A17l10k70K59K4N8L94Kk39O5R8M6K6r5J45pk65Q4K10Q1j19K0K49q9m00M25
4468E09l51K49l09K95L1p8L46k36%M8j26j00o4O6j5K78q5p0K07k50j81K45j07
4491C02Qj13J66j48L9K08k11m4R2l6q6k5o9J50K2M7K3j58K49l35K13k01l0R3k00
4516d4Lk5jO6j55J86l40J99j17J36j85j5K51K49j67l66J10l28L19K7k7j70L7o5
4540d22k12N39j09j97J52K74m50o3J92l14M14k11j05K61L4j39M22n92J89j1L0
$$ y = [4, -97, -18, -93, -167, -118, 125, 163, -270, -37, -320, -529, -355, -379, -250, -323, -351, -256, -96, -379, -410, -190, -446, -282, -363, -278, 35, -232, -473, -69, -299, -260, -276, -515, -162, -180, -492, 32, -354, -142, -178, 184, -51, -181, -281, -600, -456, -206, -246, -558, -617, -269, -266, -87, -59, -269, -477, 30, 105, -79, 50, -148, 159, -15, -4, 179, -85, -420, 117, -193, -463, -204, -180, -122, 272, 274, 35, 100, 198, 244, 270, 175, 320, 313, 48, 132, 342, 423, 304, 324, 573, 484, 84, 509, 158, 407, 98, 393, 424, 346, 692, 456, 456, 504, 378, 278, 214, 280, 265, 543, 458, 388, 595, 345, 164, 409, 302, 310, 197, 363, 215, 254, 462, 251, 207, 299, 263, 177, 152, 83, 233, 255, 302, 325, 167, 416, 81, 294, 93, 63, 156, -44, -41, -66, -67, -1, -156, 30, -310, -111, -228, -92, -277, -292, -41, 208, 41, -325, -215, -543, -224, -197, -224, -394, -357, -422, -634, -95, -204, -401, -249, 25, -425, -488, -296, -610, -196, -407, -512, -251, -217, -356, 66, -526, -337, -348, -318]
4561c18M7j05R1K32l32J84K39j12j07N1j30J6j15J62j83J06K82n9p7M5J77M6j04
4584C6m42J50J70j36K21j93K84P9p4J18j56j10M0l33L20j50M14l05J72l7K00j66
4606A02J42j96J13O1j01J74J18k37k07L38k4j18qk6K12j0m30J84K35r8J07jR4
4629D24M9l30K06j1J12k78J56rL0O0K23l59K8n8j91J66j91L65p0J81k37K66l70
4652A62J23oRJ85l86JK2P1L77j01r2k67Q1k1m4J76l92k1M6K64k46k29M48p4K7
4677A13k12J48j36R3j3L8K9q9j29j22O1j39K29Q5k08K19l8M8q5j10j16L6j95K40
4701b53j57k4k8K03k97K99r9L6Q9k39m7K69J23j69q1j74K38Q6Q3k93RP4j76L82
4725a46k38j18J83J16K6J09p5j30M0q6R4L1j79J96j21K33%k48L58k42K61o0r5
$$ y = [-318, -271, -376, -285, -53, -385, -201, 38, -74, -181, -130, -260, -244, -359, -197, -380, -274, 8, -51, -128, -83, 94, 140, 36, -406, -256, -86, -222, -1, -194, 90, 169, 95, 213, 57, -53, -13, -346, -26, -176, 238, -67, 105, 68, 268, 102, 244, 48, 161, 222, 121, 295, 413, 176, -31, 307, 283, 165, 157, 131, 343, 333, -97, 87, 322, 224, 331, 330, 424, 473, 143, 349, 338, 450, 172, 328, 319, 349, 409, 632, 273, 301, 243, 52, 218, 27, 392, 322, 503, 266, 532, 162, 285, 279, 288, 473, 87, 88, 110, 181, 558, 457, 365, 98, 179, 158, 114, 290, -102, -123, -77, 187, -59, -288, 160, 86, 113, -99, 49, -87, 6, -7, 31, 60, -29, -158, -280, -219, -358, -129, -44, -252, -33, -71, -23, -108, -218, -334, -298, -493, -253, -410, -434, -462, -259, -556, -257, -356, -320, -231, -470, -517, -248, -125, -294, -375, -549, -311, -225, -142, -435, -426, -352, -528, -146, -384, -502, -319, -203, -177, -68, -143, -273, -233, -319, -225, -194, -373, -177, -298, -65, -65, -313, 45, -197, 64, 4, -91]
4748i1l5J7K09n2J97O0l36Q8J22l6k49K80k1N0n2k15J44J29o7L29j24j21N6pJ44
4773D19k64R5n0m3%P3j34K09j59j85J75K25l17o6j7K27K26j69K32N9j96J57l15
4796A82k69K23J7P7J5k35J64Q3l8k32K73r8J66k49N6K32j27J50k22J57J18m75
4818c2K93o87R9L57q5J80J49j16k6P8kk34L88o56L99j25j6k06L62r1p1J11k1j7
4842C1j6O2j52Mk22J51K61r5k17O1n08O15l86J19k02L17j19Qj5L68q4j97j38K21
4866a33oj77J92l34m9P6k2j33K30j42L65j20m5k87J9N3M8J25p8K94k04J29p0l41
4890f10M84j23m8m3l9n0L46j08J52m37J79o4J74q4K36j99Q4N70l37K43j57k39
4912g0j60L99j76J7j38J63J08k55L19M5L4k41J63l3j74J93k2J00J51J24j10o9
$$ y = [-91, -126, -109, 100, 48, 245, 305, -31, 57, 179, 143, -106, 174, 153, 203, 151, -64, 80, 209, 142, 471, 347, 226, 282, 275, 419, 155, 250, 200, 157, 157, 230, 96, 305, 146, -39, 136, 361, 44, -22, -39, 188, 414, 245, 477, 536, 340, 497, 182, -87, 136, 153, 230, 245, 10, 174, 257, 219, -13, 260, 162, 328, 79, 135, 367, 240, 390, 168, 325, 443, -32, 261, -426, -327, 30, -55, 125, 274, 158, 132, 210, 208, -26, 362, -294, 105, -20, -36, -242, 120, 29, -42, 69, 48, 31, 15, 77, -75, -71, -293, -142, 119, 24, -193, -132, -640, -25, -411, -292, -494, -177, -296, -288, -303, 65, -19, -216, -354, -133, -139, -316, -124, -458, -507, -431, -453, -586, -356, -498, -133, -253, -298, -585, -566, -513, -465, -340, -418, -124, -328, -199, -269, -610, -126, -249, -297, -340, -379, -429, -83, -191, -39, -476, -297, -361, -187, -271, -35, -234, -150, 420, 83, 326, 169, -70, -230, 169, -7, 10, -128, 35, 143, -112, 207, 252, 286, 45, 208, 175, 1, 194, 172, 272, 423, 547, 437, 368]
4934C68m07L09KL6j18j27K73Lk4J0J83n2j12j85Mm7J43k0j67K19J06r5j56J23
4958B69J38l48L67j98j2j01Q2J45l1n4n6J26q4k49L45n10Q9Q9J32k81L30J85l60
4981A3L12m70L97o6j78j00K34j8j39J3j8j62j32J56J41Oj80j51L15K3j97K27j77
5004a51r2L38j24j48P8l69J49J93k25m1K87R8j43lj34J2lk06K42j8K41m1j33L11
5028A18j95l6r5K54m12N0Q9r6o9L44l98J71K57l29J36l49K04LQ5l83L59L37j23
5051g8MJ44m30L61m98R3L83k42O0O7J78L34o10K14J8K9j03j56K28m6J33J13k41
5074d5L7R7j78J43J11m6j81L82m48Q0J59oj97K39J22J75m20JJ39j6J05J59N2p8
5098C86k16Q4o1j4R7J25k43j0K27q5K23p2K08m50J52L5o6M3j52L1J63j61L8J68
$$ y = [368, -39, 270, 272, 308, 190, 63, 336, 339, 315, 325, 508, 456, 344, 159, 163, 116, 259, 239, 72, 291, 397, 302, 146, 269, 407, 59, 426, 228, 216, 115, 197, 342, 311, 257, 201, 327, 243, -6, 339, -171, -82, 7, 139, -142, 188, 373, 13, 325, -145, 252, 186, 8, -92, 142, 124, -15, -2, -20, -182, -314, -158, -17, -11, -191, -342, -27, -4, -201, 26, -151, -243, 95, -29, -177, -99, -468, -319, -126, -351, -392, -105, -7, -150, -153, -287, -275, -278, -484, -242, -260, -19, -60, -193, 118, -77, -113, -208, 46, -366, -316, -227, -323, -392, -48, -446, -275, -18, -347, -211, -560, -356, -353, -268, -651, -292, 45, -78, -74, 70, -360, 1, -497, -404, -21, -263, -203, -136, 42, 376, -234, -20, -2, 27, -76, -232, -4, -50, 83, 196, -45, -8, 89, -89, 54, 165, 119, -62, 320, -128, -48, 111, 105, -92, 147, 269, 444, 24, 25, 164, 148, 253, 412, 464, 386, 170, 254, 193, 179, 276, 401, 158, 148, 375, 290, 513, 441, 649, 199, 351, 386, 320, 363, 211, 242, 405, 244, 282, 450]
5122D50j00k93J47M3k07j02J07J3J51j11J0K9J92m3j47r0P1r0k84J78k25N27k38
5145a2k12N2K04o5rk98K11m0o1o9K55k5P6k37Q9J39j14j61l2r0N2k8N66l49j87
5170c45K94j44Np8m9J86k03J76q1R7j93J82j89Q7r4K49j42Q1j01K64k13j06K78
5193c9k41J60j56J00R1k03K09J33j79J95l94L67M5l55P6J02k16K49O5k48J16K0
5215a03pJ36R5j89J34K4k13M1j19J95l6L59n00L79n3j59l9K18k50J29K18j4l16
5238g0K19L3r0J29l48M2m3N05k35j35K23j21O6J88j56k52K33R2k32m3K01N0j4
5261B42m1q7Q9K22l56K76j57K76j93J97j25j29J58o9j52j9n4J25qj8Q1j37j24
5284cK26K53k47O5l8J2j60l6r4K44r3R7l40K69K08j98l0m6k12J00K00o5q0L41
$$ y = [450, 350, 57, 204, 247, 40, -62, 45, 58, 209, 98, 108, 137, 329, 286, 139, 49, 120, 30, -254, -76, -301, 226, -12, -224, -172, 32, -33, -42, -340, -129, -169, -230, -299, -44, -69, 7, -230, -141, -2, -116, -277, -309, -399, -347, -375, 191, -158, -345, -51, -195, -190, -268, -317, -131, -334, -158, -239, -142, -335, -153, -342, -255, -349, -100, -242, -161, -262, 2, -211, -317, -39, -280, -120, -276, -176, -85, -288, -79, 54, -125, 70, -324, 43, 88, -267, -191, -89, -305, -56, 9, -239, -123, -103, -110, 26, 121, -68, 66, 90, -123, -82, -201, -6, -42, 317, -183, 196, 143, -16, -55, 163, -87, 42, 260, 246, -70, 149, 182, 92, 221, -127, -85, -128, 377, 142, 7, 230, 109, 175, 363, 207, -45, 188, 280, 48, 5, 206, 256, 242, 201, 114, 203, 425, 69, 345, 188, 464, 271, 468, 343, 214, 372, 303, 151, 132, 78, 203, 195, 177, 258, 121, -3, 223, 476, 229, 294, 256, 268, 108, 72, -22, 222, 129, 226, -114, 155, 363, 165, 135, 89, -123, -23, 177, 112, 32, 373]
5308C73m35K03k13M8j9j53M8j77L6J23J82L8k51m5J13m9J25k16K39n4k52J41M5
5331a50k16J67j98K34J56j47l99O7L95l90J49n6J70P7J9O5n5j46J06l48P2O4J57
5354b07n3L73j67r9n4m2M8O3R9L6k66K49k00q7J37J56j04q7k17N04p9j02q5M24
5378B40l02j9K34R6j74N8J08k20K4J86j27j32K03J06k04k00L82j62K53j16J82
5399D16j64K87k31k6K9k02L1J96p6M8p5n9Rj30L30j86J1R4q1J86k19M1Q8j27l65
5424a75K13J95k68K97l3j22K10kl1k02J66k22n9J67K13l25Q3J86l29Q3K98m18
5446g5M4J87l67K84o9J29L9k12K28l33K42M3o9qk74K72l70M14k30J6K36j57j05
5469a35J89n6m8L2j6k53J20K93k07Q2j91o0m8K31j44K1l69K53L22q3k56P3K92
$$ y = [373, -62, 141, -72, -24, -43, -196, -148, -325, -289, -166, 16, 54, -197, -242, -129, -178, -53, -269, -30, -84, -336, -195, -150, -366, -199, -397, -163, -7, -154, -553, -486, -91, -481, -332, -388, -218, -141, -122, -57, -112, -258, -152, -500, -428, -364, -207, -260, 113, -54, -153, -207, -249, -201, -138, -39, -3, -269, -20, -220, -307, -170, -14, -118, -205, -422, 82, 3, -99, -184, 240, -62, -81, 153, 249, 75, 133, 241, 21, 45, 231, 104, -28, 175, 281, 77, -123, 259, 97, 350, 234, 416, 252, 539, 308, 282, 311, 109, 140, 336, 260, 308, 233, 174, 183, 53, 383, 197, 208, 302, 221, 407, 188, 229, 317, 190, -175, 38, 233, -35, 262, 229, 107, 317, 315, 284, 82, 248, 26, -33, 134, 347, 22, 105, 291, -38, 45, 343, -75, -31, 156, -211, 73, 4, 133, 172, -40, 188, -145, 97, 140, 71, 63, -211, 61, -309, 105, -125, -109, 127, -30, -135, 54, -2, -50, -18, -34, -287, -167, 126, -81, 1, -190, -250, -298, -67, -211, -190, -559, -306, 16, -67, -323, -250, 42]
5492D2j20J1j28M5K06j84l0n15L47Q7K52m10J36j76n3J46k24K55K93k53L3J05
5514a35J37k01k5M4J23n9N6k45j4L42n34O15j40q6j26L49k45Q9r2J28Q5l03J34
5537a03J09l11K08J35j20L70l03L8J54j3J84l10L22J08l79R0N7J10j46j31K38
5558C07j50J56R6k90L39l52J01o7J44P8J9Q8l43N9m06M85O6j29j7O0J31l45j82
5581a52M22p2j29J93j42j68K71J40P0N2m47m3J85K88m21k10K15J32k16R8O3j75
5603d6j90L12k01J75J61l58K93j52j71J77J86k12Lj69K51j01K2J11j51Q7q4J02
5625D5k7j31J84k9J05k56kj52L82k7j90Kj21M9J84K13m03L37k92j4n0Q0k0j90
5649c23K19J05j77J00K48l07N9k05K50m01K02J49m33L43j43J62K62j69j02mJ1
$$ y = [42, -78, -67, -195, -150, 56, -128, -158, -673, -326, -239, 13, -397, -261, -437, -490, -344, -568, -313, -20, -273, -240, -135, 2, -199, -224, -180, -57, -116, -60, -305, -319, 23, -511, 104, -36, -122, -248, 101, -144, -55, -147, -19, 66, -237, -103, 6, -305, -97, 38, -82, 288, -15, 23, 177, 164, 348, 38, 360, 468, 89, 179, 236, 346, 200, 69, 307, 157, 313, 409, 119, 458, 106, 207, 140, 284, 362, 381, 469, 126, 185, -221, 264, 330, 201, 184, 244, 375, 30, -152, 270, 198, 69, 262, 120, -48, 223, 363, 433, 485, 38, -5, 180, 468, 47, -163, 52, 184, -32, 66, 129, -46, -236, 76, -125, 50, 211, -147, 146, -6, -177, 0, 186, -26, -23, -192, 59, -42, -20, 91, -60, 27, -57, 45, 18, -113, 71, 42, 147, -109, -111, -263, 119, 92, -98, -96, -217, -168, 16, 229, -174, 163, -129, -143, -193, -113, -133, -323, -104, 1, -176, -76, 172, -135, -76, -281, -31, -432, -230, -81, -514, -171, -314, -152, 110, -59, -161, -165, -154]
5670a54o4J13rK49k57k67l4J90K19k05J3j2j51M95K3k92P8j8q8J94P1o8j24j4
5694a12j30M32j89J2j07J09j64J41N4n1K5L2m5R0q0J42k57J66j0j1O8n0K48Q7
5718D00r7j28P8r8j63K46q7K59m74K35J05k63L57N5q5q6j18k0M3J30Q4M9j71L0
5742B81l27J91M5l2%J2r7M2J74R8l8j3o0k03J94K0k99J76j95L74k6k51K0j38K52
5767B00j21p3j01m0J02j38J58K20j75j35K50r3m3j12k9J60p4r8k6K18j15J20j27
5790g2j35Oj8K18j69J45k65L5o3K34k21j56M77j82p4r9J41l35N74l24J48J21L9
5813B5j02J33k22j09J29n0q8K32J53k93m6k6J45P6q8Kj27M21k65J35L3j14k76
5836c22J61J64j95J00l05K05J04qK28j91L36l01N3j33K52L0k83Q8P0K02j41l09
$$ y = [-154, -218, -105, -114, 135, -122, -389, -423, -233, -14, -219, -206, -218, -369, 126, 149, -143, -65, -83, -171, 23, 94, 26, -98, -112, -242, 190, 1, 13, -94, 15, -149, -8, 46, -5, 20, 52, 7, 97, 17, 159, -98, 68, 58, 47, 115, 65, 313, 400, 303, 175, 253, 155, -8, 238, 151, 410, -64, 171, 276, 13, 370, 425, 340, 254, 136, 116, 159, 289, 373, 422, 251, 281, -46, 145, 190, 158, 158, 170, 73, 115, 289, 387, 349, 336, 276, 73, 267, 287, -12, 164, -31, 343, 317, 66, 86, -52, 200, 79, 6, -95, -135, -33, -171, -13, 207, 32, -103, 147, 54, 11, -101, -130, 30, -44, -142, -168, 50, -65, 55, -72, -207, -201, -219, -1, -170, -25, -290, -255, -318, -84, -305, -461, 16, -166, -240, -339, -198, -533, 41, -283, -135, -14, 25, -77, 56, -166, -275, -146, -196, -284, -52, 101, -192, -238, -264, -119, -43, -131, -129, -256, 165, -100, 35, 68, -46, -322, -161, 3, -192, -92, -397, -192, -88, -96, 132, -59, 277, -24, 29, -104, 148, 178, -105, -17, 53, 255, 114, -195]
5858a95K36j8j8j05L70m39J63K50j46j58J73l2k72L96p0j3M3J13j47j4mMj81K28
5882A64j84J78qJ03j17K7n5J36r0Q8m6K83l86jJ23k8L0j88J82k12J49m4J60n5
5906B09j62r2Q7K80j60j16M6O7k84M14n52L46R7k28K43R7m80K29o0l6J12m9J39
5929A47J59k32l4j02J60q4L2j6q1j26k2J00q0O5P4J47j52j51j08J56J38j06J6
5952a00m1n5JJ59k47k0J28K62l19L12q3l04K54j36n2j60J77O0J74k09R9M6m9m47
5976e50L13n9L65k28j07J27j75L49j43K37n33L09k2J2m03N54o1q8j10MJ86q0K52
5999A49l02J12q3p2K44J28k22P2r5J77k29J04k09M71k44p4k2K06n1M2J66l56K86
6022A98J00k04j3J35m9o0l53Q3K23K41K58m92j40K77m19J71L8K26J89k81J20p0
$$ y = [-195, 41, 23, 5, -100, 270, -169, -6, 244, 98, -60, 113, 81, -191, 205, 135, 122, 165, 278, 131, 117, 113, 117, -64, 164, -20, 158, 150, 253, 136, 163, 108, 244, 154, 242, 196, 479, 93, 92, 215, 187, 217, 29, 211, -1, 148, 104, 264, 209, 47, -45, 42, 322, 162, 46, 92, 159, -125, 289, -263, 83, 180, -48, 195, 292, -188, 41, -19, -55, 57, 8, 147, 306, 74, 40, -62, 98, 14, 46, 30, -51, -177, -199, -99, -179, -114, -40, 107, -45, -196, -304, -148, -10, -116, -100, -141, -196, -195, -36, -283, -303, -175, 87, -232, 80, -3, -307, -53, -189, -241, -401, -224, -164, 10, -199, -100, -54, -103, -550, -237, -296, 69, -159, -266, -139, -314, 35, -108, 129, -404, -95, -117, -105, -508, 46, -15, -103, -213, -209, -23, -103, 149, -153, -41, -124, -196, 48, 176, -46, 26, -69, 108, -121, -17, -226, 245, 1, -73, -95, 111, 60, 102, 268, -88, 198, 298, 94, 81, 216, 167, 107, -246, -163, 60, 301, 559, 67, -73, 204, -215, -44, -6, 220, 409, 128, 248, 178]
6044A78k57M22j84q6O3l02K90m43L42J35j72j19J72K06k13O9j79K54k07M44m24
6065a1M8N5j2J89j78L5j31Q5J21K1k78J65k12J09r5M1R2k74L77o7Mj88o3J32J31
6090I6M5q0m2r1J85o4k63M9K3j4M10l87J19p0k19L31k53oJ60P7k76J93N6k29k0
6115b70J86K4l12M52p7k57J98l07K47r3Q6p9Q4m6M1o7R5j13K31k10j0J99j83M3
6139a38p4O4p0O4R2j73K00l04K43J14j04J25k50k0Q3J39j06J32j56lj8j08K66
6162bJ10n2l9%j71n8J98k49L61J72l26K40K8J7j34q1N3K8N6J8Q2j73r7J69j30
6187B0k66M46Q7l29J40J03j4k89K55oJ26R0k60o4m8J64j75L95l61P6l17L92p1
6210I4j55J4J28j18L4K16k54Q0K90j82K05k07p2j39m4J72k63L14k89L02J08k64
$$ y = [178, -79, 343, 159, 73, 136, -166, 124, -319, 23, 158, -14, -133, 39, 245, 32, 101, -78, 176, -31, 413, -11, 37, 92, 80, 269, 91, 126, -5, 80, 201, 222, -56, 109, -103, 6, -89, -48, 44, -230, 147, 80, 84, -104, -167, -35, 96, 141, 61, 19, -72, 113, 49, -214, -165, -142, -156, 254, -133, -14, -84, -303, 28, -225, -231, -71, 6, -270, -77, -21, -250, -270, -84, -60, -372, 80, 3, -254, -56, -363, -116, -209, -123, -202, -118, -164, -123, -190, -95, -208, 23, -187, -197, 2, -181, -138, -212, -148, -218, -154, -62, -235, -35, -339, -96, 18, -86, 39, -211, -231, -148, -9, -115, 17, -139, -142, -160, -268, -2, 108, 56, 17, 17, -154, -212, -14, -263, 98, 270, -56, 184, 212, 229, 95, 14, 67, 95, 151, 169, 251, 78, -19, 150, 20, -246, 200, 287, -42, 98, 201, 187, -102, 153, 147, 273, 363, 103, 39, -9, 155, -20, 375, 14, 90, -227, 165, 94, -61, -47, 81, -37, -3, 213, -41, 39, 329, 147, 352, 145, 73, -66, -110, 62, -201, 113, -176, 126, 234, -30]
6232c0K35N0j22k71M07j05l82J86L6K38j15j30k00P2K29M2j16j13M5k67J69M01
6254B59n94P3K89K53m62m4j33K72J03j4r7J06K5k1o6j35K22J01j74l9J95l27K5
6277a83O7jK32m2m93M97k87Q0J1J74j24L32k75j22L3J0j72J19K51k32j10K44j43
6300a34P8J08j42q3J12p7K34l14K93m8q3P1r2k62L15nk24J81k4J40n8j9J39j69
6324f3K7mQ0K3o9J16k50J42J86k16j23L57J04k25j08J12N2j82o0K89O7l81K42
6347A16k94J84J37q4J48j62K15j11J05j45J09k98n2K40M4J4J0K5N1p9j9J26j84
6370I6RQ6K8%l95L84o8J5pL52n93m5L23J06K2l26K46j1l16N5k2K80j19k01O0L55
6396C14l00k26M97l74J65q0r1O5J6M5j05j2rR2K11k32R7k41p4K31j4j66J43j30
$$ y = [-30, 205, 255, 133, -138, 269, 164, -218, -32, 4, 242, 127, -3, -203, -131, 98, 140, 24, -89, -44, -311, -142, 259, -335, -262, 27, 280, -182, -226, -359, -87, 16, 2, -95, 11, 36, 15, -51, -186, 36, 137, -37, -76, 119, -208, -183, -116, -117, 115, 73, -420, 77, -210, -130, -119, 55, -69, 263, -12, -134, -101, -91, -263, -144, 107, -125, -235, 9, -134, -56, 52, -90, -173, -61, -138, 96, -218, 75, 27, -56, 15, -77, -339, -24, -29, -253, -72, -96, 44, -14, -33, 106, -63, -36, -40, 40, 63, -6, 110, -140, 2, 188, -28, -151, 206, 310, 85, -23, 89, 141, -41, -101, 188, 255, -126, 116, -178, 6, 143, 59, 207, 45, 260, 149, 254, 109, 218, -80, -132, 108, 152, 166, 176, 201, 252, 173, 154, 280, 96, 105, 191, 219, 219, -176, 208, 140, 155, 148, 500, -93, -138, 185, 291, 313, -13, 233, 222, -94, -39, -61, 219, 100, -101, -41, 314, 14, -212, 285, -89, 76, -4, -95, -30, -14, 31, -74, -86, -95, -3, 208, -24, 73, -168, -242, -11, -25, -191, -48, -178]
6420a78n8%K25k40N0M10n62QJ74K42m1J28M8k02l0j79K62m70L65N8j80J32N4%
6444A6j3J48k73j03K95k94M8K79k14K48l57Q9J06J70j89o6pJ4Mj15L96m11J66
6467f3J27r3k35j0L33K9j3O9j26k4j80J9K82J3o7q5O1n1j49o7LK67l24K56k8o3
6493a19J62mj1Q3k50J46J23O0l2k6j32k60J70J00q1J66J56j19L6j04K5j7j80K52
6517A44j1l0l84L07qj88K84k5j74K60l32J92K11m00K40O3j59J64J80l22J00j5
6539I7LL8j80K06r2k23n5K29j01r3P0K2J74j70L63k37K08l72k70K17J63kj09J24
6563A0j05N7m9J2k06K68o4PN0J6k49M73j97k00J02q3Pj02J88Q7R8k6k68o1J58
6588g7P4k40K68j45J87K40n34n8J37j9j01L18o5Q3j26N9j82K3Q4O0J6m8J64m9
$$ y = [-178, -236, -236, -11, -251, -201, 209, -353, -345, -171, 71, 30, 158, 206, 4, -26, -205, 57, -413, -48, 10, -170, -38, 16, 16, 3, 151, -122, -225, 70, -224, -176, 103, -111, 137, -220, -131, -25, 145, -44, -110, -117, -103, -99, -214, 182, -229, -63, 64, -29, -264, -274, 59, 88, 75, 144, 18, -6, -186, -167, 115, 128, 61, -24, 37, -14, -163, -230, -227, 40, -284, -28, -56, -119, 43, 39, 28, 111, -139, 7, 130, 190, 158, 132, 0, -260, -90, 10, -71, 95, 251, 132, 168, 64, 89, 72, -108, 144, 133, 103, -281, 26, 18, -170, 114, 89, -85, 175, -157, 35, 246, -154, 86, 149, -10, 154, 334, 12, 112, 97, 100, 138, -42, 164, 72, -151, -206, 23, -78, -171, -101, -79, 95, -75, 288, 51, 259, -113, -383, -166, -3, -5, -114, 10, -95, -38, -87, -75, -281, -13, -77, -70, -20, -4, -253, 220, 23, -177, -75, -158, -151, -253, -65, 22, 120, 94, -174, -235, -77, -3, -243, 25, -120, 67, 307, -227, -285, -148, -167, -268, 50, -15, 68, -58, 1, -181, -158, -74, -14, 2, -46, 118, 69]
6612F9j55J58p4P9l00L37p9J1j17J89J08k05J12J5j19r4p6L39j5m02K64j4k60
6635b29J10j23L25k15K95j42J46L7l38J80J03j83J99r7j60K4K97k46l4K75j73
6656E1N2j85N1R2j97L75p2k92K92k73L70j09k20Q1j01j48K20j1J16K06j43K2j64
6679A3J57j40J59m2Q9k70N2K89j27k98J51J81j93K03k93J6p8j21L99j2j31j04
6701a00L49j17r1J6J10k28L31k24k3j39J92M1M7o8j26J37M9K6j62o9o4J33j45
6724a25K86j68J1K9N3j78J82M5L2j47R1j2j7j03k62K65j0J97j71K6j39J91l34
6747b58J34J45o2j09Mr0J15L53k81L14k02O7j88J90j05k85J53J36j79K72n4k57
6769a87j76L05M9JK4J13j73k08J98j3K2p7R2Q2j87K51o1k06J66j74L36m4j51m3
$$ y = [69, -86, 72, -2, 77, -223, 114, 35, 46, -71, 118, 226, 21, 133, 148, 29, -65, -141, 198, 183, -219, 45, 31, -229, -119, -242, 83, -132, 163, 21, 167, 204, -134, 46, 149, -34, 165, 68, -92, -68, 229, -17, -51, 224, 51, 103, -82, -31, 61, -136, 239, 167, -125, 167, -106, 264, 155, -65, 16, -85, -233, -13, -24, 92, 298, 155, 177, 13, 170, 30, 189, 147, 236, -34, 18, 307, 180, -118, 33, 214, 21, 224, -69, -53, -131, -252, 147, 135, 4, -100, 249, 132, 41, 57, 167, -61, 270, 46, 23, -116, 76, 117, 164, 96, -30, 107, 156, 182, 20, -49, -113, 20, -125, 161, -7, 4, 33, 86, -92, 90, 135, 167, 20, 111, 99, 82, -21, -283, -18, -28, 169, -2, 24, -115, 76, -258, -124, 21, -41, -150, -146, -236, -121, 232, -49, 265, 63, 130, -58, 132, 27, -258, -105, 31, -148, 124, 70, -187, -363, -58, -9, -8, 16, 129, -44, -252, -54, -67, -45, -122, -30, 52, -135, 116, 55, -151, 15, -159, 177, 133, -18, -61]
6793f1p6J4J64j56O0J12j70kJ36r2L7m6J71j29j4j60L27l92L46J99k82p0J74L1
6817A21k64L22Jl84L71N2j98j1l39O09j17k27J72m5j65K17J13j88K36k5j38l2
6839H1j5J92p04P49k80Q6k00J31j01J88l03Q4K74j08q1o1p8L55K6j28J43j70j27
6862d7k25K71J57l07L47m19J05K5j32L32k74K68l07L48j04N5l99N38j56K6r5k03
6884a96L35j20P5n8J35P4m43J22k06Q0L36k32J06l43R1J13M3K74j50k62O3P9K82
6907A98l00Kj55K48nP3J61j67k56K55R9l01K3j97Q8L14K7p7k1j31p8N0M8K84l85
6932b03J44J9l9J33Q4m1q2m0j43J75J43p3k18J41k36J82r3K65K27m66O2K07Q6
6955B34l40J25mJ06k26P4n3J82k8j95K47O3J6j7j44K34l62m0J73O6j99K49p5l3
$$ y = [-61, -137, -123, 41, -115, -55, 57, -113, -115, 21, -71, -34, -80, 91, -38, -52, -212, 115, -277, 69, 268, -14, -84, 90, 121, -143, 179, 180, -204, 167, 219, 21, 10, -329, 280, 163, -64, 108, 63, -102, 115, 228, 40, 276, 251, 113, 81, 66, 258, -446, 303, 23, 109, -91, 40, -61, 127, -176, -92, 182, 74, -7, -68, -146, 209, 235, 107, 250, 80, -47, -272, -1, 156, -151, 196, -223, -118, -93, -225, 107, -167, 101, -206, 142, 38, 93, -306, 232, 76, 102, 7, -196, 139, 19, 94, 36, 171, 245, -198, -76, -282, -202, 134, -98, 8, -335, -244, -131, -88, 186, 36, -226, -163, -84, 198, -102, -100, -255, -7, -12, 61, 222, 55, -201, 54, 153, -148, -125, -322, -234, 80, 107, 30, 9, -122, -200, -150, -102, 182, -203, -59, -40, -79, 54, 138, 97, 15, -25, -168, 7, 150, 77, -141, 0, -236, -54, -147, 118, 345, -121, -59, 148, 234, -106, 19, 15, 121, -105, -31, -84, 98, 70, -125, 122, 185, 201, 184, 40, 274, -88, -128, 45, 111, -88, 161, 86, 53]
6979E3k00J32j65N89M1l84j0j89L37k90R8j20L39j26k5o5J6J01n61L24N0L5J15
7002I5k2M7J07n07K06k3J48j00J85p6P3k45J45N3k60J42J41j49M8KR2r8J3m2J02
7027G7l19L60M1J73n31K67N1j20o0J22J4j64K60j80k1j1j5P8k16J28K8J18n5k50
7051b25K80p1j81J74m9M35l98j02R7m4m4m7K58j26L39n86K58R7m42L28o9J09j9
7074b8K67j18l50J02P6J25J15l31j73J30R1J68j48Q5m6P8Q5L7k13N9j02k8J32
7097A3J2J47n2k80K06KJ9Q5n43L15Q0Mk66L5J69L59l94J7L10l51L2L69k01l56
7121b69M6J88P0J6k5l8J76j72J04j74K53j31k14J86l1J9l1K89k99j21O2J35j90
7144a51P3R7m4J97j12l12K00n5K04k08J6K15p5m5J91J01k49n6K93l37o7n7J45
$$ y = [53, -147, -15, -180, 409, 450, 66, 56, -133, 204, -86, 12, -108, 231, 105, 80, 15, 31, 132, -429, -105, -55, -20, 95, 73, 120, 227, -280, -74, -97, 51, -49, 136, 60, 133, -112, 33, 86, -174, -32, 109, -40, 8, 10, 102, 4, 17, -25, 77, -242, 118, 159, 332, -199, 68, 119, -1, -61, 61, 75, -89, 171, -9, -30, -41, -56, 22, -194, -66, -38, 80, 25, -225, 55, -16, -197, -23, -72, 363, -35, -137, -40, -84, -128, -175, 83, -43, 296, -290, -32, 65, -377, -49, -118, -9, -28, 239, 121, -229, -127, -51, 74, 189, -142, -315, -185, -94, 74, -74, 11, -35, 43, 128, 165, -48, 11, -91, -119, 13, 25, 172, 120, -160, 46, 48, 67, 152, -391, -76, 4, 8, -258, -223, -54, 305, -89, -72, 238, -113, -81, 288, 87, -269, -223, -35, 35, 51, 26, -12, 164, -8, 96, -78, 175, 44, -170, 16, -15, 4, -27, 262, -37, -158, -96, 39, -151, -78, 19, -25, 172, 60, -252, -52, -107, 97, -111, -95, 120, 45, 0, 191, 292, 43, -13, 280, -57, -124, -181, -36]
7167c6L38k80KJ84j7l24J08K28k27J24q8p3K22l08K40j35J11r7m6L94k39J12k29
7190c6J02K45J2m54R6J12J58l61j00K61k78O27n91K37n9K4O6k58K70M2K83n20
7212a22P2p7K08k18L9K82k25L82j79j87m1k08J42K46j88P5j7J33p9k32r7O25l41
7235gJ00k30O1j4L1o0J64l9j35J46k9q3J7J38PJ03k83q7J94LJ01l00K90j03P1
7260E6R1p2r7j08j79K36K82l7l27K74j99J80p1J27k1m3j27j26K71j66L52l14K36
7283B18j39rj53j60L15N3l92M07j32K23j24j17l8k47L41j98L8p0L5Q8J64m30L14
7306a3P9j47L75m41K04J2j24J17J32k65L8J53j52LO9O4l00J43J94n18M71qL6k50
7330a28P4J48K6j20L7k39o0O1L50L30n11R1RNk7R8l16K09k00L25p5j16q9j15L65
$$ y = [-36, 302, 22, 24, 208, 191, -133, -25, 203, -24, 100, 12, -61, 161, -147, 93, -42, 69, -28, -74, 320, 81, 193, -36, 66, 311, 323, -131, -35, 77, 235, -126, -226, 35, -243, 384, -207, 30, -29, -5, 61, -197, 73, 115, 398, -122, -50, -127, 81, -137, -98, 184, -41, 341, 162, -25, -66, -274, -132, 114, -74, 1, -16, 117, 38, -194, -291, 334, -7, 93, -137, -76, -90, -59, -119, 45, 6, -129, 17, -12, -95, -78, 60, 67, 170, -113, -200, -6, -3, 98, -202, 88, -15, 56, 147, 75, -22, -130, -309, -73, 209, 172, -155, 119, -80, 100, 29, 156, 135, 92, -35, -161, 110, -56, 296, -18, 218, 79, 70, -83, -243, 72, 125, -267, 140, 8, 231, 107, -10, -48, -295, 46, -152, -114, -184, -149, -61, 103, -327, -13, 66, -81, 294, -147, 57, 69, -55, 62, 194, -71, -33, 120, -32, -29, 40, 104, -196, -53, 141, -377, 94, 86, 122, -128, -54, 94, 120, 0, 37, -202, -262, -201, 149, 479, -32, 59, 68, 73, 46, 144, -172, 37, -163, 162, 87, -29, -118, -233, 132]
7355A32j2p8k53J05q9J39J33o0K20l46p7j8L2K73q4j18P2N1j97j3J90p6K5j62
7379b11J68l5J83k87Q9j38L07n74N13l6qn2J55n6J42p0l95J36l9J13j01M35j21
7402A18l7k10J22M8j00p5L14j15j47J62j90K71l15J98J43Rk85K7k30K72k00M02
7424A82j66k25L20j16k18K63M5j05O1l89K60M4k5Nm9M52j89J2J9k25K00l60K60
7447E6k7o7J59J9l82L93l00J48Q6J00j31J49k94k27O29j93k63R0l9K0o8l2K18
7470D4k22K34j09K50q3l49M28j48r7K27l43M65j85q3L5j88r2K12J1k05O1j9K46
7493I0j74J89j5j81P7K50l6k06P2l28K43P2J24j9k15K13q2j72r3J82p3KK65q1
7517A04q9o4j27R1K63k38n9J21N0N0J94n12L09P8l8j87J32n9j83J83j46N0L01
$$ y = [132, 120, 42, -211, -106, -195, -56, 77, 17, 237, -109, -186, -204, -172, 101, 17, -101, -29, 22, -175, -188, 2, -74, -49, -211, -43, -78, 105, -182, -93, -231, 76, -498, 15, -21, -29, -81, 74, 18, 160, 90, -305, -169, -208, -95, -196, 239, 118, 81, -129, -7, 41, -59, -134, 180, 65, -82, 80, -110, 161, -154, 44, 187, 196, -89, -62, -292, -20, -220, 182, 16, -209, 111, -5, -223, 40, 85, -20, 41, -348, -88, -44, -69, -64, -113, 339, 150, 162, 181, -44, 156, -204, 56, 29, -38, 121, 140, -242, 151, -149, -1, 85, 185, 54, 203, -91, -318, 311, 118, -145, -55, -94, -74, -142, -174, 44, -178, 56, -53, 197, 114, -235, 193, 45, -52, 175, -168, 297, 112, 29, 64, -124, -216, -4, 7, -198, -137, -156, 90, -84, 105, 90, -91, -14, 236, 200, -6, 66, -262, -19, 53, 177, 158, -57, 156, 74, -98, -191, -9, -82, -80, 185, 104, 15, -49, -176, -85, 178, -60, -119, 2, 52, 102, 296, -216, 93, 171, 133, -54, 78, 19, -164, 19, -127, -77, 224]
7540B24m27L67l31M1K53k85M69m67K71k12K70l92L01j7op7R3j35o1O2J33j26j13
7563a65J16J0k1J00m0K4R4o56N61j17O3j18L20k01j14J80k90K94Q2j01R6k48O1
7586g0l3M4L1J48k02J48k19K08Nj1j80O1pO9J1l53L73q2J87M4k7k32r3J51J72
7611A43j37l4r4K5J62P3K5k26j74J52J2o2K29O9j28j24K79k13J03r4J36l56J54
7634h0J3J28J5k1q2l0J86n3J31l05K81j12k54Q8J34M2L47m50O6J12l08K39l3k27
7658a73J36J03j1N8J22l50K52j42n2L0M4J41k05J57n0K31k61mp9J45j81J39l9
7681A1J67l06p3J67j31J82N4k83K80j37k1Q6o5k45M30j58J42k37P9M33l55k2p4
7704g6J22M9L25o72N2L55m75K31n1K02J93m17J53l3M5J87n82N06Kj70L74m30%
$$ y = [224, -203, 164, -167, -126, 127, -158, 311, -156, 115, -97, 173, -219, 82, 65, 59, -18, 75, -60, -121, -59, 74, -52, -165, -49, -39, -60, 40, 0, 24, 118, -538, 23, -94, -31, -149, 171, -30, -144, 36, -254, 40, 122, 21, 117, -131, -70, -103, -59, -28, 120, -82, 66, -153, 55, 60, 49, -131, -70, -77, -8, 3, -350, 23, -59, 128, 172, 145, -87, -180, -29, 143, 6, -28, -122, -97, 65, 138, 163, -63, -237, -85, -73, -135, 94, 163, 35, -89, 190, -23, 80, -14, 122, -234, -80, -67, 61, 76, 55, -27, -57, 129, 76, 207, -98, 183, 71, -183, -95, 39, 81, 428, -22, 44, 156, -152, 87, 54, -173, -37, 66, 55, 113, 235, -115, 137, -5, -57, -27, 17, 158, -47, 110, 60, 291, 30, 26, -53, 92, -89, 50, 11, 178, -128, -201, -34, -165, 17, 71, -212, 68, -69, -90, -4, -69, -314, 116, -42, 100, -137, -58, 375, 20, -2, -76, 46, 95, 420, -252, -200, 155, -320, -89, -140, 62, 255, -162, -9, -42, 3, 190, -392, 114, 116, -54, 320, -110, -110]
7727a10J28k7j19NL55j64K1l16M39k19k03k5O6K62k06J08j07K0J42K45j15j83
7749ck7J72k51j36o0K36q0n9L50k16M23j84j50p4L6k15N93n43N9L27j46k59p5
7772b82K48n7J33j42L3J13pJ72k26K91l42K0k16J36J15k80L47J38k70R1J38l65
7794b12mJ87N3k02J65M7K5J56l29J28K0P3j05k10L13k0j64L8K1j19JJ98J1M7R4
7819B12k17j89L94k49K3j20kK14r0J82k92L06j42L50m43k20L46JO8j04J03k19
7841h8o0J03o9j40J17K61l50K61k53K61N2J33j16l57M14k23j20K47k12K81j59
7862a7o8R3k34K88m02K99p4J08J30l32M22l6m21K49j02m4O6K12l30p5J31R5K59
7885B17l48L11k70N2J86j05q3M2j5J00m23N80m28l8J25J59P4O6j08l75L62J8K6
$$ y = [-110, 18, -9, -128, -123, 232, 68, 89, -227, 212, -7, -210, -235, -169, 93, -113, -5, -112, -92, 50, 295, 180, -3, -30, 142, -109, -245, -305, -69, -149, -208, 142, -74, 349, 165, 15, -59, -23, -238, 355, -188, -129, 198, 52, -207, -282, -34, -91, 42, -100, -67, 46, 39, 211, -15, 276, -66, -46, -262, -126, -11, -291, 56, 194, -76, 15, 153, -212, -216, -29, 24, -178, -13, 34, 59, 215, -114, 14, 34, 107, 2, -208, 105, 85, -79, -41, -20, -139, -138, 60, 71, 118, 212, -5, -194, 200, -49, -26, -146, -148, 66, -24, 158, -134, 172, 30, 380, -63, -283, 63, 64, 132, 28, 131, -88, -148, -45, -114, -254, -137, 124, -226, 35, -218, 43, 95, 228, 112, -245, 169, -54, -174, 73, -139, 142, -17, -85, 8, -226, 62, -340, -41, -115, -7, 123, -209, 213, 177, -244, 5, -97, -141, -75, 137, -193, -268, -137, -42, 217, -131, 180, -90, -38, 148, 43, -40, 2, -13, 87, -336, 244, -184, -222, -97, 62, 136, 202, 94, -281, 81, 99, 125]
7908A25n3l32K13K34l4k32O5o9J00l2J49q9rkQ1J02k26n4K72k66j09J3J10K55
7932B12l12J65o9m6J10m65O38k00j3M2j26J66k83p7M18j51J60J54j83Kj45j32
7954a35K62j3k47K27j22J62j68K1l9K57j67o8l3J9K18j18K32l92k8K16j21o7J72
7977F8n1k55J97J23k73J06K66j94m4J13k27L12j91J4K4P2j39o1J1J1J11L4J62
8000A89p5N2j52O7j28j45O0J28N2j22K3l41M78j44J7R4K32m27O1n6p1K78J94m07
8024a43K39p4N6j23n1L93q7l19Q2K94k46j5K2m6NJ35k70l0q7L73k71Q5l8L57k73
8049c2j48O0L30j53j48j0L3K91k30j2n7j25K81L4k29J23R6p6M1l1J27k12k3L70
8073C00k88m2J78J66l84N5j63J44L9K38k53j17J73O3j06kJ46J9l60O5R0K10l59
$$ y = [125, 72, -260, -47, 187, 153, -79, -14, -83, 17, -15, 134, 45, 36, 34, 115, 217, -9, -63, 209, -57, -166, -153, -43, 212, -100, 65, -4, -50, 60, -405, 233, 33, 20, 62, -64, 102, -181, -258, 160, 9, 169, 323, 140, 142, -3, -135, 127, 114, -133, 94, -28, 134, -34, -13, -52, 205, 38, -30, -63, -44, 174, 56, 288, -104, -132, 84, -37, -104, 68, 17, -238, -41, 82, -191, -85, 181, -13, -57, 56, -171, 141, -50, -36, -12, 60, -79, -140, -129, -118, -7, 27, 189, 114, 166, 14, 81, -47, -192, -132, -4, 48, -74, -51, -392, 86, -58, -41, 53, 285, -142, -81, -137, -208, 70, 264, -143, 96, 22, 78, -45, -96, 297, 210, -109, -27, 267, 21, 6, 28, -18, -13, 122, -148, -178, -265, 108, -163, -78, -116, 241, -32, -180, -120, 210, 57, -91, -101, -68, 223, -7, -19, -76, -201, 80, 114, -115, 8, 104, 28, 69, 38, 165, -47, -70, 300, 12, -30, 148, 314, -70, -15, -178, -34, 5, 243, -10, -127, 46, 109, 3, 1, 147, 166, -194, -129, -39, 171, -188]
8096a88J19J05R7N2jl90MP5K49l01J24K50k73L3J3N7r0K17j68K03l35K12J37K2
8120B23k01m3P1n8J21j18J65P8l82K26j44R0M5l28K50j2j81O4L67l96J99j45J18
8143Ik07L29k12R4K9j39J57J16M1J1n3l64Q6q4o9J4L47o3k24K83j51P8n1M2k60
8168b41M00k40n4N19m85K44K5r4mj28J90K73m67J77j61K24j73j55J28K9M4m9j14
$$ y = [-188, -69, 36, 133, 185, 184, -206, -202, -127, 122, -179, -55, 195, -78, -45, -32, 25, -65, 152, -16, 187, -148, 64, 201, 223, 22, -21, 50, -8, 113, -5, 160, 238, -144, 82, -62, 28, 73, -255, -5, -17, -198, -134, 233, -163, 36, -109, 9, -198, 131, -81, 13, 42, -97, 60, 176, 217, 228, 175, -189, -103, -187, -256, -242, 105, 42, -182, 101, -50, 28, -23, 19, -241, 159, -81, -135, 384, -101, 143, 168, 74, 70, -58, 132, 405, -62, 115, -46, 178, 5, -150, -22, 7, 51, 2, -112]
8191a12
$$ Imaginary data points
##PAGE= N=2
##DATA TABLE= (X++(I..I)), XYDATA
0@%%%%%%%%%%%%%%Qj6J6j6J6k4L2l2M0m8N6o9P7q8J04j20J36j56J77j97K23k51
36a32K80l13L52l93M34m83N37n93O54p24Q00q80R69j068J177j297J430j578J745
55I17j934K151k401K692l041L462l981M645n523O740q538J1454j6920L0371j18703
70i8609j37916L58914r2431k25141K37206N2524k45568J29672J29880j91411J2479
81g0401J53152j07784n5578R4220l3608m3310N9052l840r084J5289n3140r972
93f5004N6790k4059j4617M0996k5546p434O0223k9802l9785O1696J718n5724K0268
106b0280m169l5414M2990J2371l7245M2718O814o6392M3279N1459o7487M089N4659
119B7392n6627k799P5691n3074m0503R3700q527q3205L8445J7705n5151L6295
$$ y = [0, 0, 0, 0, 0, 0, 0, 0, 0, 0, 0, 0, 0, 0, 0, 8, -8, 8, -8, 8, -16, 16, -16, 24, -24, 32, -37, 40, -48, 56, -64, 72, -84, 93, -104, 119, -132, 148, -165, 187, -206, 228, -255, 282, -311, 343, -381, 419, -461, 508, -560, 617, -680, 750, -828, 917, -1017, 1134, -1267, 1425, -1616, 1846, -2135, 2510, -3013, 3727, -4811, 6643, -10277, 20094, -98609, -236525, 122389, 29958, -195183, 42023, 94547, -151021, -21349, 108531, -82880, -70401, 82751, -25033, -80611, 13609, -19999, -63309, -4257, -8097, -17181, -1892, -55032, -65004, -8214, -32273, -46890, -5894, -31440, -38874, 21349, -8453, -48238, 13458, 15176, -40548, -20280, -24449, -59863, -16873, -4502, -41747, 971, 7785, -58607, -15328, 36131, -31356, -27267, 27392, -29235, -32034, 43657, -9417, -49920, 43780, 35253, -47952, -9507, 8198, -46953, -10658]
131a0658L3886n1154J5642M0563l7603P353M3890l1700j3555K7948k7959j0268
143a3615L1122k7994q945N7107j6278m8516L2850J2734k8728K6152P640l8120
155a4591J9255K6322k8016O764K8418j9616p750J0702k1383n885J2908j6258O571
168b559L0635j9788j8108K9578M896j0272J6333j3355k4966K5405P552l3501J1474
181C324K8782j7576r131J2680j3527q243J6438n576q355J5148l203j1845J8177
194A7093J2575r792l5l720j2133P425j021k2937O329K3218j0507j0424J2771k532
208F310l068J5216q098j7140J5549M651k2164R405K2757j5147j1014J3810o674
221D393j3200O707n788j0409J6134N258j7894N783J9505l856l716K884r040k156
$$ y = [-10658, 23228, -27926, -12284, 28279, -9324, -1971, 41919, 10219, -3336, 24612, -3347, -13615, 17507, -10487, -19432, 37675, 21397, -27119, 5731, 18465, -10263, 15889, 23529, -14591, 4664, 30986, 2970, 9734, 38152, 18536, 10786, 21488, 105, -5780, 7128, -9130, -2559, 28076, 8288, -9820, 19758, 24654, 14382, 30715, 17360, -7606, 17799, 25351, -8150, 3324, 32106, 14530, 5399, 18079, 4552, -3691, 12747, 7171, -1184, 13964, 10761, -1084, 17093, 29668, 19876, 19841, 16121, 3988, 11413, 10392, -12545, -6216, 17002, 6495, -3929, 8842, 6310, 3242, 18458, 10360, -6780, 8769, 13420, -8744, 661, 23418, 8271, -2743, 11067, 4393, -8807, -2100, -7888, -18297, -2163, 3095, -14799, -9016, 10489, 6633, 2917, 5801, -3239, -5395]
235e395M714j3014m993J5476k790j2793R360M565r305L178J843p622O310L531
249f935j2425L695J5485k113m330r38m958M357q83j8897K987J6484j4050o260
263b8781K1900l317r311K0865k828k0475J8380N655k9781R652K4070k0168n739
276a9878K0403j0481n542J7447j5048j2273K4948l169k1288K0078J2806j5789
288g786J0183R902j6131M840R821k0006k336J6595q849q152J1559K317J248M740
302G945p988L824J1457j3030l873J6052p716n334J8030q841j2785K4241l219l1370
316a2607J6563J6829k7428Q92K3858j1501k188K0223j0667q737J9600n998j7598
329A241J0447J250j1944O505M61m726J2287k519j4915J3671O335j9708M806J2505
$$ y = [-5395, -681, -13695, -18688, -3212, -6002, -18795, -9435, -4870, -14175, -10997, -9154, -16776, -10466, -6935, -19360, -15665, -180, -2293, -6623, -7561, -12519, -8162, -9045, -27942, -24955, -8471, -22521, -28781, -6881, -10198, -19509, 1356, -1472, -21947, -3567, 2088, -27693, -18041, 6029, -14139, -19878, 525, -9956, -15498, 1949, -13099, -25372, -424, -3593, -24881, -4803, 8003, -7786, 2397, 12299, -3832, 1008, 10829, -9177, -11513, 5082, -3767, -11919, -360, 1957, 3205, 7945, -43, 3781, 15238, 2208, -1665, 14387, 6671, 1337, 19367, 10526, -2259, 21982, 18763, -12607, 3956, 20785, -6643, -5751, 18107, 6606, 4418, 24641, 13974, 5237, 24837, 18839, 1241, 11688, 12938, 994, 7499, 7960, 3234, 15521, 13002, -1913, 11758, 18093, -1615, 3191, 15696]
343A5696j1853L985J2252j6612J32K1212j3438j6151J4851k728j4923J0145N28
356C096r791J4637L812j5695J0858J1570j9401l37J5321j2076o773J2239p804
369c44n982J7656m467j7665J0586O906j4093K74O600m014L969L940o398M887N809
384G664q060J81M079j0758o62N626j2731K562J9408j3662j2359K3969J226k2423
398a5940J2849R633k0285P401J4356k1595k84K5043j4427j3774J9745n399j7939
411b0616J3426J475j3495J3935L756j6481J4102J2337j9848K588J3773j5520j273
424a1841J1360j6793p54K2691j2404j2190K0819l457j5323J5559L25j5463J5148
437b323K804j7798J4995J0643k0183O059J4749j7616p54J1061j6927K413K0257
$$ y = [15696, 3843, 7828, 20080, 3468, 3600, 24812, 11374, -4777, 10074, 7346, -7577, 2568, 3096, -6695, 7942, 11754, -3941, 6917, 18487, -914, -1251, 14070, 1994, -4779, 7460, -344, -6326, 11330, 6863, -10802, -216, 6690, -7403, -7129, -529, -4543, -574, 3366, -3032, 1855, 7664, -396, -215, 3864, -6894, -7556, -1930, -14661, -12099, 7309, -6353, -18712, 5257, 6483, -15940, -3091, 6542, -13743, -6342, 8014, -13581, -13865, 11178, -3249, -17023, 2722, -2677, -20616, -7190, -5715, -19210, -5275, -1519, -18000, -3898, 8439, -11409, -8821, 4952, -10568, -11841, -481, -17274, -18028, 4663, -7741, -19931, 888, -2569, -17892, -2333, -2008, -17471, -2323, 481, -17317, -2322, 8321, -11862, -5803, 8946, -8670, -9424, 1637, -15290, -12877, 7380]
450G380j6348o721K3848p042j0473J9316p130j3371K0770m857k1626K1037P076
463A1859k4087J5296J3309k3711O207J5664k3017N156K2522k3334m635L0400j2685
476H944j3077K4492q280j6827K3768n516k5964K1351Q638k5544J3009J5040k1463
489a429P232J5239j9165L159J6096j8690k448K0124j2876o083J7563j1021o230
502A471J8614j4413j3483K4218o148k0460K1275L028k0560J8388Q040k5930J3531
515G571J4658k9038L454K2453k2797n262K3957j4792r511K3863j2099j6066K4247
528A0638k314k2380J5769O051j7260J1763O355j7940R634R606j9553L290J3154
541F813j6802j079J4833j2615j612J6950j1937o286J9202q167j4091J5635p67
$$ y = [7380, -8968, -15689, 8159, 1117, -9356, 9960, 2830, -10541, 10229, 5372, -16254, 4783, 11859, -12228, 3068, 16377, -7334, -1127, 14537, -8480, -3324, 19198, -4136, -8771, 21629, 8944, -4133, 20359, 12079, -4748, 19020, 13504, -12460, 8891, 17529, -8015, 4994, 20034, -1429, 5803, 21042, 1877, 5036, 21132, 2442, -6, 20118, 7242, 1159, 18722, 7701, 1471, 20085, 5672, -7811, 16407, 10259, -10201, 11074, 14102, -6458, 11930, 19970, -5960, 7571, 22229, -6809, -3355, 19098, -3699, -8961, 14996, 204, -9307, 14556, 2457, -13609, 10638, 8324, -14056, 1713, 7764, -9496, 2267, 8622, -9318, 316, 9922, -9631, -6341, 6813, -9989, -11068, 3765, -8850, -10462, 6488, -5449, -11735, 7467, -700, -14791, 844, 77]
554G7j4601J2529J382j5147J2637P291j8058N282J2192j5447L16J2701j0965r32
568a0743J3632q681m208J4760o255j0734J1953j161j0622P460l18p943J0508K884
582E32j1285P367O287j0899K997O506r618K321Q380r290j337J1772n692o300R127
597H68j286p508M910Q4m607N907K165n013L185M335l422j539J716j67N34j579
613a417k770L167J347k835K796K409l861J297K814n656J307O861m191l660O808
628D416Q63m837L449J484l806J456J201m011M11M039j264q58K987O03j040k8N24
645E589L35j33j87n11j591K033J132k649Q65M592l404l753M507r12l658M328J103
662G686n250L780M077o289K37M932l815k948K984j718r81K387k060K86L839l451
$$ y = [77, -14524, -1995, -613, -15760, -3123, 4168, -13890, -8608, 3584, -11863, -11547, 1154, -9811, -10743, 2889, -5792, -10000, 4760, -1495, -12229, -276, -1437, -12059, -4599, -4917, -12860, -2352, 532, -10753, -3386, 2901, -7998, -5001, 1505, -8113, -5792, 2588, -6702, -8039, 3733, -1959, -8259, 868, -418, -7926, -3016, -2932, -7539, -1632, 533, -4480, -1295, 3040, -382, -1921, -205, -372, 162, -1417, -4187, -1020, 327, -2508, 288, 2697, -1164, 133, 2947, -2709, -1402, 5459, 1268, -2392, 4416, 5279, 442, 3891, 5375, 1569, 3025, 4226, 215, 626, 4665, 3401, 2543, 5530, 6133, 5093, 5065, 5589, 5924, 5791, 5604, 5093, 3502, 5535, 6667, 4018, 4883, 9475, 6071, 2318, 6825, 5913, 2255, 6583, 7686, 2436, 6216, 10293, 4004, 4241, 9173, 5358, 2410, 5394, 3676, 2695, 5082, 3022, 3308, 7147, 3696]
678C696j719L879l155j953N148l880m381P525j509o974O571K518r041L631L313
693C669q600K689N703q080O08P777o989j639P855o057k809P967o172m554R036
708D04l529p634R914L99r198P165J604r664O146M440j1140M437P763j0351Q02
723h442R680q101k334J0009p193n020J0770l773p895J0356J24q835Q101K524r871
738i900O481M011j0654M335P462r751P71R066p158r78Q456o287k313Q465m437
753b431m835Q812k767n609Q794j144o701Q280J53r568P963L934j0720M735P312
768F208j0358J900R869q489k756J1002n837o210R693j578o793P262O13o382N434
783C578J418o590N447K648p596L483M391p593K580N980p531N66P770o570l170
$$ y = [3696, 1977, 5856, 2701, 748, 5896, 2016, -2365, 5160, 3651, -3323, 3248, 5766, -3275, 356, 3669, -4931, -2242, 3461, -4619, -4011, 3766, -3223, -4862, 2993, -3064, -5873, 2094, -4078, -8632, 404, -3125, -10759, -845, -446, -9644, -2479, -875, -10539, -4393, 47, -11093, -6656, 1107, -9244, -8442, 1238, -6863, -9197, 812, -6381, -11401, -631, -4404, -12299, -1943, -1819, -10654, -2553, -29, -9900, -3419, 592, -10062, -5727, 1735, -8016, -7245, 1821, -5337, -6315, 2141, -4146, -6459, 2006, -2431, -7266, 1546, -1221, -6830, 1964, 820, -5881, 2399, 2552, -7016, 947, 4881, -5839, -1104, 6208, -4150, -2250, 7619, -870, -3626, 7376, 1539, -4671, 5022, 3444, -3349, 3913, 4526, -1856, 3578, 4996, -1594, 3853, 6501, -1095, 2388, 6779, -814, 1766, 7746, 215, 781, 8551, 1981, -1189]
798a189R045l800n799P983n28p393O648K473p852M285L929p110J596L999n342
813I45Q08M953n005j52N245m366j857O708l674l591O318j926n644O109J088o687
829g28M625K728o950J826M258o060J046N303n715n95O038m943j931P141l994m616
845b567P528j985p605P390J770q990M625N177q780L49P495o150j874P180l702
860a39m269N455j128l811M442j201l996M396j647m941N796Q29p167M860L019q083
876g585K386O987p774l03P742o140l669Q178k885n486P090j374o211N460N95n697
892h686N339K162o730L836L551p513L092O059p459R5P631o284l272Q191k536n538
908h062P079p89n752N710J235o190N881K791p095L639M038o451K054N683o870
$$ y = [-1189, 7856, 4056, -1743, 6240, 5712, -1681, 4967, 7440, -412, 3873, 7802, 692, 2288, 6287, 945, 1753, 6706, 1701, 1549, 6794, 2428, 571, 7279, 3605, 14, 6332, 4406, -1238, 4871, 5959, -728, 3897, 6625, -325, 1501, 5759, -301, 745, 6048, 333, -262, 5776, 833, -1098, 6043, 2049, -2567, 4961, 2976, -4629, 2761, 4531, -4459, 166, 5343, -3437, -3088, 4407, -1743, -3617, 3563, -139, -4408, 1047, -81, -3892, 550, -651, -4647, -251, -1898, -6839, -1043, -214, -7381, -2521, 498, -7585, -5199, 1788, -5986, -6289, 1453, -4687, -8356, -178, -3063, -8549, -1459, -2833, -9044, -3584, -2989, -8686, -3347, -1185, -7915, -4079, -528, -8041, -4949, 1110, -6349, -6254, 1377, -4907, -8179, 12, -2524, -8062, -983, -1772, -7524, -1814, -579, -6769, -888, 1903, -5192, -1553, 2485, -3966, -1912, 3771, -3099]
923c099K30O573n996k258Q220k885m885P848j218o157O824J512o657M658L379
938F089o818K195M001n007J426L699m627J99M496m753o07O184l705j142N176k713
954D093l413O400j399n387O079j41o840M056K937o183K698L798o094J076M930
969F610n219n21N831l527k083M887k620l024N514j972m821N243n95n723L852J893
985C725m811K807K334m333J954L097m509K61L744l668o67K884l065q14L891k670
1001A60k644M487j759l953M004M82k908K555J004l823K858J824m221Q62K894l729
1017a907j070K553k590l01L455k286j457L753j277k366K819P4k119J600P0k065
1033c114J930P83l031Q91J429k354n58J121j048J76J581q28m37J789L26r83K54
$$ y = [-3099, -2869, 3704, -2292, -4550, 3670, 785, -4100, 3748, 2530, -3627, 3197, 4709, -1948, 2710, 6089, -729, 1466, 5467, 460, 1886, 5585, 958, 1157, 5653, 900, 293, 6477, 2772, 1630, 6806, 4093, 680, 7080, 5681, 294, 6373, 6232, -608, 3448, 6385, 202, 2900, 6698, 604, 1680, 6610, 1391, 870, 6701, 3174, 1091, 5978, 3358, 334, 5848, 3876, -945, 4298, 3703, -2020, 1832, 3725, -1086, 1721, 4055, -278, 1676, 4773, 264, 525, 4269, 601, -66, 2818, -247, -1061, 2830, 160, -2484, 2003, 244, -3709, 295, 777, -2131, 424, 1428, -2395, 463, 2287, -1934, -1072, 1822, -1907, -2977, -424, -3014, -3315, 140, -2146, -3603, 150, -1127, -3493, -674, -600, -2719, -1119, -1049, -3114, -1184, -401, -3432, -2541, -1112, -3466, -4024, -2903, -3951, -3775, -2194, -3022, -3459, -1670, -1344, -2327, -2073]
1050b073K51J90j384p83Q10L52j613P00J182j026j32J136j174p4K091q80j003
1067c430J413P34j93K58m72O3R42k057r18J802n61j194J860M08q13K162N13j731
1085a214J795J432k936O15J411j051K64K32j507K351M40l060J151K535k444J06
1101A20L246k308q5M112j800k245M524r15l858K582K20l160K091Q79l328L076
1117C151J900l400J427L107l570P04K184l183L93L704l803j083M910k542l599
1132C00M138j142l180L324l23l674M045J550m835L261K464m223Q03J877m681J206
1148I10K719m953Q3N085l925j481M745k325k755M389k204l116N229n54m889M301
1164A259J865n256K003J668n246J701K672n792Q69N552m283p26N505l135k055
$$ y = [-2073, -1822, -1632, -3016, -3799, -2989, -2637, -4250, -3550, -2368, -3394, -3526, -2390, -3564, -3638, -1547, -2427, -3430, -2017, -1283, -1476, -1218, -1690, -1627, -685, -2742, -3660, -1858, -2419, -3613, -1753, -1345, -2158, 4, 517, -1214, 581, 2013, -923, -308, 1103, 52, 316, 548, -959, 1392, 1832, -1228, -77, 2458, 14, 120, 3366, 1058, 973, 5085, 3285, 1040, 5564, 4649, 791, 3373, 3593, 433, 2524, 3403, 75, 3151, 5051, 1651, 3078, 6185, 2615, 3319, 5503, 2320, 2713, 6417, 2614, 1531, 6441, 3899, 300, 4438, 3296, 116, 3440, 3117, -557, 3488, 5038, 203, 3464, 5928, 1705, 2508, 4385, -296, 910, 3629, -1324, -1241, 3844, -81, -1562, 3183, 858, -1897, 2492, 288, -2828, 2401, 1847, -3042, 1259, 3124, -2132, -129, 1539, -3707, -2006, 666, -5126, -4257, 1295, -2988, -3714, 1791, -1344, -3399]
1179c399N202k440m298N615j188n360M492J305m795K730J493m166K490J710n224
1194e833K278M027m295K79M518l246o12M608l897k360M994k590m706N120N09m296
1210e502L557J788l975L299J692m870K198K822l945K72L330k511k29L533l975
1225b516n24M617m018k839N091n40l770M354M89k566L625J077m574K416K383m769
1241b064o2L412l344N8L406l016LM285k255k622M382o03l180L129N36k429L093
1258B729M79m031K872J923m873K22K776k760K24L224k786O94L918k094j610L587
1274D494j208k335K020n65j693K327k62k845K927J199l508R37K109k458M71J543
1290C153k122P37L774k199j640L170p17k569R68l69k216J429K59k126K338J226
$$ y = [-3399, 1803, -637, -4935, 680, -508, -5868, -1376, -71, -4866, -2136, -643, -4809, -2319, -609, -5833, -3555, 472, -3823, -3544, 974, -2272, -2884, 1724, -2173, -4533, 461, -2129, -6835, -1715, -1206, -5502, -1945, -157, -4132, -833, 859, -4011, -1813, 1009, -2936, -2664, 666, -1845, -2074, 1459, -2516, -3040, 1577, -2441, -5280, -189, -729, -4499, -145, 344, -2222, 1403, 2480, -2094, 322, 2705, -2064, -2126, 1286, -2058, -2000, 1406, -1610, -1607, 2678, 423, -2199, 2183, 1580, -1600, 1529, 2065, -364, 2729, 3208, -823, 2049, 3972, -901, -679, 2097, -663, -439, 2785, -1, 693, 4611, 2517, 907, 4494, 3286, 951, 2971, 2406, 713, 3040, 2778, -67, 2860, 4059, 551, 1488, 3597, 1139, 1610, 3153, 1031, 1768, 5542, 3343, 1703, 4873, 4156, 1587, 2555, 2186, -30, 1399, 1658, -468, 1870, 3096]
1306C096k619Q78K415j946n10R48k032Q28J794k087j409K407k81k059P68o90j047
1323a546J069j00j569J558J342j447N37J721j314r22L60j458RP49k042q07K662
1340a198k10j315P20K75o54J213l79k289J809J211j887N99J988j964n10J360j460
1357b691j069J087j338j038K735R20k399J213K266o95O0l38j291N03R90j177q77
1374c139J377K33m22N57l38k72P78o82k65J390j94q50J792J239m22q2n03j481
1392a284J626L19l016J31K578j113k75J819m43j84K165o72j926J820J21k318J499
1409H47J512j726N0J046q85L52L1k132j22K471K35j260Q64N93Q83O47q45q98O54
1428B317n26j163K70j42n42P37N07J67O10l23j352J125J286j059j212Q51O54N13
$$ y = [3096, 477, 1355, 3770, 1824, 1314, 2262, 230, 1058, 2852, 765, -644, 1763, 1482, -577, 191, -499, -1546, -477, -577, -2146, -588, 754, -693, -156, 1565, 251, -671, -311, -1769, -1760, -1011, -3053, -3860, -1198, -1408, -2723, -2003, -1728, -2382, -1169, -1548, -3837, -2028, -817, -2704, -2105, -117, -2081, -2591, -1231, -2691, -3760, -2673, -4011, -5049, -2314, -1394, -3793, -2580, -314, -1009, -949, -1287, -2578, -2075, -1085, -2262, -3139, -1762, -1529, -1951, -1394, -1732, -2004, -1226, -1908, -2173, -783, -977, -1827, -35, 1204, 782, 700, 197, -1284, 342, 661, -2355, -2224, 354, -759, -1034, 785, 342, 158, 2323, 1651, -275, 1545, 1666, -652, 847, 2359, 633, 683, 1729, 844, 1196, 1227, -905, -1027, 1444, 1679, 419, 1283, 1876, 2759, 3406, 2561, 1663, 2317, 1791, 628, 898, 756, 214, 951, 1458, 1625, 2235, 1912, 560, 1685, 2971, 1912, 700, 1551, 2205, 2718]
1446B718K52j169n94J132o09j640j35J90j62Q05L46j21J019J22k57M88M26j382
1464A429r59J65N70J09r63m96P12J057p27r06l57P74J30m5q13K92J002K95l57
1483I12J04J14q26j193J02m8q40n20O75O99L40M95q49k44J445J76k281m24J018
1502a145Q5l88M26m80J32O12j376q68Q83l51r90J047R44n94N16M05j95J275k02
1521b64k594K52R32q92m03L29n35J191J214j615k78J691o07o58J104j45p47J308
1539g17j17k59J171K6k494J322P56k060J23R78m75J114J523k141Q30K729j408
1556I01r02R32r83p99J810o38j171K323n07j602J850P76k052M41R76j306J200
1573A249J172j872J121K780k416j153J803j165r17J157j407p56K174j18j251J998
$$ y = [2718, 2970, 1801, 1207, 2339, 1730, 90, -45, 145, -17, 788, 1134, 1013, 2032, 2154, 1897, 2385, 2811, 1429, 470, 635, 1205, 1314, 351, -145, 567, 1624, 897, -9, -366, 408, 538, 493, -320, -28, 974, 1269, 912, 1016, 1130, 304, -889, -787, -835, -1675, -2195, -1520, -821, -481, 14, -835, -1079, 366, 542, -1739, -2163, -1145, -1060, -1448, -1022, -1502, -1370, -758, -2134, -3002, -2119, -2470, -3460, -2413, -1469, -2063, -1547, -1142, -1337, -62, -264, -2858, -2606, -1674, -2566, -2969, -2640, -3175, -1984, -770, -2385, -2663, -972, -1579, -2237, -1133, -1278, -2025, -717, -834, -1093, 78, 104, -2390, -1068, -312, -2372, -2249, -1271, -1746, -632, 891, -1250, -420, 2309, 901, -1, 931, -52, -851, 959, 321, -850, 1473, 966, -636, 1214, 1990, -62, 379, 1355, 49, 1249, 2421, 549, 1670, 4450, 2034, 881, 2684, 1519, 602, 1759, 352, -404, 1770, 1652, 401, 2399]
1589B399O62j882J370J20j845J306J24k350J730J613k438l6J935j632o24J385
1605A837k004m41L169j275j645K726P58k030J177q8j908R98q9k438J197J577k290
1622g69J42J951j034k13J172j891L43J899j731j213K782l85j549J510n50j713
1638a249J665l49k590J788R36k433R60J952j192N80J223k414Q17J771k579j223
1654b337K449j117j508K047m15j298J726P0k078J710N73k325P70J663j225N41
1670g54O43j186O12P52k614K24J556j788j31J513p36k01K717j691j160K768p60
1687b36k342R05J363j909R33Q30j614R43J173k188O8J549q93n71J175o55K87J758
1705E76o97p18J948n28j957R72r1q57N50j16n43J960L23j650P47J354r12m89R33
$$ y = [2399, 3061, 1179, 2549, 2669, 824, 2130, 2254, -96, 1634, 3247, 809, 773, 2708, 1076, 452, 1837, -167, -608, 2561, 1286, -359, 2367, 3125, 1095, 2272, 2184, 276, 1274, 1185, -1253, -56, 1521, -769, -627, 1324, 290, 77, 1249, -642, -299, 1600, -131, -1344, 1438, 1053, -496, 1014, 464, -1249, 416, 67, -2523, -735, 201, -2232, -1272, 680, -512, 68, 1291, -1123, -306, 1465, -1114, -2337, 112, -1005, -2513, -466, -881, -2179, -453, -383, -2461, -751, -178, -2503, -1733, -70, -1295, -754, -111, -1297, -685, 67, -2547, -2323, -767, -2555, -2686, -1173, -1909, -2110, 607, -1084, -2244, 524, -236, -2578, -1673, -310, -2219, -1286, -456, -2070, -1127, 46, -2142, -2074, -525, -1418, -1989, -814, -1469, -1182, 576, -121, -839, 1109, 581, -1376, -404, -495, -1352, -802, -918, -1461, 499, 822, -828, -81, 1273, 361, -128, 805]
1724H05q86L8J580j176j15J877q50q02N57l8j310O15L35r7J315k7n04L81J009
1743B707p11j53l08q6K3J42j038M47J350l96o04J96j85j91O35n50j48O56K5o39
1763A172J057N52j075p6J17o37p9k88p06PJ197k17l58J07M87J54l54m80j32R7
1783E45m64J37J5K58k01J68l68r0k20m72l98P40K44n60L0O9O27K71j48n28j49
1804d94k44o59o0p0J59N96m65L17J19L8l82L59K22m95J15l36j62O34M41o93J56
1825i04K92l73m29m56N5O83J97o44R9Q92l9j53M28R4p19q6m16o0P54j15l57M29
1847h28M67l93o1j19j4L08R3r14J29J352j5j52M52j88m59l15l40m50N44O52n46
1868g97L3N51J42N2J91K26J00n66o40R1P50J05k61M31p6k1j27l46J46N01j25n00
$$ y = [805, -81, -43, 1537, 361, 246, 2123, 1273, 471, 1028, 990, -320, 295, 630, 533, 1848, 1821, 1317, 1698, 2707, 1996, 1843, 1535, 1449, 1472, 1614, 576, 1023, 2373, 1977, 1373, 1569, 1384, 1193, 1828, 1278, 1130, 1786, 1811, 1172, 2229, 2781, 1706, 1630, 1747, 1110, 1031, 743, 37, 44, 1241, 1024, 666, 773, 1260, 1414, 1060, 580, 448, 545, 81, 218, 233, 491, 290, 458, 90, 0, -220, -692, -1090, -350, -106, -666, -636, -567, 60, 331, 183, -345, -494, -738, -1397, -1457, -1527, -1368, -772, -1237, -920, -801, -763, -1145, -786, -564, -1059, -944, -1280, -1442, -808, -367, -1060, -904, -612, -985, -1414, -1870, -1815, -1132, -935, -1579, -1480, -588, -627, -780, -352, -258, -977, -1063, -1479, -1539, -785, -900, -1257, -828, -361, -754, -815, -934, -948, -640, -547, -1461, -1332, 20, 5, -147, 305, 117, -342, -657, -997, -1447, -903, -251, -797, -764, -213, -71, -19, 172, 398, 498, -68, -708, -617, 133, 238, -23, 408, 332, 311, 184, -162, -16, 485, 360, -140]
1890a40K48N32n7N03M61k45J18k07q24r0P02m48p63J144K98k33J53L92q02N49
1910A291N73j166j78N16J75M0M54J7L1n31n76M22L16m51l16O45k57l50O28MK96
1931A583M61m68r85p5O66o17J06L17l17l87N20j34j54K66k1j026L60L59j80l17
1951d3N92j61L42k39r96j14O40l12n06j49K74P0K00k02L23N09m10l82l45j32n46
1972a587K61M39l90M73L8p51N09L91j093N0L26l58J02N48j66q9J075k57r39M77
1992i41rq84M39J76n24M14K96l86M78N08m38k20J40k80J83K80n98O45N21k46n25
2013i71R12k14p64R29l27n72Q18r3o35J168M32j077L29O28p57j27N92m46m8R66
2033G43n77m86J005J61p34N70k0n63N64l93m73J235J69q01N79K51p87L95J17p21
$$ y = [-140, 108, 640, 583, 1086, 1547, 1302, 1420, 1213, 389, 299, 1001, 553, -210, 934, 1232, 999, 1152, 1544, 742, 1291, 1864, 698, 520, 1036, 1211, 1251, 1705, 1722, 1753, 1222, 646, 1068, 1384, 933, 617, 1262, 1005, 655, 1283, 1287, 1583, 2044, 1576, 591, 516, 1182, 565, 671, 988, 671, 284, 804, 670, 516, 782, 761, -265, 95, 454, 274, -43, 549, 388, 730, 491, -505, -619, 21, -291, -797, -946, -672, -602, -402, -604, -281, 228, -182, -564, -909, -1041, -1587, -1326, -887, -1277, -804, -766, -1517, -1008, -617, -1710, -1660, -1334, -1692, -1590, -1042, -1208, -1297, -222, -479, -1418, -941, -950, -1834, -1395, -1219, -1743, -1329, -1033, -1419, -941, -433, -871, -1091, -951, -1231, -1048, -768, -1366, -721, -200, -446, -971, -59, -273, -1037, -108, -435, -1007, -189, -282, -917, 251, 683, -394, -65, 563, -194, -321, 271, -175, -223, 743, 166, -320, 685, 846, 112, 682, 662, 99, 663, 270, -203, 1032, 1201, 400, 979, 1230, 443, 838, 955, 234]
2053B34K07P66q23k33J138m71m30P95j94l64N77k11p93N46N61r66L39M20n01L46
2073I43J40m37K08L21q52j7J219p23l67Q02m61j95Q68p63o18P65l24p66R99J94
2093I36m69N26J27p69L07N05j293M67L20l72m4P98n06m8L24m11q22R46l34p32
2113e44P70m4l80O25j5n14K16J63q60J23M43o41L49j80j75J60N10p10Q4L50l94
2134f64o71N50o7m01J90J98k34N63L1o98J69M36o23k9L35n89Q02k56j62M3Q77
2155b00p29k13K78l00l94P35m60n6P80l40p2M33k0p02M47j98N2n6J84k54M98M04
2177a83m68J11L12l88O5K75k96K45Q23m24j21L91k79J49J07k23j19K20j2l66P09
2198E28J08l71M48j5k38k9L01m46J81M69k93j2K09L13j76O3l44M0M7j01p6J60
$$ y = [234, 441, 1207, 384, 151, 1289, 818, 388, 1183, 989, 625, 1202, 991, 198, 744, 1305, 339, 678, 1098, 597, 943, 1083, 646, 854, 1175, 323, 306, 1525, 802, 435, 1237, 776, 581, 1449, 686, 68, 833, 509, -257, 742, 936, 467, 993, 1120, 351, 658, 1163, -130, 337, 657, 285, 241, 1039, 533, 485, 809, 398, -424, 522, 188, -544, 226, 182, -198, 427, 412, -102, 114, 277, -583, -460, -17, -658, -309, -489, -664, -504, 6, -704, -620, -270, -664, -1335, -785, -852, -1253, -1063, -865, -1099, -536, -505, -1203, -1034, -598, -1221, -1250, -915, -1504, -702, -958, -1120, -1077, -200, -929, -1142, -864, -1164, -1558, -823, -1283, -1339, -559, -899, -971, -538, -558, -1260, -813, -1011, -959, -1015, -831, -1085, -587, -183, -651, -540, -228, -616, -551, -276, -572, -327, 496, 72, -49, 342, 63, 212, 319, 96, -23, 197, 185, -181, 528, 636, 265, 713, 698, 460, 431, 732, 286, 467, 936, 643, 631, 840, 1153, 977, 1040, 696, 736, 783, 682, 606, 766]
2220G66J3j12L75J68k51J04j5l35j13L03k11Q2J48n18O17O7l54J81L50q44J45
2241E66L40l28j55M22q4m62N03j14l59K24l59K41k94o9J18Q8K62m03M02J52n41
2262A50O7J94m69L2n7N1KJ65m34j2M85l23k98O63n07j86L69L00n92L13K29n61
2284d19J87O3l08P4j29j54o5L20k34L0L73k15q1L28k93n3J57l25J61J40m7l18
2306h08K59m3j18n5Jn26K46J99j43K9L06L16m63L52l27k94J07m0j04L35J36l79
2328a014L31J94j8Qk30j57M47j91k12M57N5k78L02L4j35j67L71n69Q1L79j62M8
2350d26N36k65J41M32j45l86M29j41K2Q3M3q8j05K07j09J62J93j65J70K01k73
2371E16J04K14r4Q3J37k0m19M10j53j48M18l49k29M13r6J0O6K36j82J16j40J53
$$ y = [766, 779, 667, 1042, 1210, 959, 1063, 1048, 713, 600, 903, 692, 774, 922, 404, 1021, 1088, 734, 915, 1265, 421, 566, 906, 578, 423, 845, 761, 299, 802, 688, 329, 553, 194, 435, 141, 72, 190, 278, 540, 137, 539, 691, 150, 217, 411, -58, -26, -83, -32, -30, 135, -299, -311, 174, -149, -447, 216, -291, -477, -108, 192, -400, -87, 142, -419, -232, -169, -477, -403, -532, -686, -751, -431, -665, -635, -262, -477, -558, -230, -523, -576, -419, -744, -583, -443, -490, -808, -549, -592, -710, -765, -764, -1290, -1044, -845, -988, -959, -653, -337, -800, -448, -775, -1069, -962, -1002, -1106, -771, -635, -1014, -683, -489, -507, -499, -729, -886, -439, -630, -842, -385, -330, -608, -306, -272, -407, -574, -203, -772, -691, -312, -474, -426, 110, -155, -14, 418, 273, -113, 316, 175, 197, 280, 323, 235, 130, 337, 228, 390, 583, 418, 588, 789, 516, 620, 834, 740, 823, 960, 940, 521, 931, 778, 630, 1048, 699, 470, 883, 787, 797, 863, 1099, 917, 1033, 893, 1046]
2393A046l38M32k99l34O15q3m93K01k52o5J18J41J5k93J54M27k38j5o4r4K14k96
2415D99j11o7P9k69p3K11l39K55n1r2L9l9k07K90L0m65K30l5r0RJ63j31j38j96
2439d98K24m56L30k02J24l24N13j90K94l15o4n3j63n1M05k25j09J62m32K07K38
2460e85K0l57M17Q2j39m83M39J12k23L15n71L32r%k71M39rk18J70K82l33N3q4
2483f21lK90j41K01l39N65m64n7N21o33J64K28j9m90K80J50j11K74J15J51r9J42
2505A04k03J29J4j44j8J81q9j78J60r8k4N8L99l16K71R0k37L09L3j31J96j7J2
2528E01R5j8n96L72QK4l2K83k12k73M61m5k34M63J07k16N0J9l81M78j27l59L17
2551F85L29q58J67M15k99Q5K05J44K28l14P1N2n9J66l90J7j15J18j87j87N5N2
$$ y = [1046, 708, 1140, 841, 507, 1122, 1039, 546, 747, 495, 430, 548, 689, 704, 411, 565, 992, 754, 739, 675, 581, 795, 499, 388, 321, 400, 131, 58, 269, -70, 185, 134, 42, 81, 42, -165, 125, 155, -310, -80, -115, -205, -196, -33, -164, -302, -498, -274, -730, -400, -602, -478, -802, -289, -479, -185, -500, -564, -617, -780, -831, -426, -651, -760, -598, -1030, -823, -585, -565, -922, -505, -423, -562, -1045, -606, -494, -717, -402, -973, -641, -650, -650, -921, -482, -491, -709, -539, -257, -590, -537, -621, -624, -334, -475, -274, -613, -48, -512, -569, -48, -681, -517, -289, -308, -798, -518, -368, -479, -205, -90, 61, -38, 104, -99, 30, 44, -100, -118, 63, -26, -204, -44, -142, -166, -108, 291, -25, 246, 336, 99, 408, 441, 310, 506, 489, 501, 596, 578, -18, 354, 362, 386, 354, 637, 425, 152, 613, 568, 334, 797, 904, 688, 738, 757, 376, 854, 727, 368, 685, 1014, 156, 323, 738, 439, 524, 729, 873, 1101, 787, 858, 910, 851, 1017, 627, 644, 529, 647, 460, 273, 328, 380]
2573C80K34k18N3r6k5J79Ok09J25p0m27K78m4j97M9r0l06K86Mm7k35L17K3l53
2597c83L78m1j43Q4J7o01L99n7n81K63J47n31K27P2k47L10M4k3j0K89q4j18O8
2620e21J65k99M4j64J35k52k22K45J18J09k82M27r8j21L01pl33M56k00R3k88r5
2642g89J58P8Q4k45j95N93m21M17kk3J26L65N5p42O42ll99J32K11l53QM47k06
2665f2jK21j50o3L74m63M58m8N2L8P8J04l5n3J32l36O3j15k20J73J33k04L55L2
2689D63o1J21K76l18J5K64l93L0P0l21K36J01r5k17J82j15J07O6K01k54K01K04
2711G63j26L16O9m56R2O9k48j74M7l55K99K12j44L4R6J11j43K22q5k16K1L26k18
2734E12Q9nl20j55K98k79Q3k97K26r8L41n89L42M04j82j54J72k16j94K54m79k27
$$ y = [380, 614, 396, 449, 353, 328, 507, 513, 304, 429, 359, -68, 210, 166, -31, 18, -72, -378, -92, -88, -135, -370, -53, -30, -383, -5, -46, -189, -105, -88, -689, -290, -347, -928, -665, -518, -1049, -822, -750, -997, -687, -643, -666, -676, -387, -471, -589, -521, -356, -655, -611, -775, -640, -892, -1114, -869, -751, -642, -924, -497, -595, -716, -415, -422, -755, -299, -499, -406, -694, -789, -631, -553, -469, -714, -909, -316, -737, -320, -322, -345, -219, 146, 201, -541, 101, 98, -301, -169, 42, -311, -303, 144, -62, -63, 158, 8, -55, 319, -144, 314, 266, 318, 356, 434, 538, 503, 450, 582, 246, 309, 194, -26, 147, 280, 76, 431, 463, 402, 523, 799, 481, 496, 760, 367, 397, 467, 146, 382, 483, 388, 171, 353, 238, 345, 411, 612, 358, 559, 763, 637, 953, 1022, 566, 658, 727, 479, 305, 352, -3, 296, 508, 364, 398, 494, 605, 462, 684, 599, 383, 404, 730, 512, 601, 596, 276, 121, 419, 140, 223, -74, 152, 54, 395, -194, 148, 552, 370, 216, 388, 172, -22, 232, -247, -474]
2756d74L14R6k23k8K06m38J22M4J97R3l24N5k0K85l46J51o5j44J11j95l91l7L23
2779f88L5j7Q1J0J30j73J24N8j71O5l02J46M3q2L33k99k25K00n1j37l3K79j63
2802h37J20J70M2QK37J78L8j43m15p9K34j72j7K63j11R1M48k7k95M5L06P8R8p3
2826A87r5K1L79k15O2j67k03J12J88k78l0K83mJ62P1J27L4J09l9j02k8o5l11L41
2850E39Kl80K09K78k48K05L9l04J04L32o4j57PL30k29J78j19k98M5l18K85Ml07
2873A33j45L13J48R7k71L64j72J9K13k63j29j3K26l18j64O6j47J67l3K5J85l15
2895a4j30N29k0l65K52K84q0k33k86j42J16J05m30r8K14J73j15J1M54l16L39l58
2917a10k28L87n1p2j10P5O8o3j47O7j24m0k98J83J7k8j07J85j5q4L52p2k52J77
$$ y = [-474, -160, -64, -287, -315, -109, -547, -425, -381, -184, -91, -415, -360, -380, -95, -441, -290, -355, -499, -388, -583, -974, -1011, -688, -653, -670, -589, -579, -449, -622, -498, -440, -611, -546, -848, -702, -659, -741, -408, -707, -932, -732, -783, -920, -953, -674, -837, -717, -547, -505, -497, -260, -82, -44, -187, -602, -681, -447, -619, -636, -373, -484, -393, 55, 28, -267, -222, 84, 162, 260, 187, 92, 113, 492, 277, 339, 172, -31, 81, 269, -9, -39, 244, 240, 402, 473, 600, 634, 743, 704, 602, 574, 509, 198, 539, 541, 161, 370, 648, 400, 605, 644, 340, 444, 776, 712, 555, 562, 892, 663, 841, 722, 424, 469, 151, 436, 440, 133, -12, 301, 449, 546, 275, 639, 467, 486, 699, 436, 307, 294, 520, 202, 38, 104, -43, 124, 91, 116, 301, -14, -144, 385, 365, 0, 252, 536, 456, 223, -63, -205, -89, 16, -414, -512, -298, -125, -240, -229, 225, -91, 248, -110, -338, 49, -2, -74, -184, -109, -41, -104, -251, -184, -308, -348, -646, -463, -446, -474, -581, -396, -411, -495, -143, -215, -467, -290]
2941b90k3m36J45q8J19k03L39k99K48N3K2p0O2Lk86K88L55l11j0k00j7K14m48
2964h33k9O3R4k9J45J23K81l0J81j47L0J16l0k98J0k4o6J02J84j99J17K61l41
2987c19K18o9K31j51K96K29O1l8j5j13J15qk33N3j68n2m9K48K5K16q4N6J87R7
3011G33Q8k46q0j33M40l34J86M5m2P5m7j52Pk35L34J34l22K07J97j52J71K5m81
3034D18K1J4k03J61M0P4m86O66k16J47j95k99K63M6n07L25K80o74O12k1k32p3
3056A61o5J28p67K54L28k78J58o7L61j44N6k28J61j21j45K6M5k19j63R7R8n9N3
3079c30k35L75k66N1lJ9n6L3R3K70j13P4j97k29m1J43m25J54K90O3J3j55J51n7
3103c78J42j51J14p2j9k41O0L23l39K10k10J02O9l06K12j18K43j8o8L86O3k52
$$ y = [-290, -313, -749, -604, -692, -573, -776, -437, -736, -488, -435, -413, -483, -421, -418, -704, -416, -61, -372, -382, -582, -599, -385, -833, -862, -799, -705, -734, -589, -466, -185, -215, -34, -181, -151, -35, -65, -363, -353, -377, -443, -341, -157, -356, -239, 22, -319, -101, -170, 61, -90, 206, 435, 496, 458, 443, 330, 445, 437, 204, 257, 89, 37, -12, 236, 261, 477, 393, 449, 636, 733, 821, 575, 495, 362, 802, 468, 654, 699, 657, 732, 685, 533, 540, 305, 639, 773, 451, 658, 855, 703, 874, 899, 418, 439, 453, 250, 411, 451, 525, 39, 705, 489, 636, 441, 142, 405, 451, -56, 269, 549, -125, 487, 466, 234, 161, 96, 224, -543, -289, 39, -239, -81, -148, 213, 69, 125, -103, 58, -63, -208, -182, -137, -356, -519, -422, -324, -383, -330, -565, -190, -456, -405, -408, -389, -445, -412, -319, -49, -162, -88, -285, -514, -555, -412, -837, -683, -393, -330, -317, -472, -321, -378, -236, -387, -273, -345, -364, -605, -545, -222, -561, -351, -561, -459, -390, -696, -484, -602, -359, -377, -445, -59, 4, -248]
3125b48K39k56K63k80k93M3K46j04L59j65J9n2R7L28m56J50J83Ol76J88J02K49
3147B42J60l98j41J65j17k64L47r4j70J39J95j11K15K96k58J67J08J9m16L96j67
3168C13n1K88k20J05j1J90k82j89J76L6j01J80j14K04R9J02J7k28l57L31M5k84
3190B49J65k30J18J99L50p1j72k46N2L78n85q9J27M21k58r9j7R5Q1j77n3o5j08
3213F5J58m1P8p4K30n5K47r5m30q5L0j69j9Q1m60K56K59lj10j49Q6j05O2k23L18
3238a48j43K6L3j74K50k05q4k62N1K53l18J80R1J31k3N0k11nJ9j45k07l2L00j36
3262g09j91K59O0Q3ko5R8k8o1k3j65L83J18o6j23n8M02k98m1K44n4j45j01o5J50
3287c98J36P0O2J86k35K39j82K87k37n9J27K6L4J07r7m6K89k11k76K64k22J60
$$ y = [-248, -9, -265, -2, -282, -575, -532, -286, -390, -31, -196, -177, -229, -132, 196, -260, -110, 73, 79, -297, -109, -7, 242, 402, 4, -137, 28, -89, -353, -6, -100, -270, -131, 64, -47, 168, 464, 206, 373, 481, 500, 84, 480, 313, 262, 550, 330, 435, 424, 614, 332, 143, 319, 355, 254, 434, 320, 524, 623, 725, 742, 514, 157, 488, 533, 249, 414, 184, 302, 501, 851, 780, 608, 362, 414, 792, 207, 118, 245, 666, 408, 309, 292, 387, 468, 291, 238, 173, 65, 223, 182, 260, 186, 416, 361, 608, 513, 83, -2, 28, -141, -160, -79, -539, -283, -24, -27, -137, -286, -200, -305, -243, -466, -148, -291, -265, -232, -406, -156, -361, -445, -707, -656, -403, -721, -541, -450, -319, -342, -292, -503, -508, -489, -634, -841, -873, -573, -709, -900, -641, -581, -498, -500, -565, -467, -495, -556, -579, -744, -361, -243, -309, -432, -490, -88, -386, -427, -183, -237, -382, -483, -548, -398, -262, -192, -130, 56, -179, 60, -122, 165, -72, -131, -4, 22, 56, 163, 66, 20, 309, 98, -178, 86, -136, 24]
3309B4L62K0m24P31j40q1j28J6j29p0J21l52L79J69m82M12K10m74L10l36J47k9
3331B56k47L2M36NK40k14p2ROK52m96k31O45m04J08J69Q1j38M21l51k27L76k99
3354C57j11l4L0K38k13J84l14q2L78k19K5k50K45j51L86j24K01mj12l9j01j5m13
3377a38M27j01k99K53R8k02K30n9J5j94Q9n34J83K34j17l8j27L17k67J34j33k2
3399b51j79l7R7o8j4J82k23J6L7J87j99k3j2j29j04K67N9j23k59K7M42j33p4K32
3423b82k98m8l2j7nL49k10r7m2J09j6J28N3k5j04P4J23K12K71l62l5m2MpJJ40
3449a58q5J03k68L90Q7J6n0j1l17J21J60L3PM9N7J00K82j80j55J44K00k33j36
3472A56Q6k5K81j17l1M26k61q2p0N8nJ42m3j77J51j82K23J69j30j83k74M69J3
$$ y = [24, 386, 406, -18, 713, 573, 492, 364, 380, 251, 181, 302, -50, 329, 498, 16, 428, 638, 164, 474, 138, 285, 256, 9, 41, 477, 482, 722, 508, 436, 445, 451, 703, 207, -24, 621, 217, 325, 494, 575, 437, 858, 507, 280, 656, 357, 246, 212, 242, 480, 267, 451, 137, 55, 433, 214, 239, -11, 234, 83, 469, 345, 546, 542, 430, 391, 290, 275, -138, 289, 188, -111, 142, 240, 38, 268, 209, 224, 30, 119, -415, -232, 2, -115, -153, -280, 37, -230, -96, -229, -251, -430, -467, -370, -438, -452, -270, -493, -477, -440, -253, -452, -475, -487, -616, -720, -453, -394, -517, -776, -749, -307, -440, -514, -282, -580, -628, -660, -677, -682, -333, -543, -640, -682, -573, -589, -461, -408, -433, -537, -463, -340, -128, 143, -219, -254, -296, -292, -299, -298, -158, -243, -140, -408, -18, 69, 85, 35, 24, -293, -172, -12, 21, 28, 77, 134, 234, 516, 336, 181, 325, 525, 292, 156, 242, 217, 498, 381, 350, 776, 515, 433, 363, 421, 416, 558, 515, 338, 489, 307, 530, 699, 569, 386, 112, 581, 594]
3495E94k63j43L84j44j03M98m82o2L05k83j08J0K34k57L19J0k04p6J98r5r0J42
3517C84m99L29K1j2j1j82M4J50jJ19j77R8j29k6j62J46k95L45Q2j76L2K08l02
3540a4p5K25k81r6N1K54q0M7J45O6n78M76l94j49J5n3l4K71M0K25k27k43P3L5
3564c01P3m25J59pK79P8j27P3p2k8j46q9J70R9l81K87J44m40J30K67O5k42j16
3587e50J25o3j70K34J17l7j79K29l75L61k11J36k49L34J10l19K25k59N55m9J3
3608b2k36l0J20J14m17K43k38L86K0P6K7J1j19J72K0l9l9k40j3R7K06L11j1j07
3632B92o6N5k4O5k19j4J48K84k52N1P4K53k93j12K93o3j07j04J68R4J66l03K90
3655F76l96J24L4q0J58J6k2j11m1M9J77k37J85j08j73J07kK97o07K38P1j98L68
$$ y = [594, 331, 188, 572, 428, 325, 823, 341, 279, 584, 301, 193, 203, 437, 180, 499, 509, 305, 229, 427, 332, 242, 384, -115, 214, 235, 223, 212, 30, 74, 224, 223, 342, 165, 263, 134, 108, -54, 92, -203, 142, 224, 48, 80, 288, -14, -89, 136, -145, -241, -190, 64, -16, 31, 176, 242, -336, 140, -254, -403, -388, -441, -475, -204, -164, 61, -166, -409, -336, -301, -228, -653, -494, -501, -222, -144, -271, -198, -270, -298, -444, -533, -363, -264, -645, -358, -214, -654, -524, -257, -192, -434, -550, -425, -488, -658, -424, -307, -344, -523, -294, -669, -308, -519, -383, -632, -298, -188, -507, -282, -541, 14, -35, -22, -258, -288, -168, -54, -471, -228, -466, -80, -60, 16, 43, 54, -65, 107, 127, 88, 49, -191, -204, -107, 99, 410, 399, 292, 226, 281, 257, 322, 103, 89, 237, 521, 269, 320, 394, 647, 354, 242, 535, 472, 365, 261, 429, 523, 689, 386, 676, 280, 404, 438, 358, 516, 532, 510, 399, 358, 407, 584, 347, 532, 424, 251, 358, 356, 653, 46, 284, 355, 157, 525]
3678E25o5j14L4k67q6j28K10j78J3J9J26N51m50p2q9r9N6l4J28j10J96k01L92
3701C57o75K10m2l00K06l48K07kK2J01k08L38k7rM8l88L06l0r9l34L33%K43k2
3725a13k08l00Q1K61l25M9L25m2k20p6M75k51o7J02r5j89J93K01m01J4J74m1J83
3748b70O1j13K35pL8j37k32J39l3L7J63j72L94k94j44MQ3k3J97k83M52r5p7l3
3772a10J53j51K5K5P4j59j00K32j24LP4K66o8o0K2J58j54j13J46pp8L76l54L17
3796C93m4j92L92m52%J31J66k80J94J24k94K94j16R7o2L65j05j27o5j55Q6j46
3818B04N5J34J7l44K36j6J84J27j25j55K06r9Q0J22p0J11n00R9o9J06k25K6L28
3841D32k8j22L9K9j31k36p6q1M23K46l59k06j64J93j25J25n8q6J61k49J33l45
$$ y = [525, 460, 346, 380, 113, 27, -101, 109, -69, -56, -37, 89, 640, 190, 118, 29, -70, -14, -48, 80, -30, 166, -35, 357, -318, -108, -150, -450, -244, -592, -385, -387, -365, -264, -472, -134, -161, -170, -122, -510, -204, -234, -333, -667, -334, -334, -91, -113, -321, -621, -540, -279, -604, -555, -230, -272, -492, -568, -93, -344, -411, -309, -404, -593, -400, -199, -600, -586, -412, -453, -270, -209, -322, -87, -94, -56, -193, -425, -286, -319, -282, -119, -291, 103, -191, -335, -331, -248, -271, -74, -357, 95, 0, -77, -110, 43, -108, -83, -58, 16, -143, -243, -11, -135, -132, -58, 208, 140, 80, 102, 260, 106, -7, 139, 132, 54, 430, 76, 393, 349, 157, 549, 97, 97, 228, 394, 114, 308, 432, 138, 432, 316, 413, 351, 716, 611, 484, 419, 264, 350, 204, 259, 393, 410, 66, 302, 286, 470, 597, 472, 317, 523, 424, 504, 626, 556, 667, 167, 266, 197, 303, 78, 104, 432, 404, 282, 321, 350, 219, -17, -93, -174, 249, 495, 136, -70, -234, -41, -166, -41, -99, -185, -24, -273, -140, -485]
3863d85M18K2j36K8k8J2K88m34o4J8J27j9%l70J41P9l2j91L91j84J25p7k24L64
3887b31j03k85M51j43k28j4M7K6JJ7J13q9j82M02j28J50J55j54M6j49J99j10M
3910b05j18j2N0M1k53M50j19j42J27J09j4r1K48J78j41k67J71j61K07j09q1q8
3932b20J54J31Oj16M69l37L6j29Lj20M78n43M21N3j15L57n9m21o8J11m9J31L98
3955E71l28J42k30K61J78k15l2j7j67J43K79m45j6K64k19J47k5Q9k28L71j89l11
3977B3M41J6m24J48L90j73j35j02m3L19l18k36L03q1O6M39k56q1k3j64K36P0j04
4000C11jj88o1k6m6J01q8j16J34J11k34P6K89j22k96J56K7J75l35K44pm81K21
4023a56J27k48l4j32o1Q8J84j50m4J10k28n8K35O4J7q0O5m9k3l1k67K35M7j47
$$ y = [-485, -67, -45, -181, -153, -181, -169, 119, -315, -379, -361, -234, -253, -253, -623, -482, -403, -435, -626, -235, -419, -294, -371, -595, -231, -334, -619, -168, -311, -539, -553, -506, -480, -479, -462, -349, -438, -620, -218, -346, -196, -41, -195, -149, -298, -99, -209, -205, -323, -335, -285, -244, -497, -47, -166, -308, -181, -72, -86, -177, 71, 249, 108, -159, 12, -149, 58, -51, -132, -220, -66, 65, 71, -45, 424, 87, 123, -6, -3, -123, 355, -188, 233, 286, 171, 528, 469, 48, -20, 91, 42, 173, 571, 243, 385, 155, 416, 594, 379, 347, 330, 163, 306, 585, 140, 124, 388, 169, 316, 291, 380, 152, 523, 334, 23, 464, 480, 56, 204, 594, 421, 286, 184, 141, 460, 142, -94, 209, 128, 194, 633, 377, 296, 273, 109, 345, 415, 311, 310, 122, 61, 35, -11, 90, 2, -114, 20, 131, -103, -27, 262, 140, -156, 0, 27, 202, -133, 111, 104, -377, -156, -29, -277, -311, -443, -504, -416, -232, -382, -426, -316, -544, -602, -367, -303, -286, -366, -301, -350, -373, -404, -671, -436, -389, -536]
4047e36J03j10J72N9k17N06n90K42K20P3m63l48O26j77L36k17k24L06j14J6j42
4068d79k38M33K20q5O0M1j87K6J34k25K63p4l44K29J89k76K87L2j87K58j18K04
4090A63Q3J77j6r4K06k86P3l34J10R8lPJ02l80J58J00O9J55m3j83L29k59J82m6
4114C68N2k6kk25O7m4j23L49j29J94p4J14k6m0n3J26l97L21j21k04Q2LKK7k19
4139B2q7J12p3L22k07M30j47l17M4K30PR9o42J00K65l30K37q6K46k64k0Q0O7j14
4163b6J41M3k76J80q3J41l8j11k48J31J38l10J46l94N81p6j08K16l65K63J00r0
4185d5p7j16j24R4K40O9l09L7jj46%n9K32l09J00m4J17Nm9M8J21m04J90L1K41
4210a58j57j98k32K80j29J7K67n0J5J76j17J08J4k15L76l01M8K2o0k80J37P1k9
$$ y = [-536, -433, -543, -371, -312, -529, -23, -613, -371, -151, -78, -541, -889, -263, -440, -104, -321, -545, -239, -353, -337, -479, -717, -284, -64, -149, -89, -48, -235, -209, -75, -300, -37, -111, -455, -226, -37, -313, -26, 6, -181, 77, -41, 163, 246, 423, 407, 313, 519, 233, 306, -28, 82, 180, 177, 184, 286, -94, 64, 164, 233, 388, 345, 162, 491, 232, 414, 368, 420, 394, 392, 167, 234, 190, 67, 416, 287, 481, 407, 521, 495, 455, 402, 528, 131, 452, 331, 127, 209, 212, 214, 241, 22, -65, 47, -26, 296, 89, 519, 372, 55, 99, 329, 336, 435, -207, -107, 158, -172, 65, -21, 225, -39, -59, 21, 88, -26, 115, 158, -118, 62, -21, 120, 82, -29, -277, -146, -8, -318, -172, -566, 15, -61, -169, 47, -318, -55, 45, -45, -122, -238, -362, -268, -28, 41, -268, -231, -232, -378, -378, -437, -205, -514, -414, -458, -341, -336, -385, -337, -216, -620, -430, -399, -158, -315, -513, -745, -465, -594, -577, -310, -360, -345, -169, -286, -178, -164, -379, -3, -304, -256, -234, -294, -574, -437, -366, -395]
4233c95k15L16r3K22q4K16k79P1L95k23k2m7J72N4l7m7P2l3J56j51L8j64K39J81
4257C42L9k87L52L9k49l8j26K95j12K8j47J56j65J67J01K32j88r6J06Pj1j4K8
4280D59J71k04nJ7J43j86P3k59j79K33L3O7j47R2m6R5j31J07J10m4k14L03k41
4303B47Q9j65R8j98J94j68m7J76j76n4p7K80N7k75N6J30K67j49k58k90K4J27J94
4326H2n0j72l42K76j20L49j02j38oj06K22m0K7lk54O4J12J38k13j80j24K82P8
4349b20j61K99j29n6L2N4J11J6m56R9o5m5J00l7j9K79q4M3o6J23j83K11j35j3
4373c02L0Q6J96j94k66L77k04R0M3j46J70J38l21L6J95k29J19R7j18P4Kn4J35
4396d6m3k02L50k94O1J52M4L76n16N2J26j17j37M39j32o0J3k77L80p8J95j15k6
$$ y = [-395, -610, -294, -387, -165, -249, -33, -312, -241, 154, -69, -91, -138, 34, 88, 51, 4, 76, 43, 199, 48, 86, -78, 161, 342, 381, 94, 446, 485, 236, 198, 72, 367, 255, 283, 136, 292, 127, 294, 395, 627, 439, 343, 449, 456, 445, 431, 459, 630, 426, 421, 438, 581, 395, 468, 209, 30, 263, 296, 363, 216, 308, 262, 357, 226, 333, 443, 399, 185, 488, 247, 336, 171, 269, 71, 265, 97, 50, 226, 50, -4, -81, 199, 256, -19, 37, 167, 434, 285, 27, -263, -239, -112, 82, 32, -140, -482, -206, -326, 23, -79, -217, -223, -329, -107, -147, -120, -123, -377, -313, -201, -63, -276, -456, -580, -298, -220, -381, -82, -211, -267, -235, -181, -70, -54, -510, -411, -476, -521, -421, -458, -477, -198, -282, -239, -305, -182, -365, -154, -289, -302, -272, -186, 10, -184, -450, -73, -277, -187, -144, -290, -120, 18, -303, -267, -72, -301, -182, -85, -203, -129, -127, -181, -46, -89, -291, 59, -235, -174, -22, 22, 398, -118, -66, 60, -57, -194, 245, 113, 53, 66, -211, 169, 91, 286, 171, 145]
4419A45J29j53N2k46K95J57l07J51N3l29N40j6k3n17K65k14J76K51KR9m53J36
4441A93KK1j2J78L0j00k0J95j51J19K6m95K43O8k72K01P6NK5R1m28L19k51L5J28
4466B26M1N7P2J25k44J47j80k62J22J15k8k34n3J75P4J42o2j86q2K47k7m01N4
4489a62P1j72K15n20N98k07J15m7l13J74J86O1l49j5J38o0j22J34K10l03O0J6
4511b92j86l16L73J98k09K51k15j4L02l99L21l73K49r1j49J63j06R2J05k40L34
4532b02j67Kj57J00Q7J68o5N1K71l56n1J24J59L4j13P6p2j97Q3N3J45oL00j94
4556G3j13r4k2J91J62p7Q0j55J73rL3l87L35l30J03J39l15L35O6K00j66r1J57
4579B88P9k51o4J92j96L68K9l28O4q3L36l93J84K17o7j79m5J65j36j33K42J65
$$ y = [145, 274, 121, 173, -73, 222, 379, 72, 223, 276, -53, 487, 471, 448, -69, 196, -18, 158, 409, 411, 510, 57, 193, 195, 216, 204, 382, 412, 312, 292, 487, 336, 455, 481, -14, 229, 297, 25, 226, 302, 307, 332, 423, -5, 314, 63, 98, 226, 267, 324, 396, 521, 277, 424, 244, -18, 104, 219, 191, -43, -96, 79, 153, 295, 233, 47, -35, 212, 185, -216, -162, -91, -263, -48, -568, 30, -177, -62, -109, -422, -248, -62, -1, -350, -365, -227, -287, -409, -275, -65, -368, -308, -292, -478, -794, -421, -223, -432, -181, -396, -410, -108, -507, -186, -559, -310, -401, -550, -387, -493, -401, -296, -536, -202, -369, -367, -524, -424, -337, -169, -234, -183, 88, -268, -319, -195, -36, -2, -115, -39, -111, -308, -225, -172, -27, -33, 267, 73, -40, -134, -156, 35, 197, 120, 200, 45, 218, 209, 242, -145, 190, -140, -37, 102, -213, 122, 188, 388, 222, 131, 288, 367, 116, 52, 244, 48, 416, 445, 117, 181, 98, 434, 41, 225, 442, 375, 196, 151, 316, 180, 47, 289, 454]
4601D54p4N9l07L33k32l57J87M3J30p4K56l13J2K72N7k74O8pQ1k19L12j81j15
4624A11K17l9j95k34R4J42k54J19k2J27NJ29k05J80j43j89J59K19n58K74Lj36
4646a96o5J69k0j01l3N0Pl12K8K92K2j3r9K42m11L64j83n3j7q5l5K17r6j92J06
4671d14Q5J72l30P1R3j03K77l54L19j02j60L6J69Qj70N01k51j12q0j4m9K3K68
4694a17j04k5q2qK80k42J35J82k59no7J00J47L1o8Pn4J83J02p2l0j45J32Q5K9
4719A35j80N4O2O7j0R0O4k70nL17p0K15k75K88j42m29L09j1l5r0J25J30n9J79
4743D59m6j18K91m31J41J61j58J35k1j28p4J39L6j81J46r3J15o22K80J86L0r7
4765A50L15q1j86J45k18K8j70P7K43l46K8M7K09q3o1j9j6K9Q1k21j67K25o4L37
$$ y = [454, 380, 439, 132, 465, 233, -124, 63, 106, 236, 162, 418, 105, 117, 389, 446, 172, 240, 233, 314, 95, 407, 226, 111, 328, 289, 94, -140, -46, 96, -158, -39, -61, 66, 71, 200, -5, 175, 32, -157, 2, 221, -337, -63, -60, -196, -261, -92, -112, -213, -246, -196, -189, -501, -473, -181, -159, -172, -271, -29, -440, -76, -259, -312, -329, -414, -449, -232, -328, -520, -414, -329, -157, -487, -416, -323, -426, -149, -503, -184, -286, -446, -410, -241, -233, -403, 98, -153, -265, -345, -359, -408, -385, -117, -221, -246, -328, -336, -56, -298, -163, 19, -240, -245, -312, -212, -65, -34, -102, -95, -149, 34, 136, 64, 34, -111, 21, 106, 135, -45, 9, 71, 138, 128, 218, 282, 12, 7, 324, 254, 469, 194, 482, 340, -89, 220, 209, 174, 84, 209, 339, 280, 459, 413, 295, 586, 155, 296, 457, 299, 434, 413, 285, 211, 350, 386, 205, 351, 258, 373, -249, 31, 217, 247, 150, 465, 384, 198, 343, 125, 153, -17, 60, 303, -43, -15, 32, 241, 158, 97, 78, 62, 91, 172, -49, -216, 9, -55, 282]
4789B82k41Ql36J97Q1o6j20J36j73K10j0N8k6q5N9k1n3l24K0J94p9L13k49%j68
4814c93M19l42r3K85l08M49j28r1j4n5K19j12n7j71K53l6q8q1q2L51m25K69m0
4837b71J41j76k9J57nk41K70q0R6q2J70j50j24Q3J5k56K54j08J96j24r0K89r7
4860a62j13M94k03l24OpP5K21k1k2J04q7j15Q4L1j10M49k78k4J23k15M23l1j3
4884B85m3k08J56j67P6N1k44M83r4J17k9k52J58j65K17j83m3j4J2M90r0j19k26
4907A68K72j03K13l39q2p9L05j73K05Q2n5k67M99m26Q6j8o2m6J6Q1Qr0K48k18
4931B25j67K36j72j71J97n5p3J67k25K19k86L33j47R1O5m35n9K14R1j02K9j59
4953a84M11r9j8m73L35k68P8j54R6o8P0J37j0p3J09j79K61j80l66L07k08J79J29
$$ y = [282, 41, 49, -287, -90, -9, -75, -195, -59, -232, -22, -32, 26, 0, -85, -26, -47, -100, -424, -404, -210, -289, 24, -225, -225, -393, 26, -316, -409, -124, -432, 17, -111, -202, -216, -271, -52, -164, -221, -392, -139, -175, -263, -344, -426, -75, -500, -231, -271, -130, -306, -335, -178, -183, -424, -154, -234, -138, -220, -50, -200, -324, -241, -226, -482, -228, -336, -140, -264, -354, -65, -162, -275, 219, 16, -308, -302, -309, -234, -13, -34, -56, 48, -39, -154, -70, -39, -149, 300, 22, -2, 121, -94, 329, 298, 285, 242, 34, 190, 23, 99, 150, -94, 389, 295, 412, 383, 131, 289, 124, 341, 158, 115, 101, 113, 603, 513, 394, 168, 440, 337, 550, 211, 129, 50, 355, 182, 387, 469, 414, 147, 646, 220, 306, 288, 226, 180, 196, 277, 285, 195, 443, 225, 58, 294, 122, -49, 148, 93, 20, 187, -38, 181, -105, 228, 81, 172, 237, -198, -257, -43, 48, -54, -25, -184, 227, 128, 110, -363, -28, -296, -218, -372, -276, -344, -274, -137, -147, -220, -111, -290, -29, -209, -575, -268, -476, -297, -168]
4976a68l34L24n0k06M09k05K04k74R4o5J95j87J40j44r7J58R0l04L6K12k55J69
4998b58K67r7j8N8j80j17J11m20M27L4J54k24o0J46K15O8j83k39M6j2Q3R5k3r5
5022b22K74M4j0j71l2L15k22k07O0J43J73o1j7K48l87L9L7J58l12J51J79J7r1
5045A06J33m6k2j5m8j51o9K23j05K4J75j13J88k27K52O1k99K12j00QK8L0J30j49
5069B26j8k3r5K97p4J5n2o9R9n4J16l11J84J17k58R0l0k3J72k07K8%k07L60J15
5094C98l11L2J27K12l23j32K9j5Q4m9j2j34j07L32PN5m19N2p9J95j20J91j17j35
5118b39K3J38N5j36k04K4J15k03K72m9L9j24J03P4k76K78k21J52j30q2J40k45
5140d96J94oK64k89M8r7m2J20j31J29L39j02k93K70O2l45K28J4j21r8j97M09m9
$$ y = [-168, -502, -178, -228, -434, -25, -230, -26, -300, -206, -271, -76, -263, -123, -267, -364, -206, -116, -420, -384, -172, -427, -258, 9, -88, -106, -48, -228, -345, -234, -654, -227, -193, -39, -263, -323, -177, 38, 106, -77, -316, -270, -282, -199, -104, -127, -222, 52, 96, 86, -85, -117, 198, -24, -231, -171, -28, 145, 84, 67, 315, -72, -33, 4, 162, -150, 1, 180, 197, 106, 239, 193, 171, 156, 108, -43, -112, 111, 6, 30, 205, 92, 280, 53, 305, 366, 67, 279, 179, 187, 215, 245, 375, 226, 208, 185, 90, 387, 313, 328, 276, 207, 306, 252, 368, 57, 241, 358, 100, 190, 160, 137, 309, 102, 130, 130, -77, 283, 398, 87, 119, 246, 458, 135, 3, 32, 17, 101, 52, 40, -94, -201, 131, 138, 193, -226, -174, -253, -58, -178, 13, -104, -239, -216, -78, -23, -159, -363, -339, -224, -427, -155, -204, -165, -289, -186, -112, -388, -110, -331, -179, -309, -391, -251, -496, -302, -308, -44, -333, -285, -382, -424, -304, -435, -306, 33, -69, -362, -92, -30, -375, -147, -133, -254, -352, -549, -140, -189]
5163a89l6J84k01L46m5pl94K82l7k91M59pO7j56o9j07L30j15l32J78K93q3J84
5186B54m02J82J84m29M70j43j03Q8K08j88j77L01kj44J88o8k0J45l02J56R6K0
5208C14n09L41j31Mk5N5L8k9K51J40q8l51K59K83m02O4Ol5K93j13n02L92L64l05
5232C14j97n8K78o1l64L35k4j51r3Jm7J79J37k08M19K4Pl59OJ02j22l06J56J23
5256I1j4N5o7M5j34r3J08L66l81K30k71K39j92KJ69m85L49mk35J45j18k26N0L75
5280Dj60O9rJ25j42k01k86M57k91N8K09l82K60j88M02j99k9K02n3j60j12p0K34
5303b62j9J41J57l21N9M3k52K94o8L8j30J02L1K58P7m90K90j00r3K91j81J32k66
5326b69j44L94k47K67k11n9M7J13J8j30K90o6J12k11K27j47K05k44Q8Q1k32L01
$$ y = [-189, -225, -41, -242, 104, 59, 52, -342, -60, -97, -388, 71, 64, 131, -25, -94, -201, 129, 14, -318, -140, 153, 70, 254, -148, 34, 218, -211, 259, 116, 13, 101, 309, 121, -56, 245, 243, 99, 287, 219, 199, 344, 42, 198, 294, 314, -195, 146, 15, 19, -6, 49, 87, 58, 309, 449, 361, 10, 269, 552, 150, 214, 220, 185, 478, 365, -137, 255, 619, 314, 117, 59, 337, 276, -88, 247, 223, 72, -21, -20, -67, 112, 249, 41, 460, 484, 491, 132, 138, 240, 118, -188, -32, 91, 77, 132, 65, 110, -24, -117, -9, 357, -24, 206, -65, 174, -18, -16, 153, -332, 17, 13, -222, -77, -195, -421, -371, 4, -156, -87, -96, 29, -113, -314, -600, -143, -434, -376, -167, -549, -289, -477, -75, -274, -303, -101, -154, -314, -426, -496, -262, -281, -140, 17, -304, -245, -202, -454, -160, -228, -190, -320, -218, -187, 71, 148, -342, -52, -152, -245, 46, -135, -3, -269, -413, -19, -266, 1, -210, -269, -222, -109, -91, -221, 69, 3, 115, -96, 131, -16, 189, -55, 33, 114, -118, 183]
5348A83J19j76j07J90j02j24L06k27J45r5J0j07J47J24r7J33Or0kn0j03Q1P8k05
5372C7L76o4j44n6K11q7J29k5j24M8L3k88R0j15L07Q5l00lk5P6j35K17k40K42
5396B45l9j48q9J07O1j28J84l84L52k47K1P7j40P2P1n5J50j93L08k66p3K01N3
5419A40n24M23k2j65J06J05n2l24j0K64J23O4k16n4K39j21O2k32j28K43J9j7j31
5442b08n5J28n3%J80m24K21K74j95j09J09K5j74oJ38k51J09O2l08N48o7l55N4
5465c57P7Q7k5J41l3k04N38m38J41j31n2J65j50J94k86K70l48J18K13o2K51k80
5487a71J36j1j80M4J78k24J05P9K35k4l99J79P4j09J5P0L5O3K18q2k03N5n5k3
5511EM4q4J92r9q5J33O3LoP4j66j8J00p6J39L9M57n70L03j86R1N9m80M6N8J45
$$ y = [183, 302, 126, 19, 209, 107, -17, 289, 62, 207, 112, 122, 15, 162, 286, 189, 322, 328, 238, 236, 186, 83, 164, 242, 37, 413, 349, 205, 149, 360, 273, 402, 377, 253, 301, 334, 46, 136, 21, 328, 413, 113, 110, 85, 161, 26, 243, 3, 245, 206, 58, -31, 76, 137, 9, 193, -191, 161, -86, -65, 12, -128, -56, 15, -40, 110, -83, 225, -41, -114, 87, 140, -384, 39, 17, -148, -42, 63, 11, -313, -323, -59, 64, 128, -88, -142, 97, -24, 38, -194, -322, -79, -60, -77, -208, -263, -135, -188, -188, -8, -432, -211, 63, -132, -241, -132, -107, -281, -287, -149, -400, -291, -229, -537, 11, -56, -411, -357, -280, -193, -218, -77, -110, -314, 224, -214, -73, -204, -256, -91, -241, -47, -333, -63, -411, -293, -80, -142, 109, -171, -35, -46, -226, -182, -4, -228, -123, -44, 191, 167, -232, -53, 21, -88, -73, -3, 32, 95, 313, 231, 28, 83, 28, 5, 49, -35, 157, 58, -27, 106, 169, 172, 166, 240, 74, 56, 156, 80, 219, 258, 715, 145, 448, 262, 353, 412, -68, -22, 36, 181]
$$ [...]
8191e
##END NTUPLES=NMR FID
##END=
