##TITLE=1H_L5-TMSJ(5y-f4)
 CDCl3
 8 sc, 
 2.09.2022
##JCAMPDX= 6.0         $$ Bruker NMR JCAMP-DX V2.0
##DATA TYPE= NMR FID
##DATA CLASS= NTUPLES
##ORIGIN= UXNMR, Bruker Analytische Messtechnik GmbH
##OWNER= root
$$ XWIN-NMR		Version 3.5
$$ Fri Sep  2 13:21:21 2022 Russian Standard Time (UT+4h)  she@DPX200
##.OBSERVE FREQUENCY= 200.1313499994
##.OBSERVE NUCLEUS= ^1H
##.DELAY= (6, 6)
##.ACQUISITION MODE= SIMULTANEOUS
##.ACQUISITION SCHEME= undefined
##.AVERAGES= 8
##.DIGITISER RES= 18
##SPECTROMETER/DATA SYSTEM= spect
##.PULSE SEQUENCE= zg30
##.SOLVENT NAME= CDCl3
##.SHIFT REFERENCE= (INTERNAL, CDCl3, 0, 15.7039)
##AUDIT TRAIL= $$ (NUMBER, WHEN, WHO, WHERE, WHAT)
$$ ##TITLE= Audit trail, XWIN-NMR		Version 3.5
$$ ##JCAMPDX= 5.01
$$ ##ORIGIN= Bruker BioSpin GmbH
$$ ##OWNER= she
$$ F:/spectra/data/she/nmr/H-F/1/audita.txt
$$ ##AUDIT TRAIL=  $$ (NUMBER, WHEN, WHO, WHERE, WHAT)
(   1,<2022-09-02 13:20:01.39 +0400>,<she>,<DPX200>,
      <created by zg, POWCHK disabled, PULCHK disabled
       configuration hash MD5:
       00 E9 B6 7A A2 85 ED C7 34 08 36 98 17 FE 4E 26
       data hash MD5: 16K
       96 94 28 55 D1 24 DC DB 91 E1 FB CF 2C D5 D5 FD>)
$$ ##END=
$$ 
$$ hash MD5
$$ A7 5B 2D 0A 0D 3D 55 54 88 2A 37 BA 47 A5 B5 5F
##$RELAX= 
##$RELAX= 
##$RELAX= 
##$RELAX= 
##$RELAX= 
##$RELAX= 
$$ Bruker specific parameters
$$ --------------------------
##$DU= <F:/spectra>
##$EXPNO= 1
##$NAME= <H-F>
##$PROCNO= 1
##$TYPE= <nmr>
##$USER= <she>
##$AMP= (0..31)
100 100 100 100 100 100 100 100 100 100 100 100 100 100 100 100 100 100 
100 100 100 100 100 100 100 100 100 100 100 100 100 100 
##$AQSEQ= 0
##$AQ_mod= 1
##$AUNM= <au_zg>
##$AUTOPOS= <>
##$BF1= 200.13
##$BF2= 200.13
##$BF3= 200.13
##$BF4= 200.13
##$BF5= 200.13
##$BF6= 200.13
##$BF7= 200.13
##$BF8= 200.13
##$BYTORDA= 1
##$CFDGTYP= 0
##$CFRGTYP= 5
##$CHEMSTR= <none>
##$CNST= (0..31)
1 1 145 1 1 1 1 1 1 1 1 1 1 1 1 1 1 1 1 1 1 1 1 1 1 1 1 1 1 1 1 1 
##$CPDPRG= <>
##$CPDPRG1= <>
##$CPDPRG2= <>
##$CPDPRG3= <>
##$CPDPRG4= <mlev>
##$CPDPRG5= <mlev>
##$CPDPRG6= <mlev>
##$CPDPRG7= <mlev>
##$CPDPRG8= <mlev>
##$CPDPRGB= <>
##$CPDPRGT= <>
##$D= (0..31)
0 1.2 0 0 0 0 0 0 0 0.06 0 0.03 0 0 0 0 0.0002 0 0 0 0 0 0 0 0 0 0 0 0 
0 0 0 
##$DATE= 1662110400
##$DBL= (0..7)
120 120 120 120 120 120 120 120 
##$DBP= (0..7)
150 150 150 150 150 150 150 150 
##$DBP07= 0
##$DBPNAM0= <>
##$DBPNAM1= <>
##$DBPNAM2= <>
##$DBPNAM3= <>
##$DBPNAM4= <>
##$DBPNAM5= <>
##$DBPNAM6= <>
##$DBPNAM7= <>
##$DBPOAL= (0..7)
0.5 0.5 0.5 0.5 0.5 0.5 0.5 0.5 
##$DBPOFFS= (0..7)
0 0 0 0 0 0 0 0 
##$DE= 6
##$DECBNUC= <off>
##$DECIM= 32
##$DECNUC= <off>
##$DECSTAT= 4
##$DIGMOD= 1
##$DIGTYP= 9
##$DL= (0..7)
0 120 120 120 120 120 120 120 
##$DP= (0..7)
150 150 150 150 150 150 150 150 
##$DP07= 0
##$DPNAME0= <>
##$DPNAME1= <>
##$DPNAME2= <>
##$DPNAME3= <>
##$DPNAME4= <>
##$DPNAME5= <>
##$DPNAME6= <>
##$DPNAME7= <>
##$DPOAL= (0..7)
0.5 0.5 0.5 0.5 0.5 0.5 0.5 0.5 
##$DPOFFS= (0..7)
0 0 0 0 0 0 0 0 
##$DQDMODE= 0
##$DR= 18
##$DS= 0
$$ [...]
##$SUBNAM2= <"">
##$SUBNAM3= <"">
##$SUBNAM4= <"">
##$SUBNAM5= <"">
##$SUBNAM6= <"">
##$SUBNAM7= <"">
##$SUBNAM8= <"">
##$SUBNAM9= <"">
##$SW= 18.0517283424941
##$SWIBOX= (0..15)
0 0 2 0 0 0 0 0 0 0 0 0 0 0 0 0 
##$SW_h= 3612.71676300578
##$TD= 16384
##$TD0= 1
##$TE= 0
##$TE2= 300
##$TE3= 300
##$TEG= 300
##$TL= (0..7)
0 120 120 120 120 120 120 120 
##$TP= (0..7)
150 150 150 150 150 150 150 150 
##$TP07= 0
##$TPNAME0= <>
##$TPNAME1= <>
##$TPNAME2= <>
##$TPNAME3= <>
##$TPNAME4= <>
##$TPNAME5= <>
##$TPNAME6= <>
##$TPNAME7= <>
##$TPOAL= (0..7)
0.5 0.5 0.5 0.5 0.5 0.5 0.5 0.5 
##$TPOFFS= (0..7)
0 0 0 0 0 0 0 0 
##$TUNHIN= 0
##$TUNHOUT= 0
##$TUNXOUT= 0
##$USERA1= <user>
##$USERA2= <user>
##$USERA3= <user>
##$USERA4= <user>
##$USERA5= <user>
##$V9= 5
##$VALIST= <valist>
##$VCLIST= <CCCCCCCCCCCCCCC>
##$VD= 0
##$VDLIST= <DDDDDDDDDDDDDDD>
##$VPLIST= <PPPPPPPPPPPPPPP>
##$VTLIST= <TTTTTTTTTTTTTTT>
##$WBST= 1024
##$WBSW= 4
##$XGAIN= (0..3)
0 0 0 0 
##$XL= 0
##$YL= 0
##$YMAX_a= 178536
##$YMIN_a= -275054
##$ZGOPTNS= <>
##$ZL1= 120
##$ZL2= 120
##$ZL3= 120
##$ZL4= 120
##$ABSF1= 10
##$ABSF2= 0
##$ABSG= 5
##$ABSL= 3
##$ALPHA= 0
##$AQORDER= 0
##$ASSFAC= 0
##$ASSFACI= 0
##$ASSFACX= 0
##$ASSWID= 0
##$AUNMP= <proc_1d>
##$AZFE= 0.1
##$AZFW= 0.1
##$BCFW= 1
##$BC_mod= 2
##$BYTORDP= 1
##$COROFFS= 0
##$CY= 11.3945322036743
##$DATMOD= 1
##$DC= 2
##$DFILT= <>
##$DTYPP= 0
##$F1P= 2.36226072786647
##$F2P= -0.459571619588291
##$FCOR= 0.5
##$FTSIZE= 0
##$FT_mod= 4
##$GAMMA= 1
##$GB= 0.15
##$INTBC= 1
##$INTSCL= 1
##$ISEN= 128
##$LB= 0.24
##$LEV0= 0
##$LPBIN= 0
##$MAXI= 10000
##$MC2= 0
##$MEAN= 0
##$ME_mod= 0
##$MI= 1.114404
##$NCOEF= 0
##$NC_proc= 0
##$NLEV= 6
##$NOISF1= 3.799351
##$NOISF2= 2.8
##$NSP= 1
##$NTH_PI= 0
##$NZP= 0
##$OFFSET= 15.70392
##$PC= 1
##$PHC0= -18033.85
##$PHC1= 11.80069
##$PH_mod= 1
##$PKNL= yes
##$PPARMOD= 0
##$PSCAL= 0
##$PSIGN= 0
##$REVERSE= no
##$SF= 200.130013532006
##$SI= 16384
##$SIGF1= 3
##$SIGF2= 2
##$SINO= 400
##$SIOLD= 16384
##$SREGLST= <1H.CDCl3>
##$SSB= 0
##$STSI= 0
##$STSR= 0
##$SW_p= 3612.71676300578
##$SYMM= 0
##$S_DEV= 0
##$TDeff= 0
##$TDoff= 0
##$TI= <>
##$TILT= no
##$TM1= 0
##$TM2= 0
##$TOPLEV= 0
##$USERP1= <user>
##$USERP2= <user>
##$USERP3= <user>
##$USERP4= <user>
##$USERP5= <user>
##$WDW= 1
##$XDIM= 8192
##$YMAX_p= 0
##$YMIN_p= 0
$$ End of Bruker specific parameters
$$ ---------------------------------
##NTUPLES= NMR FID
##VAR_NAME=  TIME,          FID/REAL,        FID/IMAG
##SYMBOL=    X,             R,               I
##VAR_TYPE=  INDEPENDENT,   DEPENDENT,       DEPENDENT
##VAR_FORM=  AFFN,          ASDF,            ASDF
##VAR_DIM=   8192,          8192,            8192
##UNITS=     SECONDS,       ARBITRARY UNITS, ARBITRARY UNITS
##FACTOR=    0.0002768,     1,               1
##FIRST=     0,             0,               0
##LAST=      2.2672688,     0,               0
##MIN=       0,             -275054,         0
##MAX=       2.2672688,     178536,          0
$$ Real data points
##PAGE= N=1
##DATA TABLE= (X++(R..R)), XYDATA
$$ [...]
1839E5n5m06O2M01RJ16M44k1o7K46K75On37K63k18n2n18k61l3j08k69j99J40j74
$$ 55 0 -406 -344 57 66 182 626 605 538 784 1059 1065 528 791 573 521 3 -258 -291 -399 -668 -867 -727 -901
1863i01j00N09L13j03k08P03k83l29M80J68q25P2N92m98K24M11k72M53L6mO01
$$ -901 -1001 -492 -179 -282 -490 213 -70 -399 81 249 -576 -504 88 -410 -186 225 -47 406 442 438 1039
1884A039K80q09L49M94r03n59Q13l24j130L57M77j284L24Q13m15k69Q78j26n50
$$ 1039 1319 510 859 1353 450 -109 704 380 -750 -393 84 -1200 -876 -63 -478 -747 131 5 -545
1903e45P13l88l6M58n44r8N29m84n94J278j59j007J514L83j301P23J042j082k08
$$ -545 168 -220 -256 202 -342 -440 89 -395 -989 289 130 -877 637 1020 -281 442 1484 402 194
1922A94R49o44l35J18m12k39N43m59r7O19k49j109J238M10j134N55O63q04j79
$$ 194 1143 499 164 282 -130 -369 174 -285 -382 237 -12 -1121 117 527 -607 -52 611 -193 -372
1941c72J053j177k97Q83k61r40Q80O33q68K74L56j72L31Kk54O09r0p83N64O77
$$ -372 681 -496 -793 90 -171 -1111 -231 402 -466 -192 164 -8 323 325 71 680 590 -193 371 1048
1961A048j169m19R16k34p39Q45J75p60L21M31k91J44j21Q6Q2J85l94r6J93m53
$$ 1048 -121 -540 376 142 -597 248 423 -337 -16 415 124 268 147 233 315 500 106 10 203 -250
1981b50l6K24n31K9O5J1j59L76J41k32J83L19l95J8L94K67n20jK79J71l48L14
$$ -250 -286 -62 -593 -564 -499 -488 -647 -271 -130 -362 -179 140 -255 -237 157 424 -96 -97 182 353 5 319
2003C19j02k23K83m8J76L16k8%K6J79o58l36N85o03k86K54j68n69L83j02k88J48
$$ 319 217 -6 277 229 405 721 693 693 719 898 240 -96 489 -114 -400 -146 -314 -883 -500 -602 -890 -742
2025g42M68j89M6N18k58k4M54l15j01J68k96J21M81l84j98P11J0r24J024O88j120
$$ -742 -274 -463 -417 101 -157 -181 273 -42 -143 25 -271 -150 331 -53 -251 460 470 -454 570 1258 138
2046A38j56J155m83o84N68k84p49K70k09k96L34j55m69J119m92l33O48Q2l91L59
$$ 138 -18 1137 654 -30 538 254 -495 -225 -434 -730 -396 -551 -1020 99 -393 -726 -78 4 -387 -28
2066b8O62q79P9Q19p96k97N20K83r71P70N54m78K11P0j69K39j19k24J60j08q17
$$ -28 634 -245 -166 653 -143 -440 80 363 -608 162 716 238 449 519 350 589 470 246 406 298 -519
2087e19L37K94q21J42M00m08k68J008k30p53O79N79n25k11O24k4m63J73K83l38
$$ -519 -182 112 -709 -567 -167 -575 -843 165 -65 -818 -139 440 -85 -296 328 304 -159 14 297 -41
2107d1j62Q6L42j99l97L20M63m24K44N10l04j88k40M34l17l41J91K8m93j71N07
$$ -41 -203 -117 225 26 -371 -51 412 -12 232 742 438 250 10 444 127 -214 -23 5 -488 -659 -152
2128a52n6k20M29J1p3j08P15j85n57N30j30q5K3K66o66J80K9k46M3J56l84L94
$$ -152 -208 -428 1 12 -61 -169 546 361 -196 334 204 119 142 408 -258 -78 -49 -295 -252 -96 -480 -86
2150h6k9N3L68r6j06q1N87n98j61J56J7o48N59K57k80R1K22k09L73j42M2J82K
$$ -86 -115 -62 306 210 104 23 610 12 -149 7 24 -624 -65 192 -88 3 225 16 389 247 289 471 473
2173D73k11n9L22m21m94J99j9l94O17m74q8K93jO5L96J57n27J76O62p63j40P43
$$ 473 262 203 525 104 -390 -191 -210 -604 13 -461 -549 -256 -257 -192 204 361 -166 10 672 -91 -231 512
2195E12m18l14K69N8j92K91J04l68J43L06q7K92j63k25j46K67m12j38J58l23m29
$$ 512 94 -220 49 107 -85 206 310 -58 85 391 304 596 433 208 62 329 -83 -221 -63 -386 -815
2216h15l4J37K96R6L49m80K13O17n77L52k20k8R4L29j97j02Q3P1K06k16J82K35
$$ -815 -849 -712 -416 -320 29 -451 -238 379 -198 154 -66 -94 0 329 132 30 113 184 390 174 356 591
2238E91n47Q8N05o0j97P8k51j46R4j02j45k85j18j8J71q8k56M78M7j77m6O04k72
$$ 591 44 132 637 577 380 458 207 61 155 53 -92 -377 -495 -513 -342 -430 -686 -208 -161 -338 -384 220 -52
2261e2K0K21m67K47K64j95k06N09k62j63K23L7k47K06L09j86m8M44n5n16L60m43
$$ -52 -32 189 -278 -31 233 38 -168 341 79 -84 139 176 -71 135 444 258 210 654 599 83 443 0
2283@k77L31j75j80K09j72n03N85j09l75M15M89n85L56L21k85k06L90k77l09K36
$$ 0 -277 54 -121 -301 -92 -264 -767 -182 -291 -666 -251 238 -347 9 330 45 -161 229 -48 -357 -121
2304a21j00j77N62l70j34N18j88L0N4J22j12k63Q20n03n11M27J74n09J64J60m43
$$ -121 -221 -398 164 -206 -340 178 -10 20 74 196 84 -179 641 138 -373 54 228 -281 -117 43 -400
2325d00K34K41o5n8J15K30l1J32k63j53J88l36L74j27r7l79M91k58l36L25R7j78
$$ -400 -166 75 10 -48 67 297 266 398 135 -18 170 -166 208 81 -16 -395 96 -162 -498 -173 -76 -254
2347b54j16O92l48n2K97J07n99J57J69l20Q4M4L92j57j35r5K05J66r6j10N29k06
$$ -254 -370 322 -26 -78 219 326 -273 -116 53 -267 -183 -139 253 96 -39 -134 71 237 141 31 560 354
2369C54k81K93k94j61j83J86k56j36L06j33j53K03J51j20jM18nk27r1M7M8J35
$$ 354 73 366 72 -89 -272 -86 -342 -478 -172 -305 -458 -255 -104 -224 -225 193 188 -39 -130 -83 -35 100
2391A00k28j25L59l73K30kL0j92J54L02o2R1N13o69r1K58j59l65J9P2l13J10K83
$$ 100 -128 -253 106 -267 -37 -39 -9 -201 -47 255 193 284 797 128 37 295 136 -229 -210 -138 -451 -341 -58
2414e8q8o9K45j80j99N20k30K49M0m61J81L39k11l41O91l69l22M33K0k37K58J39
$$ -58 -146 -215 30 -150 -349 171 -59 190 230 -231 -50 289 78 -263 428 59 -263 170 190 -47 211 350
2436C50k58J2J89m36J55J82m55J21K31m16k67L92j36n7l1M87m61J13L05J22l41
$$ 350 92 104 293 -143 12 194 -261 -140 91 -325 -592 -200 -336 -393 -424 63 -398 -285 20 142 -199
2457a99M39j5J87l56J71R9J11l69o0P4k66N8L84j55l01N53jk72l2L5k43K7n7M38
$$ -199 240 225 412 56 227 326 437 68 8 82 -184 -126 258 103 -198 355 354 82 50 85 -158 -131 -188 250
2481B50k94j39q4P6l89L85J12j40N3J63k0r0K28j83J86O0j70L69l81O9J15j48
$$ 250 -44 -183 -267 -191 -580 -195 -83 -223 -170 -7 -27 -117 111 -72 114 174 4 373 -8 61 176 28
2503B8J33l38R3K68k74NM59m04k10M52J93l70P4o1J13j86L7k26J41k34R8L90k95
$$ 28 161 -177 -84 184 -90 -85 374 -30 -240 212 405 35 109 48 161 -25 12 -214 -73 -307 -209 181 -114
2526a14j90N50j7n29L75M02l08l74N55m00j56j67K92k69K11Qr2m9M19NJ89O1l73
$$ -114 -304 246 229 -300 75 477 169 -205 350 -50 -206 -373 -81 -350 -139 -131 -223 -272 147 152 341 402 29
2549B9Q0K65l57o5M4J04l88L30K46p44M00L13j93j70K43J86j91R2j30r6j38J23
$$ 29 109 374 17 -48 -4 100 -288 42 288 -456 -56 257 64 -106 137 323 132 224 94 -2 -140 -17
2571a7k50L57n72O1L70j02j60kN13l15J87J01p0l65L19J87l24J43J3J2j50J63
$$ -17 -267 90 -482 -421 -51 -153 -313 -315 198 -117 70 171 101 -264 55 242 -82 61 74 86 -64 99
2593I9J57j4j6nJ17n1k09J65l87Pk23K40j29l43L92P1j55Q8j0J02l82M51J20k77
$$ 99 256 242 226 221 338 287 78 243 -144 -137 -360 -120 -249 -592 -200 -129 -284 -196 -206 -104 -486 -35 85 -192
2617a92J6K84R8l68j15L03K92l83J76J11P2l71K31L8O9k54J91m6k44k0L69k47
$$ -192 -176 108 206 -162 -277 26 318 -65 111 222 294 -77 154 192 261 7 198 152 -92 -112 257 10
2639A0m94O79l86j91J88R7k24J27J14N3k26J03J59M7j15p5J55K94l37J2L92m00
$$ 10 -484 195 -191 -382 -194 -97 -321 -194 -80 -27 -253 -150 9 56 -59 -134 21 315 -22 -10 382 -18
2661a8J71J26j19l79L50J45n10K03K23n26J20J74j64M1N6M2k02K18j72Q1j5j54
$$ -18 153 279 160 -219 131 276 -234 -31 192 -334 -214 -40 -204 -163 -107 -65 -267 -49 -221 -140 -155 -309
2683c09J3N07L0p17N36J88k37J85j36K55j29j75K19J76m34m3k94L30k89J96p3
$$ -309 -296 211 241 -476 60 248 11 196 60 315 186 11 230 406 -28 -71 -365 -35 -324 -128 -201
2704b01M1j97J41M73k73l36M22j4l68R5K67j68K3J51k28n9J03K41K8j65K44N8
$$ -201 -160 -357 -216 257 -16 -352 70 56 -312 -217 50 -118 -95 56 -172 -231 -128 113 141 -24 220 278
2726B78k8j37J79j42j21r8J04k74j53Q9J73P6j71L77j35j97J02L04j94k35K02
$$ 278 250 113 292 150 29 -69 35 -239 -392 -303 -130 -54 -225 152 17 -180 -78 226 32 -203 -1
2747aR4M8j41N7KQ5j13m0l3o0K07P3m17K34K33J9j62o9l3k88l9K29q2k56J21M85
$$ -1 93 141 0 57 59 144 31 -9 -42 -102 105 178 -239 -5 228 247 85 16 -17 -305 -344 -115 -197 -453 -332 153
2773A53l94LK77K36k56Q4J61k78J17k6m6l3n1j61L09J43m87M41J47n76R2K71K29
$$ 153 -241 -238 39 275 19 103 264 -14 103 77 31 -2 -53 -214 95 238 -249 192 339 -237 -145 126 355
2796C55m50J95k33k70K12j32J04j4j12J96N4j6J28P1j23j90M10n7l34K82K83j60
$$ 355 -95 100 -133 -403 -191 -323 -219 -233 -345 -149 -95 -111 17 88 -35 -225 185 128 -206 76 359 199
2818A99l19M53Pq9k6l49L0J60K8P6j33L9j39j69o5J94K8m1j2Q4P0J45o51L54K6
$$ 199 -120 333 340 251 225 -124 -94 66 94 170 37 76 -63 -232 -297 -103 -75 -116 -128 -44 26 171 -480 -126 -100
2843a00J58j16o7K50k34J81L7k30q2K15j0K42r4k13P0r6pj44J66N1k43M98k04
$$ -100 58 -58 -125 125 -109 72 109 -121 -203 12 2 244 150 -63 7 -89 -96 -240 -74 -23 -266 232 28
2866B8l76K44J66k84q9K06j06M4M02k50k47M78m06J54M9L8J27l33K04M1L20j64
$$ 28 -348 -104 62 -222 -311 -105 -211 -167 235 -15 -262 216 -190 -36 13 51 178 -155 49 90 410 246
2888B46p1P5J6J1l53L10j71m07P2K34l18L24J32k7l16J36J49j77J96Ok1p0l21
$$ 246 175 250 266 277 -76 234 63 -344 -272 -38 -356 -32 100 73 -243 -107 42 -135 61 67 46 -24 -345
2911c45M80P0l04m2K06K18l06K09M0m60K65L04k48k65L36j33N7k36K05j65j86
$$ -345 135 205 -99 -141 65 283 -23 186 226 -234 31 335 87 -178 158 25 82 -154 51 -114 -300
2932c00J2R1K06j30j05L10R5j89M4M0k67K85o6J7l52K56K29l16K5N26l55R7J42
$$ -300 -288 -197 9 -121 -226 84 179 -10 34 74 -193 92 26 43 -309 -53 176 -140 -115 411 56 153 295
2955B95J88m29M5J90l32J58j49j08J06j58q4M69l59J1L16k74J74j30L21Lm83K12
$$ 295 483 54 99 289 -43 115 -34 -142 -36 -194 -278 191 -168 -157 159 -115 59 -71 250 253 -230 -18
2977a8K83o3k45p4K43l15J72K6jK09J1l05J6J13q8J79l31o5L58l38m7L97j72L9
$$ -18 265 202 -43 -117 126 -189 -17 9 8 217 228 -77 -61 52 -36 143 -188 -253 105 -233 -280 117 -55 -16
3001a6j73J36J18k23K36o6j05m9K43j8m0J08P6l2j88k10J81L34l40L3pj31j90
$$ -16 -189 -53 65 -158 78 12 -93 -142 101 83 43 151 227 195 7 -203 -22 312 -28 5 -2 -133 -323
3024c23L61K24m15J34k18PJ25K14Q5k07j21K77j26j30K44o7L49n22O6k8K53k81
$$ -323 38 262 -153 -19 -237 -230 -105 109 194 -13 -134 143 17 -113 131 64 413 -109 -43 -71 182 -99
3046i9K65K5N2p0R7k95k54K85L2j54n8J97J5J1j60m7J1j64R1L77k89j42K66K27
$$ -99 166 191 243 173 270 -25 -279 6 38 -116 -174 23 38 49 -111 -158 -147 -311 -220 157 -132 -274 -8 219
3070B19q8m08K31k28P4L62M6l28K93o7K21l46J83k14K48k33J9J06r6j80N9o0K3
$$ 219 131 -277 -46 -274 -200 162 208 -120 173 106 327 -19 164 -50 198 -35 -16 90 -6 -186 -127 -187 -164
3093a64J4j06P3k6j19L13J7l28N69l37L1kM28m14j14L82j85Kq2K28o9K0o4J1j05
$$ -164 -150 -256 -183 -209 -328 -15 2 -326 243 -94 -63 -65 363 -51 -165 217 32 34 -48 180 111 131 67 78 -27
3118b7r4K94j38J18p6m1k07p6K16P4k57M0p4n8q6K86K20L6k65L24k54PJ34j16
$$ -27 -121 173 35 153 77 36 -171 -247 -31 43 -214 -174 -248 -306 -392 -106 114 150 -115 209 -45 -38 96 -20
3142b0J7M3k73K63K89j39j58R1K62k55k09K21k33K17j72J42k85J09Q3l54K83J70
$$ -20 -3 40 -233 30 319 180 22 113 375 120 -89 132 -101 116 -56 86 -199 -90 -7 -361 -78 92
3164I2k77j26M21o3j1j23mJ9J95r4j81J23PK28q3n0l54L23J94l45K19n8Pk35n3
$$ 92 -185 -311 110 47 36 -87 -91 -72 123 29 -152 -29 -22 206 123 73 -281 42 236 -109 110 52 59 -176 -229
3189b29J80%K0K0j75K80j77j1Q6k4P0J99m8o2k05PJ11L8J43k64R2L6J65k13K4
$$ -229 -49 -49 -29 -9 -184 96 -81 -92 -6 -30 40 239 191 129 -76 -69 42 80 223 -41 51 87 252 39 63
3214F3L6j27q0L01L4j95l1j03O7K8k08K55o6j79j20M60j82k5K35j38j91J90J78
$$ 63 99 -28 -108 193 227 32 1 -102 -35 -7 -215 40 -26 -205 -325 135 -47 -72 163 25 -166 24 202
3237B02p1K4q5j21j09J25J61n1M1j36jJ11j85M2m1j87J88J48k12Q3M8n6J49k55
$$ 202 131 155 70 -51 -160 -35 126 75 116 -20 -21 90 -95 -53 -94 -281 -93 55 -157 -74 -26 -82 67 -188
3261a88J53j10J25k65L32L0k1K07r0J9l49M11j6J48m20M59l86L1j11j93R9j6J59
$$ -188 -35 -145 -20 -285 47 77 56 263 173 192 -157 254 238 386 -34 425 39 70 -41 -234 -135 -151 8
3284HN2k22j02J91J9Jj31p4J11j11L11k87L77l00j07L67p4p9K30k28K06K7O5j97
$$ 8 60 -162 -264 -73 -54 -53 -184 -258 -147 -258 53 -234 143 -157 -264 103 29 -50 180 -48 158 185 250 53
3308E3j01K5L42l33q7K98k7l64J44j01p1J97j03N6L7n0k04O9L18R7p5j66k44N40
$$ 53 -48 -23 319 -14 -101 197 170 -194 -50 -151 -222 -25 -128 -72 -35 -85 -289 -220 98 195 120 -46 -290 250
3332B50m60L40j68J83j24MO8R2m8k5L59l7m16P5J87j89r2N4j41j5K38l36J32k51
$$ 250 -210 130 -38 145 21 25 93 185 137 112 471 434 18 93 280 91 -1 53 -88 -103 135 -201 -69 -320
3356c20J51K43k52j3J35Q6l3K6J24l71K32M7K64l60J12M7J05L4k37J41j9J37k81
$$ -320 -169 74 -178 -191 -56 30 -3 23 147 -224 8 55 319 -41 71 118 223 257 20 161 142 279 -2
3379bJ99m3k34K38P7l20J07m0kj3QK55l60j02J18M25l59K91j62j36K15o9k26K16
$$ -2 197 154 -80 158 235 -85 22 -18 -20 -33 -25 230 -130 -232 -114 311 -48 243 81 -55 160 91 -135 81
3403H1m5k2l9l00J72N36k95k16J39K73l07j22P8J14j19n2J41j01J26r9J15j87
$$ 81 36 14 -25 -325 -153 383 88 -128 11 284 -23 -145 -67 47 -72 -124 17 -84 42 -57 58 -129
3425a29K58o1Q0k1P8q6j05L46k25M3mP9j34j77J64j54J69k87J74j69N0J93l09
$$ -129 129 68 148 127 205 119 14 360 135 178 174 253 119 -58 106 -48 121 -166 8 -161 -111 82 -227
3448b27M7J95o7j42K08k32k61N49j40q9O7q3pK0K28J79j8k09J55J78l67N1J69
$$ -227 -180 15 -52 -194 14 -218 -479 70 -70 -159 -92 -175 -182 -162 66 245 227 18 173 351 -16 35 204
3471B04o6j08K3m0k43K56K31l06L5k47R0Q0j32L55n61N19k51j73K05l13N04j91
$$ 204 138 30 53 13 -230 26 257 -49 -14 -261 -171 -91 -223 132 -429 90 -161 -334 -129 -442 62 -129
3493a29J92k3j41K22j58j34K92L0J25j03L7J95o9k93l7P4m89N27j87O0j70M86
$$ -129 63 40 -101 121 -37 -171 121 151 276 173 210 405 336 43 6 80 -409 118 -69 -9 -179 307
3515C07l19j83J90J51k05j98L09r0k79J24K11m05M05j12k70L49q4J75n1m6K54
$$ 307 -12 -195 -5 146 -59 -257 52 -38 -317 -193 18 -387 18 -94 -364 -15 -99 76 25 -21 233
3536B33k57O4J55k67j01K67k55J93r7k06M80j03l22J53K89j38l87J83J05j6l02
$$ 233 -24 40 195 -72 -173 94 -161 32 -65 -271 209 106 -216 -63 226 88 -299 -116 -11 -27 -329
3557c29L89k24J49R1M8k08p5PJ80J48k19J00P1k60L02J0j62nP9q1j12L4K82m56
$$ -329 60 -164 -15 76 124 -84 -159 -152 28 176 -43 57 128 -132 170 180 18 13 92 11 -101 -67 215 -241
3581b41k0L33k89M74l28k24K69j35P1J76O7J03l61J40l38M49J22k82L2J45j8k47
$$ -241 -261 72 -217 257 -71 -295 -26 -161 -90 86 153 256 -105 35 -303 146 268 -14 18 163 145 -102
3603a02K9J88j90p9n9K94l4k07kO5N5j19P9J92j86k07J81j71K59R1j03r7N05n04
$$ -102 -73 115 -75 -154 -213 81 47 -160 -162 -97 -42 -161 -82 110 -76 -283 -102 -273 -14 77 -26 -123 382 -122
3627a22M77k04n5n3J77j51N5p3n2L48l68l0J02k65k07K99J34k10P4J94K15l54
$$ -122 355 151 96 43 220 69 124 51 -1 347 -21 -51 51 -214 -421 -122 12 -198 -124 70 285 -69
3649f9J89Ok56K7M3j31J62J48j16J2L1R3M5k0j84J74O0j09R3j65j17j20M6J3J7
$$ -69 120 126 -130 -103 -60 -191 -29 119 3 15 46 139 184 164 -20 154 214 105 198 33 -84 -204 -158 -145 -128
3674a28J01k03J47k04J03J86J19k13oQ1k46K44M7r1J9K50k86J4K35l49K65o5M3
$$ -128 -27 -230 -83 -287 -184 2 121 -92 -98 -17 -263 -19 28 -63 -44 206 -80 -66 169 -180 85 20 63
3697F3K5k18L56J1l1j81J40j75m0ok21J47k20K15K59l88R3J20O0m6j40K28k27
$$ 63 88 -130 226 237 206 25 165 -10 -50 -56 -277 -130 -350 -135 124 -264 -171 -51 9 -37 -177 51 -176
3720a76J31j90K88Q9k53L38j07l31K52L8j18J86Kn2R2k82J07J41j46p2L39m42
$$ -176 -45 -235 53 142 -111 227 120 -211 41 79 -39 147 149 97 189 -93 14 155 9 -63 276 -166
3742a66J51l9j31Q3K32k58J86j49k7P8l15K76P7K94o00M48j55J51j08j61K8j9
$$ -166 -15 -54 -185 -102 130 -128 58 -91 -118 -40 -355 -79 -2 292 -308 140 -15 136 28 -133 -105 -124
3764a24L3Kk4m3P7K68l36O3J20j68L37k02o9K8j11J25k4k0j90Q8K63j11o8L46
$$ -124 -91 -89 -113 -156 -79 189 -147 -84 36 -132 205 3 -66 -38 -149 -24 -48 -68 -258 -170 93 -18 -86 260
3788B60O7m26J60K13k41k72L52n2l15L07k62n6J75oon1J83j09P2m7j91J83M8N
$$ 260 327 -99 61 274 33 -239 113 61 -254 53 -209 -265 -90 -96 -102 -153 30 -79 -7 -54 -245 -62 -14 -9
3812ij19Q7k06L32R8m21O9Q7pK26J12o1p7K0j8K17k73J03j43MJ9J52n17K65k20
$$ -9 -128 -41 -247 85 183 -238 -169 -82 -89 137 249 188 111 131 113 330 57 160 17 21 40 192 -325 -60 -280
3837b80J53K5k05J7J6L44k0l12M35j46Q9j10j55Q1Q0k5N9M9j30L20l7j09N7K3
$$ -280 -127 -102 -307 -290 -274 70 50 -262 173 27 116 6 -149 -68 12 -13 46 95 -35 285 248 139 196 219
3861B19k07j26k67P60m97M9J88j36m15J33N8j70K92j63R1L9J03j40J47R1O2l08
$$ 219 12 -114 -381 379 -118 -69 119 -17 -432 -299 -241 -411 -119 -282 -191 -152 -49 -189 -42 49 111 -197
3883a97L53N8m37L62j7k48J25J08J97k60J57o2m4j42N4Q2K26n45M2J22P7J15k20
$$ -197 156 214 -223 139 122 -126 -1 107 304 44 201 139 95 -47 7 89 315 -230 -188 -66 11 126 -94
3906i4M7k13J6L9K39k06N7Q4J28j7K02n3j40p7j05J50k37OM06j92k42P4j33M04
$$ -94 -47 -260 -244 -205 34 -172 -115 -31 97 80 282 229 89 12 -93 57 -180 -174 232 40 -202 -128 -261 143
3930A43k49J73n1M0k60L03r6K9O3k1l1J33m11K57q3j6L8O8K23j36J48j64op5J11
$$ 143 -106 67 16 56 -204 99 3 32 95 74 43 176 -235 22 -61 -77 -39 29 252 116 264 100 94 19 130
3955A30jk10J86J35l15K6l70K76J13K17o9q1K11j71j10k06J55J2k41J16J20J95
$$ 130 129 -81 105 240 -75 -49 -419 -143 -30 187 118 37 248 77 -33 -239 -84 -72 -313 -197 -77 118
3977A18J36k11l4n5K42l6Q7j55K35k55n2K0M4j8l19J81L30l34k25K77j01l9J35
$$ 118 254 43 9 -46 196 160 247 92 327 72 20 40 84 66 -253 -72 258 -76 -301 -24 -125 -164 -29
4000b9k52K83k3j29J90k2K8M7k98N9J56j94K19O9q1m4m9J46j71J50P3j02K89l48
$$ -29 -281 2 -21 -150 40 18 46 93 -205 -146 10 -184 35 104 23 -21 -70 76 -95 55 128 26 315 -33
4024c3j35N1J02J82k24j18K29k96N9q5K16K3j3L7j82J89nj8j15O9QK03j19N%J34
$$ -33 -168 -117 -15 167 -57 -175 54 -242 -183 -268 -52 -29 -42 -5 -187 2 -3 -21 -136 -67 -59 144 25 30 30 164
4050A64o0j61J70p4J38k56K99J1j95L4l11L18k06O3K45l65l3J02O5m53P90m10
$$ 164 104 -57 113 39 177 -79 220 231 36 70 -241 77 -129 -66 179 -186 -219 -117 -52 -505 285 -125
4072a25J27J00l9M7l0L7k36J41J41j66j46J52M3J21n5q8M8J51J8j34L78k01k29
$$ -125 2 102 63 110 80 117 -119 22 163 -3 -149 3 46 167 112 24 72 223 241 107 485 284 55
4095E5P9j21j95L49m51k2J16J86j73J2J89k19K01rj93J22O3l7K1n7J7L8K91l11
$$ 55 134 13 -182 167 -284 -306 -190 -4 -177 -165 24 -195 6 -3 -196 -74 -11 -48 -27 -84 -67 -29 262 -49
4119d9k11J93rJ86l2j69L7Kq0L4J42j39L52o4o4l30M5p4M27k51k92L42M1j23J42
$$ -49 -260 -67 -76 110 78 -91 -54 -52 -132 -98 44 -95 257 193 129 -201 -156 -230 197 -54 -346 -4 37 -86 56
4144E6k93L16j03K79j00m6J02k16j15K30mn7j3j33R6j19J34L9J16k49K6J26K6
$$ 56 -237 79 -24 255 155 109 211 -5 -120 110 106 49 36 -97 -1 -120 14 53 169 -80 -54 72 98
4167I8j5l3J46Ok30j24L60j46j06k70K61j16p1L55k58L41j29n7J29j2j8M1j75
$$ 98 83 50 196 202 -28 -152 208 62 -44 -314 -53 -169 -240 115 -143 198 69 12 141 129 111 152 -23
4190b3j68J73k20J16r4k6L15k64K34N1k97J16K9J17J76j55j3K0n7p8J79j08j76
$$ -23 -191 -18 -238 -122 -216 -242 73 -191 43 94 -203 -87 -58 59 235 80 67 87 30 -48 131 23 -153
4213a53L4M56k54J76j2k28m17K50J73p7j05j53J04r8J91J00o6J5j70J38J3J94
$$ -153 -119 337 83 259 247 19 -398 -148 25 -52 -157 -310 -206 -304 -113 -13 -79 -64 -234 -96 -83 111
4235A11l04L37P8l37M63k70J51R2j82J20l98K01N1m5L1k16R2L8K3j8j83J32OK37
$$ 111 -193 144 222 -115 348 78 229 321 139 259 -139 62 113 68 99 -117 -25 13 36 18 -165 -33 -27 210
4259B10m81J97n6J06lk64L35j22o6L57k85R9O3J86k59N9k1k5N9r4k63J39P1J68
$$ 210 -271 -74 -130 -24 -27 -291 44 -78 -144 213 -72 27 90 276 17 76 55 30 89 -5 -268 -129 -58 110
4283A10k69J54k6j72L16l29M21r4k17J13k10j07J93K27l01j94M27j19j12K8N1
$$ 110 -159 -5 -31 -203 113 -216 205 111 -106 7 -203 -310 -117 110 -191 -385 42 -77 -189 -161 -110
4304a10K74l66J85J35M5k40J52O7j21m6q5O3P9K9k6l03K52l91N67j71j39K18j84
$$ -110 164 -202 -17 118 163 -77 75 142 21 -25 -110 -47 32 61 35 -268 -16 -407 160 -11 -150 68 -116
4327a16J66M1l9j15J20j40J50q3K14l23K8J54j01J75P7M0k84J48P2n63M83k09
$$ -116 50 91 52 -63 57 -83 67 -16 198 -125 -97 57 -44 131 208 248 -36 112 184 -379 104 -105
4349a05L9N2k46L35j92k9Q5r6K18j19l2N4K8k01K96J49k69j85K50k27J95Om5k7
$$ -105 -66 -14 -260 75 -117 -146 -61 -157 61 -58 -90 -36 -8 -209 87 236 -33 -218 32 -195 0 6 -39 -66
4373f6P4J06j82J16j54j10N14j1l68PJ3K06l30K54j83K2J1L4j6j47J67R3r5j91
$$ -66 8 114 -68 48 -106 -216 298 287 -81 -74 -61 145 -185 69 -114 -92 -81 -47 -63 -210 -43 50 -45 -236
4397b36N67k78M55m65J16l63j08L45K2J17k57j39L65k59K31J68k65J57k88k2M2
$$ -236 331 53 508 43 159 -204 -312 33 55 172 -85 -224 141 -118 113 281 16 173 -115 -137 -95
4418i5J06J38m90M34O0k56Q1j41P5J58r0O3Q7q0J74L9j32J23L6l55K50l1p1k05
$$ -95 11 149 -341 93 153 -103 -22 -163 -88 70 -20 43 130 50 224 263 131 254 290 -65 185 154 83 -122
4442a22N5J51m7r4R9q0J29Q3j80J45j61P7q8L8j00j44L38j30k79L81j83J02j0
$$ -122 -67 84 37 -57 42 -38 91 174 -6 139 -22 55 -33 5 -95 -239 99 -31 -310 71 -112 -10 -20
4465b0k6M21k96o4P6k49J92Q1L3j3o3N9K5k15j0L95k43k98M46j63j55L3j73J84
$$ -20 -46 375 79 15 91 -158 34 115 148 135 72 131 156 -59 -69 326 83 -215 231 68 -87 -54 -227 -43
4489d3L34j40L8Q7l41L19k78m1K36j93Q7j4j31O8L01Rk07j18r1J18p6N1j05K76
$$ -43 291 151 189 276 -65 254 -24 -65 171 -22 65 51 -80 -12 289 298 91 -27 -118 0 -76 -25 -130 146
4513A46j87p8J02j79j70L97l8p0o4J42K8R8Q2l2l62J97R8m4N8m32M85m23M25j52
$$ 146 -41 -119 -17 -196 -366 31 -7 -77 -141 1 29 127 209 177 -185 12 110 66 124 -308 177 -246 179 27
4537B7j76K84j71j09M36l46J14K67m71lL69k51K45k13J64k12k40J60J15j0J63
$$ 27 -149 135 -36 -145 291 -55 59 326 -145 -148 221 -30 215 2 166 -46 -286 -126 -11 -21 142
4558A42j33k00L57l3k15k6K77o07M30K06k59j5J29j70J96K1n6M0k6lJ20k50K22
$$ 142 9 -191 166 133 -82 -108 169 -438 -8 198 -61 -76 53 -117 79 100 44 84 58 55 175 -75 147
4581A47k59j96L78j92K48j04l63K65J35o2p4O0k21L11K9kn24M03K47l21K75k05
$$ 147 -112 -308 70 -122 126 22 -341 -76 59 -3 -77 -17 -238 73 102 100 -424 -21 226 -95 180 -25
4603b5J74k08p1j9J71M6j67J11P1n2L9L05m91Q7M74l29k66K53M0q1j41J75j14
$$ -25 149 -59 -130 -149 22 68 -99 12 83 31 70 375 -116 -29 445 116 -150 103 143 62 -79 96 -18
4626a8J6J13k33K94m19J57NK88qm49N35k65Qj55J85r5J47q6j35Q4J69J59n44J09
$$ -18 -2 111 -122 172 -247 -90 -85 203 195 -254 281 16 24 -131 54 -41 106 20 -115 -31 138 297 -247 -138
4650a38K14k27l9M4J34m41M41J84j88j6Q2Q4j16o2j32J74J27L6j3j58q1L26l87
$$ -138 76 -151 -190 -146 -12 -453 -12 172 -16 -32 50 134 18 -44 -176 -2 125 161 148 -10 -91 235 -152
4673a52J31j89K47j88lJ61J2K1j81M08m68Q7K6o2jL21j36J87l87K43n3j8K1LJ25
$$ -152 -21 -210 37 -151 -154 7 19 40 -141 267 -201 -114 -88 -150 -151 170 34 221 -166 77 24 6 27 30 155
4698A55N1L8J36l99J60J11k8j62J25j99J4K03m09K2kJ94J45k07j85K90l33J43
$$ 155 206 244 380 -19 141 252 224 62 187 -12 2 205 -204 -182 -184 10 155 -52 -237 53 -280 -137
4720a37K91j96Q9j56J48mJ61k53j90M53j57k0j23J11P9r2L9K20J46k33j57M6L2
$$ -137 154 -42 47 -109 39 35 196 -57 -247 206 49 29 -94 17 96 4 43 263 409 176 19 65 97
4743I7J5k34J89k33K32j10j73J88L6l55M2J75Q7j21K30Q3k72O6K02N2j01r6n5
$$ 97 112 -122 67 -166 66 -44 -217 -29 7 -348 -306 -131 -44 -165 65 148 -124 -58 144 196 95 -1 -56
4766e6J91j60k6J82r2j36N27m27J79j22n5%J99j73j49O3J04k4o3N5R7j52J09M1
$$ -56 135 -25 -51 131 39 -97 430 3 182 60 5 5 204 31 -118 -55 49 25 -38 17 114 -38 71 112
4790A12q9K41m06J38%J40p3j51Q1O4k14J75Pj81J67j67K8mK06j63p3J98ok8l80
$$ 112 23 264 -142 -4 -4 136 63 -88 -7 57 -157 18 25 -156 11 -156 -128 -132 74 -89 -162 36 30 2 -378
4815c78K07J11J10k7k83Q1J11p0K43j63M5N2L5R6l75LJ61K4J30k20J26J91l05
$$ -378 -171 -60 50 23 -260 -179 -68 -138 105 -58 -13 39 74 170 -205 -202 -41 -17 113 -107 19 210 -95
4838i5k2J08j32J53n8j03J55P9j47j02K19Q2k99K05oR2Q%l2j67J58n8J7J15j06
$$ -95 -117 -9 -141 12 -46 -149 6 85 -62 -164 55 137 -162 43 37 129 137 137 105 -62 96 38 55 170 64
4863F4k00J79k6J16k83K70j51O3J42l5q9k06J07j87K69qJ7J23k18n8J77j10J54
$$ 64 -136 43 17 133 -150 120 -31 32 174 139 50 -156 -49 -236 33 25 42 165 -53 -111 66 -44 110
4886A10K9M8q8l99O17l52K17j50J60j83r9j48K31N0k3Q3j72J82k34r6L04j80r9
$$ 110 139 187 99 -300 317 -35 182 32 192 9 -90 -238 -7 43 20 103 -69 113 -121 -217 87 -93 -192
4909a92L01j63N3j7j25K16l14K74r8K2j1J38K40l94J72l22K73N2r8j14K83J01
$$ -192 109 -54 -1 -18 -143 73 -241 33 -65 -43 -54 84 324 -70 102 -220 53 105 7 -107 176 277
4931B77k97K02q5j77M9K45l06J06J28J31n72J81Q1j68k8J7J38J78k81q5J37K54
$$ 277 -20 182 97 -80 -31 214 -92 14 142 273 -299 -118 -37 -205 -233 -216 -78 100 -181 -266 -129 125
4953A25j7l49J87J32j69l7J91l5J34kj94J59j97R7K4k5p1J33J38l60K74k99j13
$$ 125 108 -241 -54 78 -91 -128 63 28 162 160 -34 125 -72 25 49 24 -47 86 224 -136 138 -161 -274
4976b74J90J5J22k3k01M8J78j25J22j23K10j30J62m38J85J11q7O0j78Q8R8j82
$$ -274 -84 -69 53 30 -171 -123 55 -70 52 -71 139 9 171 -267 -82 29 -58 2 -176 -88 10 -172
4998a72P7P7K7J22n5k61P8J52R9j16J24o1j18J36Q5k22J12J4j68L11l75L13j05
$$ -172 -95 -18 9 131 76 -185 -107 45 144 28 152 91 -27 109 194 -28 84 98 -70 241 -134 179 74
5021G4r7m4J0J52r6j89M81k64o1J18L0j63L8L9OM5l03j26N09k13k56K22o4J30
$$ 74 -23 -67 -57 95 -1 -190 291 27 -34 84 114 -49 -11 28 34 79 -224 -350 159 -54 -310 -88 -152 -22
5045b2J24K27j15q1j51J94L9o7O1J02k63j57K68j92m3J10J38j66o1N0K2Pj95J04
$$ -22 102 329 214 133 -18 176 215 148 209 311 48 -109 159 -33 -76 34 172 6 -55 -5 17 24 -171 -67
5069f7P5J48j90o7P3K23o18L23K46Q0l37l9K51N5J59k23q0K6j44J99j82j06J60
$$ -67 8 156 -34 -101 -28 195 -423 -100 146 226 -111 -150 101 156 315 92 12 38 -106 93 -89 -195 -35
5092c5Q9j37K33lm01J52j06L88m26K13j65P7o2K91m38K16N0j43J23J87J02m22
$$ -35 54 -83 150 147 -254 -102 -208 180 -246 -33 -198 -121 -183 108 -330 -114 -64 -207 -84 103 205 -217
5114b17K62j25J69k58q1K90j05O9K55J47j30J35m15k71K08j47L75j3l40N3K0M1
$$ -217 45 -80 89 -169 -250 40 -65 4 259 406 276 411 -4 -275 -67 -214 161 148 -192 -139 -119 -78
5136g8Q5j78J30J8N6l0j9j09k1j69M69j63M7k01Mo3N49j68k80M11n69L43j33k0
$$ -78 7 -171 -41 -23 33 3 -16 -125 -146 -315 154 -9 38 -163 -159 -222 327 159 -121 290 -279 64 -69 -89
5160h9N5R1p0q0K58j26R4k47k62M36p2K38j14j31K46K5p4k06J7J78j36n7KL39
$$ -89 -34 57 -13 -93 165 39 133 -114 -376 60 -12 226 112 -19 227 252 178 -28 -11 167 31 -26 -24 315
5184C15j87l1n2o3N4N9l41K48J64k17p0l5L1J80o3Q3J44m24Q9m8K64k59J32J34
$$ 315 128 97 45 -18 36 95 -246 2 166 -51 -121 -156 -125 55 -8 75 219 -205 -116 -164 100 -159 -27 107
5208A07R6l23K74k27J88k26K36m4lJ02k31M1P3K5k04MJ50J26k64O4j23K27K3k52
$$ 107 203 -120 154 -73 115 -111 125 81 78 180 -51 -10 63 88 -116 -112 38 164 -100 -36 -159 68 91 -161
5232a61J69j52K1L64j62J88m48J0J56j2R6l3j69M41l42m7K26l30J35K65k75O7
$$ -161 8 -144 -123 241 79 267 -181 -171 -15 -27 69 36 -133 308 -34 -81 145 -185 -50 215 -60 7
5254Go4m06M12Q2k36L33k41K94k23J06j45J5M7O7m4k73K66J3m4L7J00j91P0J58
$$ 7 -57 -463 -51 31 -205 128 -113 181 -42 64 -81 -66 -19 48 4 -269 -3 10 -34 3 103 -88 -18 140
5278A40l27J65K37j89Q0K90m53K9J51k88K44l34J94J30J10m09R8K52q0j02J7l1
$$ 140 -187 -22 215 26 106 396 -57 -28 123 -165 79 -255 -61 69 179 -230 -132 120 40 -62 -45 -76
5300g6K12l19K43j33J66l01K11P2m4j14L6NO5k3J7Q3J6k12R4k8n4J02j7RP5k85
$$ -76 136 -183 60 -73 93 -208 3 75 31 -83 -47 -42 23 0 17 100 116 -96 -2 -30 -84 18 1 10 85 -200
5326b00L80j35j41J43k47j0L3K70j21K66o0j50j52O5m8J10J96K5k35R6oK08l81
$$ -200 180 45 -96 47 -200 -210 -177 93 -28 238 178 28 -124 -59 -107 3 199 224 -11 85 79 287 -94
5349i4O8P5j6j35J14K0o3M4K88k10j14o2K64l3j70P2j01J1K22m06M22j52k01L12
$$ -94 -26 49 33 -102 12 32 -31 13 301 91 -23 -85 179 146 -24 48 -53 -42 180 -226 196 44 -157 155
5373A55k01K90l88N7J24o8k78L61mp0j85nq1L79k19K03j26K0n9M0JK06j68o4P2
$$ 155 -46 244 -144 -87 37 -31 -309 52 48 -22 -207 -212 -293 86 -133 70 -56 -36 -95 -55 -54 152 -16 -80 -8
5398hj88J2J84J64m18K72l1n8K90l54J66J3L4J99m21K57k18j2j23L91j82P8p2
$$ -8 -196 -184 0 164 -254 18 -13 -71 219 -135 31 44 78 277 -144 113 -105 -117 -240 151 -31 47 -25
5421b5j27k15K99J59j76j4J79j51r1K9J21K19k40O3J12k27J72j83K18l03K59q3
$$ -25 -152 -367 -68 91 -85 -99 80 -71 -162 -133 -12 207 -33 30 142 -85 87 -96 122 -181 78 -5
5443eP9o2k06K43k4k0K04k55K54l16K64o6k43J0K36l5j6n2j54O7K84j38P7k04
$$ -5 74 12 -194 49 25 5 209 -46 208 -108 156 90 -153 -143 93 58 42 -10 -164 -97 187 49 126 -78
5467g8J1j73L87K7j55o1j32J37k08L14j2k57L47p0j1j4R6k10J23j75j64jJ59K51
$$ -78 -67 -240 147 174 19 -42 -174 -37 -245 69 57 -200 147 77 66 52 148 -62 61 -114 -278 -279 -120 131
5491A31M0J36l86m0J7J66k70L01Q2j66O7j00M22l72M8P3K42k46l39J48N5q2J54
$$ 131 171 307 -79 -119 -102 64 -206 95 177 11 78 -22 400 28 76 149 391 145 -194 -46 9 -73 81
5514H1k0r3j84K30r1J93Jj17J14l00M66k02j94K6k6j19L38L6r2k87J69Q9J43j13
$$ 81 61 -32 -216 14 -77 116 117 0 114 -186 280 78 -116 -90 -116 -235 103 139 47 -240 -71 18 161 48
5538D8J06j51r4n0p2L42j22J06j75J32m3k31K65q6Kk54J72rK3K14k66R6K51j65
$$ 48 154 3 -91 -141 -213 129 7 113 -62 70 27 -204 61 -25 -23 -277 -105 -114 -91 123 -143 -47 204 39
5562C9j4J21j95K5M1L0M1k35N8K86m39M12k89K20Q5o1k83J80n8J1K29l22J16J38
$$ 39 25 146 -49 -24 17 47 88 -147 -89 197 -242 170 -119 101 186 125 -158 22 -36 -25 204 -118 -2 136
5586A36k73q0Q7R1l0K26r3J32k90J41p2M6j1M5j25N2k07M57J33k31j61p9K94j18
$$ 136 -137 -217 -130 -39 -69 157 64 196 -94 47 -25 21 10 55 -70 -18 -225 232 365 134 -27 -106 188 70
5610G0o3J0P7k01J26j62O9J50j30O1MQ6j03J08J27k30J29j19j61J50O8j3o4K19
$$ 70 7 17 94 -107 19 -143 -74 76 -54 7 11 97 -6 102 229 -1 128 9 -152 -2 66 53 -11 208
5634B08o5Mj3k45J76m31M38J18m91K33%l9L05j97j04J49p1P3m73K80J99r3Q7m2
$$ 208 143 147 134 -111 65 -366 72 190 -301 -68 -68 -107 198 1 -103 46 -25 48 -425 -145 54 -39 48 6
5658FQ4j56J27M7j66K1r5L04k63R7r4J46l56K90k0j04L09k54J81J79k68j15m2
$$ 6 90 -66 61 108 -58 -37 -132 172 -91 6 -88 58 -298 -8 -28 -132 177 -77 104 283 15 -100 -142
5681a42K15j18N3K09l16J98k02K35k82J13J5J30p0L0k4Q9j29J25J08k93J97j51
$$ -142 73 -45 8 217 -99 99 -103 132 -150 -37 -22 108 38 68 44 133 4 129 237 -56 141 -10
5703a0j18L24L0k37K47k29j96K94j62k9J6r8J66M0Q3p5J32L8m31K13Q6r4J25j91
$$ -10 -128 196 226 -11 236 7 -189 105 -57 -86 -70 -168 -2 38 121 46 178 216 -215 -2 84 -10 115 -76
5727g6O1K3o0J79j76J41l33M00j45o6J39j04p6qJ77J16k19n1O3j56l4j42O55l84
$$ -76 -15 8 -52 127 -49 92 -241 159 14 -52 87 -17 -93 -101 76 192 -27 -78 -15 -171 -205 -347 308 -76
5751g6j18oL91k10J02k24Q5M5o9K56j69q9J51K32k30j84M07n15K58j00J1J68k74
$$ -76 -194 -200 191 -19 83 -141 -56 -11 -80 176 7 -82 69 301 71 -113 294 -221 37 -63 -52 116 -158
5774a58L17k29J89l7r0J46o4q1l2J86k9k18J25J25l05J8J93J8k25Jk6O5N2J26
$$ -158 159 -70 119 82 -8 138 74 -7 -39 147 118 -100 25 150 -155 -137 56 74 -151 -150 -176 -111 -59 67
5798F7L2R1k75L02o7J8k40j59K02J86m27L20j67K32p6K09m78O4MK83n7o3Q4k28
$$ 67 99 190 -85 217 150 168 -72 -231 -29 157 -270 50 -117 115 39 248 -230 -166 -162 121 64 1 85 -143
5822a43O8O7o4J55J45k59n1l76K71N3K01o0J16j37n2k7K33Jk88J65J9O6N7l29
$$ -143 -75 -8 -72 83 228 -31 -82 -458 -187 -134 67 7 123 -14 -66 -93 140 141 -147 18 37 103 160 -169
5846a69O5J56j98J93jj39j5R0J15j95rJ30pJ87j42K2k11l1J00J20k00M73l40j19
$$ -169 -104 52 -146 47 46 -93 -108 -18 97 -98 -107 23 16 203 61 83 -128 -159 -59 61 -139 334 -6 -125
5870a25K19K28m51Q9n9J90j89O3L50l54N3l19P0K47Q7P9l69LJ62k65J65L23O6
$$ -125 94 322 -129 -40 -99 91 -98 -35 315 -39 14 -305 -235 12 99 178 -191 -188 -26 -291 -126 197 263
5893B63l01J81l33L72k21p0Q9M2p5J05k4j94J50J09k33J86N8k02J29j77K23o5
$$ 263 -38 143 -190 182 -39 -109 -20 22 -53 52 28 -166 -16 93 -140 46 104 -98 31 -146 77 12
5915A2K6r5O1o5l5J59p4m5q2M37j05k98J90j94L0Q0Q0k17J15K5q3r7K36j25n0
$$ 12 38 -57 4 -61 -96 63 -11 -56 -138 299 194 -104 86 -108 -78 2 82 -135 -20 5 -78 -175 61 -64 -114
5940a14K73k56j05J85J23l07J73J32j14k02L08r7K3j21O9K03o3j40j73K77J92
$$ -114 159 -97 -202 -17 106 -201 -28 104 -10 -212 96 -1 22 -99 -30 173 110 -30 -203 74 266
5961B66n67K91K61l82R8R4j0k11L75j72j71J08n3K42k50K71k09J06O8m7j38o3
$$ 266 -301 -10 251 -131 -33 61 51 -160 215 43 -128 -20 -73 169 -81 190 -19 87 155 108 -30 -93
5983i3p1K78j07m0Q9J20j78J15n5q4R2K0P2Ml6j91j4J68R6q0k34J17Q8j9p7j92
$$ -93 -164 114 7 -33 56 176 -2 113 58 -26 66 86 158 162 126 -65 -79 89 185 105 -129 -12 76 57 -20 -212
6009b12qK61j70K81R2k56MJ19l37K52nJ38J8o3r3J83l23q7M2o9M04m21J97Q6j14
$$ -212 -220 41 -129 152 244 -12 -8 111 -226 26 21 159 177 114 21 204 -119 -206 -164 -233 171 -250 -53 33 -81
6034h1J19l5k03K55l38K12K46j48P3rl00J01L3R9N9j25R3J76l75J07K82n7J0m23
$$ -81 38 3 -200 55 -283 -71 175 27 100 91 -209 -108 -75 24 83 -42 51 227 -148 -41 241 184 194 -229
6058b29L79k23K76O3m25L5r8J14J32K9k77K19P6j08R7M8q6j64K19j94M2J45l11
$$ -229 150 -73 203 266 -159 -124 -222 -108 24 53 -224 -5 71 -37 60 108 22 -142 77 -117 -75 70 -241
6081b41K22J11j48J69j91P0j19J04l1j9R6K26j91M5k10J9K43l56M4R9l6j40J74
$$ -241 -19 92 -56 113 -78 -8 -127 -23 -54 -73 23 249 58 103 -107 -88 155 -201 -157 -58 -94 -234 -60
6104f0J61k4o9L6j45Q6k20L65k95K57j4k55J88l5J5j6m5j5J79O1p1j28J98k28
$$ -60 101 77 8 44 -101 -15 -235 130 -165 92 78 -177 11 -24 -9 -25 -70 -85 94 155 84 -44 154 -74
6128g4j83K22l0K37j72j45J88Koj02rJ40k5j21J93k4J89j10l29L75j00k06R7P
$$ -74 -257 -35 -65 172 0 -145 43 45 39 -63 -72 68 43 -78 115 91 280 170 -159 216 116 -90 7 14
6152A4J59k07J26k69L94j9%m41k1L88M7k48J73j92k29L08J21J9j87J50r5K81j08
$$ 14 173 -34 92 -177 217 198 198 -243 -264 124 171 -77 96 -96 -325 -17 104 123 -64 86 -9 272 164
6175A64k87J53L7p0R7l8j59k6J90J57j81K8j60K73k49j01J82J47j19k38L77j69
$$ 164 -123 30 67 -3 94 56 -103 -129 61 218 37 65 -95 178 -71 -172 10 157 38 -200 177 8
6197Hj51Q5K39j12p2l5L82n57J67J51o02J87L55oo8L34k19m5m8N5Q6M9k83L8L9
$$ 8 -143 -58 181 69 -3 -38 344 -213 -46 105 -497 -310 45 39 -29 305 86 41 -7 48 134 183 -100 -62 -23
6222b3j60L33j58J63p6j44k5k7J5J63J03k38J22k72l0L47j52J29l30J6J75J11
$$ -23 -183 150 -8 155 79 -65 -90 -117 -102 61 164 -74 48 -224 -254 93 -59 70 -260 -244 -69 42
6244D2M6N2j38J09j9j72J68m1j48J59j84J5PL76l80J32l8j47K53l83K49m5M0j24
$$ 42 88 140 2 111 92 -80 88 47 -101 58 -126 -111 -104 272 -108 24 -14 -161 92 -291 -42 -87 -47 -171
6268a71J42j00L25j17oJ60k51M8J35k67J54K4K5k87O3J27J99k96m6J59j18J57
$$ -171 -29 -129 196 79 73 233 -18 30 165 -102 52 76 101 -186 -123 4 203 -93 -139 20 -98 59
6290E9R7j18kJ74o9k2J8k51J49k40K12n4R0n3J99l63K76l69M20k13m2J62n6k73
$$ 59 156 38 36 210 141 119 137 -114 35 -205 7 -47 43 -10 189 -174 102 -267 153 -60 -102 60 4 -269
6314b69L36j78J3J95j5j12p1n3r3L11o3r5K07J2j83K75k41r5rn8K42O5m2k38L15
$$ -269 67 -111 -98 97 82 -30 -101 -154 -247 64 1 -94 113 125 -58 217 -24 -119 -128 -186 56 121 79 -159 156
6339A56l1k76L06j05R1j72R4J86l50J69N5k54L49j40k22NN38m95K0j16L96j38
$$ 156 125 -151 155 50 141 -31 63 249 -101 68 123 -131 218 78 -144 -139 399 -96 -76 -192 204 66
6361F6j83R8L10k18l42K62J37R5k61RJ8J29J21l00J48R3n1J48j28j56m0k11L54
$$ 66 -117 -19 291 73 -269 -7 130 225 -36 -27 -9 120 241 -59 89 182 131 279 151 -5 -45 -256 98
6384I8k7o9O0j17J5J49R9l07K6K28m3j64R5l4P2j90J79j6L0Oj93o2J16K12k42
$$ 98 71 2 62 -55 -40 109 208 -99 -73 155 112 -52 43 9 81 -109 70 54 84 90 -103 -165 -49 163 -79
6409g9J43Q6j10n3K26On5j24p9r8L54l16K04o3L4j14K8j74m0K6M59l47J9J52j61
$$ -79 64 150 40 -13 213 219 164 40 -39 -137 217 -99 105 42 76 -38 -10 -184 -224 -198 261 -86 -67 85 -76
6434g6J74L8O1l84J07j7L8K90k42K12l60J25l7J86o7j10Q2L0L36l33j98J73p9
$$ -76 98 136 197 -187 -80 -97 -59 231 -11 201 -159 -34 -71 115 48 -62 20 50 386 53 -145 28 -51
6457e1L3r0L97l45J83Q1k35O6k61L43j38k89J59J71j29%K8P8N2l75L62J3R5k92
$$ -51 -18 -108 289 -56 127 208 -27 39 -222 121 -17 -306 -147 24 -105 -105 -77 1 53 -322 40 53 148 -144
6481a44J53n7r1K67K3j52j32L59k15m0l69M81j9j80O7q6NJ18j08j03J37M2K55
$$ -144 9 -48 -139 128 151 -1 -133 226 11 -29 -398 83 64 -116 -49 -135 -130 -12 -120 -223 -86 -44 211
6504B11r3k9J6j05j52Q1K35p6N8k13J43M2j91J89k74L00m2j96%J48k4k0l83M07
$$ 211 118 89 105 0 -152 -71 164 88 146 -67 76 118 -73 116 -158 142 100 -96 -96 52 28 8 -375 32
6528C2j04L19k27MLJ52k83P7k17M92k24J62k58J7J77q7k6r4n7K23l08K40J55r3
$$ 32 -72 247 20 24 27 179 -104 -27 -244 248 24 186 -72 -55 122 35 9 -85 -142 81 -227 13 168 75
6552G5m3J34j10j33j54K23P8N3k37O1K53j88J5m49L40k9q5L26P7l49J69j86K94
$$ 75 32 166 56 -77 -231 -8 70 123 -114 -53 200 12 27 -422 -82 -111 -196 130 207 -142 27 -159 135
6575A35k35J74l7o5J95l30K1l2L15l69J55l4Q1J21m84K62j61L95K8k85J06K34
$$ 135 -100 74 37 -28 167 -163 -142 -174 141 -228 -73 -107 -26 95 -389 -127 -288 107 135 -150 -44 190
6597A90p1k37P2j06L6P9lmK75l61P1k6J08K15l59J95m1j3J40j89r4Q0k7R2J3m5
$$ 190 119 -118 -46 -152 -116 -37 -40 -44 231 -130 -59 -85 23 238 -121 74 33 20 160 -29 -123 -43 -70 22 35 -10
6623a0J24l3m2j4j22k30M88j41m9j95N77k83j83J48m4j52J39Q5j23J28J00k27
$$ -10 114 81 39 25 -97 -327 161 20 -29 -224 353 70 -113 35 -9 -161 -22 63 -60 68 168 -59
6645e9n2L7J95J96k43m0j66nP0oJ33k87N3OK43j12J23n1l4j39J43J16n3k35J37
$$ -59 -111 -74 121 317 74 34 -132 -137 -67 -73 60 -227 -174 -168 75 -37 86 35 1 -138 5 121 68 -167 -30
6670c0m2J40k07J56q8P1j03J52k1n2q5j85M8K57r5K01k1k83L04n0k01K19j70j47
$$ -30 -72 68 -139 17 -71 0 -103 49 28 -24 -109 -294 -246 11 -84 117 96 -187 117 67 -134 85 -85 -232
6694b32j5L72j38l8J48j98K05k00K4K00l37M28k91o2K27l2p0j58J28j74K83j66
$$ -232 -247 125 -13 -51 97 -101 104 -96 -72 128 -209 219 -72 -134 93 61 -9 -167 -39 -213 70 -96
6716i6K33k32j00L14j89k24L70j20o6j15J50P0l8l7Q9q9M05J10o57K32PJ9k66
$$ -96 137 -95 -195 119 -70 -294 76 -44 -110 -225 -75 -5 -43 -80 9 -80 325 435 -222 10 17 36 -230
6739b30K76p7J47j67K32k96N7N8l5r0R6K85k44j36l2K49r4p6K87J51j88k07k2
$$ -230 46 -31 116 -51 181 -115 -58 0 -35 -125 -29 256 12 -124 -156 93 -1 -77 210 361 173 -34 -56
6762e6J67Qk33J03L09j82j55m4l7Q0K89j35N2j35j40J22j20J27l4P7j85L46q3
$$ -56 111 119 -114 -11 298 116 -39 -83 -120 -40 249 114 166 31 -109 13 -107 20 -14 63 -122 224 141
6785A41m44J23K46l0m3j45J60Qj07j39K49J25N2j64o1L7k58K04L8J40k18K71l66
$$ 141 -303 -180 66 36 -7 -152 8 16 -91 -230 19 144 196 32 -29 8 -250 -46 -8 132 -86 185 -181
6808a81J77j58p2K74o3k6L6k13J51r4J02J18j44L50j62Jrk04J33j3K18j7m43K52
$$ -181 -4 -162 -234 40 -23 -49 -13 -226 -75 -169 -67 51 -93 257 95 96 87 -117 16 3 221 204 -239 13
6832A3o6p6J22J8j7l2M5%qk52P48n97R9M4j74L92J5m09qL52l9j87k5J75j88J8
$$ 13 -53 -129 -7 11 -6 -38 7 7 -1 -253 495 -102 -3 41 -133 259 274 -135 -143 209 170 -17 -42 133 -55 -37
6858c7J18k54L10N8k24M2J02k6j73K6j51K13j19J65P5j76k02M31k35n0K55j40
$$ -37 81 -173 137 195 -29 13 115 89 -84 -58 -209 4 -115 50 125 -51 -253 178 -57 -107 148 8
6880HpQ9k93K05lJ02p9N6O0o9k52K58k05K69j33nJ52j9q0j82J46o5K07r3r2N1
$$ 8 1 90 -203 2 -1 101 22 78 138 69 -183 75 -130 139 6 1 153 134 54 -128 18 -47 160 67 -25 26
6906B6J31q9j60o5J49j03M69k50j32nO7Q2j65o1j01J67K29k40j13N8L11j94P4
$$ 26 157 68 -92 -157 -8 -111 358 108 -24 -29 38 120 -45 -106 -207 -40 189 -51 -164 -106 205 11 85
6929H5j53J51j21m8K88k94J13J42j42j90J1J09L7P8k8p3L4L8j17n4K01j39l6J
$$ 85 -68 83 -38 -86 202 -92 21 163 21 -169 -158 -49 -12 66 38 -35 -1 37 -80 -134 67 -72 -108 -107
6953a07K48l19Q5N0J00l8P3M3O3k38j7L5N5k70K60K11k55q2R5J46k74M15k46k2
$$ -107 141 -178 -93 -43 57 19 92 135 198 -40 -57 -22 33 -237 23 234 -21 -103 -8 138 -136 279 33 11
6977A1k4P7m00M15j38j74K77J56k27P6R8K5j52J19j44o4J59q2R0j04K88k05J45
$$ 11 -13 64 -336 79 -59 -233 44 200 -27 49 147 172 20 139 -5 -69 90 8 98 -6 282 77 222
7000B22l21R4R1j13J49p3L2k26J67j2j29J9j36K36k26N8M84k91rk03L5Q0j78K68
$$ 222 -99 -5 86 -27 122 49 81 -145 22 10 -119 -100 -236 0 -226 -168 316 25 16 -187 -152 -72 -250 18
7024A8J67k63N5P5K2Q4l47J59J20Q4lM9k71m7QQ2q2J58j02P0R9j64m8k3k26J81
$$ 18 185 -78 -23 52 74 158 -189 -30 90 174 171 220 -51 -98 -90 -8 -90 68 -34 36 135 -29 -77 -100 -326 -145
7050a45L6K1P6Jo0l6L01J55l81J4K96k95J09n4%J10k45j1r8P6L95k54L7m1j90
$$ -145 -109 -88 -12 -11 -71 -107 194 349 -32 -18 278 -17 92 38 38 148 -97 -108 -206 -130 265 11 48 7 -183
7075a83K29q9K36j74r2j99L33k40J59K46j56n9O0J13j78R7j52J31K0k39K72j12
$$ -183 46 -43 193 19 -73 -272 61 -179 -20 226 70 11 71 184 6 103 -49 82 102 -137 135 23
7097B3l07K17n9R8j82L58j94J40j42K77k96j04K81J02m34K05q8OJ99j84K44j89
$$ 23 -284 -67 -126 -28 -210 148 -46 94 -48 229 -67 -171 110 212 -222 -17 -105 -99 100 -84 160 -29
7119b9K93k85N8m7K67l12m9M5J25j9k28J05K9j47N1L21j07N9k29r7M37l05q1L03
$$ -29 264 -21 37 -10 257 -55 -104 -59 66 47 -181 -76 -47 -194 -143 178 71 130 -99 -196 241 -64 -145 158
7143A58kp8J6j56m7J25J05m40K04Q0j05J41K6q1l2J36j79L6K47Ql11L08j20k21
$$ 158 156 78 94 -62 -109 16 121 -319 -115 -35 -140 1 27 -54 -86 50 -129 -93 154 162 -149 159 39 -182
7167a82J10O2R2J0J5j08j6L2L6R5j43j69J03mJ56p3j92K49j39q9q2L99n3Ml43
$$ -182 -72 -10 82 92 107 -1 -17 15 51 146 3 -166 -63 -67 89 16 -176 73 -66 -155 -237 162 109 113 -230
7192b30K60j22L57l80J20l9K9r7K12j4j45K20l06M24l33J3J04M3l03L18k43J9
$$ -230 30 -92 265 -115 5 -34 -5 -102 110 96 -49 171 -135 289 -44 -31 73 116 -187 131 -112 -93
7214i3O6J38k01J62j54K0MN7J9k5J45j17j80M05k43j47J11j3K06o3k13K8k5J27
$$ -93 -27 111 -90 72 -82 -62 -58 -1 18 -7 138 21 -159 246 3 -144 -33 -46 160 97 -116 -88 -113 14
7238A4Q9n8j67J96j10O5J00j04J59m72J60l8N07l02p2J77L0j70J33l22J70r8J25
$$ 14 103 45 -122 74 -36 29 129 25 184 -288 -128 -166 341 39 -33 144 174 4 137 -185 -15 -113 12
7261A2J96l2n71M94j38J38K0j31j1kJ03j76j28K05K54k85Q1J45l95J12K58J19
$$ 12 208 176 -395 99 -39 99 119 -12 -23 -25 78 -98 -226 -21 233 -52 29 174 -221 -109 149 268
7283B68k28m5J50j10n2lQ2o5M5q5O7k0N9O2M3l23J83R2M8j27N2J02k56L41j23
$$ 268 40 -5 145 35 -17 -20 62 -3 42 -43 24 4 63 125 168 -155 28 120 168 41 93 195 -61 280 157
7308A57l54J75N2J2j25Jq5K45k4j45O8QP4j41J71N2n2J52m8j64k65L75l50L27
$$ 157 -197 -22 30 42 -83 -82 -167 78 54 -91 -23 -15 59 -82 89 141 89 241 193 29 -236 139 -211 116
7332A16m9k32P3J12N9j13j84L32o5k41K43N2K0p6P2k41q7M74l09K69j26l94L71
$$ 116 67 -165 -92 20 79 -34 -218 114 49 -192 51 103 123 47 119 -122 -209 265 -44 225 99 -295 76
7355G6k4R6j62K22k05j65J65nJ77l3j03o7J11j20R1k11K74k09J29L8k08J80Q3
$$ 76 52 148 -14 208 3 -162 3 -2 175 142 39 -28 83 -37 54 -157 117 -92 37 75 -133 47 130
7378A30k19J95Lk43K60l78J53J69r5J19l29J82j4J78k11K3L2n9j4L7o0K09m7j92
$$ 130 -89 106 109 -134 126 -252 -99 70 -25 94 -235 -53 -67 111 -100 -77 -45 -104 -118 -81 -141 68 21 -171
7402a71j6J80N4L9k99J71p8j77J11K35j77K22j75m2k4L39k32P0j29J40n5k14K65
$$ -171 -187 -7 47 86 -213 -42 -120 -297 -186 49 -128 94 -81 -123 -147 192 -40 30 -99 41 -14 -228 37
7425C7r3J35l29K94l7J48r7k86K58j19l2j37j35O39m0p1j71lM5j39J76n6q6K81
$$ 37 -56 79 -250 44 7 155 58 -228 30 -89 -121 -258 -393 246 206 135 -36 -39 6 -133 43 -13 -99 182
7449A82p8k34M00%r6l38L9K75k9j97L20KJ03m6j11l65M8K19j13J39r8j32p7J52
$$ 182 104 -130 270 270 174 -164 -125 150 121 -76 244 246 349 303 192 -173 -125 94 -19 120 22 -110 -187 -35
7473c5J47k88M19l37j12J28K70k00m9J43k9J31p8j18P2K2J01l7k19K29k16K26
$$ -35 112 -176 243 -94 -206 -78 192 -8 -57 86 57 188 110 -8 64 86 187 150 -69 160 -56 170
7495A70k23R4J06j66l7M8j64K54n6k58L84m7L5j06j98L11l8N1k6j83j4O5R8j42
$$ 170 -53 41 147 -19 -56 -8 -172 82 26 -232 152 105 140 34 -164 147 109 160 134 -49 -63 2 100 -42
7519d2J42j83L90k98O0j81m5J42j2J39k54qO0o9J63R6l56K37k4K92m63L4P8l9
$$ -42 100 -83 307 9 69 -112 -157 -15 -27 112 -142 -150 -90 -159 4 100 -256 -19 -43 249 -214 -180 -102 -141
7543a41N2L34k02j32J80J7j00m0J34j75j2J39j48m7k1O3K14k59J5l2K14j85j42
$$ -141 -89 245 43 -89 91 108 8 -32 102 -73 -85 54 -94 -141 -162 -99 115 -144 -129 -161 53 -132 -274
7566b74K52k5r6M6j54K98j19m7K14j67L7J56k12J33N3k22K95l62J97j05K73j56
$$ -274 -22 -47 -143 -97 -251 47 -72 -119 95 -72 -35 121 -91 42 95 -127 168 -194 3 -102 171 15
7588A5r2J96k41J43r2J95k05Q2J65j99LJ47j57J08p2k04P7J1J72j33K65k09Q8
$$ 15 -77 119 -122 21 -71 124 -81 1 166 -33 -30 117 -40 68 -4 -208 -131 -120 52 -81 184 -25 63
7611F3N6l58J32R6J34p6k30M32k46P0K14k93r1J66k69J25L0J3K33m13L81o8Q6
$$ 63 119 -239 -107 -11 123 47 -183 249 3 73 287 -6 -97 69 -200 -75 -45 -32 201 -212 169 101 187
7634A87k28J53k9k86K30j85L21k27j21O0J98j23O3K58k87J56k50j42L67rj51K69
$$ 187 -41 112 83 -203 27 -158 163 -64 -185 -125 73 -50 13 271 -16 140 -110 -252 115 106 -45 224
7656B24r0mK0j57o6Q9n4k50J24J7O7O4J01J32m52J27q7L23M8k39J23q2m4J74j12
$$ 224 134 130 150 -7 -73 16 -38 -288 -164 -147 -80 -16 85 217 -235 -108 -195 128 176 -63 60 -22 -66 108 -4
7681dL4k52K58K54ql61K38k15J72l4k71K03q7j21M1K36j59N6J37j92J58p1P2l18
$$ -4 30 -222 36 290 282 -79 159 -56 116 82 -189 14 -73 -194 -153 83 -76 -20 117 -75 83 12 84 -234
7705b34J47J31M9o0k77K31P1O2j43J18o5J41k65J25M9M7q1k37Q5J31p8N8j36J26
$$ -234 -87 44 93 33 -244 -13 58 120 -23 95 30 171 -94 31 80 127 46 -191 -106 25 -53 5 -131 -5
7729el9J63j63q2J4J10j98K70N2j16j9n3J62k15K51J1k53l5M4QqmL40k14K0J86
$$ -5 -44 119 -44 -126 -112 -2 -200 70 122 6 -13 -66 96 -119 132 143 -110 -145 -101 -93 -101 -105 235 21 41 227
7755B27N2o9m31J61P3r0l2M6K09k08P6K3j67M6M42k35L7k93P2J04L53l21pO6l6
$$ 227 279 210 -221 -60 13 -77 -109 -63 146 -62 14 37 -130 -84 358 123 160 -133 -61 43 396 75 68 134 98
7780I8l2M3n7j36J44P2l08K00J62m03m4K05K0j76J53j7p9K68o5k07J61K9j22N16
$$ 98 66 109 52 -84 60 132 -176 24 186 -217 -261 -56 -36 -212 -59 -76 -155 113 48 -159 2 31 -91 425
7804D25n84K18K7k6J19n9k94K38R1k19K31k66Q7j38O5n5k6L21j29p7J37l27L59
$$ 425 -159 59 86 60 179 120 -174 64 155 -64 167 -99 -12 -150 -85 -140 -166 155 26 -51 86 -241 118
7827A18j16P7j32J21j84K19R9j45q0q3kJ49j54K7k1J50j92L13k9q1j76M0M5L8
$$ 118 2 79 -53 68 -116 103 202 57 -23 -106 -108 41 -113 -86 -107 43 -149 164 135 54 -122 -82 -37 1
7851An1j65J33r5L6J97k79r2K76K4K38j59L9l47L31k88K20r4K9lP6J27q1K32q0
$$ 1 -50 -215 -82 -177 -141 56 -223 -315 -39 -15 223 64 103 -244 87 -201 19 -75 -46 -49 27 154 73 305 225
7876B25k5j33J11p1j4j9J39k65j41Q4K7K13j75J25o8M2J37k53%L30j50j97J03
$$ 225 200 67 178 107 93 74 213 -52 -193 -109 -82 131 -44 81 13 55 192 -61 -61 269 119 -78 25
7899B5l95N36N3j71j38K44Jq9J11k34oJ48j09m8K58o1l43L20j58J49l20L19r0
$$ 25 -370 166 219 48 -90 154 155 66 177 -57 -63 85 -24 -72 186 125 -218 102 -56 93 -227 92 2
7922BlJ07j55l4L15l63J02qK36l64L36p8j39j06J23j10J20J79j1K2k63J99k43
$$ 2 -1 106 -49 -83 232 -131 -29 -37 199 -165 171 93 -46 -152 -29 -139 -19 160 149 171 -92 107 -136
7945a36M91m06L17k59q3R8N3O6k25N2J21l4J8l45m1L01j42k4J77N9q4J16j23J1
$$ -136 355 -51 266 7 -76 22 75 141 -84 -32 89 55 73 -272 -313 -12 -154 -178 -1 58 -26 90 -33 -22
7969b2J23J38m7l22J28J80k01Q8K41k73J45l21Pl3P8J1P2R0l8O4j89l1K51j36
$$ -22 101 239 192 -130 -2 178 -23 65 306 33 178 -143 -136 -169 -91 -80 -8 82 44 108 -81 -112 139 3
7993Cp8J0O2L9J48l5o2Q1k68J15J11j93m6J75r5l3o6J42j04m7J36r8P2J88l95
$$ 3 -75 -65 -3 36 184 149 87 168 -100 15 126 -67 -113 62 -33 -66 -132 10 -94 -141 -5 -103 -31 157 -238
8018b38J18N1K5J89j35J3l07L77l15O2J61J35n6r6k20L37j03j33K90j02j86K24
$$ -238 -120 -69 -44 145 10 23 -284 93 -222 -160 1 136 80 -16 -236 101 -2 -135 155 53 -133 91
8040I1k4P1p0n2o8J46j58O6l6R5J73l80R0q3Q3J67k93M31j35J0q8q4K86q0j21
$$ 91 67 138 68 16 -52 94 -64 2 -34 61 234 -146 -56 -139 -56 111 -182 249 114 124 36 -48 238 158 37
8065C7j9QL0J17m34K39O9j66K75j72J9j87q1K77r1j33K09j19K47j48R1mk09l4
$$ 37 18 26 56 173 -261 -22 47 -119 156 -16 3 -184 -265 12 -79 -212 -3 -122 125 -23 68 64 -145 -179
8089a79%K72k53K1L62p5K6j05k6p1J34j46N7kK0J07q7q3m0pK9n4J81kM5j22n1
$$ -179 -179 93 -160 -139 223 148 174 69 43 -28 106 -40 17 15 35 142 55 -28 -68 -75 -46 -100 81 79 124 2 -49
8116d9j69L84k37j50R5L10l77L47O9n1k85K41n1k7l5K1k2n4mn1j8J46Q3k30J33
$$ -49 -218 166 -71 -221 -126 184 -193 154 223 172 -113 128 77 50 15 36 14 -40 -44 -95 -113 33 116 -114 19
8141A9lP5J87k89k2m6J76j91R4o9J02m1j51O0J61K2j32o3j5K60j8l8j80r8K01
$$ 19 16 91 278 -11 -33 -79 97 -94 0 -69 33 -8 -159 -99 62 84 -48 -111 -126 134 116 78 -102 -200 1
8166AR4j2J11j80k28P6M31k97k72K22K16k80P3J78l57K84j99K99k92K43k1l05
$$ 1 95 83 194 14 -214 -138 293 -4 -276 -54 162 -118 -45 133 -224 60 -139 160 -132 111 90 -215
8188b15J09l9L54
$$ -215 -106 -145 209
8191B09
$$ Imaginary data points
##PAGE= N=2
##DATA TABLE= (X++(I..I)), XYDATA
0@%%%%%%%%%%%%%qJ6j6J6j6K4l2L2m0M8n6O6p4Q8j04J20j36J52j74J98k24K54
$$ 0 0 0 0 0 0 0 0 0 0 0 0 0 0 -8 8 -8 8 -8 16 -16 16 -24 24 -32 34 -40 48 -56 64 -72 80 -94 104 -120 134
35A34k85L21l58L99m46M95n50O10o74P44q21R07j000J102j214J339j476J625j793
$$ 134 -151 170 -188 211 -235 260 -290 320 -354 390 -431 476 -524 578 -636 703 -773 852 -941
54i41J983k198K442k724L053l441L912m496N237o213P561r547J2753j8741L3474
$$ -941 1042 -1156 1286 -1438 1615 -1826 2086 -2410 2827 -3386 4175 -5372 7381 -11360 22114
69B2114j30748j66420L74373l0217k75929J57506J95462j88656m7723J66585j3753
$$ 22114 -108634 -275054 99319 69102 -206827 -49321 146141 -42515 -90238 76347 62594
80F2594j09141L2878M6689j1727l4365q394L8090m620p0383K8148N6776m9821
$$ 62594 -46547 -13669 33020 21293 -13072 -21466 16624 12004 -58379 -30231 26545 -23276
92b3276O210Q2594n4887n2269R9282N368j01637M5615N4747q6757p870Q5601l0167
$$ -23276 -17066 65528 10641 -41628 57654 63022 -38615 7000 61747 -25010 -32880 52721 22554
105B2554n4659L3410M388k9735Q936m51k409K1965p225k450L8067r946l4891K6260
$$ 22554 -32105 1305 5693 -24042 -15106 -15557 -17966 3999 -3226 -5676 32391 22445 -12446 13814
119A3814l467n7927J9499M5722m1544k1769M4808n929k5682L8836K4914k6934
$$ 13814 10347 -47580 -28081 17641 -23903 -45672 -864 -6793 -32475 6361 31275 4341
131D341k425K4452M674j3019j7559j292J3194j8497k3478L3345K4502l8807n304
$$ 4341 1916 26368 31042 18023 464 -828 12366 -6131 -29609 3736 28238 -10569 -15873
144a5873M5926q794l1972K7589J4405m2160j2959K4008l091j2328P696K634j713
$$ -15873 30053 21259 -10713 16876 31281 -10879 -23838 170 -2921 -15249 -7553 -4919 -6632
157f632J568o125L644J1196j8251j4006L0449R784k4209J2509K0628k6916p608
$$ -6632 -5064 -11189 -7545 3651 -14600 -28606 1843 11627 -12582 -73 20555 -6361 -13969
170a3969L4058l311k3669J5788R929k1423j280J3361l803n695k597K527J5492
$$ -13969 20089 16778 -6891 8897 18826 -2597 -3877 9484 5681 -14 -2611 -84 15408
183A5408l047j5315J5485K152l8881N260L6403l0484k6896M5142O510l9108K6502
$$ 15408 12361 -2954 12531 14683 -24198 -18938 17465 -13019 -39915 5227 11737 -27371 -869
196h69L2547l9046j4507L2841r220k3001J7068J1276j1499k475P668J0026l52
$$ -869 31678 -7368 -21875 10966 1746 -21255 -4187 7089 -4410 -6885 783 10809 10457
209A0457j2300J1976J6783k4833p656L6281j6583m4902K8043J9516m4229O717
$$ 10457 -1843 10133 26916 2083 -5573 30708 14125 -30777 -2734 16782 -27447 -20730
221b0730M5597k3647k5011L7345O126l2386O243J4825j3992j0073N769J0390K460
$$ -20730 24867 1220 -23791 13554 19680 -12706 -6463 8362 -5630 -15703 -9934 456 2916
234B916j7485K646K6822j6302k4360L7891J3190m6636J2098M5462l0109k4585
$$ 2916 -14569 -11923 14899 -1403 -25763 12128 25318 -21318 -9220 36242 6133 -18452
246a8452M1115J531l8819J2088K2162j8254j0697P392J456k063n866r8J4590l821
$$ -18452 22663 24194 -14625 -2537 19625 1371 -9326 -1934 -478 -2541 -8407 -8505 6085 2264
260B264j2259J8123Q049k1524O017J3778k5462o841K2764j3796j7009K4937M804
$$ 2264 -9995 8128 16177 -5347 670 14448 -11014 -17855 4909 -8887 -25896 -959 3845
273C845k0100J3650J8320j1780m434Q523P35j069q393m954J4584m671k3191J5161
$$ 3845 -16255 -2605 15715 3935 -499 8024 8759 7690 -703 -5657 8927 4256 -18935 -3774
287c774J9879k4168n977K9336n908j8883J6879N879j4945N750K725j0067Q403
$$ -3774 16105 -8063 -14040 15296 9388 -9495 7384 13263 -1682 4068 6793 -3274 5129
300E129J497j6089Q143R372j9352m72J6988j0738q075J4803j985p289J2037j089
$$ 5129 6626 -9463 -1320 8052 -11300 -11772 5216 -5522 -13597 1206 -779 -8068 3969 2880
314B880r388J0856P82j3587O928M961j2429L150O819q872N108R559r825M557J6445
$$ 2880 -6508 4348 5130 -8457 -1529 3432 -8997 -5847 972 -7900 -2792 6767 -3058 1499 17944
329A7944j2950q310K2367m789k3545J3830J2922k2839l393J9541o935j3021J0566
$$ 17944 4994 -3316 19051 14262 -9283 4547 17469 -5370 -8763 10778 3843 -9178 1388
342A388L215r303P50L287k134q92k430L07M824m391m968J0105O56j2388P846J1623
$$ 1388 4603 -4700 -3950 -663 -2797 -3689 -6119 -5812 -988 -5379 -10347 -242 414 -11974 -4128 7495
358G495j4976l589K0202n653j7869J6984J3880j9421j302K1396m167j4530P810
$$ 7495 -7481 -11070 9132 3479 -14390 2594 16474 -2947 -4249 17147 12980 -1550 6260
371F260P649p934o043Q92N069p65j1768J880J3844j1293j4209J9956N727k6653
$$ 6260 13909 5975 -68 824 5893 5128 -6640 -4760 9084 -2209 -16418 3538 9265 -17388
385a7388P231K4105j9794j2279K5769l671k1965J5849R491j8403L823J3892r800
$$ -17388 -10157 13948 -5846 -18125 7644 3973 -17992 -2143 7348 -11055 -7232 6660 -3140
398c140l046Q660j657J649K241o653R629P353j7648M815J9361k2555j1825K8739
$$ -3140 -6186 2474 817 2466 4707 -1946 7683 15036 -2612 2203 21564 -991 -12816 15923
412A5923r570k8644K4723J2384l2588Q008K5956k0786q188K3357p410j1876J3339
$$ 15923 6353 -22291 2432 14816 -17772 -9764 16192 -4594 -12782 10575 3165 -8711 4628
425D628k148q452Q577o115o125J3423p761j1040K0788j95k0795J9231J3595k5643
$$ 4628 2480 -5972 2605 -3510 -9635 3788 -3973 -15013 5775 5580 -15215 4016 17611 -8032
439h032N452K2643k0757q355K3337j0189j5789J8061k099j6292J1788K538j2704
$$ -8032 -2580 20063 -694 -9049 14288 4099 -11690 6371 4272 -12020 -232 2306 -10398
452a0398J0745M526j2496J1825P046j7752P464J3178k0023j337K0306j5547j1747
$$ -10398 347 4873 -7623 4202 11248 -6504 960 14138 -5885 -7222 13084 -2463 -14210
465a4210K1064m428j7037J6002M255j5240J0990P110j4676P791J0215j6373J494
$$ -14210 6854 2426 -14611 1391 5646 -9594 1396 8506 -6170 1621 11836 -4537 -3043
478c043J4936j5255p028J6683p129j2579J4704K236j2233R559N308j0617N766
$$ -3043 11893 -3362 -10390 6293 -836 -13415 1289 3525 -8708 851 6159 -4458 1308
491A308P462r904J737R807q500l732P411o618n059Q271l694n535J0234j210r870
$$ 1308 8770 -1134 603 10410 1910 -1822 5589 -1029 -6088 2183 -1511 -7046 3188 1978 -7892
506g892R038N244j3388L243J3479j0207q858J3617L2j2713L311P957n481j223
$$ -7892 1146 6390 -6998 -3755 9724 -483 -9341 4276 4308 -8405 -5094 2863 -2618 -3841
520c841M943q73j61Q23j706L516K512m892K487O069p462m372J0417k858j1480
$$ -3841 1102 229 68 891 -815 2701 5213 321 2808 8877 1415 -2957 7460 4602 -6878
535f878Q385N125j3737J476J1955j0246o655J4410n36j1819P478O899r472j332
$$ -6878 1507 6632 -7105 -5629 6326 -3920 -10575 3835 3299 -8520 -1042 5857 -3615 -4947
549d947N573j530j07ql569M444K023p693N286Q607r288p92J2553p632q218J3313
$$ -4947 626 -904 -1011 -1019 -4588 -144 1879 -5814 -528 8079 -1209 -2001 10552 2920 -5298 8015
565H015j097j2654R670O036j3215L084P505j1967j917J0821n757n121P928l057
$$ 8015 6918 -5736 3934 9970 -3245 -161 7344 -4623 -6540 4281 -1476 -6597 1331 -1726
579a726m310N504l205k345J0662l240p977J0943Q94j3625O816O932j2854L249
$$ -1726 -6036 -532 -3737 -6082 4580 1340 -6637 4306 5200 -8425 -1609 5323 -7531 -4282
593d282J2447r534l621J2487m910o071J0222n98o902O511p86q430M500J798o624
$$ -4282 8165 -1369 -4990 7497 2587 -3484 6738 6140 -762 5749 4963 -3467 1033 2831 -3793
608c793L260J576o158N247K872r571L488Q072r391o35J0692n636n231R125k338
$$ -3793 -533 1043 -5115 132 3004 -6567 -3079 4993 -4398 -5033 5659 23 -5208 3917 1579
623A579p270Q874Q94r095M543L027p906L613N518o240J369O341m608m17M307m150
$$ 1579 -5691 3183 4077 -5018 -475 2552 -5354 -1741 3777 -2463 -1094 5247 639 222 4529 379
639C79R15L743p417o02P975p838p008J1564J51r725R427O823j1725J205R860p085
$$ 379 1294 5037 -2380 -2982 4993 -2845 -9853 1711 1862 -7863 1564 8387 -3338 -2133 7727 642
655F42m981Q207l81o275K370J529j905r5r39R40K039k380J29M321m315l428O971
$$ 642 -4339 3868 3487 -2788 -418 1111 -794 -889 -1828 -888 1151 -1229 -1100 3221 -1094 -4522 2449
672B449j280o278O439L302q457K246N893o720r63O164m846k677O781j191l587
$$ 2449 1169 -5109 1330 4632 -3825 -1579 4314 -2406 -3369 2795 -2051 -4728 2053 862 -2725
687b725O288K15m688N424J195p239L616K785q728P93O682n963k925O756j487m862
$$ -2725 3563 3778 -910 4514 5709 -1530 2086 4871 -3857 -3064 3618 -2345 -5270 1486 -1 -4863
703d863N054J669l949J538J752k900L03P50j936J455R41j824K261K242l261O19
$$ -4863 191 1860 -2089 -551 1201 -1699 -1396 -646 -2582 -1127 -186 -2010 251 2493 -768 -149
719a49L391l171j537N286j466m495M971J793n776J767N211n011l030N211k597
$$ -149 3242 71 -1466 3820 2354 -2141 2830 4623 -1153 614 5825 814 -2216 2995 398
734C98n143L730J244n290K111L780l817Q90M261k949j183M487k658k745M386j373
$$ 398 -4745 -1015 229 -5061 -2950 830 -2987 -2097 2164 -785 -1968 2519 -139 -2884 1502 129
750A29m408M789J131m343M000K894n106K803L824o054R7N860n789k704P500l514
$$ 129 -4279 510 1641 -2702 1298 4192 -914 1889 5713 -341 -244 5616 -173 -2877 4623 1109
766A109n483P672n83q098N933L118r485L035N980p982l59Q295n375k194Q321l333
$$ 1109 -4374 3298 2715 -5383 550 3668 -5817 -2782 3198 -4784 -5143 3152 -2223 -4417 3904 571
782E71m158Q013k567o696Q229m08r580P028M983j0879M183Q620r122m06J0098
$$ 571 -3587 4426 1859 -4837 3392 2984 -6596 432 5415 -5464 -1281 7339 -1783 -2189 7909
797G909o843n192R795m108p262P757j66q049O678K188p836N079M381q690L163
$$ 7909 1066 -4126 5669 1561 -5701 2056 1890 -6159 519 2707 -5129 -50 4331 -4359 -1196
812a196N961q278O76Q386q013k183J0793n577o227J1041j024j0770Q362L760j1576
$$ -1196 4765 -3513 -2837 5549 -2464 -4647 6146 569 -5658 5383 4359 -6411 1951 5711 -5865
827e865L284P721q830r14Q867m346l348P266k548l570M951k140m042M876j861
$$ -5865 -2581 5140 -3690 -4604 4263 -83 -3431 3835 1287 -2283 2668 528 -3514 1362 -499
842d99m383O437m0o145O057L507p888L438O861q138j471Q635n769n448Q416j306
$$ -499 -4882 1555 1515 -4630 1427 4934 -2954 484 7345 -793 -2264 6371 602 -4846 3570 2264
858B264p805O168L475p206J554M311m773q73L815l065k57K752j800k89L282k087
$$ 2264 -5541 627 4102 -3104 -1550 2761 -2012 -2885 930 -2135 -2392 360 -1440 -1729 1553 -534
874e34j884M470j609l769M475J298n713K234M353m405m06O063k388l028N111j56
$$ -534 -2418 2052 443 -3326 1149 2447 -3266 -1032 3321 -1084 -1490 4573 2185 -843 4268 4112
890D112m929J307K273m435r08L327k196r11K779r09j680K642m72j792K256j81
$$ 4112 -817 490 2763 -1672 -2580 747 -1449 -2360 419 -490 -2170 472 0 -1792 464 283
906B83k580K638O10m581K666L721m805j82O317k907l673N685L9o327L691K753
$$ 283 -2297 341 951 -3630 -964 2757 -2048 -2230 4087 1180 -2493 3192 3231 -3096 595 3348
922C348n040J048M300l206q80K787k671j065K228k899p20L655k278j635M801j729
$$ 3348 -1692 -644 3656 450 -430 2357 -314 -1379 849 -2050 -2770 885 -1393 -3028 1773 44
938D4l895N684P13o414M639M269p221L54O002m887l152O316j092m006M462J608
$$ 44 -3851 1833 2546 -3868 771 5040 -2181 -1827 4175 -712 -3864 2452 1360 -2646 1816 3424
954C424l352J077N55k166J032q33k102K878m84l407L397J662n690K521M444n678
$$ 3424 72 1149 1704 -462 570 -263 -2365 513 29 -3378 19 1681 -4009 -1488 2956 -2722
970b722p79O799l574l925O056O2n269L613K850m078J389K509k309KJ274k339J155
$$ -2722 -3501 3298 -276 -4201 1855 1917 -3352 261 3111 -967 422 2931 622 624 1898 -441 714
987G14J278k995R88L074l501r20L695k378k142L196r20k789K573k33k894K630
$$ 714 1992 -1003 -15 3059 -442 -1362 2333 -45 -2187 1009 89 -2700 -127 -360 -3254 -624
1003f24J202k792K065K129l479N71K288k363l52K588j720j74K933j742j111K796
$$ -624 578 -2214 -149 1980 -1499 -928 1360 -1003 -1355 1233 -487 -661 2272 530 -581 2215
1019B215j131k274K896j69k810J908J029l774J832J646l259Q40K657k468n19L391
$$ 2215 1084 -1190 1706 1537 -1273 635 1664 -2110 -278 1368 -1891 -1051 1606 -862 -1381 2010
1035B010j412j907J983n80j387J052o52j62K454n20j675K392O7l230J648P25k573
$$ 2010 598 -1309 674 94 -1293 -241 -893 -1055 1399 879 -796 1596 1663 -1567 81 806 -1767
1052a767J858K279l162o0K768k944j959L683l21l084K398K849l450j400K608N41
$$ -1767 91 2370 -792 -852 1916 -1028 -2987 696 375 -2709 -311 2538 -912 -2312 296 837
1068H37k311J70K278J377k139p34K817q97k823J245K704k671j007L068l42k101
$$ 837 -1474 -1304 974 2351 212 -522 2295 1398 -1425 -180 2524 -147 -1154 1914 1572 -529
1084e29J426J118k360QJ141j774o86J399l38r46J086M57j540k44J637l92q44R87
$$ -529 897 2015 -345 -337 804 -970 -1656 -257 -595 -1541 -455 2 -1538 -1782 -145 -537 -1381 -394
1102c94Q46K31n92p03L30P83o93k91J817M69j718J291J367k925j104L908j791
$$ -394 452 683 91 -612 -282 501 -192 -483 1334 1803 85 1376 2743 -182 -1286 2622 831
1119H31k512K694O67l043J115J371k197j31J400j394J81J050j368P92J467j786
$$ 831 -1681 1013 1680 -1363 -248 1123 -1074 -1205 195 -1199 -1018 32 -1336 -544 923 -863
1135h63l46L128k530j948M092p07l775M430J510m839J860K996m899L32M873l067
$$ -863 -1209 1919 -611 -2559 1533 826 -2949 1481 2991 -1848 12 3008 -1891 -1559 3314 247
1151B47j912M432j545l310K894r62k716L115J96k816L097N35l485K837J805n380
$$ 247 -1665 2767 1222 -2088 806 -156 -2872 243 439 -2377 720 1255 -2230 607 2412 -2968
1167b968K164M787n032j100N597k936l319N797q81m972M040J677m786K334K822
$$ -2968 -804 3983 -1049 -2149 3448 512 -2807 2990 2109 -2863 1177 2854 -1932 402 3224
1182C224m203Q35K493l884J84K716l628m58M539l146j935N049j563m501M424P06
$$ 3224 -979 -144 2349 -1535 -1351 1365 -2263 -2721 1818 -1328 -3263 1786 223 -4278 146 852
1198H52m288L181K973m352J483L301m222R7M049l517j252N003j755l161L932M6
$$ 852 -3436 -255 2718 -1634 -151 3150 -1072 -975 3074 -443 -1695 3308 1553 -1608 2324 2370
1214B370l590K880J41l660K790J535m474J595K858m066j039L784j958k670L436
$$ 2370 -1220 1660 1801 -1859 931 2466 -2008 -413 2445 -1621 -2660 1124 -834 -3504 -68
1229f8M16k702J986O78j649P79Q86j732J194J199j832P20J697j345q85K023o54
$$ -68 348 -2354 -368 310 -1339 -560 326 -1406 -212 987 -845 -125 1572 227 -658 1365 711
1246G11j200J412p9j232J711p7j616O34J149j622o35J806r25p30O01K46p66O65
$$ 711 -489 923 844 -388 1323 1246 -370 264 1413 -209 -844 962 37 -693 -92 154 -612 53
1264E3k24p75J187K3j883J325J841k180j69K118p62k380J662J383k122K71J435
$$ 53 -171 -946 241 264 -1619 -294 1547 -633 -802 1316 554 -1826 -164 1219 -903 -632 803
1281H03j683M10J295j925m62K729j266j826K801L10k094J344J039j859L54Q72
$$ 803 -880 -470 825 -1100 -1562 1167 -99 -1925 876 1186 -908 436 1475 -384 -30 842
1297H42j534J139J138k477O53K664k592j099L467j111k135K355L05k280J192K3
$$ 842 -692 447 1585 -892 -239 2425 -167 -1266 2201 1090 -1045 1310 1615 -665 527 550
1313E50j648J068J81k517J519J771l482Q09K428k184o88L641j389k184L456j76
$$ 550 -1098 -30 151 -2366 -847 924 -2558 -1749 679 -1505 -2193 1448 59 -2125 1331 1155
1329A155k405J885J360l231J361J922k040o18K270j061n96J466o20m88J530j381
$$ 1155 -1250 635 1995 -1236 125 2047 7 -611 1659 598 2 1468 848 360 1890 509
1345E09q65J695j235j935J922j13k406J743O96k075N84J696j548L69J586j089
$$ 509 -356 1339 104 -1831 91 -22 -2428 -685 11 -2064 -1480 216 -1332 -963 623 -466
1361d66o16J923o41n08R08l18n82R40k05n74J181l40j104J243K72j507O21J274
$$ -466 -1082 841 200 -308 600 282 -300 640 435 -139 1042 702 -402 841 1113 -394 227 1501
1379A501j004k03O90j081m46L33n26j16N6m33M63O29q61o1J601p23n09J530l93
$$ 1501 497 294 984 -97 -543 -210 -736 -852 -796 -1229 -766 -137 -998 -1059 542 -181 -690 840 447
1398D47r11J246J16j260O74M00q67M86Q70j547O27J010j283j82Q18p58o5N74l75
$$ 447 -464 782 898 -362 312 712 -155 331 1201 -346 281 1291 8 -174 644 -114 -179 395 20
1417B0k41K91p04m81J280j041r71J401L80j464R12J010j262J37J765q73k99R90
$$ 20 -221 70 -634 -1115 165 -876 -1847 -446 -66 -1530 -618 392 -870 -733 1032 159 -140 850
1435H50k05j2N84p97r58J354O3j384M89R12p22j1m4l61P57j13o56M79M93p95m94
$$ 850 645 633 1217 420 -538 816 879 -505 -16 896 174 163 119 -242 515 402 -254 225 718 -77 -571
1456e71Q42m50j323Q77Q47p51m67O96L26o5n26L79K61m2K67K68j29K84n86n33
$$ -571 271 -179 -1502 -625 222 -529 -996 -300 26 -39 -565 -186 75 33 300 568 439 723 137 -396
1476c96L55k8n53J10N74j91J01Or2R12k23o31M13J094r40o56J038n12j360Q67
$$ -396 -41 -69 -622 -512 62 -129 -28 -22 -114 798 575 -56 357 1451 511 -145 893 381 -979 -112
1496a12J88o87L01N69l29L40j6q66L09J370j614l42J374o40q68Q34p63r25J548
$$ -112 76 -611 -310 259 -70 270 254 -612 -303 1067 -547 -889 485 -155 -1023 -189 -952 -1877 -329
1515c29k02r62J813O43k223J244K138k343J3K619j332p84J186n25r96J225q72
$$ -329 -531 -1493 320 963 -1260 -16 2122 -221 -208 2411 1079 295 1481 956 -40 1185 313
1532C13r19J542j05k027J888Q26k302R93J479k481j41J411j723o15K120j353j394
$$ 313 -606 936 831 -1196 692 1518 -784 209 1688 -793 -934 477 -1246 -1861 259 -1094 -2488
1549b488K341k68k228K044J382k209R77J941j541M51J119j471L16J226j395k06
$$ -2488 -147 -415 -2643 -599 783 -1426 -449 1492 -49 402 1521 50 366 1592 197 -9
1565iK261j486j794K577j81k565J946P76k208Q79Q22j859M55J265j709m86J593
$$ -9 2252 766 -1028 1549 1368 -1197 749 1525 -683 196 1018 -841 -386 879 -830 -1316 277
1582B77j425l98J085q15p75J900l07j099J752kj313J651R63k093Q05J984j854
$$ 277 -1148 -1546 -461 -1276 -2051 -151 -458 -1557 195 193 -1120 531 1494 -599 206 2190 336
1599C36n60J394l16j181R26L33j073N79K59q50L60J66o84K47M59p07l44O97m33
$$ 336 -224 1170 854 -327 599 932 -141 438 697 -153 207 373 -311 -64 395 -312 -656 41 -392
1618c92n35O74J67j005K92N80p47K07R34k49M2R5K27j18LM78n46J46M78p49O1
$$ -392 -927 -253 -86 -1091 -799 -219 -966 -759 175 -74 -32 63 290 172 175 653 107 253 731 -18 43
1639D3j44l16q6O56l48j40Q88J67r86Q64L44j391L80Q40r99n52J186k50j134M71
$$ 43 -101 -417 -503 153 -195 -335 553 720 -266 598 942 -449 -69 771 -228 -780 406 156 -978 -507
1659e07J51m57O65O6m27R00o3p10J081M06j635L01J220j787j50J704r72j058J521
$$ -507 -356 -813 -148 -82 -509 391 328 -382 699 1105 -530 -229 991 -796 -946 758 -214 -1272 249
1678B49J26j120J010N35q73N20J099j148N72P5q40q2J26j034J74J090j453L29
$$ 249 375 -745 265 800 -73 447 1546 398 970 1045 205 123 249 -785 -611 479 -974 -645
1696f45J869j142j379J794L89j893Q57J110j258k10P49o65n67J94j62J86O30m13
$$ -645 1224 82 -1297 497 886 -1007 -150 960 -298 -508 241 -424 -991 -797 -959 -773 -143 -556
1714e56K66J191o82k42J558p18o53J253l41j517J206P10j961J24J361j263o93
$$ -556 -290 901 219 -23 1535 817 164 1417 1076 -441 765 1475 -486 -362 999 -264 -957
1731i57J127N70j094L8M57J72j83r00J61L60q25l31J293o30m14M56O15n27j6O98
$$ -957 170 740 -354 -316 141 313 130 -770 -609 -249 -1074 -1405 -112 -742 -1156 -700 -85 -612 -628 70
1751G0J43k8P14k42L15j1r3j08k28k73L81j50n11M67M38j343R9R25n59p48O80
$$ 70 213 185 899 657 972 961 868 760 532 259 640 490 -21 446 884 -459 -360 565 6 -742 -62
1772f2J24m66k53M01k83n6m99K72P34o49l30J148j7j053Q40R34q86%J316m83j05
$$ -62 62 -404 -657 -256 -539 -595 -1094 -822 -88 -737 -1067 81 64 -989 -149 785 -101 -101 1215 732 627
1793F27M55j56m86O80l11r67O45J93q65K80J12p17M71J49p13K16O57n44J4O27
$$ 627 1082 926 440 1120 809 -158 487 680 -185 95 207 -510 -39 110 -603 -387 270 -274 -260 367
1813C67j82j171P91j2q30K70M54l94M05K33j72N25r4q2M92K51m83J14L76n55k03
$$ 367 185 -986 -195 -207 -1037 -767 -313 -707 -302 -69 -241 284 190 108 600 851 368 482 858 303 100
1834A00K03o2p25N08K71n88J61N45k59n2K08J25j95kJ8j56j60k42L9j63K56m80
$$ 100 303 241 -484 24 295 -293 -132 413 154 102 310 435 240 238 256 100 -60 -302 -263 -426 -170 -650
1856f50kK68k5K4L66M83m21L0O05m97l23M66j70q50N02k4n33K31O81j60j49N43
$$ -650 -652 -384 -409 -385 -19 464 43 73 678 181 -142 324 154 -696 -194 -218 -751 -520 161 1 -148 395
1878C95R5J29P9l65M80K69q54l91O59n63o86P68nj185P57P86j038M40O72k87n98
$$ 395 490 619 698 333 813 1082 228 -163 496 -67 -753 15 10 -1175 -418 368 -670 -230 442 155 -443
1899d43Q83l68n71L92l24m05P58k40m12P65o2n22J097j93n45R24P96j099j00J112
$$ -443 440 72 -499 -107 -431 -836 -78 -318 -730 35 -27 -549 548 355 -190 734 1530 431 331 1443
1919A443o96q58P28k58o86N40k80p57N11J89m75N77J68j081Q17M06j078L13O15
$$ 1443 747 -111 617 359 -327 213 -67 -824 -313 -124 -599 -22 146 -935 -118 288 -790 -477 138
1938A38p41n65J087o71m88J157K12j036R52O74o50M00J72r9p1L28m4J21J34j120
$$ 138 -603 -1168 -81 -752 -1240 -83 129 -907 45 719 69 469 641 542 471 799 755 876 1010 -110
1958a10L00M19n82n57P92j29j107O87O74j009O5M17k34k37L40q9j54J86K83m83
$$ -110 190 609 27 -530 262 133 -974 -287 387 -622 -557 -140 -374 -611 -271 -360 -514 -328 -45 -528
1978e28K84k7m1J5J84j30O21k4k3K70N05m81k81K05p0m77K51K95p80Q5L07k98
$$ -528 -244 -271 -312 -297 -113 -243 378 354 331 601 1106 625 344 549 479 2 253 548 -232 -147 160 -138
2000a38l19L51j07R7l09L33m0K04n5m29R9O05q37j29P66n79j24O65Q5p50O07N67
$$ -138 -457 -106 -213 -116 -425 -92 -132 72 17 -412 -313 292 -545 -674 92 -487 -611 54 139 -611 -4 563
2022E63o01P6P16l30J9L93k11n46R0k14l12L59m45J7N36k88m09J124L6j060O48
$$ 563 -38 38 754 424 443 836 625 79 169 -45 -357 2 -443 -426 110 -178 -587 537 573 -487 161
2043A61R50j085j49P56n34q62P52J2p62M78K94j75M1J47r4M07j82m67M66L58q36
$$ 161 1111 26 -123 633 99 -763 -11 1 -761 -283 11 -164 -123 24 -70 337 155 -312 154 512 -324
2064c24J86O49r32l33Q03l06p45Q55N81q50N80L58m53L57J16j80j47j57o4K42
$$ -324 -138 511 -421 -754 49 -257 -1002 -147 434 -416 164 522 69 426 542 362 215 58 -6 236
2084B36j98k69L4L93q27j46J142m89m75R46J78j025M94K50m04m04O47k9q08M42
$$ 236 38 -231 -197 196 -631 -777 365 -124 -599 347 525 -500 -6 244 -160 -564 83 54 -754 -312
2104c12K93J91m16K24OK13o5K84J48p6k25O13k88m54M2j1m18l1q5L28k44j48M03
$$ -312 -19 172 -244 -20 -14 199 134 418 566 490 265 878 590 136 178 167 -251 -282 -367 -39 -283 -431 -28
2127b8l2l74M29O8k93k72N25j02k58L09N8n56K56L67k95K14J87j7JN14m03J78
$$ -28 -60 -434 -5 63 -230 -502 23 -79 -337 -28 30 -526 -270 97 -198 16 203 186 187 701 298 476
2149D76K14k31j04M42o90k62L69j50o72P22m08k93L18J42j57nK29k07o7M74k72
$$ 476 690 459 355 797 107 -155 214 64 -608 114 -294 -587 -269 -127 -284 -289 -60 -267 -334 140 -132
2170a32l46M19l63lO25m11m10N94K53l70K34P04o74J60O95k47k85K50n65r3K05
$$ -132 -478 -59 -422 -425 200 -211 -621 -27 226 -144 90 794 120 280 975 728 443 693 128 35 240
2191B40k37m32N10l49m78P48o0k77J61K75n21M02J76l68J16Q0j57J5J94l44N5
$$ 240 3 -429 81 -268 -746 2 -58 -335 -174 101 -420 -18 158 -210 -94 -14 -171 -156 38 -306 -251
2212b51K19J3j98J20K77l48M25K47l94J36M1k01j7J57j88k63j05K40M6j03K27
$$ -251 -32 -19 -217 -97 180 -168 257 504 110 246 287 86 69 226 38 -225 -330 -90 -44 -147 80
2233H0N1k40L98r4k32J07K20k44o1K67Ol53rp6l39L00J08r5J67J19o4J7R9k37
$$ 80 131 -109 289 195 -37 70 290 46 -15 252 258 -95 -104 -180 -519 -219 -111 -206 -39 80 16 33 132 -105
2257a05R4O3o2j92K44l85L6M98k29M1J23M5j52N1Q0N1M1M50k88l34M28l28k99
$$ -105 -11 52 -10 -202 42 -343 -307 191 -38 3 126 171 19 70 150 201 242 692 404 70 498 170 -129
2280a29M52m22n28P37n14j22L75j85j34K44L27l09p2N91m90k21M81K7m80L73o8
$$ -129 323 -99 -627 110 -404 -526 -151 -336 -470 -226 101 -208 -280 311 -179 -400 81 108 -372 1 -67
2301f7j56J85K40k15L31K35k18M10k67j51J52M25p20j98L51j56o41M14J42o84
$$ -67 -223 -38 202 -13 318 553 335 745 478 327 479 904 184 -14 337 181 -460 -46 96 -588
2321e88K78L76n52K72K14l84K12J18q0K4J95k01J89l2k76J24N5j20K0N02k52j58
$$ -588 -310 66 -486 -214 0 -384 -172 -54 -134 -110 85 -116 73 41 -235 -111 -56 -176 -156 346 94 -64
2343f4L99J06q8J30K86j74n76J41J24m47P5n3o7k26J21Q0J61R8N4j70J70M2j61
$$ -64 335 441 353 483 769 595 19 160 284 -163 -88 -141 -208 -434 -313 -233 -72 26 80 -90 80 122 -39
2366c9P6o8j27J10m2R4q7K62k14k31N66J32m07K27J45j86n2K59k21k23K37l24
$$ -39 37 -31 -158 -48 -90 4 -83 179 -35 -266 300 432 25 252 397 211 159 418 197 -26 211 -113
2388a13q4m8q0j01O07l95K23K6J19k57J85J40k00N2K62j89m11M80l20l65P41k62
$$ -113 -197 -245 -325 -426 181 -214 9 35 154 -103 82 222 22 74 336 147 -264 216 -104 -469 272 10
2410A0m35M70Qp3J96m7j43J75Q3m16J31N6l38R3J57j03k16L35k79n6M57M3j49
$$ 10 -425 45 53 -20 176 129 -14 161 244 -172 -41 15 -323 -230 -73 -176 -392 -57 -336 -392 65 108 -41
2433d1K09k6J92l40J96l28J04J78l15J57L75n54j52M81j35j69M8L08l38j05J01
$$ -41 168 142 334 -6 190 -138 -34 144 -171 -14 361 -193 -345 136 1 -168 -120 188 -150 -255 -154
2454a54J39k26O8K45l95M07l65J15J67N3j60L51J6m34L44p7l7k3J28j69O3K53
$$ -154 -15 -241 -173 72 -323 84 -281 -166 1 54 -106 245 261 -173 171 94 57 34 162 -7 56 309
2476C09k04l06K52J6l49n8K06l6L48o09L12K1l2J25J11j52p8J23K58j63l37L83
$$ 309 105 -201 51 67 -282 -340 -134 -170 178 -431 -119 -98 -130 -5 106 -46 -124 -1 257 94 -243 140
2498A40K26m96J73J13o8O4J43p6p8k7K56j51k98L20j65k58j50K12k63o1K2J16
$$ 140 366 -130 43 156 88 152 295 219 141 114 370 219 -79 241 76 -182 -332 -120 -383 -444 -422 -306
2520c06k3O9k33N22o0j7J53K14l70o7L70k23l56K46M42l79Q7O4j25L16L01l05
$$ -306 -329 -260 -493 29 -31 -48 105 319 -51 -118 252 29 -327 -81 361 -18 69 133 8 324 625 320
2542C20p2J22k51L01l05L8k36J0k70k25K92m2l86L96L72l52J64L60j97j75L53
$$ 320 248 370 119 420 115 153 -83 -73 -343 -568 -276 -318 -704 -308 64 -288 -124 236 39 -136 217
2563B17P5l57k26J38R1M8j84L69p0M8r2L66l63q5L48L7l04J03J00J4m57j5K70
$$ 217 292 -65 -291 -153 -62 -14 -198 171 101 149 57 423 60 -25 323 360 56 159 259 273 -184 -199 71
2586G1l13k2j59L43j00QL60l03J4j3J40R2l24J65L38m17R1J76Nk37JK09m1m02
$$ 71 -242 -264 -423 -80 -180 -172 188 -115 -101 -114 26 118 -206 -41 297 -120 -29 147 152 -85 -84 125 84 -318
2610c18N54Q3m59K33k0J9m13L21j82Q5k23K93L11m79j35M55o9N1J01l2K50m23
$$ -318 236 319 -140 93 73 92 -321 0 -182 -97 -320 -27 284 -195 -330 125 56 107 208 176 426 3
2632CJ65J27n20K74L66l24k48J05R9l42L16J8m06j39N82m7k5Q0j58L08k47k34
$$ 3 168 295 -225 49 415 91 -157 -52 47 -295 21 39 -367 -506 76 29 4 84 -74 234 -13 -247
2654b47Q7L11j76j02M85j43o01M83J14l46p7N95l39j92K92P1k58L91o0j73J32
$$ -247 -160 151 -25 -127 358 215 -386 97 211 -135 -212 383 44 -148 144 215 -43 348 288 115 247
2675B47m94J70j31p9J35j21J59j41J39L73m72K20K14p5k02J74n9J45O3k16j08
$$ 247 -247 -77 -208 -287 -152 -273 -114 -255 -116 257 -215 5 219 144 -58 116 57 202 265 49 -59
2696e9K2K63l18L35k06O7J20k8j16j11N99m23l84J39K94o39K12J74q4j37L25p4
$$ -59 -37 226 -92 243 37 104 224 196 80 -31 568 145 -239 -100 194 -445 -233 -59 -143 -280 45 -29
2718b9O8J28k96j6L40J33j34k5k13J81j23j51J85R1j09j91L18J15l01K56q7j06
$$ -29 39 167 -129 -145 195 328 194 169 -44 137 14 -137 48 139 30 -161 157 272 -29 227 140 34
2740C4J15k7K46m54q3J8n3K41m74O60j05n38J38N2P9J58J0K20o3j41L03O1j32
$$ 34 149 122 368 -86 -169 -151 -204 37 -437 223 118 -420 -282 -230 -151 7 17 237 174 33 336 397 265
2763B65k72K12p4j84J04N4k80N09n3l17J03J25K19m77k3J49j84O8r3l6K5j40L1
$$ 265 -7 205 131 -53 51 105 -175 334 281 -36 67 192 411 -66 -89 60 -124 -56 -149 -185 -160 -300 -269
2786b69N50l07l36L00L26r1j40K48k61l59P46j84l89K20Q3k36j35K23L7L0k70
$$ -269 281 -26 -362 -62 264 173 33 281 20 -339 407 223 -166 54 137 -99 -234 -11 26 56 -214
2807b14J78n0L6j17J6K04k41J41p7M11q05Q26J5p67M70J51j49J1J95k09K6q4K7
$$ -214 -36 -86 -50 -167 -151 53 -188 -47 -124 287 -518 308 323 -444 26 177 28 39 234 25 51 -33 -6
2830fP9K4J47m91N25l27r6K64q9J4q5k14K11r1K38j89k97K27L40l87J28J49p7
$$ -6 73 97 244 -247 278 -49 -145 119 30 44 -41 -255 -44 -135 103 -86 -383 -156 184 -203 -75 74 -3
2853cJ94l04K31j23K9R2mr8Q8RNj38r4K88L7o4o5Qk94P8P1Q5l51K46N8R3k43Q3
$$ -3 191 -113 118 -5 24 116 112 14 102 111 116 -22 -116 172 209 145 80 88 -206 -128 -57 28 -323 -77 -19 74 -169 -86
2881h6K2p0j43L11r8q9K27J21j38L0k50Q0J48k57K38J07k07j97N75m72J5J09l02
$$ -86 -64 -134 -277 34 -64 -153 74 195 57 87 -163 -83 65 -192 46 153 -54 -251 324 -148 -133 -24 -326
2904c26L52j99J58J50k30J28k6j09k44p8L46j27j14N02J63n41K89K93l85j37J48
$$ -326 26 -173 -15 135 -95 33 7 -102 -346 -424 -78 -205 -319 183 346 -195 94 387 2 -135 13
2925A3J69l59K77J16j96l7j5l0L43j76n29M55l6r3M19j9n73K03M3Kl24L68j22
$$ 13 182 -177 100 216 20 -17 -32 -62 281 105 -424 31 -5 -98 321 302 -271 -68 -25 -23 -347 21 -101
2948a01J74k44M31j84Or4M53n08l9L16J14k64j83Q3J14l32lN63l59n07O99j6k68
$$ -101 73 -171 260 76 82 -12 441 -67 -106 210 324 60 -123 -40 74 -258 -261 302 -57 -564 135 119 -149
2971a49p9N62l69rk88J01l7R8J68P1l28M43m7m3J01k28K58j7L2p4P2k41J30o3
$$ -149 -228 334 -35 -44 -332 -231 -268 -170 -2 69 -259 184 137 94 195 -33 225 208 240 166 238 -3 127 64
2995F4K09l43L88j10m07r1J87J96m3L6r6q9m87O42l06r0J75N0K95m81M24N9K32
$$ 64 273 -70 318 208 -199 -290 -103 93 50 86 -10 -99 -586 56 -250 -340 -165 -115 180 -301 123 182 414
3018D14k49k4K6k8m29M17p1k14p1L99J52l24J69n7j09J08M8j44q3k80L79k15n9
$$ 414 165 141 167 139 -290 127 56 -158 -229 170 322 -2 167 110 1 109 157 13 -70 -350 29 -186 -245
3041b45j02K01K92l92L3J04J54l44M42n4j01L4K44j63o9K39m9j62j59J31J29q4
$$ -245 -347 -146 146 -246 -213 -109 45 -299 143 89 -12 22 266 103 34 273 224 62 -97 34 163 79
3063G9o8J97j10j35k4P7k91N4K91J32k86q1J66p0J3j5J89k03N2Q6N2j47K63Nk94
$$ 79 11 208 98 -37 -61 16 -275 -221 70 202 -84 -165 1 -69 -56 -71 118 -85 -33 53 105 -42 221 226 -68
3088f8L6L18l53p1J54K02k43j62J82k8j95R3M39k18j78M7J90l43j16K66J5j8q7
$$ -68 -32 286 -67 -138 16 218 -25 -187 -5 -33 -228 -135 304 86 -92 -45 145 -198 -314 -48 -33 -51 -138
3111a38L08l64J35j13K38J75j40p6M28l67j82K00lL9m8J50q9mj4j78j39m9L56
$$ -138 170 -194 -59 -172 66 241 101 25 453 86 -96 104 101 140 92 242 153 149 135 -43 -182 -231 125
3134A25j06j15j67Q9p5K34J10p6Qk7j66M34j71k06K48q6J56ok15l1k0L79k66J20
$$ 125 19 -96 -263 -174 -249 -15 95 19 27 0 -166 268 97 -109 139 53 209 203 -12 -43 -63 316 50 170
3158A70j24k1j65K10k93L09q4l42K47J81l53J85p1J96k60K72j5j91J51L56l28
$$ 170 46 25 -140 70 -223 86 2 -340 -93 88 -265 -80 -151 45 -215 57 42 -149 2 358 30
3179C0k62K08K19j77J24J64j98j16j36L73j81J10j41K1j74Ql4K5O2j66L35O0l36
$$ 30 -232 -24 195 18 142 306 108 -8 -144 229 48 158 17 38 -136 -128 -162 -137 -75 -241 94 154 -182
3202a82j34L82q3l20L43J47l88O08m9m3l27K05j29j13P1K71M2j17p0L02l19r5
$$ -182 -316 66 -17 -337 6 153 -235 373 324 281 -46 159 30 -83 -12 259 301 184 114 416 97 2
3224BJ98l5j07q3K41j30j96J60o3l9K0n9J40l69K4L08k54j18N01k80O7J73j57
$$ 2 200 165 58 -25 216 86 -110 50 -13 -52 -32 -91 49 -320 -296 12 -242 -360 141 -139 -72 101 -56
3247e6M92m29j69K01M13m14j26K2J60j47J18r4j24J12J59l2k60K46Jl10N5M96
$$ -56 436 7 -162 39 452 38 -88 -66 94 -53 65 -29 -153 -41 118 86 -174 72 73 -237 -182 314
3269C14m77p6J32j42J94n6K22k74K62o9k3J20n4l2J82j9l22K65j46r2QJ98q6l9
$$ 314 -163 -239 -107 -249 -55 -111 111 -163 99 30 7 127 73 41 223 204 -118 147 1 -91 -83 115 29 -10
3293a0L9j60pK26j79K99k11j82K60J92k71J07N5P9k78k1O7J79k45q9J66j5N9L
$$ -10 29 -131 -138 88 -91 208 -3 -185 75 267 -4 103 158 237 -41 -62 5 184 -61 -150 16 1 60 63
3317F3k79K16JN4j5j22O8p8j71R7J14o5L7Q6J45j53j44L71j37j61l4K41m7l9O0
$$ 63 -216 0 1 55 40 -82 -14 -92 -263 -166 -52 -117 -80 6 151 -2 -146 225 88 -73 -107 134 87 48 108
3342A08l5k5p9K37k38m1j3K41k90J33J49m5o0j68N1J31k36O5K48k76l1O7J63l71
$$ 108 73 48 -31 206 -32 -73 -86 155 -135 -2 147 102 42 -126 -75 56 -180 -115 133 -143 -174 -107 56 -315
3366c15O0K85p0k28K68L00j35K03m1j90O1J21p5J44l73p1L72j16l09J72J14m32
$$ -315 -255 30 -40 -268 0 300 165 368 327 137 198 319 244 388 15 -56 316 200 -109 63 177 -255
3388b55r9J49L15nj99K17l08J41rk73J33j9L17k37J28J15n1l1QJ22M8j74PR0j02
$$ -255 -354 -205 110 105 -94 123 -185 -44 -53 -326 -193 -212 105 -132 -4 111 60 29 37 159 207 33 40 130 28
3413B8j85M18p1Q7k71J74l16J65J45o9j34o7K56k5k40K99j84j68K34l60K44j23
$$ 28 -157 261 190 277 6 180 -136 29 174 105 -29 -96 160 135 -105 194 10 -158 76 -284 -40 -163
3435a63K36j01J28j98p5J96Q7p4j42M18k09j89J61O2k51K44k82J34r0J25r2r1
$$ -163 73 -28 100 -98 -173 23 110 36 -106 312 103 -86 75 137 -114 130 -152 -18 -108 17 -75 -166
3457a66J04J37Rj40j46L41k20K68R6m9k21Lo3p1JL7n0j06K51l21K96NJ80o4K9
$$ -166 -62 75 84 -56 -202 139 -81 187 283 234 13 16 -47 -118 -117 -80 -130 -236 15 -306 -10 -5 175 111 140
3482A40L0o4L8q2k18n2K96p6j66J42P7l15J69K54P8l43K06pJ3k8K06l78J81j87
$$ 140 170 106 144 62 -156 -208 88 12 -154 -12 65 -250 -81 173 251 -92 114 107 120 92 298 -80 101 -86
3506h6K1j9P0J70o8k88M26j02k42J22l1J19l57J80K93m33J17m2J11j04Q1k21K91
$$ -86 -65 -84 -14 156 88 -200 226 124 -118 4 -27 92 -265 -85 208 -225 -108 -150 -39 -143 -62 -283 8
3529HP6o5P8P5l3q8P1R1p7m3K33l70K7J12M7l6O2j10k14mJ5P8j16L38l70J43r8
$$ 8 84 19 97 172 139 51 122 213 136 93 326 -44 -17 95 142 106 168 58 -156 -160 -145 -67 -183 155 -215 -72 -170
3556a70J32M9k51J40j23K37k06J54J1K9Ko2K19J73m18K53K09k79J64m8k38L22
$$ -170 -38 11 -240 -100 -223 14 -192 -38 -27 2 4 -58 161 334 -84 169 378 99 263 215 -23 299
3578B99j02j98k49K92k01K13N5j73j24oJ72j21J50j04o1O3J22k82J42n7j27K50
$$ 299 197 -1 -250 42 -159 54 109 -64 -188 -194 -22 -143 7 -97 -158 -95 27 -255 -113 -170 -297 -47
3600d7L1Q3J18n8o9n2J93Q9L6l01J61r0Q4n3j80J2j02J46k2j34K5K4O4kJ4mk04
$$ -47 -16 67 185 127 58 6 199 288 324 23 184 94 178 125 -55 -43 -145 1 -21 -155 -130 -106 -42 -44 -30 -34 -238
3627b38J43J18q5l0J74j39L51j50j31k9K05j4j76O7P2j19n9J47j7j45L70k33m97
$$ -238 -95 23 -62 -92 82 -57 294 144 13 -16 189 175 -1 66 138 19 -40 107 90 -55 315 82 -415
3650d15L78J52k32J2K29j60Qn0L1N1j15j03L58j11L22k99n8mr1Q0R5K5m36K46
$$ -415 -37 115 -117 -105 124 -36 -28 -78 -47 4 -111 -214 144 33 355 56 -2 -6 -97 -17 78 103 -333 -87
3674h7N0J5pJ34J14j43p8j47M18l54J29P4k64J39P5m27L45K59j83J77Rl39K23
$$ -87 -37 -22 -29 105 219 76 -2 -149 269 -85 44 118 -146 -7 68 -359 -14 245 62 239 248 -91 132
3697A32P4r7nK5p2j39j1j01J79J9q2p1K18k3R6l10J02j60KK44k07l2J17j26J80
$$ 132 206 109 104 129 57 -82 -93 -194 -15 4 -78 -149 69 46 142 -168 -66 -226 -224 20 -187 -219 -102 -228 -48
3722d8j89K75j40r0K79Qj63KJ80l3K52%l70O3J23J8j29J97m88K85j69P6J1O7J12
$$ -48 -237 38 -102 -192 87 95 -68 -66 114 81 333 333 -37 26 149 167 38 235 -253 32 -137 -61 -50 17 129
3747A29k15j9P8j46J92j89K77n5k52J38p5k6o3N31k09j58L03M4k20K02M3J25n38
$$ 129 -86 -105 -27 -173 19 -170 107 52 -200 -62 -137 -163 -226 305 96 -62 241 285 65 267 310 435 -103
3770a03K67l8J71j55J67l62k8N1j00j4j11J29q0K84k03J07j88J49j12J0m0R3Q3
$$ -103 164 126 297 142 309 -53 -81 -30 -130 -144 -255 -126 -206 78 -125 -18 -206 -57 -169 -159 -199 -106 -23
3793b3j8K0p6K28k18J68Q2n8P6P5r4l4k38J91J79j52o3Nl8kj91j01L13J1m0oK8
$$ -23 -41 -21 -97 131 -87 81 163 105 181 256 162 128 -110 81 260 108 45 50 12 10 -181 -282 31 42 2 -4 24
3820B4j46K2L20l42M4r4J81p7l3o1L2j51K79J18k9J26k2m1J05k7k14O6J3J25r3
$$ 24 -122 -100 220 -122 -78 -172 9 -68 -101 -162 -130 -281 -2 116 87 213 191 150 255 228 14 80 93 218 125
3845A25k35r0J17Qj43J02J08j37L71M6l18j72M16k76j00L00j31J90K4j97o2l3
$$ 125 -110 -200 -83 -75 -218 -116 -8 -145 226 272 -46 -218 198 -78 -178 122 -9 181 205 8 -54 -87
3867h7K47J5j63o3k85K31K84q0O7j98K12M9j65M7k64J19J50k75L37k06k08L02
$$ -87 160 175 12 -51 -336 -105 179 99 166 -32 180 229 64 111 -153 -34 116 -159 178 -28 -236 66
3889F6L0j60L8J67J43k17M3j18q7K00k31j7R9L4k29J96K96k62Qr5k9Q5lj05K69
$$ 66 96 -64 -26 141 284 67 110 -8 -95 105 -126 -143 -44 -10 -239 -43 253 -9 -1 -96 -125 -40 -43 -148 121
3914A21k70K7J19n0L57m74L3J60k01R7J52q0J53j12J28N7Q5j30J89o60K54P6p6
$$ 121 -149 -122 -3 -53 304 -170 -137 23 -178 -81 71 -9 144 32 160 217 302 172 361 -299 -45 31 -45
3937d5j74O0J02j05J20o9k16K16J15j52m6j7J17l8L9K55r1j59p6K26k29L08j36
$$ -45 -219 -159 -57 -162 -42 -111 -327 -111 4 -148 -194 -211 -94 -132 -93 162 71 -88 -164 62 -167 141 5
3960EO7J06LK97l53P1R3k52J57jk26QO8k62J47J41k22P2j23Q1j25L24ql32J54
$$ 5 72 178 181 478 125 196 289 37 194 193 -33 -25 43 -219 -72 69 -153 -81 -204 -123 -248 76 68 -264 -110
3985a10jK29l15L44M5l00N03n62J82k4M5k2P8j20N5N5J18r7K01r4j36J1Qm57K94
$$ -110 -111 118 -197 147 192 -108 395 -167 15 -9 36 14 92 -28 27 82 200 103 304 210 74 85 93 -364 -70
4010g0J69j70j20J39p3M0M7k53M67J22k00j2k39l6J89j75J4J09j28J87J83k98
$$ -70 99 -71 -191 -52 -125 -85 -38 -291 176 298 98 86 -153 -189 0 -175 -161 -52 -180 7 190 -108
4032a08K21K6k07L64Pl76K95j75j31k6o0L9J70o1J34j52J26Q8l96J35Q4J94j37
$$ -108 113 139 -68 296 303 -73 222 47 -84 -110 -170 -131 39 -22 112 -40 86 174 -222 -87 -3 191 54
4055E4N1K2R4p5j52O7j40q9P6L2j66J5J00K2J72j04J9j14J91j21J40n5q4qJ35
$$ 54 105 127 221 146 -6 61 -79 -168 -92 -60 -226 -211 -111 -89 83 -21 -2 -116 75 -46 94 39 -45 -53 82
4080H2j14J72l28K84p4K23n8p7J80k93Q6j16j67O9J63p8j68M10n04M53j51j86
$$ 82 -32 140 -188 96 22 245 187 110 290 -3 83 -33 -200 -131 32 -46 -214 196 -308 145 -6 -192
4102a92J32j23K85k62J30l9j22K05j70J74j60J61J7m4l7m2m8L3K26j49J53M7J89
$$ -192 -60 -183 102 -160 -30 -69 -191 14 -156 18 -142 19 36 -8 -45 -87 -135 -102 124 -25 128 175 364
4125C64l99J27o3N5k3k12K23j02k1k50J84J13l41K82j21KQ0M1l4R6r2J84N8j35
$$ 364 -35 92 29 84 61 -151 72 -30 -51 -301 -117 -4 -345 -63 -184 -182 -102 -61 -95 1 -91 93 151 16
4149A6o2m7k5L26j53J3K16k45n7K2L5Q5R9k2l05J44L4j50QJ37p1l75L29k4j35
$$ 16 -46 -93 -118 208 55 68 284 39 -18 4 39 124 223 201 -104 40 74 -76 -68 69 -2 -377 -48 -72 -207
4174b07K85o7m2m1K62l67O7J02K25k83K20J01k27M7j53j35J77J00k46J8K10J5
$$ -207 78 11 -31 -72 190 -177 -110 -8 217 -66 154 255 28 75 -78 -213 -36 64 -182 -164 46 61
4196F1k17K04k0L8o7J81j02R9k17j92K34k07L8N9J1R3K8j1q0%l3J00l8M3P8k05
$$ 61 -156 48 28 66 -1 180 78 177 -40 -232 2 -205 -167 -108 -97 -4 24 13 -67 -67 -100 0 -38 5 83 -122
4222a22R4J8j35j20M14k99lO5j5K95J68n33L08n4j98j38K62R5j19l95N56k35K11
$$ -122 -28 -10 -145 -265 149 -150 -153 -88 -103 192 360 -173 135 81 -117 -255 7 102 -17 -412 144 -91 120
4245A20j02o6J66p8k3Q7o3N8q9m2j27K56r6O8J42j30j14r2J16J38j0k05k0P1j05
$$ 120 18 -48 118 40 17 104 41 99 10 -32 -159 97 1 69 211 81 -33 -125 -9 129 119 -86 -106 -35 -140
4270a40N5k04qK56j53J70q1R2q4k4K55l50P0L35k46M6N5L9N7j24kk29M22n25J13
$$ -140 -85 -289 -297 -41 -194 -24 -105 -13 -97 -121 134 -216 -146 189 -57 -11 44 83 140 16 14 -215 207 -318 -205
4295b05L54k05j06J5J16j44J18PM9j09J20J49j46J56J16k78K28k57J66k75nK63
$$ -205 149 -56 -162 -147 -31 -175 -57 -50 -1 -110 10 159 13 169 285 7 235 -22 144 -131 -136 127
4317A27k1O5l28P19m23k18K51L6p1j55RO6j69J62m3k13R3MK2l9J17R4o9K16n1
$$ 127 106 171 -157 562 139 -79 172 208 137 -18 -9 57 -112 50 7 -206 -113 -109 -87 -126 -9 85 16 232 181
4342A81j01N8j12j15kJ38J16j42N0o2j6J68k62J31K0k3R4k42M4J16P9k33j06O9
$$ 181 80 138 26 -89 -91 47 163 21 71 9 -7 161 -101 30 50 27 121 -121 -77 39 118 -115 -221 -152
4366a52K45j96LR4j52K80j36J1j2J27j6rp9M59n04QJ90m98N14k82j02K46Jj49
$$ -152 93 -103 -100 -6 -158 122 -14 -3 -15 112 96 87 8 467 -37 -29 161 -337 177 -105 -207 39 40 -109
4390a09o7M16l30J0J10j43J07J3J63l16J30j38k7K53j79K09j35j15L15Q9r3J1
$$ -109 -176 240 -90 -80 30 -113 -6 7 170 -146 -16 -154 -181 72 -107 102 -33 -148 167 256 163 174
4412A74J65r0j07j04jK0P2l07J95o6j01J91J30j23j28m1NK24j73Q3j54J94j36
$$ 174 339 249 142 38 37 57 129 -178 17 -49 -150 41 171 48 -80 -121 -116 108 -65 18 -136 58 -78
4435g8K1l8N4J29j21j30L48q8n2K6O2p4k26J53j54L36j54J61j1m4m8M5Q7j96k90
$$ -78 -57 -95 -41 88 -33 -163 185 97 45 71 133 59 -167 -14 -168 168 14 175 164 120 72 117 204 8 -282
4460b82O08l52K1j31K92k11k3M9l49L84k22K03k12N80j74l1k5j38k1L14j86M4
$$ -282 326 -26 -5 -136 156 -55 -78 -29 -378 6 -216 -13 -225 355 181 150 125 -13 -34 280 94 138
4482A38l05R6p4K95o5j4j91J13j09K47l42J01M1j55K36jj66K35j84p5L43j48J9
$$ 138 -167 -71 -145 150 85 71 -120 -7 -116 131 -211 -110 -69 -224 12 11 -155 80 -104 -179 164 16 35
4505C5m1r8j45L59r9rm1J68k70L45j63j55K13k80K81J4J4l43K04k81J32J04j21
$$ 35 -6 -104 -249 110 11 2 -39 129 -141 204 41 -114 99 -181 100 114 128 -215 -11 -292 -160 -56 -177
4528a77l0L42k16L0l7K09l40K74J55j59K32j87Krj15J19k80j3N9K73J3J41k97
$$ -177 -207 135 -81 -51 -88 121 -219 55 210 51 283 96 98 89 -26 93 -187 -200 -141 132 145 286 -11
4551a1l53P22j72k68K73j02N5k44K6P6p4N6j9j1o5L93l62k0Q9P6L7K21j45K3M0
$$ -11 -364 358 186 -82 191 89 144 -100 -74 2 -72 -16 -35 -46 -111 282 -80 -100 -11 65 102 323 178 201 241
4576B41j85k4j40L57k53n4K16k88n4N5J21J0K69o2k25r5J72q4J02K45n39J43J63
$$ 241 56 32 -108 249 -4 -58 158 -130 -184 -129 -8 2 271 209 -16 -111 61 -23 79 324 -215 -72 91
4599I1j35j20K9k0J64M8k8LJ76k80Q0K55m30J59M2J50l12J09j56K84l91J25n6
$$ 91 -44 -164 -135 -155 9 57 29 32 208 -72 8 263 -167 -8 34 184 -128 -19 -175 109 -282 -157 -213
4622b13l6K81k40J71j30L30o1k4l7j98K01k01K86J03l28Q7M2Q3mj51J98j80R4
$$ -213 -249 32 -208 -37 -167 163 102 78 41 -157 44 -157 129 232 -96 -9 33 116 112 -39 159 -21 73
4645G3j90P6K29l59O5K18k25K6r7K75l73M5j06L62j43qK81j96k3J23j64M6J61
$$ 73 -117 -41 188 -171 -106 112 -113 -87 -184 91 -282 -237 -343 19 -124 -132 149 -47 -70 53 -111 -65 96
4668I6j48J15K33k73R9Rj11k0n5J10Q6J3m1K5j14k9Q6k8J23l72K9K81j70J62k94
$$ 96 -52 63 296 23 122 131 20 0 -55 55 141 154 113 138 24 -5 81 53 176 -196 -167 114 -56 106 -188
4693a88K99p0j07J40k37J7K02J51l63K39N1k59J66J65p2k81P0n2O3P4mj54j10
$$ -188 111 41 -66 74 -163 -146 56 207 -156 83 134 -125 41 206 134 -147 -77 -129 -66 8 4 -150 -260
4716b60L85k02L2k3N1J53k47j46K12J96k26R9P1L1j15l9J36L3j96q4J92j89k6
$$ -260 125 -77 -45 -68 -17 136 -111 -257 -45 151 -75 24 95 126 11 -28 108 141 -55 -139 53 -136 -162
4739a62P9l4J02L4m5p1J4J12k59J07O7Q5Ol01L77p2K05l71k2l7J04M9J76j84J21
$$ -162 -83 -117 -15 19 -26 -97 -83 29 -230 -123 -56 29 35 -266 111 39 244 -127 -149 -186 -82 -33 143 -41 80
4764H0j5N9J23l48J80J22l37j1J27j45K75Oj68K72m77L93m1j13j40M55l59K24
$$ 80 65 124 247 -101 79 201 -136 -147 -20 -165 110 116 -52 220 -257 136 95 -18 -158 297 -62 162
4786A62k12j16K02O8r1l97L05j27J23J64M4j63Q2l7p9j44J30Q4K00j04k3Jo7J12
$$ 162 -50 -166 36 104 13 -384 -79 -206 -83 81 125 -38 44 7 -72 -216 -86 -2 198 94 71 72 5 117
4810A17J08j36l29J45K08k98J11mj48K45M4J92n02N18m27L9K02k79J69O4j16J44
$$ 117 225 89 -240 -95 113 -185 -74 -78 -226 19 63 255 -247 271 -156 -117 85 -194 -25 39 -77 67
4832F7r5k1K02m37M15P7l5l34M34m51L34P2k29J03k39j15N26j15j89L1j7k9l0
$$ 67 -28 -49 153 -284 131 208 173 -161 273 -178 156 228 -1 102 -137 -252 274 159 -30 1 -16 -45 -75
4855g5K2p5K24j05k35K33P1k75K60L9j84J03k07K52J60k68Q8j2L5j06K26m08L68
$$ -75 -53 -128 96 -9 -244 -11 60 -215 45 84 -100 3 -204 48 208 -60 28 16 51 -55 171 -237 131
4878A31o9k61J27k79K10R3J93k48J76j29J14M8k90K4K32m9N7N1k64L31j34k02
$$ 131 62 -199 -72 -351 -141 -48 145 -103 73 -56 58 106 -184 -160 72 23 80 131 -133 198 64 -138
4900a38J16M3J1K91m21lJ89k25J21j61O7J56M6L2k67J05L1o3m5J85q4Q4q1q8j24
$$ -138 -22 21 32 323 -98 -101 88 -137 -16 -177 -110 46 92 124 -143 -38 -7 -70 -115 70 -14 70 -11 -99 -223
4925b23O1K28k7ol3J94n25J80K72k8l4J7J4k1J56k90j98K76o8j04K7N8J00q6j40
$$ -223 -162 66 39 33 0 194 -331 -151 121 93 59 76 90 69 225 -65 -263 13 -55 -159 -132 -74 26 -60 -200
4950b00J49K8J25mj60K2M9K11k02J00r5Q6jo4K2J83k17k59L60K25p3m87K59j76
$$ -200 -51 -23 102 98 -62 -40 9 220 18 118 23 109 108 44 66 249 32 -227 133 358 285 -202 57 -119
4974a19J8K15k14l8l1J47j82K64j19k51L12k10K10K2Q8J4j26k15O53n91J47o5
$$ -119 -101 114 -100 -138 -169 -22 -204 60 -59 -310 2 -208 2 24 112 126 0 -215 438 -153 -6 -71
4996g1k5L32l90M16j21k7J49k55J21j4o9k59L93k12q7J41k20J89L75l82j18N2
$$ -71 -96 236 -154 262 141 114 263 8 129 115 46 -213 180 -32 -119 22 -198 -9 366 -16 -134 -82
5018h2J03j37O9K6k2J75K9k03N7j14QJ74k26M10k60K91j65j82J66k06K6k8m1k02
$$ -82 21 -116 -47 -21 -43 132 161 -42 15 -99 -91 83 -143 267 7 298 133 -49 117 -89 -63 -91 -132 -334
5042c34K73j20o1J10K21j22J28j24Q9j55J09k6n0K29m30L63M5k66O6J38j70K53
$$ -334 -61 -181 -242 -132 89 -33 95 -29 60 -95 14 -12 -62 167 -263 100 145 -121 -55 83 -87 166
5064A66k54J74j3r4L8n5m18N24k02K41j15K64m17K00J08k50J64O8O0k91M97k07
$$ 166 -88 86 73 -21 17 -38 -456 68 -134 107 -8 256 -161 39 147 -103 61 129 189 -102 395 188
5086A88l68J05K24l10K59o3J03k85M40k56J57k85J90J43j81RL0k7q9J12K3j61
$$ 188 -180 -75 149 -161 98 35 138 -147 293 37 194 -91 99 242 61 70 100 73 -16 96 119 -42
5108d2qj00l7J34j11J36R7n5PL09n95K39Q8r6J28P0M0j75K28j22k71K74j74K37
$$ -42 -50 -150 -187 -53 -164 -28 69 14 21 330 -265 -26 62 -34 94 164 204 29 257 135 -136 138 -36 201
5132B01k09N8J18k57N6J4K45k31j74L52l42q6L58j08n9J0Q7J51o6K4k86J27O3
$$ 201 -8 50 168 -89 -33 -19 226 -5 -179 173 -169 -255 103 -5 -64 -54 33 184 118 142 -144 -17 46
5155D6n7j26J74J6J55j72P8r4j04Q8j14J44qm3j2l3j11J3K28k80L1K15j33L5K3
$$ 46 -11 -137 37 53 208 36 114 20 -84 4 -110 34 26 -17 -29 -62 -173 -160 68 -212 -181 34 -99 -64 -41
5180d1N1J61L3k10j45K28m31L76K93K9l89Q1j44J55j30L6Q7j85KO1Q9o2K00j32
$$ -41 10 171 204 -6 -151 77 -354 22 315 344 -45 36 -108 47 -83 -47 40 -145 -143 -82 7 -55 145 13
5204A3J3j6l21J45L85l76j22J68J35k67L12j53j86L41J5r9P0P4j33N7m7J54l00
$$ 13 26 10 -311 -166 219 -157 -279 -111 24 -243 69 -84 -270 71 86 -13 57 131 -2 55 8 162 -138
5227a38N2L17l90R9L07j16k24KJ52j86P6k81J73Jk9J91M4j01j6J38j40P1q0O8
$$ -138 -86 231 -159 -60 247 131 -93 -91 61 -125 -49 -330 -157 -156 -185 6 50 -51 -67 71 -69 2 -78 -10
5251a0m0Q6J24j83N3N8q5Q6n6Q0j01l11K90J42q2j16j5r8K58J19j67j40K09m8
$$ -10 -50 36 160 -23 30 88 3 89 33 113 12 -299 -9 133 51 -65 -80 -178 80 199 32 -108 101 53
5275E3M0j66P8l57J37K06Q6k34J45K4L55l82L6k00K40j34J21k9QK43m34P6K31
$$ 53 93 -73 5 -352 -215 -9 77 -157 -12 12 367 -15 21 -179 61 -73 48 19 27 270 -164 -88 143
5298A43j35j02J81k92J50j28O9K3L0J22Lj79K13k68O0l9J48Q6p3K5r2K8J71n7
$$ 143 8 -94 87 -205 -55 -183 -114 -91 -61 61 64 -115 98 -170 -110 -149 -1 85 12 37 -55 -27 144 87
5322H7KM1m5M4o4r3r2J09j15J17k72J8L77j51kj09QJ61j27r1j01L05oM4p5j10
$$ 87 89 130 85 129 65 -28 -120 -11 -126 -9 -281 -263 114 -37 -39 -148 -140 21 -106 -197 -298 7 1 45 -30 -140
5348a40M35j4j08J02j44j98M70k74k50L32l63L38j45k17K14j62J44NP1L6q0M3
$$ -140 295 281 173 275 131 -67 403 129 -121 211 -152 186 41 -176 38 -124 20 25 96 132 52 95
5370I5k39J43M5j18J79q5N1n9j04O1j11L61k86K83l03QJ29k46j18J23K36k49K40
$$ 95 -144 -1 44 -74 105 20 71 12 -92 -31 -142 219 -67 216 -87 -79 50 -196 -314 -191 45 -204 36
5393C6p5j48K62M8l21K62J55j62O9o8j96J64J65n1l59J56N6k35L15R4j18J48l20
$$ 36 -39 -187 75 123 -198 64 219 57 126 58 -138 26 191 140 -219 -63 -7 -242 73 167 49 197 -123
5416a23l0J37l2J14J39k08KP4j69J40q3K22j27lm0K32l42K53Nl08L70l94J04l1
$$ -123 -153 -16 -48 66 205 -3 -1 73 -96 44 -39 183 56 53 13 245 -97 156 161 -147 223 -171 -67 -98
5440i8M0j94L14k5P3j66J90r3j17K9j36J32P5o5J85l17J74l2l6k4N6J1o0R0m8
$$ -98 -58 -252 62 37 110 -56 134 41 -76 -47 -183 -51 24 -41 144 -173 1 -31 -67 -91 -35 -24 -84 6 -42
5465d2k0k1K53k43jPj22K04NQ5m0L2l95K52J83j43J25P5l30N4J43P5r9K12m5r8
$$ -42 -62 -83 170 -73 -74 -67 -189 15 20 105 65 97 -298 -46 137 -6 119 194 -136 -82 61 136 37 249 204 106
5491A06k32L06J28k81J19k50J9k0J25q3Q6p1k03L21k9P8n4k25J92N5M7k25J53
$$ 106 -126 180 308 27 146 -104 -85 -105 20 -63 23 -48 -251 70 41 119 65 -160 32 87 134 -91 62
5514F2n2J05QR2jl64R8N5J09k97o0K83qj79Q4p4J81J85l17P5k33K65k90J18K96
$$ 62 10 115 123 215 214 -150 -52 3 112 -185 -245 38 30 -149 -65 -139 42 227 -90 -15 -248 17 -273 -155 141
5539A41J6k99J84J62l22J04j6p5J8J98K09k82j4k4J3k70L22l3j76K98j99M4kj53
$$ 141 157 -142 42 204 -118 -14 -30 -105 -87 111 320 38 24 0 13 -257 65 32 -144 154 -45 -1 -3 -156
5563a56R4J57j9l5P3j04m8J66j50J17j97N8K20q1J12k05J31k29K08o8j00j77N44
$$ -156 -62 95 76 41 114 10 -38 128 -22 95 -102 -44 176 95 207 2 133 -96 112 44 -56 -233 311
5586C11k35L7q8l2j69O8R7k50L05k22K93k97J62m9K8J3j18K21j11J50j98K05j84
$$ 311 76 113 25 -7 -176 -108 -11 -261 44 -178 115 -182 -20 -69 -41 -28 -146 75 -36 114 -84 121 -63
5609f3O1j63K16J22j54KL19m39J37q4nL51m37J79j13k8N1K34J1k26j7MNK0Q5j36
$$ -63 -2 -165 51 173 19 21 340 -99 38 -46 -51 300 -137 42 -71 -99 -48 186 197 -29 -46 -42 -37 -17 68 -68
5635f8r6K56q4L61n13L06j68OJ44k59K30k15J85k25K03Q1j37L36j15m1P9m50J88
$$ -68 -164 92 8 369 -144 162 -6 0 144 -115 115 -100 85 -140 63 144 7 343 228 187 266 -184 4
5658DL32m86J21o3n3L61k83L5n3J00k84K43N2J72J04l37j64K60K00j21l41K3J69
$$ 4 336 -150 -29 -92 -145 216 -67 -32 -85 15 -269 -26 26 198 302 -35 -199 61 261 140 -201 -178 -9
5681io3L7O1J46j38n8p9O3j56O3L39j62j48L12j70j65K11k63q0J89J32n8O3j4
$$ -9 -72 -35 26 172 34 -24 -103 -40 -196 -133 206 44 -104 208 38 -127 84 -179 -259 -70 62 4 67 53
5705E3J76j89j0Q0j26J49k22L93j52k76K19j41j78K30J15m15K05n8pn1J16M01
$$ 53 229 40 30 110 -16 133 -89 304 152 -124 95 -46 -224 6 121 -294 -89 -147 -154 -205 -89 312
5727C12k60j3p9k5J07k00J92Pj13K64l12K39j43j1j77J03K44j40l2p5J17N4j45
$$ 312 52 39 -40 -65 42 -158 34 41 -72 192 -120 119 -24 -35 -212 -109 135 -5 -37 -112 5 59 -86
5750h6j96M40q3j17q2K47j92k6r2M2R3k10M09m3j58J5K02l29K4kJ80k02M4J10
$$ -86 -282 158 75 -42 -124 123 -69 -95 -187 -145 -52 -262 147 104 -54 -39 163 -166 -142 -144 36 -166 -122 -12
5774a2K09K62l74O7k89K28j89K73j00J57l51l7L0L1L43l61n3K41j01j1K62k14
$$ -12 197 459 85 152 -137 91 -98 175 75 232 -119 -156 -126 -95 248 -113 -166 75 -26 -37 225 11
5796A1k47J27K47m3p3KQ7j09K32j45j81J56k58L23j19K36j40m3n0j06J80j79K35
$$ 11 -236 -109 138 95 22 24 111 2 234 89 -92 64 -194 129 10 246 106 63 13 -93 87 -92 143
$$ [...]
8191a26
##END NTUPLES=NMR FID
##END=
